##TITLE=1H_DE-80H_X3
 200.13MHz, d2o
 8 sc
 
 19ns.26.2.2025
##JCAMPDX= 6.0         $$ Bruker NMR JCAMP-DX V2.0
##DATA TYPE= NMR FID
##DATA CLASS= NTUPLES
##ORIGIN= UXNMR, Bruker Analytische Messtechnik GmbH
##OWNER= pz
$$ XWIN-NMR		Version 3.5
$$ Mon Jul 20 14:33:57 2026 Russian Standard Time (UT+4h)  Yarkov@DPX200
##.OBSERVE FREQUENCY= 200.1313
##.OBSERVE NUCLEUS= ^1H
##.DELAY= (6, 6)
##.ACQUISITION MODE= SIMULTANEOUS
##.ACQUISITION SCHEME= undefined
##.AVERAGES= 8
##.DIGITISER RES= 18
##SPECTROMETER/DATA SYSTEM= spect
##.PULSE SEQUENCE= zg30
##.SOLVENT NAME= DMSO
##.SHIFT REFERENCE= (INTERNAL, DMSO, 0, 14.3821)
##AUDIT TRAIL= $$ (NUMBER, WHEN, WHO, WHERE, WHAT)
$$ ##TITLE= Audit trail, XWIN-NMR		Version 3.5
$$ ##JCAMPDX= 5.01
$$ ##ORIGIN= Bruker BioSpin GmbH
$$ ##OWNER= Yarkov
$$ C:/Bruker/XWIN-NMR/data/yarkov2/nmr/H-C/1/audita.txt
$$ ##AUDIT TRAIL=  $$ (NUMBER, WHEN, WHO, WHERE, WHAT)
(   1,<2026-07-20 14:33:00.46 +0400>,<Yarkov>,<DPX200>,
      <created by zg, POWCHK disabled, PULCHK disabled
       configuration hash MD5:
       00 E9 B6 7A A2 85 ED C7 34 08 36 98 17 FE 4E 26
       data hash MD5: 16K
       1A 8E E6 B8 91 C8 D5 C0 EF 6E B4 8B F6 C8 9F 2B>)
$$ ##END=
$$ 
$$ hash MD5
$$ CC C0 47 69 04 65 AF 1B 91 5D A0 97 0A 03 99 E4
##$RELAX= 
##$RELAX= 
##$RELAX= 
##$RELAX= 
##$RELAX= 
##$RELAX= 
$$ Bruker specific parameters
$$ --------------------------
##$DU= <C:/Bruker/XWIN-NMR>
##$EXPNO= 1
##$NAME= <H-C>
##$PROCNO= 1
##$TYPE= <nmr>
##$USER= <yarkov2>
##$AMP= (0..31)
100 100 100 100 100 100 100 100 100 100 100 100 100 100 100 100 100 100 
100 100 100 100 100 100 100 100 100 100 100 100 100 100 
##$AQSEQ= 0
##$AQ_mod= 1
##$AUNM= <au_zg>
##$AUTOPOS= <>
##$BF1= 200.13
##$BF2= 200.13
##$BF3= 200.13
##$BF4= 200.13
##$BF5= 200.13
##$BF6= 200.13
##$BF7= 200.13
##$BF8= 200.13
##$BYTORDA= 1
##$CFDGTYP= 0
##$CFRGTYP= 5
##$CHEMSTR= <none>
##$CNST= (0..31)
1 1 145 1 1 1 1 1 1 1 1 1 1 1 1 1 1 1 1 1 1 1 1 1 1 1 1 1 1 1 1 1 
##$CPDPRG= <>
##$CPDPRG1= <>
##$CPDPRG2= <>
##$CPDPRG3= <>
##$CPDPRG4= <mlev>
##$CPDPRG5= <mlev>
##$CPDPRG6= <mlev>
##$CPDPRG7= <mlev>
##$CPDPRG8= <mlev>
##$CPDPRGB= <>
##$CPDPRGT= <>
##$D= (0..31)
0 0.7 0 0 0 0 0 0 0 0 0 0.03 0 0 0 0 0 0 0 0 0 0 0 0 0 0 0 0 0 0 0 0 
##$DATE= 1784543579
##$DBL= (0..7)
120 120 120 120 120 120 120 120 
##$DBP= (0..7)
150 150 150 150 150 150 150 150 
##$DBP07= 0
##$DBPNAM0= <>
##$DBPNAM1= <>
##$DBPNAM2= <>
##$DBPNAM3= <>
##$DBPNAM4= <>
##$DBPNAM5= <>
##$DBPNAM6= <>
##$DBPNAM7= <>
##$DBPOAL= (0..7)
0.5 0.5 0.5 0.5 0.5 0.5 0.5 0.5 
##$DBPOFFS= (0..7)
0 0 0 0 0 0 0 0 
##$DE= 6
##$DECBNUC= <off>
##$DECIM= 32
##$DECNUC= <off>
##$DECSTAT= 4
##$DIGMOD= 1
##$DIGTYP= 9
##$DL= (0..7)
0 120 120 120 120 120 120 120 
##$DP= (0..7)
150 150 150 150 150 150 150 150 
##$DP07= 0
##$DPNAME0= <>
##$DPNAME1= <>
##$DPNAME2= <>
##$DPNAME3= <>
##$DPNAME4= <>
##$DPNAME5= <>
##$DPNAME6= <>
##$DPNAME7= <>
##$DPOAL= (0..7)
0.5 0.5 0.5 0.5 0.5 0.5 0.5 0.5 
##$DPOFFS= (0..7)
0 0 0 0 0 0 0 0 
##$DQDMODE= 0
##$DR= 18
##$DS= 0
$$ [...]
##$SUBNAM2= <"">
##$SUBNAM3= <"">
##$SUBNAM4= <"">
##$SUBNAM5= <"">
##$SUBNAM6= <"">
##$SUBNAM7= <"">
##$SUBNAM8= <"">
##$SUBNAM9= <"">
##$SW= 18.0517328524113
##$SWIBOX= (0..15)
0 0 2 0 0 0 0 0 0 0 0 0 0 0 0 0 
##$SW_h= 3612.71676300578
##$TD= 16384
##$TD0= 1
##$TE= 0
##$TE2= 300
##$TE3= 300
##$TEG= 300
##$TL= (0..7)
0 120 120 120 120 120 120 120 
##$TP= (0..7)
150 150 150 150 150 150 150 150 
##$TP07= 0
##$TPNAME0= <>
##$TPNAME1= <>
##$TPNAME2= <>
##$TPNAME3= <>
##$TPNAME4= <>
##$TPNAME5= <>
##$TPNAME6= <>
##$TPNAME7= <>
##$TPOAL= (0..7)
0.5 0.5 0.5 0.5 0.5 0.5 0.5 0.5 
##$TPOFFS= (0..7)
0 0 0 0 0 0 0 0 
##$TUNHIN= 0
##$TUNHOUT= 0
##$TUNXOUT= 0
##$USERA1= <user>
##$USERA2= <user>
##$USERA3= <user>
##$USERA4= <user>
##$USERA5= <user>
##$V9= 5
##$VALIST= <valist>
##$VCLIST= <CCCCCCCCCCCCCCC>
##$VD= 0
##$VDLIST= <DDDDDDDDDDDDDDD>
##$VPLIST= <PPPPPPPPPPPPPPP>
##$VTLIST= <TTTTTTTTTTTTTTT>
##$WBST= 1024
##$WBSW= 4
##$XGAIN= (0..3)
0 0 0 0 
##$XL= 0
##$YL= 0
##$YMAX_a= 125140
##$YMIN_a= -114189
##$ZGOPTNS= <>
##$ZL1= 120
##$ZL2= 120
##$ZL3= 120
##$ZL4= 120
##$ABSF1= 10
##$ABSF2= 0
##$ABSG= 5
##$ABSL= 3
##$ALPHA= 0
##$AQORDER= 0
##$ASSFAC= 0
##$ASSFACI= 0
##$ASSFACX= 0
##$ASSWID= 0
##$AUNMP= <proc_1d>
##$AZFE= 0.1
##$AZFW= 0.1
##$BCFW= 1
##$BC_mod= 2
##$BYTORDP= 1
##$COROFFS= 0
##$CY= 83.5205535888672
##$DATMOD= 1
##$DC= 2
##$DFILT= <>
##$DTYPP= 0
##$F1P= 10.8118882576601
##$F2P= -7.23987719738617
##$FCOR= 0.5
##$FTSIZE= 0
##$FT_mod= 4
##$GAMMA= 1
##$GB= 0.15
##$INTBC= 1
##$INTSCL= 1
##$ISEN= 128
##$LB= 0.25
##$LEV0= 0
##$LPBIN= 0
##$MAXI= 10000
##$MC2= 0
##$MEAN= 0
##$ME_mod= 0
##$MI= 1.114404
##$NCOEF= 0
##$NC_proc= 0
##$NLEV= 6
##$NOISF1= 3.799351
##$NOISF2= 2.8
##$NSP= 1
##$NTH_PI= 0
##$NZP= 0
##$OFFSET= 14.38212
##$PC= 1
##$PHC0= -7255.922
##$PHC1= 7.421964
##$PH_mod= 1
##$PKNL= yes
##$PPARMOD= 0
##$PSCAL= 0
##$PSIGN= 0
##$REVERSE= no
##$SF= 200.129724274929
##$SI= 16384
##$SIGF1= 3
##$SIGF2= 2
##$SINO= 400
##$SIOLD= 16384
##$SREGLST= <1H.CDCl3>
##$SSB= 0
##$STSI= 0
##$STSR= 0
##$SW_p= 3205.1282051282
##$SYMM= 0
##$S_DEV= 0
##$TDeff= 0
##$TDoff= 0
##$TI= <>
##$TILT= no
##$TM1= 0
##$TM2= 0
##$TOPLEV= 0
##$USERP1= <user>
##$USERP2= <user>
##$USERP3= <user>
##$USERP4= <user>
##$USERP5= <user>
##$WDW= 1
##$XDIM= 8192
##$YMAX_p= 0
##$YMIN_p= 0
$$ End of Bruker specific parameters
$$ ---------------------------------
##NTUPLES= NMR FID
##VAR_NAME=  TIME,          FID/REAL,        FID/IMAG
##SYMBOL=    X,             R,               I
##VAR_TYPE=  INDEPENDENT,   DEPENDENT,       DEPENDENT
##VAR_FORM=  AFFN,          ASDF,            ASDF
##VAR_DIM=   8192,          8192,            8192
##UNITS=     SECONDS,       ARBITRARY UNITS, ARBITRARY UNITS
##FACTOR=    0.0002768,     1,               1
##FIRST=     0,             0,               0
##LAST=      2.2672688,     0,               0
##MIN=       0,             -114189,         0
##MAX=       2.2672688,     125140,          0
$$ Real data points
##PAGE= N=1
##DATA TABLE= (X++(R..R)), XYDATA
$$ [...]
732B01j69j70J08j69K89J07k48j8J57j60J19r8r3J05M7j66J09L5J4J57k30M0J00
755F7j41J23q0j44J88j96K35l6j78K71K5j69q7K00j94J66K0j47Q5j4J63p1j69
778h3J38K2r2J50j58k2J13j77n2K37j02j0K30k07K4k8k6J12j49J29M0l0j8P2l42
803b29K98j03k9J19j55k5J34On5r1J07j9J15m5R0k5j53J00j47J68J75k43j3N7
827C7oM2n6r0n8R1NJ59k92J99K1P3n5Mj24J51j10J9N7q8N9q5l5Q5J21k51M6n4
855a35K0J22q5P9j07p9J50J94k72J32j4q4K09j37j37J14Q2j16K7p1O1O4Rn7q1
880a12N1K41l16J38J06j38P5K2j45J34m9Q9Lj90O8M9k14K64j69Q9P7p8j07K28
904A16r1r7J13p2M5J17j14n4J31k54L39j34j41K24k16O9M2j27R3J9M8r3J0oR5
$$ plain form
732 201 32 -138 -30 -199 90 197 -51 -69 88 -72 47 -51 -144 -39 8 -158 -49 -14 0 157 -73 -33 67
755 67 -74 49 -31 -175 13 -183 52 16 -162 109 134 -35 -122 78 -116 50 70 -77 8 -6 157 86 -83
778 -83 55 77 -15 135 -23 -45 68 -109 -161 76 -26 -36 194 -13 11 -17 -43 69 -80 49 89 59 41 113 -229
803 -229 69 -34 -63 56 -99 -124 10 16 -39 -130 -23 -42 73 28 118 93 -60 40 -107 61 236 -7 -20 37
827 37 31 73 17 -73 -131 -40 -35 124 -168 31 52 125 70 74 -50 101 -9 10 67 -21 38 -47 -82 3 124 -127 -81 -135
855 -135 -115 7 -78 1 -106 -185 -35 159 -113 19 5 -79 130 -7 -144 -30 52 -64 -37 -108 -47 17 26 -31 -112
880 -112 -61 180 -136 2 108 -30 45 67 -78 56 7 96 99 -91 -23 26 -188 76 -93 -4 73 -5 -112 116
904 116 25 -72 41 -31 14 131 17 -37 94 -160 179 45 -96 128 -88 -19 23 -104 -11 8 56 -37 -27 -33 62
929F2L1n4O6N8r4q3l3M1n4N1N6m2o7K17k03n7R2L7O0P6k10L9R8o7J46k04j1J28
957G9j95J02NK4JP7j18J13p4PQ1J0j39L8L1k03J24K8J6J0o0P7r5j5k6O8K6On2
986e4O1N0j17J69j30L7j17K7M8Q4p1O7j67J36MNNJ3j49R0k0J2r0J8J82n7Q1j73
1014e6J81o8j0K9j90R2M1m9J11M5j54O8j47M3O9q5rJ34jK7k9k2l5J8l5J49j07
1041A0M7Q7k36J6nO4JR4q2M8mp8L0N9j4J7m9o3P7j9m4J03n3P7p0r1Q4j60K07k10
1071a57N4J82j39K9R3N9j29k1j20J54oo6R8J19j82RJ0R6Jq6q4j4Q4O7j46pJ42
1098D0j25J19OJ1r0J80j03l0Pj31J29R3Nk5r6l3L3kq7P6QL9j35M3N4p6PM6J8K7
1128HP5o3P1k3j63Q5kP6j33j6R7M5r2P2l4O0L3j04J3J14j48Q4qk7o6J32o7M5n2
$$ plain form
929 62 93 39 105 163 69 -14 -47 -6 -60 -9 47 5 -62 155 -48 -105 -13 24 84 160 -50 -11 87 20 166 -38 -49 79
957 79 -116 -14 -9 15 16 93 -25 88 14 21 102 112 -27 11 42 -161 -37 -9 7 17 -43 34 -61 -76 -102 -34 -8 -2 -54
986 -54 7 57 -60 109 -21 16 -101 -74 -26 58 -13 54 -113 23 27 32 37 50 -99 -9 -29 -17 -107 -89 93 36 117 -56
1014 -56 125 57 47 76 -114 -22 19 -30 81 126 -28 40 -107 -64 5 -80 -89 45 44 71 42 20 -15 3 -32 117 10
1041 10 57 144 -92 -76 -81 -17 -16 78 -4 44 40 -38 -8 51 37 54 5 -58 19 0 -44 59 6 83 13 -78 6 -154 53 -157
1071 -157 -103 79 -60 -31 62 121 -8 -29 -149 5 -1 -67 31 150 -32 -23 -13 83 84 -2 -86 -100 -16 51 -95 -102 40
1098 40 -85 34 40 51 -39 141 38 8 15 -116 13 106 111 86 -10 -43 -10 -12 -99 -23 -15 24 -111 -68 -14 -90 -83 -37 -19 8
1128 8 83 20 91 68 -95 -10 -12 64 -69 -85 12 57 -35 37 3 63 96 -8 5 119 -29 55 47 20 -46 86 19 64 12
1157A2m3NQ4o8K9p5P9o8l3M6O6q0R1lr4K26k24J56j31J8M2k6j07J49o6m3j7o4
1185a39J00k5J27M4k3o1p4JR1k4J3l3j3K7m5N5J26j30J2q6R9o3L7K9oj9l0j6J
1214b5N5L8o6O0j1Oj37J17Lk4l4K0K2mm1J1L3lK1N9j33l6N2K3J28j46J07j51l8
1243i4N4Lk6l7J46q8P6j1n6j4j5k1J03l2Q9k18N9L5L3J9L8r7ml8J02n7J11n0L7
1272D7n8P8p1l2L7O7m5R7j45k4Q6j10K7P7Rk0j1nr4J47p7L1Rq4nO4QK5M4r4N0
1303B8Q2j49M8O5m6M9o8P8r2K1j00Q1L8q8O3n6J37Lq9N4o4Q5Qn2j02J12n1O7k4
1332C8j13J6O8Rj7J9j4Ok7Q4K8o1n5J12j18L2O8j14O4n5l5K4O4j46J15n8R0N1
1360G5j73J17l3M8j1j31Q2K2J0n7J7l8L7k3J49j59lJ11o2P2j0m1J9j8m1k5J98
$$ plain form
1157 12 -31 -26 58 -10 19 -56 23 -45 -78 -32 34 -46 45 42 -52 174 -50 106 -25 -7 35 9 -98 51 -15 -58 -75 -139
1185 -139 -39 -64 63 107 84 23 -51 -50 41 17 30 -3 -16 11 -34 21 147 17 29 -57 42 -21 16 45 39 20 -10 -26 -25
1214 -25 30 68 2 62 51 57 -80 37 40 16 -18 2 24 20 -21 -10 23 20 41 100 -33 -69 -17 6 134 -12 95 -56 -94
1243 -94 -40 -37 -63 -100 46 -42 34 23 -33 -47 -62 -83 20 -12 77 -141 -82 -47 -14 5 43 -54 -58 -96 6 -51 60 10 47
1272 47 -11 67 -4 -36 1 68 23 120 -25 -49 37 -73 -46 31 40 20 9 4 -90 57 -20 11 20 -64 -69 -5 3 28 72 -22 28
1303 28 110 -39 9 74 28 77 9 87 -5 16 -84 -3 35 -53 10 -46 91 94 5 59 -5 80 88 36 -66 46 -5 62 38
1332 38 -75 -59 9 18 1 20 6 12 -15 69 97 36 -19 93 -25 7 75 -39 25 -30 -65 -41 23 -123 -8 -66 24 75
1360 75 -98 19 -14 34 23 -108 -26 -4 6 -51 -34 -72 -35 -58 91 -68 -71 40 -22 50 40 -1 18 0 -41 -66 132
1387A32j19Q9j62n7J71nj18P2j03J32q6J5L3K1Pr7J01m8M6o9M9m2L1j02J71n4
1413Hj3o7K6M2n0P3n1l3k7J17Mm0k8Q6j91J36Q3j04J25r8L6O0j07m1L9r9M2P0
1441bQ2k0n2L7j3k7j9P5J2m4Jl5N6L0j18O5%O3l6K2p1kL7j37OP1k2m1O0o0N4M3
1473A5M3O2n8J0r8nJ00p1o7J15o0%K1l6r4J08o8N4Rm0R9L9nJ6j06m5O7n0L0Ok9
1504c8M5Kl6l5N2K8J6n8P4j13J77j44N8n1L3j5j7n1P1m4J58j03J5j36J45m3P8
1531F8k7p1j5PJ39j15RL6M7J0q0j32M3K6P0o2L4jQ4PM3o0k2j13J5p2Q0J03l8K8
1561D1m2O0l0j8l5j3J6J9l9p0R8L1o9q1J16l6J55M3j33O9j25R3p9P9q4J83j12
1588C7n5K4m9O4k5o5J41j34J3J7Q2o5M7k3J36k30P3o0M8p3P1Q9l2n0p9J62m0n0
$$ plain form
1387 132 13 102 -60 -117 54 49 -69 3 -100 32 -54 -39 -6 15 22 -75 26 -22 24 -45 4 -38 -7 -109 62 8
1413 8 -5 -72 -46 -4 -54 19 -32 -65 -92 25 29 -11 -39 47 -144 -8 75 -29 96 -2 34 94 -13 -54 -15 -114 -72 -2
1441 -2 80 60 8 45 32 5 -14 61 73 29 30 -5 51 81 -37 28 28 91 55 77 6 4 41 -96 -90 -19 -41 -82 -22 -82 -28 15
1473 15 58 120 62 72 -26 -31 69 -2 -69 46 -14 -14 7 -29 -123 -15 -83 -29 -20 -60 39 78 73 89 -17 -62 5 -45 -15 -9 -38
1504 -38 7 9 -27 -62 -10 18 34 -24 50 -63 114 -30 28 -23 10 -5 -22 -73 -2 -46 112 9 24 -112 33 -10 68
1531 68 41 -30 -45 -38 101 -14 -5 31 78 88 8 -124 -81 -55 15 -47 -13 -14 70 77 120 60 38 -75 -60 -132 -52 51 13 41
1561 41 -1 59 29 11 -24 -37 -21 -2 -41 -111 -13 18 -51 -132 -16 -52 103 146 13 82 -43 50 -29 50 -34 149 37
1588 37 -18 6 -43 21 -4 -69 72 -62 -49 -32 50 -15 32 9 145 -85 -12 -72 -24 -97 -26 63 31 -19 -98 64 24 -26
1616b6j3J4Q5j40J26j09J73n2j1r7k7K7J11kp5M9o5O1j16O7kK2N4L8j13O0j79
1643a40K14r2KOJ02j84J12q7J33q8J5Mp2N4n9J14o5j6R1j37J85k1k45J15J05j83
1669a37P6K9J14m4N8m7J5J9j8j92K14N3j79l8J22j04J20m4p7m1J3J53m7m8J3J11
1695I4j47J11k8k7J09r6l2rp6k3Q3R7L0o1ml2l7M8MM1k24L50j65l0L1j42J59l6
1723a2lJ13p6O4J1m0m3N6m6j08J07l3R5m5j00L8Nj9q%o8J20N6%J5n9K0n2l0R5
1753E3m9m8p2J06n1M1N2j20O2M9j05R7l9m9J35o2J03k40K97k42J5P4O7Pj65J16
1779C2P4j46QK9L2q6L6j3O8Rj28M1O8L6n6p6k0J37j1J6j57K06r8P9r4Q8q3lM4
1808C2p7O4j7l1M2N4k0Np9L3O8j32L8O5j7j07N1m1J27q3k9J63j46K7j3j0L2j3
$$ plain form
1616 -26 -39 -25 60 -80 46 -63 110 58 47 -50 -77 -50 61 59 -16 33 -32 29 -87 -20 -22 0 54 92 -21 39 -140
1643 -140 74 -18 -16 -10 92 -92 20 -67 66 -22 -7 -3 -75 -21 -80 34 -31 -47 44 -93 92 71 -174 -59 46 -137
1669 -137 -61 -32 82 38 96 49 64 83 65 -127 87 140 -39 -77 45 -59 61 17 -60 -101 -88 65 18 -30 -17 94
1695 94 -53 58 30 3 112 16 -16 -25 -101 -124 -41 56 86 25 21 -11 -48 0 4 45 -179 171 6 -24 7 -135 24 -12
1723 -12 -15 98 22 86 97 57 14 70 24 -84 23 -10 85 40 -60 -22 -17 -36 -44 -44 -112 8 64 64 79 20 40 -12 -42 53
1753 53 4 -44 -116 -10 -61 -20 32 -88 -26 23 -82 15 -24 -73 62 0 103 -137 160 -82 -67 7 74 81 -84 32
1779 32 106 -40 -32 -3 29 -57 -21 -34 34 43 -85 -44 24 60 4 -72 -92 45 34 50 -107 99 1 80 -14 74 -9 -12 32
1808 32 -45 19 2 -29 13 67 47 52 -27 6 74 -58 -20 45 28 -79 -28 -69 58 -25 -54 109 -37 -10 -23 -33 -1 -14
1836a4l5oL0j6O3L5l1Qq8r0J08J19l8j32M7N4MJ3l0M5Mn7J2J6P9q0ok0Q5p4J26
1867A31j19O5p5j12N2N2n7p0N7J03m5n4N0J00lj8j04R0k4k2l3r3J47j02M1R4m9
1894BJrN3q6N2PJ9r0L7K6J57j68K4m9P4o5N3J7l2k1N6NnJ1j3rj00KM4p9J39n3
1926@k7J9p7N5J49q1q8P8l9L2k7O9n7l2P6m3lk1m4P9p3N4J78j72J1J0K8j52J35
1955C7Oj3J6J2o7k7J12L0j76K7O6O4j08q1O9lq0K37j20q7O6o1Q2n4LM1j8O7K5
1984F5o5j9M4P5j19l5K0M2k3jM0K5NRq6J54p2r5N8J19j26k0NJ4J5K9r3L5M9m7
2014BK4r%m2L9N4ml1N8o7J1K9m8QK4M2Lj37L5J06j49L5n8j9J21k8R1r9L9L4j1
2045E3kj5K4p3O9j25N7J16j40R8o5J2j23J07M6m1n0l5J0R9J13p8j33J29Mk02J66
$$ plain form
1836 -14 -49 -55 -25 -41 22 57 26 34 -54 -144 -36 83 45 -87 -40 14 18 31 1 46 50 -7 5 21 100 20 14 -6 79 5 131
1867 131 12 77 2 -110 -58 -6 -63 -133 -76 27 -18 -72 -22 78 75 57 -47 43 19 -3 -36 -129 18 -84 -43 51 2
1894 2 3 -6 47 -39 13 20 39 -51 -14 12 169 1 25 -24 50 -15 38 55 23 2 58 63 58 69 56 47 -53 -51 -7 -86 53 0
1926 0 -27 -8 -85 -30 119 38 -50 28 -11 21 -6 63 6 -26 50 7 4 -17 -61 18 -55 -1 177 5 16 26 54 -98 37
1955 37 43 30 46 58 -9 -36 76 106 -70 -43 23 87 -21 -102 -33 -36 -116 121 1 -86 -20 -81 1 -53 -50 -9 -27 40 65
1984 65 0 -19 25 100 -19 -54 -34 8 -15 -16 24 49 54 63 -23 131 59 -36 22 141 15 -5 0 14 29 58 -35 0 49 2
2014 2 26 17 17 -25 14 68 64 33 91 24 35 64 16 24 48 90 93 -44 -9 97 -52 -17 -75 -94 27 -1 90 -9 30 64 53
2045 53 51 36 60 -13 56 -69 -12 104 -36 62 -3 9 -114 -7 39 -2 -52 -87 -77 22 135 57 -76 53 57 -145 21
2072B1q5o6J29r1P5o1Q3j93J60N8l0j7o9J36p7k4m4K01j52L5q0M9J8j0Q6q4n4
2099h6J22j7Ko2K9m2n1K13j00j18J32m2O4m9M3l9jO8l7m4P2p6j05R2L9m5k2J2
2127d8J02n7R6j65J9J8OO6p9Q0l2j03J12r8%J41r6m3J98j66M0P4p4L7L7o5O2L1
2155I3Jj37J61n5p5L0r1O5P4j01l9P4j23J14m2P5K9j28L8nN9M6j24J30lj22R2
2182C6jm1oJ4M3o5j9R9q1j2lQP2rK6o6O8o5K8k5R0k9k8r2m9J96j34k6M8M7j4j8
2214hl5L2j25J62ql4M2O0l0j33K8N6J04j39O4q0Q4j05J44j14O9m3Jp8J55p2J23
2241A20p7J4l8J8P3o2p8J9o1J8l7R0J17p4j4mNL8kl0k0q3P5o7J61q6R4r0r2K4
2271d9j1RJ2O7O0m9j08j4R6K4j04j2O4r2J16K3j25pJ38k1l7m4O1m7K4N8m6J42
$$ plain form
2072 21 -64 -130 -1 -92 -17 -78 5 -188 -28 30 0 -17 -86 50 -27 -51 -95 106 -46 -11 -91 -42 -24 -34 52 -32 -86
2099 -86 36 19 21 -41 -12 -54 -105 108 8 -110 22 -20 44 -5 38 -1 -2 66 29 -15 57 -19 -124 -32 7 -38 -60 -48
2127 -48 54 -3 93 -72 -53 -35 -29 37 -42 38 6 -97 15 -83 -83 58 -38 -81 117 -49 -9 65 -9 28 65 0 62 93
2155 93 94 -43 118 63 -12 18 -73 -8 66 -35 -74 0 -123 -9 -51 24 53 -75 -37 -42 17 63 -61 69 66 -56 36
2182 36 35 -6 -12 2 45 -20 -39 60 -21 -33 -36 -28 44 35 61 -5 63 -2 26 1 91 62 34 -58 -107 89 -45 -71 -23 24 10 -8
2214 -8 -43 -11 -136 26 18 -16 26 86 56 -77 -49 7 111 -28 36 -44 40 -65 79 -35 34 -9 -8 -86 69 -3 120
2241 120 43 57 19 37 110 48 -30 -11 -72 -54 -91 -1 116 42 28 24 29 67 65 35 15 -68 7 -60 101 15 109 19 -73 -49
2271 -49 -60 -51 -39 28 88 39 -69 -83 13 37 -67 -79 -15 -107 9 32 -93 -100 38 17 -20 -64 -3 -50 -26 32 -14 128
2299A28q6m6n7N7L8L1j10N5o7M0n9L3j6M2J00o1j29J16k9J0n1J30ko3J43j92O1
2326A6l7l4O1r3J02N0m1Q5j58L1J1L8Mn1L4LP1j42P3N0j8j74J02K9K4K4n8m9P4
2355B7j02P1m9P5K2j8Q3o4j4m5P5q8n4mJ14k0j71J34k0O7q2p5J62k4J4l8J0m3
2383e7j7J22j1q5J3m5J62m5j16Q0M1q6L6k5Q3j11m2J25j33J13j13J38m4P1rj14
2409f9M0j59K47j48Q9P8o3j28K15k12K7M9J2Q2j2r0n2M6J0J30Jj24J25j51O7J7
2435B7l8q9NO3m4J21p2nn8R1O0j22N9N8j5q5J18L5j12m3M1J23r4L7k8o3J6k2N4
2464A8k1p8N2qQ4m7l0O7j36N9O7N7j47j00J43m5P5M1r7L9J8p8j3Q5lO4p4M1q1
2493d8Q0J27l9j14N4o5l8k6J6P3j3o4P0N1j13K2n6R0p8P9R4q4M8j15k5J17j08
$$ plain form
2299 128 42 -4 -61 -4 34 65 -45 10 -57 -17 -76 -43 -59 -17 83 22 -107 9 -20 -10 -61 69 67 4 147 -45 16
2326 16 -21 -55 6 -87 15 65 24 109 -49 -18 -7 31 35 -16 18 21 92 -50 23 73 55 -119 -17 12 36 60 2 -47 27
2355 27 -75 -4 -53 22 44 26 109 45 31 -14 61 -27 -81 -85 29 9 -162 -28 -48 19 -63 -138 24 0 14 -24 -14 -57
2383 -57 -74 48 37 -48 -35 -80 82 37 -79 1 42 -44 -8 -33 50 -61 -103 22 -111 2 -111 27 -17 54 45 -69
2409 -69 -29 -188 59 -89 0 78 15 -113 102 -110 -83 -34 -22 60 48 -42 -94 -48 -38 92 93 -31 94 -57 10 27
2435 27 -11 -100 -95 -32 -76 45 -27 -32 -90 1 61 -61 -2 56 41 -44 74 109 -3 -46 -5 118 24 61 33 -30 -14 -36 18
2464 18 -3 -81 -29 -37 47 0 -30 37 -99 -40 27 84 -63 -163 -20 -65 10 51 -46 -7 11 -67 -80 5 2 66 -8 33 -48
2493 -48 32 159 120 6 60 -5 -43 -69 -53 20 7 -57 13 64 -49 -27 -83 7 -71 8 102 18 66 -49 -74 43 -65
2520f5J17n6O6m1j65L9Q1Pn0N4ml5L0O6r0R7k6RL0r3J24j97P0N5k4j5J8%n6J2
2550d2J07p2q2J97j16n5L4N2k7j2M6J1N2r4j37P1Q3j30J11J59j68L1p9O0M0p3
2576c3P2k5n1J8j01J29P3j14J8NM8j13K8M8m8j7k0J15p6j4R2L5q1k2o0J79j09
2603b4N2J2p7L1K4N1k35J14M2J3k6O4q5O0P6n2M2j65N7j2J62j55KL9p2K1L0O2
2631E1q2j12K10o9j13J45r1Q9K6n0Q8j36q3K04j82J75L2j04R4r7J05o2j37O3Q8
2656E2o5KLk2R3p5j06J2J75j0M1j02O1J9j08N7N8k1j50M9mK8n6J11L3m9m8n6R7
2685A9r9J58r9k0k4L6j6R8%j12M0j8K1m2O1l8Q1p3M0j24L7O9L8r9O3o9Q5n3M5
2714Ej8m2N3k6n8O8J61k28%N7M7n1p4K16j50K8L1l4M4p8O1Kln7J3O7j11J8P2O
$$ plain form
2520 -65 52 -4 62 21 -144 -105 -24 -17 -67 -13 -17 -52 -22 44 -46 51 25 34 64 -29 95 -102 -32 23 -1 -16 2 2 -54 -42
2550 -42 65 -7 -89 108 -8 -63 -29 23 -4 -16 30 41 93 -1 -138 -67 16 -114 -3 156 -12 19 -60 0 40 -33
2576 -33 39 14 -37 -19 -120 9 82 -32 -14 -9 39 -74 -46 2 -46 -63 -83 32 -44 -58 34 69 -12 -34 -94 85 -24
2603 -24 28 40 -37 -6 18 69 -166 -52 -10 3 -23 41 -44 16 92 40 82 -83 -26 -38 124 -31 -29 10 -62 -41 -11 51
2631 51 -31 -143 67 -2 -115 30 -61 28 54 4 92 -44 -127 77 -105 70 102 -2 92 -5 100 38 -99 -36 52
2656 52 -13 -11 -8 -30 63 -12 -118 -106 69 59 100 -2 59 78 -30 27 85 64 -86 -37 -41 -13 -69 42 75 26 -22 -78 19
2685 19 -80 78 -21 -41 -65 -29 -45 53 53 -59 -19 -37 -16 -58 3 -35 46 -27 13 -111 -74 -5 33 -66 -3 -72 13 -40 5
2714 5 -13 -55 -2 -28 -86 -18 143 -85 -85 -28 19 -32 -106 110 -40 -12 19 -15 29 -49 12 14 11 -46 -33 34 -77 -59 13 19
2744A9j36lP7lN6L4jj51O1J33o3Rn7l9J51o2k4m5P5K4ro2J12p4n5J4J08n1n5l
2774b0O7O6j19l4O9K3J0q0PJ08l3J3o1k0j0P5p6K5J1L9l2j%J56k39L9J1L1l4%
2804iO2J21j80J12n3l8q8J07j1n3N3o5J4p7K5J48j09J4oN2N7j53O1m7K4QJ19q4
2832Dp1K9K8m0jJ06p2o9J06j24N0J15R3j20m6jJM8O1k0o3j18Q7mN0R8j07mP1q5
2862BOl6k7l5J15l7j0j01J13l3OL6r6J65j47R4K3N0j32J3o8J12L5kl2j30Q9P3
2890D6N2o1l7j7r5K38p2j00P6j00Q6qq6J33j13J22p3K2l7P4j08M8k0P9m4L6o0
2917a9q8N8O5m0j3L3J54j53j21K09j62O0KO4j2r5O0K8r7J38j8n1L1l6mJ09r8O
2945A0m5M9j10J48r1M3j06J17p3O5L6q5o7J32j26M4L9J9l4L2K5j0p7J04k1m6o3
$$ plain form
2744 19 -117 -120 -43 -46 10 44 43 -108 -47 86 23 32 -25 -64 87 25 1 -44 31 55 46 -16 96 22 -33 -19 89 38 -17 -20
2774 -20 47 113 -6 -40 29 52 62 -18 -11 97 64 77 16 -4 -14 61 -15 10 21 60 28 27 27 183 -56 -17 -6 25 -9 -9
2804 -9 53 174 -6 106 53 15 -73 34 23 -30 23 -42 -28 -105 -80 68 -41 -27 -33 19 76 -77 -16 -63 -39 -31 88 4
2832 4 -67 -38 -10 -50 -51 55 -17 -86 20 -104 -54 61 154 34 -12 -13 -12 36 97 77 14 -104 -17 -21 29 127 20 16 87 2
2862 2 8 -28 -55 -90 25 -12 -22 -123 -10 -43 -37 -1 -97 68 -79 15 38 88 -44 -31 -99 13 48 46 14 -116 -27 46
2890 46 98 37 0 -17 -112 126 54 -46 30 -70 16 8 -78 55 -58 64 -9 13 -24 50 -58 -10 -30 49 5 41 -19
2917 -19 -107 -49 16 -24 -37 -4 150 -3 -124 85 -77 -17 -15 49 37 -58 2 30 -67 71 53 2 33 -3 -7 102 4 10
2945 10 -35 14 -96 52 -39 4 -102 15 -58 7 43 -42 -109 23 -103 -59 -20 -1 -35 -3 22 12 -65 39 18 -28 -91
2972i1j4K02q5l5j5J01o2j27J99p5N6j44J83p8k20R5J10q2R4n9l4M1P2R6j05L8
2998F1j00N3jK10k33km8j0K6RN4m4LJ40j61P2j03O6j09J40k7P7p3J24j27k8Q3
3025E2j24J47r4M9Rl3o9J85r4Lr3R6j7J17j58L5J8q7L6O4l0j32J42K7m1l6J21
3052I3j16N9o2P8M9j3n1K4m8m7k5mo7Q3k9J29M9n8r1R8l3m5M2L9l6L2r8J27j49
3081g0R8j9J08j51Q3m1n3P1q9J41k2o4q1NP2N4k4j30J38R2j64M1n0J06J3n9N6
3108F1o1K9M3q7l6Q8L1j25l0J17J35k65J36j0Rq9Q4o0J53j75K9qk9O8N0j8K3k3
3136D0r3Q7n2Q5k28K28j37M7R1n8P3j11K7J7L3j5M3k04M0L3M4R0n0q0N1Rq8J10
3164C2Qn7Q0r2l7K28j40J7j09k0N8k3P3k2k0j2Q8j8m4N6p5J13j33PJ6l6J06P2
$$ plain form
2972 -91 -105 97 12 -23 -38 63 1 -126 73 -2 54 -90 93 15 -205 -110 0 -82 12 -47 -81 -40 32 128 23 61
2998 61 -39 14 13 223 -10 -12 -60 -70 -44 -35 19 -25 -22 118 -43 29 -74 -8 -117 23 -4 73 0 124 -3 -31 52
3025 52 -72 75 -19 30 39 6 -63 122 28 31 -62 34 17 134 -24 11 29 -58 -22 42 12 -120 22 49 8 -28 93
3052 93 -23 36 -26 52 101 88 37 61 13 -34 -59 -63 -130 -47 -76 53 102 44 -47 51 18 -27 15 54 18 50 -48 79 -70
3081 -70 28 9 117 -34 49 8 -45 26 -63 78 56 -8 -89 -84 -12 42 18 -112 26 118 -46 -5 -55 51 64 5 61
3108 61 0 29 72 -15 -51 37 68 -57 -87 30 165 -100 36 26 35 -54 30 -30 123 -52 -23 -31 -60 8 58 40 63 40
3136 40 -53 34 -18 67 -161 67 -70 -23 68 10 83 -28 -1 16 49 34 77 -127 -87 -54 -10 80 30 -50 1 10 -78 32
3164 32 40 -17 63 -29 -66 162 22 39 -70 -90 -32 -55 18 -4 -24 -36 52 34 -10 46 -29 84 -49 -42 -26 -62 44 116
3192A16j25k9J7qO9l4L0L6j1j70J14o3L8n5R2n3p5P0L4j3j36K20p3l8J0n7J82
3219H8q1q0K9N7O1q8O8j86J26P9j48R7J0o7l3J4qJ19n6loK1J5P4r5L1p8k5M4k2
3249d3R5j1n4N6K3o6p9lK2O7k1L2k9l1O0N7j15o7J34l4K7L4j26J35j41P2Q4J0
3277H8n8Pq1j8M1J4o4J32n9l0r8J17m7L8j4l1J17p6n0Q3lo4o5N7J19j28O1l9J05
3306E4kj12L9Qj2O4J6j05J01j32J71n0j8p3K15j68k9M0K9j0l1k7O2q8l2J21k2
3333IL5n6nNj2R5p9l5J36j10k0mL8J7o9M8N6o8m7J34j93N9J67j15m2L9k1O4j0
3362A6J33j37L5j1L7j53m3Q0L9kn4K6j5JM8l0K3L0p8Q8P0p0K2j35J49k7r5N3N6
3391E6k1j40J7J10K4q5L4n7RJ1Q0k0j18P4L5jk5l0J41j9j3n6m4L3O0J0j08L2M
$$ plain form
3192 116 -9 -38 -21 -29 40 6 36 72 61 -109 5 -58 -20 -75 17 -36 -111 -41 -7 -20 -156 64 -9 -47 -37 -94 88
3219 88 7 -73 -44 13 74 -14 54 -132 -6 73 -75 22 32 -35 -68 -54 -62 57 1 -2 -8 13 28 102 7 38 -40 -65 -21 -43
3249 -43 52 41 -13 43 66 0 -79 -82 -60 7 -14 18 -11 -42 18 75 -40 -107 27 -7 20 54 -72 63 -78 -6 78 88
3277 88 30 37 -44 -62 -21 -7 -71 61 2 -28 -126 -9 -56 -18 -32 -63 54 -22 -72 11 8 -56 -121 -64 55 -73 -12 -51 54
3306 54 52 -60 -21 -13 -25 39 55 -50 51 -81 90 40 22 -51 164 -4 -33 7 36 26 -5 -32 30 -58 -90 31 9
3333 9 44 -12 -17 -12 -24 71 -8 -43 93 -17 -37 -41 -3 14 -55 -7 49 -19 -66 68 -125 -66 101 -14 -56 -17 -38 26 16
3362 16 149 12 47 36 73 -80 -123 -43 -4 -6 -60 -34 -49 -48 0 -30 -7 23 -55 33 103 33 55 -80 69 42 -53 0 56
3391 56 35 -105 -88 22 46 -39 -5 -62 -53 -42 38 18 -100 -26 9 8 -17 -47 94 75 62 6 -38 -5 55 65 -43 -11 -7
3420gkp5mQ7J5o1J00k4m5j0O6Pl5J17j39J7K4K2n3n7R8O9l5r3m8M9P5r1L2P0o2
3451GL4J8o9L7m6Q0L3l3j18R9p5l9O6o3R2j64J54o9J81k83J44k2O6P2q3j48K71
3478A42j81L6n6J81j40l0M0JR0q1M0p0NmJ9P9M2j29Q4j25J41p3q9J01r2J26o0
3505cq3J19j02M9Ml6J44m3K1K8qn7O9l3n4N4j82R7j7k7Q7m4L7P9l5j95O6O7M4
3534D6N0j30K2k6Q3n1O0M0j96J18k0O2j33J53o2M0j1p8rK2j1N4n3J37l8j51O3
3561a9P9p6jL0K0Q3n0q5P4m4n9J10k19J75L7l6k3N8O7j85K5K5m7R8lk7q2Q8j04
3590i1L5J5R6O1j32QP5m9k6NN5r0j9K2L4K4oLj4N3K3j20K4P1L1Qj80p1K07m5O9
3621G6m3ol7l7O1k0k2m5J5L4K5R0j19R5j5nr3J3J27p6nJ5l7RK3J0P2K6l03K45
$$ plain form
3420 -7 -9 -84 -88 -1 14 -47 53 29 -16 -26 40 47 12 129 -10 7 31 53 0 -57 41 110 75 -18 -66 -17 58 -33 -1 69 7
3451 7 41 59 -10 27 -19 61 94 61 -57 42 -33 -72 -6 -69 23 -141 13 -56 125 -158 -14 -36 30 102 19 -129 142
3478 142 -39 -3 -59 122 -18 -48 -8 -7 83 2 42 -28 -23 -27 -8 71 113 -16 68 -57 84 11 -78 23 -69 57 -3
3505 -3 -86 33 -69 -20 -16 -52 92 49 70 98 90 33 102 69 15 69 -113 -16 -33 -60 27 -17 20 99 64 -131 -65 2 46
3534 46 96 -34 -12 -38 45 -6 54 94 -102 16 -4 58 -75 78 16 56 45 -33 -42 -20 -31 23 -30 107 69 -82 -19
3561 -19 60 -16 -17 13 33 116 66 -19 55 11 -48 62 -157 18 55 19 -4 54 121 -64 -39 -14 -61 37 34 7 -75 13 -91
3590 -91 -56 -41 55 116 -16 -8 67 18 -8 -3 52 -38 -57 -35 -1 23 17 20 6 59 82 -38 -14 57 88 96 -84 -155 52 7 76
3621 76 33 27 -10 -47 14 -6 -28 -73 -58 -24 1 91 -28 67 52 47 -46 -33 94 18 13 28 -9 0 23 33 105 131 -172 73
3651G3J3q6k5Ko5O2K2j1J45j55K8K7K2j68J33o9L3j8n8J26m4N8k6m9qN0p8Q7q8
3680f7M3Q2j8p6R4l0l7mQK1r3J18k3k7Ol9P1N8q3L1q7l1K3J84q5J1m5K7m9Q3q1
3711a5m4Q4m0J9j9J9jn9n6J25M9o5k4k1L6R9p3N7L3m2l3oR2j48nN7k1M2j61K25
3741A04j37L5K8N0rj81N5M4k5k5R0m5O7Oo9J04j25r5J43J23j72K7jp7N0N9k9j9
3769b4L9j4J12m5r6m4M7K1J59j65K6k0k4l8J19pn0M3J8j34Q2r2J49m0l8q5P4O
3797b1L2n5k5P6P3n5m9Q0o6mj5Km8J20P9j43J5L4k8O6j30O3No1Q1k4j06J13j36
3826a27J59j11J21Q1r6p6K0K6J7M4j14J32j25O0K2r5L2K3m4OO0j05J51j41J47
3851F7p4J09j32R1o9R0q8j27J51k4N7Jr6K9P6m6mQo5O7K8n5P9r8P2l4J3j9p0P3
$$ plain form
3651 73 86 0 -25 -23 -88 -26 -4 -15 130 -25 3 30 52 -116 17 -52 -19 -37 -95 31 -13 45 19 -30 -38 12 -66 21 -67
3680 -67 -24 58 40 -36 58 28 -9 -13 -5 16 -77 41 18 -9 -3 -42 29 87 4 35 -52 -83 -60 124 39 50 5 32 -17 66 -15
3711 -15 -59 25 -15 4 -15 4 3 -56 -112 13 62 -3 -27 -48 -12 87 14 71 104 62 29 23 115 -33 -38 19 -2 40 -121 104
3741 104 -33 2 30 80 71 -110 -55 -11 -36 -61 29 -16 51 57 -12 92 -33 -128 15 138 -34 -7 -8 -85 -35 24 -5 -24
3769 -24 15 1 113 68 -28 -72 -25 -4 155 -10 16 -4 -28 -66 53 46 -4 39 57 -77 5 -87 62 22 -16 -101 -27 -21
3797 -21 11 -44 -69 7 80 25 -24 56 -10 -14 -29 -27 -75 45 124 -19 -4 30 2 68 -62 1 6 -55 26 2 -104 9 -127
3826 -127 32 -79 42 123 27 -49 -29 -3 14 58 -56 76 -49 11 33 -62 -30 -7 -51 -45 15 -90 61 -80 67
3851 67 -7 102 -30 61 -8 82 -6 -133 18 -6 51 52 -44 -15 61 15 11 19 -46 21 49 -6 73 -25 47 13 26 7 -63 10
3881A0n4J1K8m3N3K9n8JJ4j11J39Kn1J7j8n2P0K2n3Mj7N8L2j6N9qmk3l4Q8m9l5
3913A1k4m8M1p9J92j67P9l6J06o3j50J30N5L7q5O4j02O0Ll2r4MJ4J88j77J37p1
3940gN7K5p4n1q1J67p9J06L8j22j3k4m6J0J32o0J73p2r7M6r1L2R8j32N2p6P1k2
3968d0R3o8L8o0nJ34m9q1J03j23j1K4K7J19j32K6RP3j6q0j1J40m8k6l8N7k6Rn1
3997a3L3p1P5n4P8l6o3K5J9L1P5j17l1J25j33Ll4J25j22J00j9O6j21J52n7M4j30
4024e0jK4l5J11l8P2j17R3o5O6j29P2p7P4L1r8J36L6p9o0Q7j08j1J11p7K3j7J43
4052A17j56J23j09OrJ03r1L8Pm3P7r1J21l3J6L5k8M2k30O7J24Ln2Jj54J47RM4
4080H4j22jJ23r2P7Om3RJ5j39J12j18Q3m3k4J01j9M8MM0j52M7o9M2J2oj%m0J38
$$ plain form
3881 10 -44 -33 -5 -48 5 34 -24 -23 -9 -120 19 21 -30 -13 -31 -83 -13 9 -44 -40 -57 1 33 17 76 68 64 41 7 95 46 11
3913 11 -13 -61 -20 -99 93 -74 5 -31 75 12 -138 -8 47 84 -1 63 -39 21 24 -8 -102 -98 -84 104 -73 64 -7
3940 -7 50 75 1 -50 -131 36 -43 63 101 -21 -34 -58 -104 -94 38 -22 151 79 -18 28 -63 -31 67 -65 -13 -89 -18 -40
3968 -40 53 -15 23 -37 -42 92 43 -38 65 -58 -69 -45 -18 101 -31 -5 4 77 61 -19 -30 110 62 36 -2 55 29 38 -13
3997 -13 20 -51 24 -30 48 12 -51 -26 -7 24 99 -18 -49 76 -57 -54 -88 37 -85 15 -4 62 -59 93 36 80 -50
4024 -50 -51 -27 -62 49 11 83 -34 59 -6 60 -69 3 -74 0 31 -67 69 105 26 -34 53 -55 -66 45 -32 -9 -26 117
4052 117 -39 84 -25 -19 -28 75 -16 22 29 -14 63 -28 93 60 76 111 83 125 -105 -38 86 89 37 38 -116 31 40 84
4080 84 -38 -39 84 -8 69 75 32 41 56 -83 29 -89 -6 -49 -73 28 9 57 61 101 -51 -4 -73 -31 -19 -25 -26 -26 -66 72
4110G2M0m8l17K55N2m5j5n8K26j45K6j79J46M3n6Ol1J12r2QM1j15n3J37k9n4J11
4137C8k3j08R7jj96K63l9o8k1Q9r5O9L6o6R7m6J9m6M5j6L3L9q4j39J42p7O1K0
4165B3N8l7o2L4o4O5m1L9j8K0r1K5O1L1J2o7R5r6KK0p7N7O8n4Q2j08N6K6j00j6
4195e7L9j7P9j00M6n1M5o9P5r7J52l0J0L0ok0M0l6m2j1K9p1J96j34J5n9K9p1J52
4224F6k6m1L1%j0p7M8j3L4mP0oN4j85J08l6r0N6oM8l6n9L3RJ18j08M3l1%k7M0
4255CM1k05P7R7O1k07J70%k7k9l9Q8M4nN8j7j14J23j90Q1q1J6O9kQ4j44N2j17
4283a13J03J38j42Kj1k7N5o8O7j69J12J08j1o1o5J49o5m3J3K5rl%pJ20p3k5P1
4311G1j95J53j35J04pMq0P1qM6j18J09l1k6J16k4J1n3l1P0Kj6k9j5p3J09J39j07
$$ plain form
4110 72 112 64 -253 2 54 9 -6 -64 162 17 43 -136 10 53 -3 3 -28 84 -8 0 41 -74 -127 10 -19 -73 38
4137 38 15 -93 4 3 -193 70 31 -37 -58 31 -64 5 41 -25 72 26 45 -1 44 28 61 100 16 -123 19 -58 3 23
4165 23 81 44 -18 16 -48 17 -24 15 -3 17 -74 -49 12 43 55 -12 83 -13 -11 9 -68 -11 57 3 85 -23 33 59 -41 -57
4195 -57 -18 -35 44 -56 -10 -61 -16 -85 -10 -107 45 15 25 55 49 29 69 33 -9 -20 9 -62 134 0 15 -44 -15 -86 66
4224 66 40 -1 30 30 20 -57 -9 -22 12 8 78 72 126 -59 49 13 -77 -21 -27 21 -15 -74 -41 -32 86 -22 21 -10 -10 -37 3
4255 3 44 -161 -84 13 74 -133 37 37 10 -19 -58 30 74 69 127 110 -4 119 -71 10 -71 -55 14 12 96 -48 4 -113
4283 -113 -10 128 -14 -12 -23 -50 5 -63 4 -165 -53 55 44 -17 -82 67 2 -41 -28 -3 -12 -15 -15 -22 98 25 0 71
4311 71 -124 29 -106 -2 -9 -5 -85 -14 -22 24 -94 15 -16 -42 74 50 61 8 -23 47 49 33 4 -11 -84 25 164 57
4339E7q2P1l0j46J96j20O7q6q6M1j3J21O7N8q5J28j70N8k2K9M0j08O0j86K11p8
4365hJ99j82j03P4L7n5Pj8O3lJ3k6pO7jp6J13j05n7O8o9K6R0r6O2NJ9j49J66j63
4395a09lR4J5K1%K9j00M6k5N5kK1o6Q5l5j3N1M7j87Q4o0K9P1n1l9L6k7P0j20K49
4425A66k33J60j19L1r7Q3Po9M2j0n0J51k1r3J06Mk4j3O7p4JL0pj22M5j31L03j24
4453IQ4q4nj56J95o9Po9J8P9j41K04n9L1m3n5RL2j6Q6o8J18j24P9j6j8m2J25j46
4482c5K8RM7O2j13rjO9j24R7Q9j38K9J4k8q4J1J78j88J12J3n3J00j01Q8l7k1l0
4510a6q0N4k5N3qM6o4M5m3J7j8J4%o5J29k9m8N5pK1Rj7J31l4j14n1O1NJ3K6qj23
4542g1P6O7j05J23m0r0j4jk2J5J13Qm6J3j29L4J16L5j20O5r8L0M5m1M8KR0r7o2
$$ plain form
4339 57 -25 46 16 -130 66 -54 13 -73 -159 -118 -131 -10 57 115 30 158 -12 46 24 53 93 -15 45 -141 70 -8
4365 -8 191 9 -94 -20 17 -38 -31 -49 14 11 24 -2 -9 58 57 -19 94 -11 -68 0 -69 -43 47 -49 13 18 37 -112 54 -109
4395 -109 -112 -18 -3 18 18 47 -53 -7 -32 23 21 42 -24 61 26 13 64 111 -76 8 -52 -23 48 -3 -42 -6 -33 37 -83 166
4425 166 -67 93 -26 5 -92 -9 -2 -71 -29 -39 -89 62 41 -52 54 58 34 21 88 14 15 45 38 -84 -39 -170 133 9
4453 9 93 9 4 -152 43 -26 -19 -88 -70 9 -132 72 13 44 1 -54 -45 -13 -29 57 -11 107 -17 62 46 28 -14 111 -35
4482 -35 -7 2 49 111 -2 -11 -12 57 -67 30 119 -19 10 24 -4 -88 -77 101 -87 25 38 -15 85 -16 72 35 14 -16
4510 -16 -96 -42 -67 -14 -22 24 -40 5 -38 -21 -39 -25 -25 -90 39 10 -38 17 10 31 40 23 154 120 6 -45 16 21 34 60 52 -71
4542 -71 5 72 -33 90 50 -40 -54 -55 -77 -62 51 59 13 26 -103 -69 47 82 -38 27 -71 -41 4 -37 11 13 103 6 -56
4571e6K1n4J78j09Q1p9l0Q3m4R0n0N2k7N7o7j38J19pl2m6J78o6o9K4l9J2Q4p6
4599a0M3n8N7J6j37J02N3j34K3M3j0N5J2j6M3O4r3n2L3ll3N4q4L4j8M0r0J2N5
4628Ap7R4q5J11K6o2K6r8N2j6k5J4k4O0P5j21Q1k9j02J01m1j0K9O0NjK5M6j50
4657c5P8n1j6J04o7J23j67L5N4Jk2m8J4k5M2%j33P7R5j38R7l1O7or0M2p1J4J24
4686F7o0o8j1K8o1J35N7j08l9J25p0N4q6j1j6P7p0L5M2L9m6JJ1O1j51J28k7j44
4714a08Q8L1n3O1N0j76N3K4M1Q7j19J1k4j11J14O0r6k7L1m8Q4%Q6K1j24J08j10
4741d6j5R4N1j33M2j5J05q9%J21j20j9J6o7J90k03Q9J7J44j68l2L9p7Q6p7J45
4767G8j53M9M4N6p3J4K8j6M8o4M2m3qmR0m2n6l0J07Mj8j37O7pJ0J6j9J07kj74
$$ plain form
4571 -56 -35 -89 89 -20 61 -18 -48 35 -9 81 31 83 56 113 46 -92 27 20 -12 -58 120 54 -15 9 -30 -18 66 -10
4599 -10 33 -25 32 48 -89 13 66 -68 -45 -2 -12 43 55 39 82 146 53 1 34 31 -2 52 -32 2 -16 24 -66 -54 1
4628 1 -76 18 -67 44 70 8 34 -64 -12 -28 -53 -39 -63 -3 72 -49 32 3 -99 2 -39 -49 -20 40 45 44 69 115 -35
4657 -35 43 -8 -24 80 13 136 -31 4 58 59 37 -11 3 -22 20 20 -113 -36 59 -79 18 -13 54 48 -42 0 -71 -57 67
4686 67 7 -61 -72 -44 -105 30 87 -21 -60 65 -5 49 -37 -48 -64 13 -57 -22 20 59 13 14 25 86 -65 63 36 -108
4714 -108 -20 11 -42 19 69 -107 -54 -30 11 98 -21 -10 -34 -145 -31 29 -67 -94 -63 -111 -27 -27 59 80 -44 64 -46
4741 -46 -61 33 84 -49 -7 -22 83 -6 -6 115 -5 -24 -8 -75 115 -88 1 18 162 -6 -38 1 -76 10 -67 78
4767 78 -75 -26 18 74 1 15 43 27 75 11 53 10 2 -2 88 46 -10 -40 67 71 53 -84 -17 -24 -14 2 -17 90 88 -86
4797h6K7J41q5l5J03J1l8n5m3J37m8mJ5j27J33n3n7J35o3O1N3k5j44Q4k2r0mJ06
4825B7N4m8p4M7K1rJ2r0K0M6jn5j9K8r4J30M2p8j5n5O9N9l2L9o2O0KM1n4l2m1
4856f2K21m7j62J09J3r6N0q0ooJ4MO0Pk6Km1N8o9Q7p9J0pl4K20j37l4j5J6o3J41
4887D8j45l3P5L6M6p7J2M6Km4J0%J30j07J5J7O1j47R0m4j3J68j74Nm8J62j32P4
4915C3MN7k34J50O1o7k9n2Q6P8j28J10j24N8n4J84j19j04J62r6J18q1L1j35R0
4940am2l9K3J4J09j3j36K04l5K2j46J01j05L3p0P8m9Q1l1J05q4q3N1n2J48qo2
4967A3J5pj3pL3J4j34J17L3j33P2K0l9k8J0P0p3P3j06K0O7rN4j3K5K9j90J02J46
4996A61k11pL9Q3on2J7q7o5J44j5J7L9Pj31P6J8m4K9R5j50Q8n7j3O4m1j57N2K06
$$ plain form
4797 -86 -59 82 -3 -38 65 76 38 -17 -60 77 29 25 40 -87 46 -7 -64 71 8 69 122 97 -47 37 15 -75 -79 27
4825 27 81 33 -41 6 27 18 30 -60 -40 6 5 -50 -69 -41 -135 -5 37 -41 -56 -111 -42 17 -15 24 -38 22 24 65 11 -21 -62
4856 -62 159 112 -50 59 72 -24 26 -54 -60 -66 -52 -48 12 19 -7 -5 -46 12 -57 30 -49 -39 -46 -80 140 3 -31 -46 -30 -93 48
4887 48 -97 -130 -55 -19 27 -50 -38 8 10 -34 -24 -24 106 -1 14 31 92 -55 35 -9 -22 146 -28 -23 -71 91 -41 33
4915 33 37 94 -140 10 71 4 -25 -77 9 87 -41 69 -55 3 -51 133 14 -90 72 -24 94 13 44 -91 -1
4940 -1 -43 -82 -59 -45 64 51 -85 119 84 106 -40 61 -44 -11 -81 -3 -52 29 -2 103 19 -64 -13 -65 83 75 13
4967 13 28 21 8 1 34 48 -86 31 64 -69 3 23 -16 -44 -34 36 -37 36 -70 -50 17 8 62 49 74 103 -87 15 161
4996 161 -50 -57 -18 65 59 7 24 -63 -128 16 1 18 57 64 -67 9 27 -17 12 107 -43 45 -12 -25 39 -2 -159 -107 99
5025I9j29oJ22j84M0O3k7J59j20nkL0p0P2j2Q7m8m6m6J03q6M9l3K5m8pk7J05r7
5054c9P5nlj7J03j82L4M2p0N2m7J16j2n5m1J4j2L3k0l0J33m0l7k7J40j43Q9j2
5082C9l2n1j4m6J57n8N4m7KJ13j52l6O6p5J36o5P9p3j9M7K9lk5L8p1L3J8q8J32
5111H8l6n7J6J26j32JJ2L8q4P8k5Oj0p9L3M2k5N4o4rQl7R4J3K7j13RmK3jL0J1
5143C3l0q1J89j01j20J68j10L8P3q0P2J9m4lpl4k0O7o4MJ01K8j66J00L4j19K6
5170b7M5l5m4N3Jj6j09J59o9j2K7J10o8p1L3K6Ol3n8O7n0J15lL3Ml8r8O2j0k9
5200b9J46K4j78N7R7j51j8J18q3p6lP9p3J09m6O4m2O5p5N0k4j2k7M3k8ll2J08
5228F0o8N2n5o8L7n4J88n5o7kQ1m7q6M7M1n9J22Jq9L6P6j29Q8m8pl0J82o9j37
$$ plain form
5025 99 -30 -36 86 -98 -58 5 -22 137 17 12 10 40 -30 42 30 117 69 23 -23 80 -6 43 10 35 -13 -20 -47 58 -39
5054 -39 36 31 28 11 114 -68 -34 8 -62 -10 -57 59 47 -8 -49 -35 -47 -14 -34 -64 69 29 -8 -35 105 -38 51 39
5082 39 7 -44 -58 -104 53 -5 49 2 4 117 -35 -71 -5 -80 56 -9 70 -3 -22 25 54 51 26 64 -7 26 44 -44 88
5111 88 52 -5 11 137 5 6 18 56 -28 50 25 31 21 -58 -25 17 -8 46 -18 -27 -19 -56 38 51 78 -35 -26 -30 -7 -8 22 33
5143 33 3 -78 111 10 -110 58 -52 -14 59 -21 51 70 26 23 16 -18 -38 29 -35 -31 70 98 -68 32 66 -53 -27
5170 -27 18 -17 -61 -8 -7 -23 -132 27 -42 -54 -27 83 15 -56 -23 3 9 -24 -82 -15 -65 50 47 80 84 46 -52 10 0 -29
5200 -29 117 141 -37 20 117 -34 -52 66 -17 -93 -96 -17 -90 19 -27 37 -5 60 -15 35 11 -1 -28 15 -13 -16 -48 60
5228 60 -8 44 -11 -79 -42 -96 92 37 -30 -32 49 2 -84 -37 4 -55 67 68 -21 15 91 -38 50 2 -5 -35 147 78 -59
5257e9R5kLP2o8o3J10o5pp8O4p1oL4p1O0K3Qn3M2M1j46J53m4J54j24M0%o2PM6
5288C3ro9R8l4k7K1p3M4J21r0qO3j70O7K05j98Q9k15K36r9M8q5m7R0J6N0L2j40
5316e1kO9m5M5Lk7n7N5j2M5mOor0R3R6j7j88O8J03j16P2K6q1l3KK7M2o9N8j05
5347i3P6RR6r2P2r8J01n1K7L7j4L3j15o5O0j0Q6q9n1k8J40On1q8R9l0L1m7j3P7
5377A5P0o8m9P2Lj9m0l6R9j64P7O7L7j7m3n7kQ5O8o9L7m3M0l8j4o9N7K1J4N1j55
5408g0M2m7J28J5q2m1Rm7JP4j9Q3j41m1J34J27q6oj48K04o0o5Q6n0J32k29M0l3
5436i0Q8o0P4P5m2j8OL1p3N1n5M7r7k1k0J26J62k21P9j08J39J5j59K8k9Q4j5R5
5464I2k0Kj55K9P1jj74J83jr1J58j64L0qL8N6j8l3r0N8m7J05n2P5L4m2n4J14n2
$$ plain form
5257 -59 36 34 37 109 41 -22 88 23 16 -62 2 -69 -75 -41 -112 -52 -29 -21 -74 -32 9 -137 16 -28 126 2 42 42 -20 -13 33
5288 33 24 -45 53 19 -8 13 -60 -16 105 15 7 70 -100 -33 172 -26 63 -152 84 -15 33 -52 -99 -9 7 57 89 -51
5316 -51 -53 16 -29 16 19 -8 -65 -10 -22 23 19 25 19 -71 22 118 101 -87 -19 84 -32 40 66 -15 -48 -46 -19 23 -46 12 -93
5347 -93 -17 -8 88 -4 68 -30 71 20 47 84 70 103 -12 -77 -17 -27 59 -30 -81 -109 31 37 -14 -102 -3 -33 -2 -49 -62 15
5377 15 85 17 -32 40 43 24 -16 -52 47 -117 -40 27 64 47 4 -53 -55 30 98 29 66 23 63 25 11 -58 -1 20 34 85 -70
5408 -70 -28 -75 53 68 -14 -55 -46 -93 -92 -18 -37 46 -95 -136 -2 125 39 33 -115 89 29 -36 50 0 132 -97 -57 -90
5436 -90 -2 -62 12 87 45 27 33 64 -9 42 -13 34 -63 -84 -104 22 184 -37 42 -66 73 88 -71 -43 -72 12 -3 92
5464 92 72 74 -81 -52 19 18 -156 27 26 -65 93 -71 -41 -49 -11 45 27 -6 -96 -38 -85 20 -32 43 77 35 -19 95 43
5493D3l7j8J4j0l9J08r8MK0J11j42n2J64k9n3QR3l5M0j90J34j23J08n8n6J14n6
5520c5J5o7RnR8l4L0Jk4N4K5j5j36M2N9K3%m3K4j09J26q1n6P0m4J09o9J35k02
5549a00Q8j3J09j6J5p9O7p8k0K7r9J55o1L8nn0oM1j00J38L7j58J4Q4J20j20r5
5576f7J34j92J15m0J13nO1j50Q9q1M5rP4r3J5j32O4L0J01j12J9L1Kj18J40j19
5602h5K6O0J28j88R2p4rj5k3J64j09M0j9J12l7n9k8%O7K4r1J1J5j6mk5R4K2M3
5631A16n8r4M2R7o7M6j12kJ36k9k22J04K8K9j9Qp4L6jJ18r5J1L4j88J49J0q0O2
5659a5J5K6k9j72K54Oj05j17J86j79J32k6M7q3J43j80O5P8j28K19r3j6q5J61j50
5684d6O6L1l7p9j4K2J37j22Q0j12L4Q4Nj00k0J3J03n6qJ3q8Q3n7J47k5q7L0M7
$$ plain form
5493 43 6 -12 2 -8 -47 61 -37 -33 -13 98 -44 -96 68 39 -14 -6 87 52 92 -98 36 -87 21 -37 -93 21 -35
5520 -35 -20 -87 -78 -83 15 -19 11 12 -12 42 67 52 -84 -42 17 40 40 -3 21 -88 38 -43 -99 -29 -73 36 -33 102 -100
5549 -100 -12 -25 84 68 83 4 71 -7 -27 0 -99 56 -5 33 28 -22 -28 13 -87 51 88 -70 -56 28 148 28 -67
5576 -67 67 -125 -10 -50 63 58 119 -31 58 -23 22 13 87 -6 9 -123 -59 -29 72 -40 -21 10 12 -106 34 -85
5602 -85 -59 1 129 -59 33 -41 -50 -65 -88 76 -33 7 -12 100 63 4 -24 -24 43 67 -24 -13 2 -14 -18 -43 51 73 116
5631 116 58 -36 6 103 36 82 -30 -32 104 75 -147 -43 -15 14 -5 3 -71 -35 -36 82 -13 -2 32 -156 -7 3 -77 -15
5659 -15 0 26 -3 -175 79 85 -20 -137 49 -130 2 -24 23 -60 83 -97 -32 46 -82 137 44 28 -57 104 -46
5684 -46 20 51 14 -65 -79 -57 80 -42 38 -74 -40 44 49 -51 -71 -58 45 -11 -19 -6 -94 -11 -68 79 54 -33 -3 44
5712D4J5o3P9j29lJ6K7O1n8J6p4N6j6l3j1J63r8p4J01l6M6Plk1o1J01m2o1O4k5
5742a2J29j63J86j35N6q9J00n9P7j43j16J87j46J96j14M5KL9j52J48j09O8J6p4
5766f3O0q9J22j16N3M1L2n2n7K3LJ76l3K9j56J41j84J14o0p7J89m8qj19K71k04
5792a2J1L3j17p6O9J5J03k6M1M8q9n1J05j09RmJ17J7k8p5o0J64M7j33K0k9m9k1
5820h0J58j60J00M3n4R1L0l7o8p1J28j82k4L3K0J7oK8l4K8J00q7k0QO4r4J33L
5848F7j44K1M2L0J4j9q3J47L4k43K50j32M7o2J7J8L6L3n5L2J3nj91J09J12j34
5874d6J42P9j36j1k07J66M9p5M4N4p4m1m5J60K0j30Q8m6l5K4l1J09j27M3m4J33
5900F3j55j4J22M3o9JM9mj4m4J03J5j00l6on8J42q1l6J82k4q1M5j25O5J5j0l8
$$ plain form
5712 44 59 -4 75 -54 -57 -41 -14 47 -11 5 -69 -13 -29 -62 -73 90 -8 -82 19 -17 29 36 33 12 -49 52 10 -51 13 -12
5742 -12 117 -46 140 5 61 -28 72 13 90 -53 -169 18 -128 68 -46 -1 1 40 -112 36 -73 -5 11 -63
5766 -63 -3 -92 30 -86 -33 8 40 -12 -69 -46 -43 133 100 129 -27 114 -70 44 -16 -93 96 48 40 -79 192 -12
5792 -12 -1 32 -85 -161 -92 -77 26 0 41 89 0 -51 54 -55 -46 -50 67 84 56 -19 -79 85 132 -1 19 -10 -59 -80
5820 -80 78 -82 18 61 7 98 128 91 23 -48 80 -102 -126 -93 -73 -56 -62 -34 -68 -40 60 -27 -47 -39 25 -69 64 67
5848 67 -77 -56 -14 16 30 11 -72 75 109 -134 116 -16 31 -31 -14 4 40 73 18 50 63 58 -133 -24 88 -46
5874 -46 96 175 39 28 -179 -13 36 -39 5 59 -15 -56 -101 59 79 -51 37 -9 -44 -20 -51 58 -69 -26 -70 63
5900 63 -92 -106 16 59 -10 -9 40 36 22 -22 81 96 -4 -40 -46 -104 38 -43 -79 103 79 -2 43 -82 -17 -2 -12 -50
5928e0J23ko3J9pq0l7N4k8J28K1p3l2m5M2Q7j24J07o2n7J70j70J67j28Nk1l6J39
5956D7oj55J69p0M1o5M7n3m0J54l7rJ2m0Q9j22J3pN6j6j06J13R1l8k0J4r6J40
5984A06k08J64p3o3O2M8k1K2lN9r5nM2M7n2j01J07o8%Oj4%q0J71j24J01r2R4j31
6013a01J71m3q2l6L2P6p3Q0p7J05J3p9mO3J6j28J44o2j45J68m4L3rl3%J6o8M1
6041b6J22j90J04Pj7j04Q5p7J35Lj03KP3M4m1m0k2l7P9o3l3M6J77r6r6m2Q0L3
6069Cj17J19P0p8%RJ5m6n8R4Q5j06N5j2o4J00j19O9j01J42j23N8J0p8J2J10j13
6096f4o6K50j11M3m8J9m9L4l3K4o6J01Mn6RkK5qn7O6J0o9O3O8n5Qr7L3KL0l9L1
6128@J6M0o1P4j05N9N3J6mq1qq9NL0M6Nlj02q4J36P6q1OO2m2J16k0o6oQ2L6k02
$$ plain form
5928 -50 73 71 8 27 20 -60 -97 -43 -71 57 78 5 -27 -72 -30 57 -67 40 -22 -79 91 -79 88 -40 -35 -56 -92 47
5956 47 41 -114 55 -15 26 -39 8 -45 -85 69 32 23 35 -5 84 -38 -25 -32 24 8 -98 15 106 68 48 62 -34 106
5984 106 -102 62 -11 -74 -12 36 15 37 34 93 -2 -7 35 82 30 -71 36 -32 -32 -26 -40 -40 -120 51 -73 28 -64 30 -101
6013 -101 70 27 -55 -91 -59 17 -56 24 -53 52 65 -14 -18 45 61 -67 77 15 -130 38 -6 27 18 -15 -15 1 -67 -26
6041 -26 96 -94 10 17 0 -104 -19 -96 39 42 -61 -59 14 58 17 -23 -45 -82 -3 -66 -99 -53 124 28 -68 -110 -30 3
6069 3 -114 5 75 -3 -3 6 21 -25 -83 11 96 -10 45 33 -31 69 -50 19 -82 60 -63 -5 5 -73 -61 49 -64
6096 -64 -130 120 9 52 4 23 -26 8 -25 -1 -67 34 38 -18 -9 -11 14 6 -51 15 25 -44 19 87 32 40 -57 -24 -22 8 -31 0
6128 0 16 56 -5 69 -36 23 76 92 88 7 -1 -90 -85 -55 -9 -4 -7 -109 -193 -57 19 -62 -56 6 -36 80 60 -6 -12 70 106 -96
6160i6mJ1J91j29M0K7J7o1k1j8J4JNQ3k3j01RP0Oj20O4M7k4O1m2J03r3lJ05j50
6190c1R7k6p2P2j49K16j6q1l7n7J24Ln8M6j37J83q7j6O5l2KM6m3l5l5Q2j20J47
6218E1p2J58q9j45J11r1K7K6p9J72p1n8JJ1n3O4j4P4pq7J77k50J28K9L4j81J62
6245B8Q0q8o7j8R7k1k5o1k1J33m8O4n8L7J6Qj20Q9n1p9j7K05l8J2r6O1j05R9N3
6274F9j78J62q0P3j18M3L9M6n7j3k7N5P3l5j27N2R7k3k4P0j78j7J5Q8o6L0RJ85
6302A63j17j50J04q6Q3M0q7j0N4j25J07r5P5Q1k8L8p7M2p1J0K1K8p1j1P9J06j40
6329c7k0Q0p4O8m7P4K0q1q3O7k1J62k3k9p9N1k4J4P1q8p8k5J09J7J5j03M5N5p7
6358d1JN4k7m7R5p6O3j08N3K4JO7j41KJ4O5K8K4M0j54R6m0pO9j24O8nQ5n8n6J3
$$ plain form
6160 -96 -100 -89 102 -27 13 40 57 -4 -25 -43 -29 -28 -23 60 37 -64 -55 15 21 -99 -35 12 -12 49 7 110 17 14 119 -31
6190 -31 66 40 -32 40 -109 107 91 10 -27 -84 40 43 -15 31 -106 77 -10 -26 39 7 9 55 12 -23 -58 24 -96 51
6218 51 -21 137 48 -97 14 -77 -50 -24 -103 69 -2 -60 -59 -48 -101 -37 -51 23 16 -71 106 -144 -16 13 47 -134 28
6245 28 108 20 -47 -65 32 11 -14 -75 -96 37 -11 53 -5 32 48 56 -64 25 -26 -105 -122 83 45 57 -39 22 -83 16 69
6274 69 -109 53 -27 46 -72 -29 10 56 -1 -14 -41 14 87 52 -75 -23 74 51 27 97 -81 -98 -83 5 -61 -31 -22 163
6302 163 46 -104 0 -86 -3 37 -50 -60 -6 -131 -24 -119 -44 37 9 47 -30 12 -59 -49 -28 0 -71 -82 -3 103 -37
6329 -37 -57 23 -51 17 -30 44 64 -17 -100 -33 -54 108 85 56 -23 28 4 18 89 1 -77 -102 7 24 39 -64 -19 36 -41
6358 -41 -40 14 -13 -60 35 -41 22 -86 -33 -9 -8 59 -82 -80 -66 -1 27 51 91 -63 33 -7 -14 55 -69 -1 -6 79 21 -35 -22
6389b2N0M1j59pJ42l5KL8q3n4J52o4n1R4kn3m7q4N0O3L0M2j07j3J15r1J11o6r4
6418a02J1M2Kk1J08j92M3J18M8Nj11N6L7j49J74k20J96m5PN4l1K1j12J00j01R6
6444C4k9m2J00j09L3LJ5q5K9J67j05l9QJ65j20MM1k5p9M9oL2o5k9M5oON9m3Jj81
6475a72J72r8J40j28N6L0m1RR9j17J26J9o6k3k8P9L0Ko5k7m7K8k3P6n9M8l9K7
6503Hlk8J43o9j03J90n6r3o7J46l9q1pO3L1j8J6j04J20q2M5K2n8J29q1j48R3r2
6531a23J16n0J02j13J12j74K04j21Pk3J71q7m2O3r8J51o9P4o2R7j95nJ26q0n8
6556g7M8l5Mn5R3J00j08J03o0lJ3M1n4j47K12o1l5N5k11K22k7Pj23Q4M4KM2oj14
6585d6J28j55Q8n2J02j24M7P9m9nr3J40l7m3P3N6j04K3j06J74k07J50n6j7P3l5
$$ plain form
6389 -22 28 69 -90 -97 45 10 12 50 -33 -87 65 1 -50 44 42 -11 -58 -142 -92 -29 1 43 -64 -77 38 -53 58 -8 -102
6418 -102 -91 -49 -47 -68 40 -152 -109 9 57 62 -49 7 44 -105 69 -151 45 0 7 61 30 51 -61 39 -62 34
6444 34 5 -37 63 -46 -13 -10 5 -80 -51 116 11 -28 -20 145 25 29 70 45 -34 15 9 41 -24 -53 -8 -14 -8 51 8 9 -172
6475 -172 0 -98 42 -86 -30 0 -41 -32 67 -50 76 95 29 6 -22 57 87 89 24 -3 -50 -22 -45 31 -28 20 -19 8
6503 8 5 -23 120 51 -52 138 82 -11 -78 68 29 -52 -59 4 35 17 33 -71 49 -33 12 34 -24 105 24 -124 -31 -123
6531 -123 -7 -57 45 -68 44 -130 74 -47 -40 -63 108 21 -21 42 -56 95 26 100 38 135 -60 -65 61 -19 -77
6556 -77 -29 -64 -60 -115 -22 78 -30 73 13 10 23 64 10 -137 75 14 -21 34 -177 45 18 25 -98 -14 30 32 74 68 -46
6585 -46 82 -73 15 -37 65 -59 -12 67 18 13 -80 60 23 -20 53 109 5 28 -78 96 -111 39 -17 -34 39 4
6611DN8J7n2K0n5rkK7L8K1q6n7NO0l3J42m3j21jJ55r3N7l8n3J60m6p6k0J19j88
6641i0K13j67K2N0Rk0jm3R2k7j49N3M2mM2j22N9J09M3j24K8L8j10l5J44k8k8l9
6669d3J09l9J9N7m7r6r1Q0J14j59N5J21j40J26j0j78L2K5p4Q8P5P2jn4Lk6N2M5
6697A15j37j9P0J1o5J22q0o1P6L1r5J8J11m2m3l8L2K2r8P8p8p5K38j19mkL2k0
6725b0Jl1M9k0n2kP3QJ0j5k7j7O3o0L0M1j80J55o5k6Q2J04k00Q4O4q2L2K8j11
6754h4O9Q7n6J9PJj01k1j21K04J3j3L6k3k7L4m9k8nM6Qm7j02J87k2LQ3j20J54
6783A32k4r5j6j0j27J37M9J0l4J3N0j19qR5m0K7o3J84j53J10j57K3N8j2K8j37
6809g9J6J65q1m0mj2K25j87N6o9j0k4P6J2r9J31j99N8O5o2J27J9m9jk0l0J3k7
$$ plain form
6611 4 62 79 27 47 -8 -17 -19 8 46 67 -19 -76 -71 -11 -44 98 55 -66 -67 88 -5 52 14 -39 121 75 -1 -21 98 -90
6641 -90 123 -44 -22 28 37 17 16 -27 65 38 -111 -58 -16 -20 22 -100 -41 68 111 -13 15 53 -57 -92 52 24 -4 -43
6669 -43 66 27 46 103 56 -40 -131 -51 63 -96 -41 80 -60 66 56 -122 -90 -65 -139 -51 24 96 95 41 44 18 70 115
6697 115 -22 -41 29 40 -25 97 17 -44 32 63 -32 -14 97 55 12 -26 6 28 -70 8 -70 -145 93 -26 -30 -32 0 -20
6725 -20 -19 -50 -1 -21 -73 -75 -2 6 16 1 -26 -43 20 -40 -10 31 -149 6 -59 -85 -3 101 -99 -15 49 -33 -1 27 -84
6754 -84 -15 72 16 35 42 43 -58 -79 -200 4 17 4 40 17 -10 24 -25 -53 -58 -12 -4 -51 -153 34 12 15 98 -22 132
6783 132 108 13 -3 -13 -140 -3 46 56 22 35 85 -34 -42 53 13 40 -23 161 8 118 -39 -16 42 30 58 -79
6809 -79 -63 102 21 -19 -23 -35 190 3 59 -10 -20 -44 32 44 -55 76 -123 -65 0 -62 65 84 35 34 14 -16 -3 -30
6837c0j8L2lPM6L8n5P7N3m0j84J63j68j3J09m5o1J23m4R6Pq0K6Kj85J43M1q3M8
6866BM7o8l2J18j25O7rj1K9o6qN6j21J30j02R3j23J11j0L9nk8L9m4lQ0M3r3L0
6895C6r3P7j19OJ76r1r9O2R0Nn6k3J40j03p4J44k5j23J35k4QJ6m8j21N7J36m0
6922D9j42J28n9N2J8j8k0j68K09nN5Poj45jR5j34J33J3K6p9q8R0q9N9M9M8p4J0
6951A3k6ll0Q4Lj25Q3K3N2j2p3R7j6j41J45j47J26k60J91MJ4L9j32K31n8j1j42
6978g1J52o8r2mJ47j23K3J08p3m6O8L5r6R8j39Q1k4L7K2J4n4J7O6k6K6m1m7Q1
7006G1m7j3K7o4NP3j27N9l1M6P0j05nJ7J24j59N0k3k7O0q3N0P5no7jJ9j26K74
7035A37n4q1j48J29K14j19k7j41J85o2q7J36o0PMO2q4J60j94K1n0K0O1p9K3K3
$$ plain form
6837 -30 -48 -16 -19 -12 34 72 17 94 147 107 -77 86 -82 -95 14 -31 -92 31 -13 83 90 10 36 38 -147 -4 37 -46 2
6866 2 49 -19 -51 67 -58 9 0 -11 18 -48 -56 0 -121 9 -93 0 -123 -12 -22 17 12 -16 23 -21 -24 56 99 6 36
6895 36 -57 20 -99 -93 83 -8 -107 -45 45 50 -6 -29 111 8 -66 78 53 -70 65 41 49 65 17 -104 -47 89 49
6922 49 -93 35 -24 28 46 28 8 -160 49 44 99 106 100 -45 -46 49 -85 48 61 87 8 -80 10 -79 -20 29 77 3 13
6951 13 -13 -16 -46 38 41 -84 -1 22 74 62 -11 86 70 -71 74 -73 53 -207 -16 -12 2 41 -91 140 82 71 -71
6978 -71 81 13 -79 -83 64 -59 -36 72 -1 -47 21 56 -40 58 -81 0 -24 13 35 49 -5 12 78 52 78 37 -10 71
7006 71 24 11 38 -26 -21 52 -75 -16 -47 -1 69 -36 -41 -24 100 -59 -9 -32 -59 1 -82 -32 43 38 -29 -30 -11 -137 137
7035 137 83 2 -146 -17 197 78 51 -90 95 33 -54 82 22 29 33 95 11 171 -23 -2 -52 -32 29 -50 -27 -4
7061dJ12k20R4L3p7J42p0L3K6j18J37k07J76o5Q8O3J3j45q7k0N9N3n2j1L0K9k2
7088a0j3%O1l0M6q3K2P5p7k0Q4j51J10k5o9N4R4N9j23l1M2N5q2P1l1j06L7k2K7
7117c6jN4j22J55q2J33j09n1O5N1M7j84J48k0l1O8P7k20J39o0j7n2M0n9L0Q5o7
7144a9L1M9o8Rj11R4p0j0J85j96K36j23j08K1R3o1Q7J9Kj17q6J94n1O0qn8N3r8
7172e1L4o7MJ21r6o0J49J8j2k7m3M9p6J07q0k1M7N4o1k8K3lj27J73L9j42J5j2
7200g3N2N2j7rm5k5JJ09J38k00k5J16Kq8Jj3n9J19K2n9j1qN8m0k1N9r6r1J55m3
7230c9j32J99q8p2J58L5j41L7K4O8j09J15J7l2j12J29l5k1l4J17o5K3l2K9l5j5
7256a1nJ07q6r8J46O8l3L3j54l4P0L0m8P2p0n3LL1K6q5M6P6m1r0L6N9M3j6k2j2
$$ plain form
7061 -4 108 -112 -18 15 -62 80 10 43 69 -49 88 -119 57 -8 80 143 156 11 -76 -96 -37 16 -36 -47 -17 12 -10
7088 -10 -23 -23 38 8 54 -29 -7 68 -9 -29 55 -96 14 -11 -80 -26 68 127 4 -27 15 70 -12 59 28 -78 -41 -63 -36
7117 -36 -37 17 -105 50 -32 101 -8 -59 6 57 104 -80 68 48 17 85 162 -58 81 21 4 -48 -8 -67 -37 48 -19
7144 -19 12 61 -7 2 -109 -15 -85 -95 90 -106 130 7 -101 -80 13 -48 39 58 60 -57 -143 51 0 60 52 -6 47 -51
7172 -51 -17 -84 -80 41 -55 -115 34 52 40 13 -30 19 -57 50 -30 -51 -4 50 -11 -39 -16 -19 -146 27 66 -76 -61 -73
7200 -73 -21 31 14 5 -40 -65 -64 45 183 -17 -42 74 76 -12 -11 -24 -83 36 58 -1 -12 -20 38 -2 -23 36 -60 -151 4 -39
7230 -39 -171 28 -60 -132 26 61 -80 -43 -19 49 -60 55 72 40 -72 57 22 1 -33 84 19 42 10 39 4 -11
7256 -11 -16 91 5 -93 53 121 88 121 -33 -67 3 33 -15 57 -13 -66 -63 -32 -6 -91 -45 31 -10 -100 -64 -5 38 22 0 -12
7286a2M2j66J50l4J98j49o2n1J60r2J52j12L5j4J5l6M9j7j45K1P6p0qQ7k2Mm9
7313e0J4J2rL0MO1m3O3r1K7k5Q0lj9n2j28N2L9M1j16P7J05j06N1QPJ2K1l0lJ2
7344D1rm0P7n1K5j27J32j11P7k5j0N8m8L7m0K5j9Rl5P1o1M4j8KK4RK4r3N0J01
7374A19j93J56op7M5m8P1j08RL1j5Rm9j7J1Q3p5J06n9k6O4j34N7O2K7l8n7K7m9
7403g4O8l1J56j4r2j7kj5n4jN4M2L9k9Q9k1q3r1J50ml0m5M1jo9m1R7p3N3K6k7
7434AO1K6j95J15l0o1Q0j5l6r7K41q0nJ12j50O4L6l7k1K6l6oK0l7M7jk0J2P6j85
7464i5K26k01L4R6J0j5n3J7l7K6l5N1Jn8K2n3J2J8Q3L6j69O7q8Q3m9Q9l3K2p0
7493f3K59j53m8J3M7j05m7J19K2q9RL0J00o8q2J05J6M5l5j01k0P6Pm2n8j3P8N5
$$ plain form
7286 -12 30 -136 14 -20 178 29 -33 -84 76 -16 136 24 59 45 60 24 73 56 -89 -68 8 -62 -70 17 -5 -1 -50
7313 -50 -36 -24 -33 -3 1 62 19 82 -9 18 -7 73 70 51 -1 -129 -77 -38 3 -113 -36 69 -37 14 22 29 41 62 32 29 41
7344 41 32 -8 69 18 43 -84 48 -63 14 -11 -21 37 -11 26 -14 11 -8 1 -34 37 -24 20 2 4 28 37 61 -32 18 119
7374 119 -74 82 76 -1 44 -4 67 -41 -32 -1 -16 -7 -56 -73 -62 21 -54 52 -7 -33 31 -103 -46 16 43 5 -52 -25 -74
7403 -74 -6 -37 119 105 13 -4 -6 -21 -75 -76 -22 20 59 30 119 98 15 -76 74 70 40 -5 36 35 -34 -75 22 -51 2 28 1
7434 1 62 88 -107 8 -22 -83 -3 -18 -54 -151 90 10 5 117 -33 31 67 30 9 35 -1 -7 13 -24 23 22 2 14 90 -95
7464 -95 131 -70 -36 60 70 55 2 19 -18 8 -27 24 25 -33 -11 -64 -52 -34 49 85 -84 -17 -105 -22 -71 18 -15 7 -63
7493 -63 196 43 -5 8 55 -50 -97 22 44 -45 -36 -6 94 26 -56 49 65 110 75 -26 -46 30 37 -5 -63 -76 2 57
7521E7J3k7p6Qk0jP4o1M0L7m0o3P6R4r8J5N8o7o7RJ18P1j43m4J20j10k0J03o3
7550gm9J50q8k5N9n8O9j04J54o5R6j22k16J64J6N7O7j62J70q6J28j57j9J4J4P
7576GkM5n9J17q3j45L4J04k9L3K4p6L6j01N4R5r3jRM6r7J6L9L6q4j3R2L0K6l9
7606B1j11KR9M9o9L8j13J15K5j2n9l2N2j54J47m4Q4r7N2K23j45j27J16p7Q4m7
7632B0Q2r9Rn3J29j16k1k0J26k0m9P3m8p9q5J09O4L0j23L8O8l4n5P3l9rQ9q5R8
7661G3m2L3l2l9j1J22m3o2J0K4j64J25k3j6R1j17Q3K8r4J2J43r2R5j19k3J9q8
7688a07J65j04J2m5J16q4Q6j4o2J24r9l4J29n5j44J27j33J53M0j69J07K3J0k4
7712A8j28P0O1Lk7Q4j11J32q9l1O8mn2L5J8q0J39j37P6p4R9j50J68r4pJ02j57
$$ plain form
7521 57 70 43 -33 -25 -45 -46 28 -33 7 44 4 -59 17 111 13 28 86 19 -48 -39 79 150 7 -37 83 -27 -47 56 -7
7550 -7 -56 94 6 -19 40 -18 51 -53 101 36 132 10 -206 -42 -26 31 98 -64 106 20 148 -9 -28 -14 0 7
7576 7 5 50 -9 108 25 -120 -86 18 -11 22 46 -30 6 -95 -41 54 -39 -40 -31 15 -82 -66 -27 9 -75 -88 4 34 60 21
7606 21 -90 -88 11 60 -9 29 -84 31 56 44 -15 -47 5 -149 -2 -46 38 -59 -7 216 71 -56 60 -17 67 20
7632 20 102 3 12 -41 88 -28 -49 -69 57 37 -12 61 13 -66 -151 -42 22 52 -71 -33 35 1 -54 19 -20 -29 60 -25 73
7661 73 31 64 32 -7 -18 104 61 -1 9 33 -131 -6 -29 -45 46 -71 12 40 -54 -42 101 9 104 -15 -38 -19 -107
7688 -107 58 -46 -34 -79 37 -47 39 25 -37 87 -12 -46 83 28 -116 11 -122 31 71 -98 9 32 42 18
7712 18 -110 -40 21 24 -3 81 -30 102 13 -18 50 46 -6 29 47 -33 106 -31 45 -29 70 -80 88 -6 -13 89 -68
7739f8J18q8J30o4%j07R6N4P7r5l0p7R6j20K6P4j4n4l7k2J06l3J5K4jP3l7j64
7767a22J52n6J33j40J16p3P8j28mP1P3p0j70K19n0q1J00m7J6k0L1j72J20R7j02
7792b9j2Q9K2p7m1J72n6q7lJ52l4j39O0R7k4j76N0P2n7J12j44ml7M3pP1Pj28R5
7821a3l4j2j3K0N1q4L2P7j08J01L0j01Q5p7L9o0O9j15KnJ27M4j54M0J03j04OM4
7849a0N3n5J03p7O9n9m6L0k8J15j15nLl0K9M4ON1mp1r1J30J7l4j09O7k5P4m5l6
7879d9Q8L4o4q1J00O2j16P0j8PJ3j9j28O4R4Pj1p8J26L3j44Q8p7N1j04O0m3Pl1
7908e9mO8r1J94j57J11o1l2M4j09J67p4n5J50j42k4J27j5P9j94Q2K3M7j29J29
7933G5m0mL5p3q7R6N8J5l8j01k6J07Q5j71J96j01m7N5j03K8K3K5O7q8j2k7Q5N1
$$ plain form
7739 -68 50 -38 92 28 28 -79 17 71 148 53 23 -54 42 -78 -52 22 8 -46 -83 -105 1 -32 -17 7 6 79 42 -122
7767 -122 30 -26 107 -33 83 10 88 -40 -44 27 100 30 -140 79 29 -52 48 1 17 -3 28 -144 -24 73 -29
7792 -29 -41 48 70 -7 -48 124 68 -19 -22 130 96 -43 17 114 90 -86 -36 36 -21 91 -53 -57 -94 -51 -58 13 20 -108 -13
7821 -13 -47 -59 -72 -52 -1 -85 -53 24 -84 17 47 -54 31 -46 -7 -67 2 -113 -111 -116 11 55 -99 -59 44 -60 -54 -10
7849 -10 43 -12 91 14 83 24 -22 8 -20 95 -20 -25 -22 -52 -23 21 27 78 74 3 -88 42 59 25 -84 -17 -42 32 -13 -49
7879 -49 39 73 9 -72 28 90 -26 44 26 33 46 27 -101 -37 57 64 53 -25 101 134 -10 78 1 52 -52 8 -35 -28 -59
7908 -59 -63 5 -86 108 -49 62 1 -31 13 -96 71 -3 -58 92 -50 -74 53 38 117 -77 5 28 75 -54 75
7933 75 35 31 66 -7 -94 2 60 75 37 -64 -90 17 102 -69 127 26 -21 34 -69 -41 -18 7 74 -14 -26 -53 32 83
7961H3o3o5L4n2N4J54l7m2l9n1J3J16j5o9K8k8N5p0j2P9j87J49O0p3k3k4m6Q1
7989A0L3J6r0P1n1%LR2n2l6pp2K7L4M6l4L7Nn5lJ78j69O2j74J47j4rM8l3n3N1
8020HN8j17O9M7mk3o9j03R7L0k7p7J07J04m1k6OL1p3j30O2N4k0J64j23P7n9p3
8048e1j6M1L4p4P8Pj28M4N5j43O2R3J29j77p9J25J0Q5q7j0%m5O4lm5o8J38l7l0
8077b8%N4m9MO5l1L2j50L8M2PO6j47J11L7L7j76K07l1j26J6l3J16o5J04o4J9p9
8105b4K4lJ49j99L0j4M2N2k9p9q8K50k17n1J32N1j62K24l4j26L0O8K6Qp7J1r2
8132i8R5j4J1P7p4n8j5N0n1O8qj6O4m2j28O7OlN8p4J16KJ9p1q5N6L2J24j77J1
8162e8O4Q0p5N6j00l6J54o6m6k8K8k8p3M3J70j50O6Pp1Q6m5o1N9nO4q9J10j27
$$ plain form
7961 83 20 -45 -11 -63 -9 145 108 66 27 -24 -11 105 90 21 49 21 76 6 -6 73 -114 35 95 22 -1 -25 -71 10
7989 10 43 59 -31 40 -11 -11 -8 84 32 -4 -11 -83 -56 -22 24 -10 27 32 -23 -26 152 -17 45 -129 18 4 -5 43 10 -43 8
8020 8 66 -51 18 65 61 38 -31 -134 -37 -7 -34 -111 -4 100 59 33 39 70 -3 -133 -71 -17 -37 127 4 81 22 -51
8048 -51 -67 -26 8 -66 12 19 -109 -65 -10 -153 -91 2 131 -46 -125 0 10 95 8 -2 -2 -47 17 14 -31 -99 39 2 -28
8077 -28 -28 26 -23 -19 46 15 47 -103 -65 -23 -16 50 -97 14 51 88 -88 119 88 -38 -22 -55 61 -4 100 36 55 -24
8105 -24 0 -3 146 -53 -23 -37 5 57 28 -51 -139 111 -106 -157 -25 26 -136 88 54 -72 -42 26 52 60 -17 -6 -98
8132 -98 -3 -17 -6 71 -3 -61 -76 -26 -77 -9 -17 -33 31 -11 -139 -72 -66 -69 -11 -85 31 33 52 -19 -104 -48 -16 108 -69 -58
8162 -58 6 86 11 67 -33 -69 85 19 -27 -55 -27 -55 -128 -85 85 -65 1 8 -63 23 -22 -83 -24 -29 35 -54 56 -71
8190g1R8
$$ plain form
8190 -71 27
8191B7
$$ Imaginary data points
##PAGE= N=2
##DATA TABLE= (X++(I..I)), XYDATA
0@%%%%%%%%%%%%%%%qJ6j6J6j6K4l2L2m0M8n6O4p2Q8j00J11j27J48j68J85k09K36
37A24k63K95l32L69m09M56n05N57o15O79p51Q30r12J002j105J218j342J480j640
56h64J824k027K263k543K876l282L793m453N341o617Q612j2184K0547p7913m9562
71a14189J05145j3498R23M8482K0492j8119L1359J2504j9327k589J0321k5827
83C5677q710P486j4347q209J0814k2743p213K3714j1837k1318J9160J614j2322
96h234J6280O992j7751J0624K0310j5171j2076J5228p999j8108J0570l234j8342
109b0911J1215K484j5736J4760J2217j7187L798J4367j1289k651J6725n335j4370
122a1913J2748P162j4066P536J0078j9108k259J3125j2687n453J1859p142m995
$$ plain form
0 0 0 0 0 0 0 0 0 0 0 0 0 0 0 0 0 -8 8 -8 8 -8 16 -16 16 -24 24 -32 32 -40 48 -52 59 -68 80 -88 97 -112 124
37 124 -139 156 -176 193 -216 240 -265 292 -323 356 -395 435 -477 525 -580 638 -704 776 -864
56 -864 960 -1067 1196 -1347 1529 -1753 2040 -2413 2928 -3689 4923 -7261 13286 -64627 -114189
71 -114189 -9044 -22542 -21619 26863 47355 29236 60595 73099 53772 51183 61504 35677
83 35677 26967 34453 20106 11897 22711 -32 -7245 16469 4632 -16686 2474 4088 -8234
96 -8234 8046 15038 -2713 7911 28221 13050 974 16202 8203 -9905 665 -2569 -20911
109 -20911 -9696 -7212 -22948 -8188 4029 -13158 -9360 5007 -6282 -8933 7792 2457 -11913
122 -11913 835 7997 -6069 1467 11545 -7563 -9822 3303 -9384 -14837 -2978 -10120 -15115
135a5115J3567J263o222Q645O311o049J712N044o749o43Q096p839l871J1984n886
150D248r731R788j493r094O732k36j0537N045Q449m861j448Q529n98l772P885
165H906k74q767O104J382j1819L428N433q686O79N107n899n64O306l024n094M618
181b164K595n396K375N855m117J276P052n203j866O106m741l368M367l099m470
196d798K626P46j715J738K395k292j039M015j252k505M473r72l418M157P3l008
212g76M250J06n055R75J151k087j076N21l54j013K278P38k310L303L074l809M36
229C52K034k642J422J360l233L36K211j207j303K05R10n10j670J25j088M54K891
246F47j437r67K785n9J86J863j662m61J470j876j009L31M31N10j125m03N76j97
$$ plain form
135 -15115 -1548 -285 -6507 2138 8449 2400 4112 9156 2407 1764 9860 2021 -1850 10134 4248
150 4248 -5483 4305 2812 -6282 450 214 -10323 -5278 3171 -1690 -3138 5391 4793 1021 8906
165 8906 8632 -135 5969 7351 -4468 -1040 4393 -4293 -3614 1493 -4406 -4970 1336 -1688 -6782 -2164
181 -2164 431 -4965 -2590 3265 -852 424 7476 2273 407 6513 1772 -1596 2771 -328 -4798
196 -4798 -2172 -1426 -3141 -1403 992 -1300 -2339 1676 424 -2081 2392 1420 -1998 2159 2232 -776
212 -776 3474 3580 -1475 -500 651 -1436 -2512 -1991 -2345 -3358 -1080 -342 -2652 651 3725 -84 352
229 352 2386 -256 1166 2526 -707 -371 1840 633 -670 -465 445 -65 -1735 -1610 -2698 -2244 647
246 647 -790 -1757 1028 969 1155 3018 1356 895 2365 489 -520 -189 242 752 -373 -776 -200 -397
264c97Q72l53j804J415L5j639K087M30o09J734l34j015R30n9p23p83n99K06j241
283a847j26K080q09l28J302q80K94R90j186M01N97p97M32j24L75J338n75m07k65
302D65r95R21r3j924O63O2k74P71l73P84J421p98l48Jl58J057j50j221L33J6L33
323B93N75j090L58R13j309n14k86r6J119l77o28P92M08O71L20p99L72L04j167
342a41K57n1o72R74m53n30N62j71L80K40r37K84l62l38R80k77k5J033l81m2P29
363A059o07K53k1q60J6m24l95J136k87j08K93n65O60L47p38J85J11l58L93n57
383d67J86J174l16k52J68n90N10K6j103P7L3j53L24m72N59Q42n14J71J20n58P11
404D76n6o34J81j79J93Q27o21n0N39n12j17k88m06O94l35l16L04l35P08O51p26
$$ plain form
264 -397 475 122 -1682 -267 -232 -1871 216 646 37 1771 1437 422 1352 1293 570 -213 -812 -606 -1847
283 -1847 -1973 107 -702 -1030 272 -608 -314 676 -510 -109 488 -309 123 -1 374 1712 1137 730 465
302 465 -530 391 298 -1626 -963 -901 -1175 -404 -777 7 1428 630 282 283 -75 982 832 -389 -56 -40 293
323 293 868 -222 136 1049 -260 -774 -1060 -1156 -37 -414 -1042 -250 158 829 1149 350 722 1026 -141
342 -141 116 65 -607 367 -86 -616 -54 -225 155 395 -542 -258 -620 -958 22 -255 -280 753 372 330 1059
363 1059 452 705 684 -176 -160 -584 -979 157 -130 -238 55 -510 150 497 -241 -56 55 -303 90 -467
383 -467 -281 893 577 325 493 -97 413 439 -664 -587 -554 -707 -383 -855 -296 546 32 203 323 -235 476
404 476 420 -214 -33 -212 -19 808 187 137 676 164 47 -241 -647 47 -288 -604 -300 -635 73 724 -2
425bK91J74o14O20l56k78N54l38l62L36k05K92K51l64k1l66l13O19k47j00N58
446A29n48M59O09p88M30M16m34k10k07p2L72j59L6j58k91N77O1n29M67k30l80
467d50N59l91j72Q92j52j05J73j93N2J68j29j62o39L85L92p26K07N82n89L57Q5
488A44p86R16j6n34J49Q0k44M09O8J80j70k11M52n74k29N99k66l01K83n81L98
509b34N86m38L9L27k75J22O8q3M8k64K89Nn25N58L03n27K52k48m71N57p6m35L72
532e0k18n5N60k12N9N5J62k0n22J86K69l72K28J75p43N07K87n28K28J52m58J42
554a68J53k39M5K65K42m25j00O62k05k13L78m44j66N64l58j60L63k83m3J64j78
575a46P8J62N2j08l89K96K33k23J61K23n16L63L1m34L87mk32j31Kj20L06l2J24
$$ plain form
425 -2 289 463 -151 469 113 -165 389 51 -311 25 -180 112 363 -1 -22 -388 -701 -82 -329 -429 129
446 129 -419 40 649 -139 291 707 273 63 -144 -216 156 -3 33 -125 -416 161 222 -307 160 -70 -450
467 -450 109 -282 -454 438 286 181 354 161 213 381 252 90 -549 -164 228 -498 -291 291 -298 59 144
488 144 -642 274 258 -276 -127 -47 -291 118 186 366 196 -15 437 -137 -366 233 -33 -334 -51 -632 -234
509 -234 352 -86 -47 280 5 127 195 112 160 -104 185 190 -335 223 526 -1 251 3 -468 89 13 -422 -50
532 -50 -268 -323 237 25 84 139 301 281 -241 -55 214 -158 70 245 -498 9 296 -232 -4 148 -310 -168
554 -168 -15 -254 -209 56 298 -127 -227 435 230 17 395 -49 -215 349 -9 -169 194 -89 -132 32 -146
575 -146 -68 94 146 38 -351 -55 178 -45 116 339 -177 186 217 -217 170 166 -66 -197 -195 -315 -9 -41 83
598H3k98P7L56k97nL86n60J52L54l86J9L05p0l5k9j06L0J22q9n1k17J69J20k14
622a84K58k7q5L49j95k50K71o9K0Oj17rK88j84o0m7M2J79k54j66K74l06K12J42
646H8l26L25j2L5P0k19k4K34j77j92L30k10J44j46n8L23j93M5K12m77J43J44q2
669b3J90r2j83J55R6r9J52j28l3L5k42J29J59k82L37q8l53L52Jj81K12m7j23Q6
693C0n3KQ6J5J48l42Q6J82k96P0K32l04J21N3k01J01J03L0M4j71l6O6L8J20r9
718B5j65J33M2j74L24j56j20L13k80l9J42j93J48j13LJ24J1J3J78l19N2J77l32
741b06K29Oj18K2J76j77O4N1j76K27k73R7Q7l2k0Q4k41K00l4K3J20j72L6J66l18
766a79M1Q5k6J14k2p0P8l5K1O0k12J75M4k21J79J0o2J02j4k21J08J28q5J59l03
$$ plain form
598 83 -215 -138 218 -79 -84 302 -258 -106 248 -138 -119 186 116 81 52 -54 -24 98 9 -42 -259 -90 30 -184
622 -184 74 47 -38 311 116 -134 137 68 88 94 -23 -32 256 72 12 -35 7 186 -68 -234 40 -266 -54 88
646 88 -238 87 75 110 180 -39 -63 171 -6 -198 132 -78 66 -80 -138 185 -8 37 249 -228 -85 59 -23
669 -23 167 75 -108 47 143 44 196 68 35 70 -172 -43 116 -166 171 83 -270 82 83 -98 114 67 -56 30
693 30 -23 -21 65 80 228 -114 -28 154 -142 -72 160 -144 -23 30 -171 -70 33 63 107 -64 -100 -34 4 124 25
718 25 -140 -7 35 -139 185 29 -91 222 -58 -97 45 -148 0 -113 -110 14 25 38 216 -103 -51 126 -206
741 -206 23 29 -89 -67 109 -68 -4 47 -129 98 -175 -78 9 -23 -43 41 -200 0 -34 -11 109 -63 -27 139 -179
766 -179 -138 -53 -79 35 13 -57 21 -14 7 67 -145 30 74 -147 32 42 -20 82 68 -153 -45 83 -2 157 -146
791a46Q6Q1o9M6J5P3p1L2j8p6j0J23J07l23J03K06j65J4L9k30J96l0O9o7p2J47
817F0O0k93K00m4RJ28j00K3O0j22J9J0l5n7P9NO0j09NJ31j06L4n4oJ01j08j10
844a60J90k9J36L3j00j9P4k25J02j4k8J44n8r1Q2pm9M3n7j0Q8n8J21j15L9O1J8
871A11j27J9Q5q4J00j78M1Oj15K13j08m6J80j50J33L0j80O4J44k20P5p1N1J58
895A31o0j00J13k09K23m0n8j45J85n5m3n5MJ87l9p7L9o1O8J2Ql0j7j71J86j25
921a29Q9J48k69J21p0M1J10L8k37J0Q7P2Q7j77J62L0j38N1o0p7J40oMo2j22K75
947A18q0p9O0M0j32J51j64N0J68l7j84K34j14m5Q1m8q7l6J37J25k35J9K4J58k63
972a39K54k07K4J39j03K1k6M1M4r2P0j2j53P1M1p2N1J11j73O7N8k5J27k2p5J01
$$ plain form
791 -146 -60 21 -48 -2 13 86 15 47 29 -47 -57 66 173 -150 -47 159 -6 8 47 -183 13 -17 52 -15 -87 60
817 60 120 -173 27 -17 -8 120 20 43 103 -19 0 10 -25 -82 -3 2 62 -47 -42 89 -17 17 -37 -43 58 -50 -160
844 -160 30 1 137 170 70 51 125 -100 2 -12 -40 104 46 -45 37 30 -19 24 -33 -43 45 -13 108 -7 32 93 111
871 111 -16 3 88 4 104 -74 -33 -27 -142 71 -37 -83 97 -53 80 110 -70 -6 138 -82 -7 -78 -27 131
895 131 71 -29 84 -125 98 58 0 -145 40 -15 -58 -113 -109 78 39 -38 1 -60 8 20 28 -2 -19 -190 -4 -129
921 -129 -40 108 -161 -40 -110 -69 41 79 -158 -148 -61 11 98 -79 83 113 -25 26 -34 -111 29 23 27 -35 -157 118
947 118 38 -41 19 59 -73 78 -86 -36 132 95 -89 145 31 -14 67 19 -68 -104 33 158 -77 -58 -34 124 -139
972 -139 115 -92 -68 71 -32 -11 -37 4 48 -44 26 14 -139 -68 -27 -99 -48 63 -110 -43 15 -10 117 95 20 121
998A21m8j06Q2O2o3q1M6J2Q8j17O4kOm9j18K69l26P9Q6o5M7M1n7P5j62K18q4n9
1026d1k7J11j49J05Mk7l9J51j78M1nm3J02l6n4MR8j08M4p4L3J36j04J36J6j13
1052a7j6P8j12op8J18J04l9l6K6m4R2j47J01j45P5J4P1n8j55K09o4M0N5j41n7
1078a32J39J8r5NJ91k51K6J1J19Q6p7J5l5j7m7N1J14k13P3K5m4O7L2lj35J71j78
1105h4J19l7QpNq5J02p5O5n5P1K7p6J6J03j14J47j18k7J29j39J3J9K1q4J0M1N1
1133D6R5p6j05J19j07lM2j9k3M7p3Q8j09R2nJ4N5j18JJ89k8j72O1j57J44M5M0
1160H3o5j07q5K29p2P6q7PJ02J1k15R1Ol8M2O4j26Q9m4K17p4j58R3k1j15R7N3
1187E3o4L7k5p6J39j32RN9n4J2j2Mo2R0Q8o7o0J40n5J1q7J30j34J9J09K6K5k68
$$ plain form
998 121 73 -33 49 111 48 -33 13 25 113 -4 60 58 64 15 -103 166 -160 -81 5 -60 -13 28 -29 46 -116 102 18 -41
1026 -41 -68 43 -106 -1 3 -24 -63 88 -90 -49 -54 -97 5 -31 -85 -81 17 -91 -47 -121 -88 48 -56 80 96 -17
1052 -17 -33 45 -67 -73 -151 -33 71 32 -4 22 -22 70 -77 24 -121 -46 -32 39 -19 -174 35 -29 11 66 -75 -132
1078 -132 7 25 -70 -65 126 -125 -99 -88 31 117 40 55 20 3 -44 7 121 -92 -19 6 -38 29 61 58 -77 94 -84
1105 -84 35 -2 6 -1 4 -81 21 -54 11 -44 27 54 -22 -6 97 -17 130 12 -15 114 -25 -12 7 28 -56 -46 -5 46
1133 46 141 65 -40 79 -28 -31 11 -8 -31 16 -57 31 -78 14 9 23 78 -40 -39 150 122 -50 11 -146 -2 43 83
1160 83 18 -89 -174 55 -17 59 -28 -21 81 92 -123 -32 -26 -64 -22 42 -84 5 -39 178 104 -54 39 18 -97 0 53
1187 53 -11 26 1 -75 64 -68 -59 0 -54 -42 -54 -50 -112 -22 66 -1 -61 79 24 35 -52 78 -56 -37 72 98 123 -145
1215a45J66pp0O5P0j52J23qo8Q2j69J36NJ5j6p0N7P0r9K2n5J12r5M7Rq5K5rOO3
1245B5j06K03l0n7q8Q7o8Q0j1m6j0m3K6Q1k4L0L1p0p2J19K8l2nj47M2J08k6Oo3
1274c2K3L4M2Po2M8p8q7R0qJ07oL7j19j7kL8n9K7L7q5N4K7N1j38K28k08p7J10
1303a8o1Q7P6j8n4nj3K1q6n0J56L9j20l3J33l3n5k1J56j02P5K0%K0j24J2n4J29
1331G7j12J04jk1q9P5l7P6j2n2%K3p4l4J87L9k37J49q7J06q3k1p3k6O8QM1k0O2
1360C6m8j3k8P0P5j33r8J22LO9o3L2r0O4k6m8P6Kk4J8jrr6J47J03j96kJ10%k2
1390C0j6q5l3J13J29q5o4JP1m5j9MN6j1j5k2K3l8L2m7K7n1M5l6O9o7K4pq5K9O9
1421dM7kM4j35M8kM6r3K3R4j28L7M2Ok3m1Q9M9J2p2j22J00p2J1P9m0O5L2r1pm2
$$ plain form
1215 -145 21 14 -56 9 79 -73 50 42 -26 56 -113 23 28 43 27 -43 14 84 -15 7 -48 64 -31 16 25 -60 -35 -44 -38 25
1245 25 -81 122 92 35 -53 34 -34 46 35 -11 -21 -64 -38 43 19 49 80 10 -62 57 85 53 48 -99 -57 51 25 31 -32
1274 -32 -9 25 67 74 12 60 -18 -105 -15 -23 84 78 115 -4 -21 -23 15 -44 -17 20 -65 -11 16 67 -71 157 -51 -128 -18
1303 -18 -79 8 84 66 12 7 -6 15 -71 -121 35 74 -46 -79 54 21 -34 -55 101 -1 74 94 94 114 -10 2 -52 77
1331 77 -35 69 68 47 -42 33 -4 72 60 8 8 31 -43 -77 110 149 -88 61 -26 80 -3 -24 -97 -123 -55 -47 -6 -26 36
1360 36 -12 -25 -53 17 92 -41 -139 -17 -14 55 -8 24 -66 -2 -28 -76 0 2 -22 -4 -5 -14 -110 37 140 -56 -58 52 52 30
1390 30 14 -71 -104 9 138 53 -11 -10 61 16 -3 1 57 46 31 9 32 -6 26 -21 6 -45 0 -36 33 -34 -10 -17 -102 -73 -4
1421 -4 43 41 85 -50 -2 -4 42 -51 -28 66 -62 -25 17 23 0 -41 48 97 109 37 -85 15 -57 -46 33 -7 58 90 -1 -8 -50
1452e0R0K2n2r3k4Q1K8%J1n6Q1l4m8P7j16L5n0J92j03k3O9O6p8j11J15m3j6O0
1480C0r7Q6q9J14nj6nl3K3Jo2L6M3L3k5L0k4l4M6rj42J33k6k1oLM7m3Rn0J18r7
1512c2m8J2J95n9n8K9J0J8j65Q1P7j64M8J04J7k73K86j20N5l6K6O0j22O5l2n4
1538h0J39k8m7J4j1J41j07K8j20R6m1O2j05J20r2O4r1L1L0M4M9n7no8L9K3omj14
1567i6J56l2Q8j09r2M4n7Q5J55j26PQp2P6m6K7o3Q3N1o2n1J03m1r8O6J08j71Q6
1595B7j38N7M2O1l5l7P6j46K78j57J8m2j27P8J18n2k1O9m5q2m1K37n2o3K7m6j7
1622a3j2m5P2j7p9J25n4N9m8J3k2j5J28j40O1N2j23j5M8j0N4J7j5R4j03m8rl7
1650h2M9J36j44q1J56k2k0j02M0j2P7pk0j65K10P4j08MJ08n2o8kO6N1o1nR0j62
$$ plain form
1452 -50 40 62 10 -83 -107 -26 2 2 13 -43 38 4 -44 33 -83 -48 -98 94 -9 -32 37 103 25 -86 29 -14 -30 30
1480 30 -67 19 -70 44 39 23 18 -15 8 9 -53 -17 26 59 34 64 40 6 52 43 -99 34 8 -13 -19 -16 31 -12 -3 -53 65 -32
1512 -32 -80 -68 127 68 10 39 49 67 -98 -17 60 -104 -56 48 65 -208 78 -42 13 -23 3 63 -59 6 -26 -80
1538 -80 59 31 -16 -2 -13 128 21 49 -71 25 -16 46 -59 61 -31 33 -58 -27 3 47 96 39 34 -34 5 28 22 18 -96
1567 -96 60 28 116 7 -85 -41 -98 -13 142 16 23 31 -41 35 -11 16 -47 36 87 25 -26 77 36 -62 4 112 -59 27
1595 27 -111 -54 -12 49 14 -23 53 -93 185 28 46 4 -123 -45 73 21 0 69 24 -58 -99 138 86 23 50 4 -13
1622 -13 -25 -70 2 -15 -94 31 -23 36 -12 1 -21 -36 92 -48 13 65 -58 -73 -25 -35 19 36 21 115 12 -36 -45 -82
1650 -82 -33 103 -41 -122 34 12 -8 -110 -70 -82 -5 -12 -32 -197 13 87 -21 -17 91 39 -29 -31 35 86 25 20 110 -52
1678e2J03j37RJ22j2q0M9q6L6r3J62JM6p2Pr6J70j3m6j78J86K4j43M0o9Q4j0L5
1706a3r4K05j16P1l0k3o3J31J9o6mk8P3j06p6K07o7j9O6r3J2J5l9R0j3j39N7J36
1734I3p6n5L3l2K6k5J31o6j9j6L4j1l5R3j60J97m9O8j94J32q0j8N3l1Q3q7n8J26
1762E7j48L4J34q0n8L3N1j5R0p8m3JQ2j31J05j9rRl9%L1Q4j96J91j48J13K1l2
1790D0j6O5j2q4m2J46j56R7p0m9Q7J6n3j0J8L3k2J62j66P2j24K9j0M0J2k7K3l8
1818c9N1q4Q8om8o2J05j04N9m4Q2N4J2k7p3Qml3K8j8J62j27l9L8J8N8q7mnP0m8
1849a9j6J31r8rK8m9M6N5j19j7P0jN7l5m9k1N9R4j95j4Q8K3mJN4M4j71N9K7O8
1879H7j48N1k7N2KL4j28J09m5n6O4R0q4k5m1O3o5oO6kOm6L0R5o4m0qRL6L3o2l4
$$ plain form
1678 -52 51 -86 -77 45 33 -47 2 -84 -48 -141 21 22 68 -4 3 -93 77 64 18 -160 26 50 -93 -53 -122 -38 -48 -13
1706 -13 -107 98 -18 53 23 0 -63 68 87 21 17 -11 62 -44 -120 87 20 1 67 -26 -14 1 -38 52 39 -100 -43 93
1734 93 17 -38 -5 -37 -11 -36 95 29 10 -6 28 17 -18 75 -85 112 63 131 -63 69 -11 -29 24 -7 76 -11 -69 57
1762 57 -91 -57 77 -3 -61 -28 23 8 98 20 -23 -22 60 -71 34 15 6 15 -24 -24 7 91 -105 86 -62 51 72 40
1790 40 24 89 77 -7 -49 97 -59 38 -32 -81 6 22 -31 -41 -23 10 -12 150 -16 56 -68 -39 -49 -9 3 -24 -1 -39
1818 -39 12 -72 16 10 -38 -100 5 -99 -40 -84 -2 52 64 37 -36 -28 -32 -65 -37 -55 107 -20 -59 -21 -3 55 -32 -36 -41 29 -19
1849 -19 -35 96 -2 -11 17 -32 14 69 -50 -67 3 2 59 24 -25 -46 13 107 -88 -102 -14 9 5 6 60 104 -67 -8 19 87
1879 87 -61 -10 -37 15 17 51 -77 32 -13 -69 -5 85 1 -24 -65 -2 -67 -73 -7 -9 -3 -49 -19 76 12 -28 -36 -27 9 42 -20 -54
1911e4M2n2Q4n6Jk9J66j24k7J36j18N2M2Rn9n5L8N6m5k6jJ07o1Mj28J67k6l3n7
1940d7J59p2Q4j52l6P9K6K1j42J02k7O1j00J17r9J18j32N2LJ26j9q5j58J30l9
1965c0M2R8o8L6Jj01J9J7l4j05J02N1j9R7k01J39j79J62K6j51K22j78L3Q1m6k5
1991a1j3j40J15j4Q6l0M4n6M4mM3j32J50p5l4jm3P7j04J79j18Q1q7J02N0j34J92
2018A67j64M5o6m8P4L0n5M6O0j22K1j07n8R9RJl4J58j41nJ49m4J03r4O0q4l3J37
2046A04n6j47J04rl5J1n9ML2Q7r4Q5j63J2J63j1K2M7M1j37k4J6R8n9o4po6lJ06
2075br6J02N1o8p1R3j06J02l4l6L3O4M1p0kJ3P0j49J72n8p3l2M3qP4N1L6j84Q5
2104D1k6p2P4j03J74o5J2p3J20J4j19L3n1k5l4Q0p9o0J21K7R7k2q6P6k0o2j2P5
$$ plain form
1911 -54 -12 -64 20 -36 -35 -64 102 -22 -49 87 -31 21 63 72 13 -42 -4 52 7 -19 -20 87 26 30 -98 69 43 10 -47
1940 -47 112 40 124 -28 -64 15 41 62 -80 22 -5 56 -44 73 -26 92 -40 12 15 141 122 37 -121 9 -30
1965 -30 12 110 42 78 79 -22 -3 14 -20 -125 -23 28 9 106 -95 44 -135 27 53 -98 124 -54 -21 60 14 -11
1991 -11 -24 -164 -49 -63 23 -7 37 -19 25 21 64 -68 82 7 -27 -28 -71 6 -98 81 -37 44 -43 59 109 -25 167
2018 167 3 48 -18 -66 8 38 -17 29 89 -33 -12 -119 -177 -78 -69 -68 -102 56 -85 -90 59 15 118 24 84 0 -33 104
2046 104 48 -99 5 -4 -39 -28 -87 -83 -51 36 -58 27 -136 -124 39 28 50 97 138 1 -23 -7 91 32 -32 -39 -105 -108 -2
2075 -2 -98 4 55 -13 -84 9 -97 5 -29 -65 -32 32 73 3 1 14 84 -65 107 49 -24 -56 -13 -21 53 104 140 -44 41
2104 41 15 -57 17 -86 88 23 35 -38 82 96 -23 10 -41 -66 -100 -20 -99 -159 -38 -11 86 64 -22 54 34 -28 -40 35
2132C5o6L0J51j72n0J53k5Rn6K2O4j03mK8l7k4O4Qrj03J23J4q7m5j2J37j49J38
2160C4J9o7j9K6Q0n5k4j7J48n1q8M0J9J4Nj47M9k5J5LK0K8l9K6Q2o2n8J7n2J26
2190D7Rj12M4l6L1j9Mp2M1J95l7j57k1J30r3N7J34k70J83j07K9K5k6qonQ7j58
2218a11N9J42j98P9O6j07J47m3j04Q9P6N7j70q3J31n2J6O1p9mO0jo5q1O1J30p3
2245Cj3l1O0j9R2jo9o1R4j34Q9M7L5j32J4N3m8M8M0l8N9o7k4M3m0O6j55K18r6
2274C3o0J03p8N9l5m2k5J47j0Qj54O1n2nQ6k03J61J2J06j28rL1l4m3JJ8K9PmM9
2304B9o4q0J51p3p0Q3M0m7lKR6j2k1q2L2R2j09J06m1N5m5Qj31Q0r4Q9N2p1J05
2333G7o2j4jm0R6m4j17R2L1j4P7j43oJ6R4j36N5k0J30p2O1l4n3K4k2l8L9Q9j9
$$ plain form
2132 35 -31 -1 150 -22 -72 81 56 65 9 31 95 -8 -12 16 -21 -45 19 27 18 -85 38 52 -35 -80 -92 45 -104 34
2160 34 53 -14 -33 -7 73 18 -6 -23 125 74 -14 26 45 59 64 -83 -34 -59 -44 -41 -21 7 -32 -6 76 14 -44 -27 -79 47
2190 47 56 -56 -12 -48 -17 -36 -32 -104 -63 132 95 -62 -83 47 -46 11 145 -125 58 -49 -20 5 -21 -29 -35 -40 47 -111
2218 -111 -52 90 -108 -29 37 -70 77 34 -70 19 95 152 -18 -101 30 -22 -6 55 -24 -28 32 31 -34 -115 -54 76 3
2245 3 -10 -41 19 0 92 91 22 -39 55 -79 10 57 92 -40 -26 27 -21 27 67 29 88 21 -3 40 0 66 -89 129 33
2274 33 -27 76 -2 57 22 -20 -45 102 92 100 -54 7 -45 -50 36 -167 -6 6 112 -16 -25 6 -28 -71 -70 -52 -23 -16 -20 29
2304 29 -35 -115 36 -37 -107 -24 16 -31 -34 -32 64 52 31 -51 -19 73 -36 70 29 84 39 47 -84 -4 -98 -9 43 -28 77
2333 77 15 1 0 -40 56 12 -105 -13 18 4 81 -62 -68 -52 42 -94 -39 -59 71 -1 60 26 -27 -3 -25 -63 -24 65 46
2362D6j05m0J9R4KJ8j23N2J23r7J12j70L5p2Q3PM4P8j19K4R2l7j22J09PO3j23
2389@j11J13Lo6j62K07ML3k4q1J81j33l1J6P9kk9o9R9r6J39nm8j28J60l5q8NK1
2418d8J0J06m2M6j01Oj9k2J81n7j07m1N5J26q5j24J53Jk0q3J15P4m0j5j00K1L0
2445B0r7L5PK7P5r3N2oQk8o0O1L2n0k6M7j50J40j30J92L7j77K8m2Q4J9K39k37
2473Gj2p1R0O4q6J4Pj8j4m5k7Q3j82J79LK6K6k4l8M9O6p8m2J9n4J15j51N6J11
2502G3O0k20Q8k6O1n6J5Pn0J17j05MP1o3J49j51n0O4J1J2n1K1L4j38j10J61P6
2529Do4J07m5L8Mj10PJ26nj26N0n3O6p9N3l3K8J41j38M6L5MN7q9m6K8O4Oj39J31
2559F8o3p3R3n4l8K6J93j27Nj2%k4N0m6R3k15K91k28J6Q6j43M7k8R3N3M9j75K0
$$ plain form
2362 46 -59 -99 -80 14 16 34 -89 -37 86 -11 101 -69 -34 -106 -23 -16 28 106 -13 11 103 66 -56 53 60 123 0
2389 0 -111 2 5 -61 -223 -16 -12 21 -3 -84 97 -36 -67 -51 28 26 -3 -72 27 -69 70 65 17 -111 49 14 -74 -69 -48
2418 -48 -38 68 26 72 -29 -23 -42 -64 117 60 -47 -88 -33 93 8 -116 37 38 18 -65 50 124 84 69 -31 -10 20
2445 20 -77 -42 -35 -8 67 -26 26 20 28 0 -60 1 33 -17 -43 4 -146 -6 -136 56 93 -84 -56 -98 -14 5 244 7
2473 7 -5 -76 14 78 -8 6 13 -5 -19 -64 -91 -8 -190 -11 -8 18 44 20 -18 31 97 19 -23 -4 -58 57 -94 -38 73
2502 73 133 -87 1 -25 36 -20 -5 2 -48 69 -36 -32 39 -24 125 -26 -76 -12 -1 11 -40 -19 15 -123 -233 -72 4
2529 4 -60 47 2 40 44 -66 -59 67 62 -64 -14 -67 -1 -80 -27 -60 -32 109 -29 17 52 56 113 24 -22 6 70 76 -63 68
2559 68 5 -68 25 -29 -67 -41 152 25 30 18 18 -6 44 -2 91 -124 167 -61 -45 41 -102 -55 -83 10 63 112 -63 -43
2587d3J57k1j94J93r4N7j5o6M5j1k6J23q8o8N4m1J22P2j46K1l2O0p7j6N1q6JJ35
2615F7k00J90l3l4k4k5R5K2m7o6J66j74M5j0P1l3j00N9J79k70R3l9QJ69o6l4r
2642@M4Mj59J39R3k11J53o4J8PL3n4j8J1P0m2q0L6rRm1J01m8l1J50j33k2J68o9
2671E5j61J39K0M0k37J94j01l8J5J18q9J14L9j97Q1o9J14p7J12j48J47j03o5J45
2695D8j21Q9o9Q1o0m3N8j49J90k0m5K4o1R9P5j35J53j25p2J08k3P4j47R1M7j55
2721h8K6L0J18l6l6j46J83j02Q1K2q3P0p6K3O5o9R1m8q8J8R7J00j83Q5m3J6m5
2748a8N1P4j27Q5l8J15j60K1J6j5Pq9N9K9l0j12K75j53l3K1j05J21j3P5q5M4l2
2775a7j2N7l4No0J2M2p0Q0mk6J55j40P6m3l5p3O6L9m4m3R0l4N2qj25K19r6J1o9
$$ plain form
2587 -43 114 93 -101 92 -2 55 40 -26 19 8 -18 105 17 -51 3 -38 84 156 10 31 -1 59 -18 -34 17 -69 -68 67
2615 67 -133 57 24 -10 -34 -59 36 58 11 -55 111 -63 -18 -28 43 10 -90 -31 148 -122 -29 -68 -60 109 43 9 0
2642 0 44 48 -111 28 121 -90 63 -1 17 24 57 3 -15 -4 66 24 -56 -20 -29 -20 -61 40 -8 -39 111 -22 -44 124 55
2671 55 -106 33 53 93 -144 50 -51 -89 -74 44 -45 69 108 -89 -8 -77 37 -40 72 -76 71 -32 -97 48
2695 48 -73 16 -53 28 -32 -75 -17 -166 24 4 -41 -17 -78 21 96 -39 114 -11 -83 25 2 76 -71 20 67 -88
2721 -88 -62 -32 86 50 14 -132 51 -51 30 52 -31 39 -37 -14 51 -18 73 25 -63 -45 52 152 -31 54 11 27 -18
2748 -18 33 107 -20 65 27 142 -18 3 19 4 11 -78 -19 10 -20 -132 143 -10 -43 -22 -127 -6 -19 56 -29 15 -17
2775 -17 -29 28 -6 -1 -61 -49 -7 -77 3 -1 -27 128 -12 64 21 -14 -87 -21 18 -26 -69 21 -13 39 31 -94 125 29 40 -29
2805b9m9O4j4R4l9P4j09L8Lq2oj57J28P5Mp2J03L0r7Q7j60J09j5L7n7L7l3j0L1
2834a5K9l9J2k4J1L2J0J02j38m3k5N0L8j9J1QJ02p8n7J34p2K3l5j07J63o6M1l5
2862A3o4N8J7l7p0J57q9L5J56j00j10N7KN1j34j2M7O8k1%l5J38j57N9rkn6PQ3
2891E2j42J73l8j6M2l6j3p5P2N3j41m5J38R2n5m2p6R6n9m7l5M2J23j00J50j70
2917e7J66j50M6k8J09j56P2L1r4P8k7j2M1K0m8O0j46J15Q6r8mqo3Q1j1j7J45k08
2945g7N7L5l7lo6l7Q4J1n1O7m9j5K5L5K4K2j8l2l7P0l1m2J33qk0j18j9P2J07j15
2975c3N2ro3J05Kl7K0m5L9J0j21J58j40P2O2j31J91r8n0O9o2N6j08J47p0r9L7
3002d6jK6j5J09p8P9j03J0Q0j2j9J6m1P1j20l7K17k13o3J78l3k0Q6q8O1j02l4
$$ plain form
2805 -29 -78 -14 -28 66 27 101 -8 30 33 -49 -55 -212 -84 -9 -5 -77 26 56 -41 46 -114 -5 -20 17 -40 -3 -36 -46 -15
2834 -15 14 -25 -13 -37 -26 6 16 118 -20 -63 -88 -38 0 -19 -8 0 102 24 -33 101 29 52 17 -90 73 7 48 13
2862 13 -51 7 24 -13 -83 74 -15 20 176 76 -34 23 25 76 -58 -70 -23 45 24 24 -11 127 -30 29 20 18 -38 -31 52
2891 52 -90 83 45 29 71 35 22 -53 19 72 -69 -114 24 116 61 19 -57 39 -20 -67 -102 -60 63 -37 113 -57
2917 -57 109 -41 5 -23 86 -70 2 33 -61 17 -10 -22 19 39 -9 51 -95 20 106 8 4 -4 -67 14 3 -14 131 -77
2945 -77 -20 15 -22 -25 -91 -128 -44 -33 -84 -17 -66 -81 -56 -21 3 25 7 -25 -62 8 -23 -65 68 60 40 -78 -97 -25 82 -33
2975 -33 19 10 -53 52 54 17 37 -8 31 41 -80 78 -62 10 72 -59 132 34 -16 53 -9 47 -61 86 16 -83 -46
3002 -46 -47 -21 -36 73 -5 74 -29 -19 61 49 30 46 5 76 -44 -81 136 -77 -140 38 5 -15 71 -17 44 -58 -92
3029i2J05k3m6m0Q2mlqn1J15r7J7l9J01N5j16rN1qk0l0l7J31o1J01q3J12j92J84
3058I5j40K4j0JO2m1K8j8m6n3JJ01M9m6o9K8Q5n2l1QL8p8L8P0K6j25M0J1K7l9
3088a6j5p3R5j5k4Nj17Q2J47j16k9J34q0L5m1M8k3J1N0k2n9N2oP8j15Q3j15R4
3116D8K0Nq6K6q5J00L1j23MK6M0j55K12r6l2RK9L1j19K2K39n3j87J40j2J9p7J14
3144I0j26J5J3K8l8K3L1m0J11j07mO7j51l6J24q1J01J9j02R8p5m4N2NK2m8l7J17
3172B7q3O9j19K57j69%q2J72l3K1k50J42N2ln8l6R6l5N4L4o3N8m6O1l9n7P6q2
3200c6P2k5l3J13j31l4J9K7L3N5Kj71Q0M4j18J71q0O5Rj9o1J77j02J1q5j7lP5
3228C8j2n6N5j6J05o2qn6O3j12j9O5k2R3j11J13j48l3J51o4K8O7Lo6J5k5n7J09
$$ plain form
3029 -92 13 -10 -56 -96 -14 -18 -21 -29 -80 35 -62 -45 -84 17 72 -44 -53 -2 -10 -30 -60 -97 34 -27 74 -9 103 -89 95
3058 95 -45 -21 -31 -30 32 -9 19 1 -45 -98 -97 4 53 7 -62 -34 51 -1 -32 -24 14 -64 -26 44 70 -55 -15 -4 23 -16
3088 -16 -31 -104 -9 -24 -48 -43 -160 -78 69 -47 -76 58 -22 13 -28 20 -3 8 58 36 -23 29 23 101 -14 69 -46 48
3116 48 68 73 -13 13 -72 28 59 -64 -60 -34 6 -149 63 -33 -65 -56 -27 4 -115 -93 146 93 -94 46 34 53 -24 90
3144 90 -36 -21 -8 20 -18 5 36 -4 107 0 -4 63 -88 -124 0 -81 20 39 -63 35 -40 -84 -32 -27 -5 -53 -90 27
3172 27 -56 13 -106 151 -18 -18 -100 72 39 60 -190 -48 4 1 -57 -93 3 -32 22 56 -7 51 5 66 27 -30 46 -36
3200 -36 36 11 -22 91 -40 -74 -55 -28 5 60 62 -109 -29 15 -103 68 -12 53 62 43 -18 159 57 68 -17 -34 -37 38
3228 38 26 -30 25 9 114 52 44 -12 51 -61 -80 -15 -37 56 -55 58 -90 -123 28 -36 -8 59 62 -4 11 -14 -71 38
3256C8j10J26r6Q0k8k3R6p3J7j9p6J08m4P4r2J99j64l0m2m2M9J24p1J6o3J07k4
3283C7r4l4J29j08Q9j8km7M1l8N6L8j02J57j09k0R8j32J42J4j22k0O9n0JO4p3
3310c4O2p7J3O1L7j33O0o3J5M6M6r2M5P0k5p3M7k44K29l4J15q1M5M6k8q0l7N9
3338eJ9M5n2k0l3Qn6J19k9J8p4J49n6nn3MK2M3j6N2O7k21J48n7l7j5Q1j08O3q2
3368h1R3j33J20k3k7MR8m6R2j80J85j55J35j31l0J81r8PKK4n4j5M6J1p7R7n5k
3396a2J6l6o9L9k1j2J57J5j13R9M3j33R3%n9k6j25J89j29J65J6r2K3oo6KLO8j57
3425a28J30M0M7m5o4M8j37K3P6M6o8J25j14L5j0K9j11M3K9j3m4J42r7k0R3j22
3451f7J11n9N2j15k6J05O9j34J3l0J88p0m4kJ00j36R2J6r2K4M5qM7o9o3pl1J71
$$ plain form
3256 38 -72 54 -42 38 10 -13 83 10 27 8 -68 40 -4 70 -22 177 13 -17 -59 -101 -52 72 1 17 -46 61 37
3283 37 -57 -91 38 -70 19 1 -1 -48 -7 -45 11 49 -53 104 -5 -25 73 -59 83 97 -25 -45 24 -26 -25 39 -34
3310 -34 28 -49 -36 25 62 -71 -11 -74 -59 -13 33 -59 -14 56 31 -42 5 -239 -10 -44 71 -10 35 81 53 -27 -64 -5
3338 -5 14 59 7 -13 -46 -38 -94 25 -4 14 -60 89 33 28 -25 -21 1 44 28 80 147 -74 74 17 -20 -35 46 -62 1 -81
3368 -81 12 -121 -1 -24 -51 -47 51 5 97 -83 102 -53 82 -49 -79 102 4 11 13 37 -17 -32 14 25 -52 45 -10 -12
3396 -12 4 -32 -101 -62 -83 -95 62 77 -36 63 106 -27 66 66 7 -19 -144 45 -84 81 97 5 28 22 -44 -42 -39 29 -128
3425 -128 2 42 89 44 -20 28 -109 -86 -10 36 -32 93 -21 14 4 33 -78 -35 -6 -19 -63 79 -18 -38 55 -67
3451 -67 44 -15 37 -78 -104 1 70 -64 -51 -81 107 37 -7 -9 91 -45 47 63 -29 -5 40 32 79 10 -53 -60 -91 80
3479H0o3O6n0j72O2Q8r6O8pO7p7K00j14m4m9L4l6P7j3jJ0p9j02K03K3j47J73k
3507I9o5l5J10k32Q1P7J15l3o2o5M3o0J07k06J67j6o6Q5l7M1l5l2K1k7o6J09j5
3534Cj14L6Q9l8j14L7J31r0O1o5J38k29J7J12k4m4J60k00J51L3j82O0Q1N9q9m
3560b5Kj1J2P0k3Q4Qj09m0J53n9K7j27QJ43q2q1P8j01J07j10J62j49M6J4RL4l6
3588DO8r2J4l2L6qjk5Q2j02J4M1o3J09p6L7O8j5J8k15J52j2o2J07n0K9j37OK7
3617g8J56j45J18j45J76j63K03j43o3M9J4M0j26J52o0m1pm8J88l5m8JM2q7P1j29
3643a08K16m0p6J4k6K1L2n7J4J09l8m5N4q0l3L9Q4j71K6Q8J4jo4j3M7Q1j54lJ01
3672C1n8O7k4n7l3O2J28jk80K16q5J07p1l6J22j02R5j80O9Q8j62O1M3qJ4Mjj9
$$ plain form
3479 80 17 83 33 -139 -77 11 -85 -17 -24 43 -34 166 52 8 -41 -7 -43 34 21 20 30 -49 -151 52 75 -72 101 99
3507 99 34 -1 109 -123 -42 35 150 117 55 -10 33 -27 80 -126 41 25 -41 44 7 48 13 -19 2 -25 -91 18 3
3534 3 -111 -75 14 -24 -138 -101 30 -60 1 -64 74 -155 -138 -26 -50 -94 66 -134 17 50 -132 -72 9 68 -21 -25
3560 -25 -23 -34 -22 48 25 109 117 8 -32 121 62 89 -38 -30 113 31 -50 28 -73 34 -76 86 -63 -17 -3 6 40 4
3588 4 72 -20 -6 -38 -2 -10 -11 -36 46 -56 -42 -1 -64 45 -31 6 74 59 77 -138 14 2 -60 47 -3 26 -111 -105 -78
3617 -78 78 -67 51 -94 82 -81 122 -21 -84 -35 -21 19 -107 45 -15 -56 -63 -111 77 42 -6 -5 37 -50 21 -108
3643 -108 108 68 -8 6 -20 1 33 -24 -10 99 61 16 70 -10 -43 -4 80 -91 -65 23 37 36 -28 -41 6 87 -67 -70 31
3672 31 -27 40 16 -41 -74 -12 116 115 -165 51 -34 73 2 -34 88 -14 81 -99 -30 58 -104 -43 0 -8 6 10 9 -10
3700a0Q9j36J50k02J48p7J4O6j6QQm6m8qp3M7L7K1k9J92j08Lj9pJ6PrPK2J4n2
3731IJ9p5K5M9M5o8L2r7J36q5J6j5J00k5Jj28N7J06j57k3QQ5k0K6j20Q6j6K7l
3760eNO6k9n3R4p7n0J7J6o6P0N3m1P4l9j8L5q1J61k0k01K6R7p2l4O6n8R1k5m1
3790c9j3N3n6J01qj25J5N7qo4N5N5J14o9j34R8J05l04J48nJ02k09J08J8J19j37
3816b3K2K1mjj6j36J59n3K6Q1m8M3k22K46o6L2j08N3N5j55J00K6j39J85j23J48
3842A03n6l7m8rn0M5O8Mn1K41k69j2K01k14P7J6l3M9j40Q6O0l4jj28J50L2O5r7
3870A8j5m3K0k0N3n5O1o8L4O4o3j6n1m1J40J05j82J30l3J8l6r8K4M4k2P2r2J12
3898F0j1j09J08p4P9j17O4O8j79J19k3J0K2O0j22Q9j60J21J08j51OJ0O7n7J8K3
$$ plain form
3700 -10 79 -57 93 -109 39 -38 -24 42 26 34 42 -4 -52 -60 -133 -86 -49 -28 -57 135 27 30 11 4 20 27 18 25 47 61 9
3731 9 28 -47 -22 27 72 4 36 -61 75 -10 6 -9 91 66 67 -61 -4 102 -55 -78 -70 15 -5 21 -99 -13 -29 -2 -5
3760 -5 0 66 37 -16 78 1 -49 -32 -16 -82 -12 41 0 74 35 17 52 -29 132 112 -89 -63 34 -38 -72 -6 -64 27 2 -39
3790 -39 -52 1 -55 46 38 -87 -72 -15 -23 -87 -32 23 137 68 -66 32 137 -167 -19 -24 78 -131 -23 -5 114 -23
3816 -23 -1 20 16 15 -1 -137 22 -31 -5 76 28 71 -151 95 29 61 -47 6 61 -94 6 32 -107 78 -45 103
3842 103 47 10 -38 -47 -97 -52 16 20 -31 210 -59 -71 130 -84 -7 9 -24 25 -115 -29 31 -3 -4 -132 18 50 115 18
3870 18 3 -40 -20 -40 13 -42 19 -49 -15 49 -14 -30 -81 -122 18 123 -59 71 38 56 20 -78 -54 -10 -32 40 -52 60
3898 60 49 -60 48 -26 53 -64 0 68 -111 8 -15 -5 17 77 -45 44 -116 5 113 -38 -32 -22 45 -12 6 29
3924B9pk7K0j15R0o1l5N7J14q5J24j35J02o8m2N0m8Rl4K9j02J76O4l3o9J07n6
3951E4K5j25J34n5k9n9N5K4K8r8n8O3j7J37j54J40p3j1J52j68M5P5j38K00j82
3976c5p1J62nK4n3oo7J00n6J08m7j22J12Lo7l0l1J22j05N1N0L2J09j84jm5J3L1
4004hn4J8l7RJ3K0m2O0M2p2K3L7k2Qj16J9L7N6j03K04l9Lp1K0k0J23p0n6q0Q3
4034a5m3L1q5J14o7P0M9o7Ol3K5k1K8l0p2J77Lm3N4j43oQ4m6M3k1M8r5m6J48n
4064D2q6Q0q5k4J14l9J9K2m9oq4N5O1mrn7L7%J02j36N3k0RN0o2M9o3J06J27j98
4094DK8Mo6M1K4J5q0m0J57o2j1K3j00J07P0k40J85j57J58n4Op0O9j40R7n7P3j12
4122a28J11qL8j3j6L4n9M4kk8Q8m0j52P1j1O9p2J52r4n0o5J18L0p8M8qQ4j2K7
$$ plain form
3924 29 22 -5 15 -100 -10 -71 -106 -49 65 -20 104 -31 71 3 -39 11 -37 -28 -62 -33 -135 41 105 72 3 110 54
3951 54 79 -46 88 33 4 -55 0 24 52 -46 -104 -41 -58 79 -75 65 -8 -19 133 -35 10 85 -53 147 -35
3976 -35 -106 56 51 75 22 16 -51 49 -7 101 54 -68 44 47 -20 -50 -81 41 -64 -13 37 69 178 -6 -7 -52 -39 -8
4004 -8 -62 -44 -81 -72 -59 -39 -81 -21 21 -51 -28 9 -13 -5 -121 -102 -65 -9 -112 92 53 56 -15 5 -15 108 38 -18 -98 -15
4034 -15 -58 -27 -112 2 -65 5 54 -13 -7 -40 -15 -36 -8 -38 -110 67 70 27 81 -62 -68 16 -30 13 -8 40 -55 -101 47 42
4064 42 -44 36 -49 -73 41 2 21 43 -6 -12 -96 -41 20 16 7 -50 -13 -13 89 -47 6 -14 -5 45 -17 32 -31 75 202 4
4094 4 32 36 -30 11 35 50 -30 -70 87 25 14 37 -63 44 114 -126 59 -98 60 6 12 -58 11 -129 -32 -89 -16 -128
4122 -128 -17 -25 13 0 -16 18 -41 3 1 -27 61 21 -131 -60 -71 -2 -74 78 -16 -66 -131 -13 17 -61 -13 -21 63 51 78
4151G8Mn3M7j25Q0j25k4K45j22L1l9O9n9O0q0j3J0K3Q3k6r7l7J03m3M4k3N1r0
4179b8J2L9Nq0MRN2j5O2j40J54q9n0O6J4j05M6R7m7J0J25k01R1Nj26J17j15J99
4207A11j24KM7O3j07l9K8J9Q0L7p4ln1O1m4j07J84q3mJ1M4j25K0J58l8p6Q8j9
4235E9l3l0K8K2p3MP8o6KJ9l8PN2L7j08M4j49P6R0r1k8l8J55o0M0nM5J52k89Q8
4265a0L3q6n5J26r9J02K5n9J1J55p9n5J7J19mj75M1K3m1N7k0L6J4j08L3p4M9q1
4293a05Kk2O7J3J14n7K1j21l8J63l7K5M3l3j00L3M7L7k4M3j60J01o7o9J41J5j11
4320g9LP6O4j42J30Jk3j22K15j16m7l7k9N7K9J3k5K5O1K5j97J77j20J75j07J9
4346B6k9k3j8R7n4k1M9K9n0j9P1Q5k12N9J46j84j3J50j59RR1n2j02rM6K6J55k6
$$ plain form
4151 78 82 29 76 -49 31 -94 -118 127 5 36 -3 66 7 67 -13 -26 -16 7 90 64 -33 -70 33 -10 34 11 62 -28
4179 -28 -16 23 28 -52 -48 -39 13 -2 60 -80 74 -15 -65 1 15 -90 -44 53 6 16 141 -60 31 36 -90 27 -88 111
4207 111 -13 -11 36 99 -8 -47 -19 0 80 117 43 40 -11 50 6 -101 83 0 -4 7 51 -74 -54 104 66 -10 78 59
4235 59 26 -4 24 46 -27 -23 55 -11 -9 10 -28 -21 31 68 -40 4 -145 -69 21 -70 -98 -136 19 -41 -1 -6 39 191 -98 -10
4265 -10 23 -63 -118 8 -91 11 36 -23 -12 143 64 9 26 145 141 -34 7 30 -11 46 26 62 76 -32 1 -73 -24 -105
4293 -105 -103 -125 -58 -45 69 12 33 -88 -126 37 0 25 68 35 -65 -32 15 52 28 71 -89 12 -55 -124 17 32 -79
4320 -79 -76 0 64 -78 52 53 30 -92 123 7 -40 -77 -106 -49 -20 -7 -32 -7 54 79 -118 59 -61 114 7 26
4346 26 -3 -26 -44 53 -1 -22 27 56 6 -13 58 143 -69 -10 136 -48 -61 89 -70 -61 30 -22 -124 -133 -87 -61 94 68
4374F8p0R2q4K7l1m0K4K3m9O4j61P5L1j2M6J12j13p0J7Rj15J23L0O2j60O0OJ22
4402H6p6j3j1ko7M9J04j18J2r1J10J24k44J01M6K3p0M2J21q4P0j91Q1kk6L9Q6
4429I9n3o9N4q4kK1N1r4K0NJ17l6J8j29J41J5p1J0o8J19J0j18Q6m0mN2j06R8q0
4458c8J30p5M3N0j75J6lLNl5Q9M4j8o1O1mj17J29Mm1%k2n0J33q2L6PJ5l7l3M6
4489B0l4Rk3N4j8p5Q7q8J22n8J05j19J03J48k66L4m2N5N4j31m6O2O1J5j9N3q9
4516b6P0J6qn8n1Q6p4k5l1K12q0j17N8M3N9n7q6q5J23O5m9J51j73p3J34J5r2J85
4544A32j16L3j09l8J17M8j40L2K7l9J15r4n9O6R6j35Q7N2j03L5n5O6j6%Rm8o8
4571a05P6O5L%l9j0j09J88j71J04M4l1k3n6J63j23j3J42j48m1P8l3N7Q1j1j97
$$ plain form
4374 68 -2 90 6 33 2 -38 -14 9 -40 24 -137 -62 -31 -43 3 115 2 -68 -51 -42 -157 -34 -4 58 -102 -42 -36 86
4402 86 10 -3 -14 -16 -83 -34 70 -48 -36 -127 -17 107 -137 -36 10 33 -37 5 126 42 112 -79 2 0 -26 13 99
4429 99 46 -23 31 -53 -55 -34 17 -77 -57 -52 65 29 47 -82 59 74 3 13 -55 64 74 -44 42 2 -2 50 -56 42 -38
4458 -38 92 17 60 110 -65 -49 -52 -49 -44 -79 10 54 36 -25 36 32 -85 44 48 7 7 -15 -65 68 -14 22 29 44 7 -26 20
4489 20 -14 -5 -28 26 8 -67 20 -68 54 -4 101 -18 85 233 -33 1 -41 14 68 -63 -109 -47 14 29 10 63 -26
4516 -26 44 60 52 -6 -57 29 -45 -70 -101 111 31 -86 -28 15 74 17 -69 -154 -31 34 -15 136 -37 -110 24 39 -53 132
4544 132 16 49 -60 -98 19 67 -73 -41 -14 -53 62 -32 -91 -25 71 -64 23 75 -28 7 -48 18 2 2 11 -37 -105
4571 -105 -29 36 39 39 0 -10 -119 69 -102 2 46 15 -8 -64 99 -24 -37 105 -43 -84 -6 -39 18 99 88 -109
4597a09K59j13p3M9N8j7o3MMMK3O8p2j30J17l4Jj4R2J6o5m5N8q7N6P9OjrRj08
4628c7OJ03m2K7k53J38J33q5PO3o7j3M8jn6K8n1J28k53J47L5k0O7m2o9R0Ml7o
4657hl1nn8N5o8J07o6P6k5jn0J36n6n2N6m7L3o0kj8M5N7j1pL4J0q6j2Q2j7J07
4688A18j04n7Q0j48J10k7N1o1P0j29R0K1m4J5l2N3J0K4j01O8P6j93J1J22j9m9
4714d5Jm4K9m9J16r2P9O4q5J25o7j01J56p9j24N7N5O5j30j2Q1o0O7n1M%Q6r2Q3
4743C7r5qJ36m0q3mJ13o2n9J93j87J01L5j84J14J1r4R9l2J2p6Q1j22J82k8L8k08
4770a30J66r9K6K7q5J09%N0q3M2K1n8L0M9j14LPm9J08K1r7PJ11L4q1lJ1n3R2m9
4800A3mM2j37J80k2l4j03J21O4o2n9p8N9K3R8q3q6J58k9n5M1l7NR6j61P7p8N0
$$ plain form
4597 -109 150 37 -36 13 71 54 -9 -5 -1 3 26 94 22 -108 9 -25 -24 -38 54 70 5 -40 18 -69 -13 66 72 71 62 71 -37
4628 -37 -31 72 30 57 -196 -58 75 -10 -3 60 -7 -20 28 27 -29 -1 -52 76 -177 -30 5 -15 52 10 -59 31 35 -2 -8
4657 -8 -39 -44 -102 -47 -115 -8 -74 2 -23 -24 -74 62 6 -46 10 -37 -4 -64 -66 -84 -39 18 7 0 34 44 -42 -54 28 11 118
4688 118 14 -43 37 -111 -1 -28 23 -38 32 -97 -7 14 -30 -15 -47 6 16 40 -61 7 83 -110 -99 23 4 -45
4714 -45 -44 -88 -59 -108 8 -84 -5 59 -26 99 32 -69 87 8 -116 -59 -4 61 -69 -81 0 -60 7 -44 -40 -40 46 -46 37
4743 37 -58 -66 70 30 -53 -57 56 -6 -65 128 -59 42 77 -107 7 18 -76 23 -9 3 -73 8 -114 68 40 78 -130
4770 -130 36 -63 -37 -10 -95 14 14 64 -19 23 44 -14 16 65 -49 -46 -39 -88 20 41 -56 -49 62 96 15 12 23 -30 62 13
4800 13 9 51 -86 94 72 38 -65 56 120 58 -1 -79 -20 3 101 18 -68 90 61 6 47 10 15 111 -50 27 -51 -1
4828alJ2Q2j63J18j23J81j98J50p0n6J56j13O2Q4j42P5j23L8K5J4j07O8K5%O2
4854E3o0j8mM0J4N3p6Qj28J21m5%M5l6L3j4J1K5o7J3k0n3J06l4q%n3P3M6MJ3k4
4886A8qJ9nL2k8r6K6N1J2lon3L7m5J21n4r7Q9J11j14k6J18q1r5Q1K8j18J05p8
4915e9m4M0J08K9rj32Q9j38J04R5j06M6r1R8rn5P4n0J6j8qK1l8k8J00p6N5O4k4
4944E4q5ML0j3J7k4j9R1p9o2P3J15j05L3l5q0J97k9j38N5r2K5J2K8M4K4r9N3r8
4973a03J8J30j28J14p1M2%m7J03M5j0j92J14J3l9l1oJ16Pp5j8n4P4j5J3M6j16
5000g0R1o0m1P3R1n7m6Kn1R0L0q4O4n3R6K0o8p7O5M1m5NO0q3N9N7j18O2j06P3
5030B0M6o2j5Q5q6N7j07K1M3L4k2Q6n3q4M3J22j47k6pJ23m7r0M9k0K7n7K3N7l1
$$ plain form
4828 -1 -4 8 90 -73 45 -78 103 -95 55 -15 -71 85 -28 34 118 -24 51 -72 -34 -9 5 -102 -34 -9 -9 53
4854 53 -7 -25 -29 11 25 78 2 10 -118 3 -42 -42 3 -33 0 -14 -3 22 -45 -32 -52 -105 1 -33 -41 -41 -94 -21 25 29 42 18
4886 18 10 29 24 56 28 -68 -42 9 21 18 12 -41 -4 -49 72 18 -79 10 121 7 -19 99 18 -77 4 32 -86 19 -59
4915 -59 -103 -63 45 74 65 -67 22 -116 -12 83 -23 23 -68 30 21 -34 40 -10 6 -12 -20 1 -37 -65 35 -41 14 78 54
4944 54 -31 -27 3 -10 7 -17 -36 55 -24 -86 -13 102 -3 30 -5 -85 112 83 -55 0 -92 -67 -55 -27 17 41 -58 -5 -103
4973 -103 -85 45 -83 31 -40 2 2 -45 58 103 93 -99 15 28 -11 -42 -48 68 75 0 -18 -72 2 -13 0 46 -70
5000 -70 21 -39 -80 -7 84 27 -19 -17 -68 22 52 -32 32 -21 75 95 27 -50 15 56 11 16 76 -7 52 109 -9 53 -53 20
5030 20 66 4 -11 74 -12 45 -62 -41 2 36 14 100 47 -37 6 128 -19 -45 -52 71 24 -66 -17 -37 -10 -67 -44 13 -18
5059a8L5Jk5O4p2k2M7m7J81j30l5l1K3O1n8Q1M3j9j46L5N7J3J4k5K6k16J46k5
5087d2NJ31j42J4K0L8J7l5M5r1m7OM2k3q1J04P8n1J5N2k6j11M4j07J65J57l69
5114a92K14j03J45r0n3J56l7r7P3o5lLL4j0%N1k1L0M5l8j20J11j36Q2j04J45p
5141A3RL1n9k9J17q9j1Q4j8q6J25n5j37J86m1l6N4m2L5p3O9q7n1K7J39j00J04
5168G9o3K9K5j11%jM1N2q9k4j0P6O0m5J19j44J03j2m7N8j26Nj0m7Q8k8Q6j1m5
5197Hm3l5J9L2NL9l2RJ2LN5j68O7Q6n5q9M8J03j23Q5P3o6m3K7j0L4k5r5rJ50j55
5228i3R1M9j3q7J15j69J66l3r8J32j88J79k5NO5K5j93P7J4J18p2n0j04K4k4J53
5254F4K0Lp3l9N3k9k0J75j58n1Q8lJ1l3nm6K9P1k0r5Q2k6j7J8O6J7k06J56M2j77
$$ plain form
5059 -18 17 18 -7 57 -15 -37 10 -37 144 14 -21 -52 -29 32 -26 55 98 79 -67 -32 25 38 52 27 53 -163 -17 -42
5087 -42 -37 94 -48 -34 -14 24 41 6 51 -40 -87 -81 -39 -62 -143 -39 39 -12 3 55 29 -82 -38 -145 20 177 -192
5114 -192 22 -81 64 -26 -79 77 40 -57 16 -49 -52 -49 -15 -25 -25 26 5 35 80 42 -78 33 -103 -21 -125 20 13
5141 13 22 53 -6 -35 82 -7 -18 66 48 -38 87 32 -105 81 40 4 58 16 51 -22 47 -40 -91 -64 75 -25 79
5168 79 16 45 70 -41 -41 -42 -1 51 -38 -62 -72 4 64 19 138 -6 97 85 38 96 -30 -25 -35 -82 6 -22 64 53 8
5197 8 -35 -70 -51 -19 -14 25 -7 2 14 17 72 -96 -29 57 2 -87 -39 64 -59 26 99 33 -10 17 7 41 16 -79 -88 62 -93
5228 -93 -2 47 34 -53 62 -107 59 26 -72 60 -128 51 26 31 96 121 -72 5 19 137 65 15 -89 -65 -89 64
5254 64 84 87 14 -25 28 -1 -21 154 -4 -55 33 30 41 8 3 -43 -14 57 37 -58 24 -2 -19 -1 65 82 -124 32 74 -103
5284a03Q6n4P9k2n3N5k0P5r8R9j1q1Q1O8o2j37Q9L6q1m6J12m5N9q9M7j7K0l0N8
5313A5m4nP1p1P7m8L9L1r1K0N8m7n6J30o9n1K9Q5p3P9p6J15j24qK1o3j4Q5l2K4
5343Grrp2K5M8L3mp8M9l5rJJ76j26q2Q8l5P0q6Q8J4r3J6j4N3J3j06L2QRj04O8
5375f4N6nO4j02l4J11M6o7rj6P0j01NO8L2j7j36J31K0p1L3J0p7M2L1o4J24j45
5403f5OQ1m2o6Jj17K06N2lj26j4J06J19j87J5J06j6K6l5j00L6l9J07q1lN3J06
5430A26j37J40j05q1R6q3l8N0M6r2Q0K8K4K5p4m1O7M8p9n5N7np5R5L2q6n3j9O0
5459d9N7k1J91j96K6n1O0J2l5M3O9n1r2J22j63j1P0k6K6j34J21RJ7K5j8P7q0k4
5487b6J89k52Q0m0L6M9L7rn6J1j64K27p5mQ3l4r5L1ro5O3K2m5N1K5k7K8r3l3J7
$$ plain form
5284 -103 -17 -71 8 -14 -67 -12 -32 43 -55 44 33 -48 33 101 39 -98 -9 27 -54 -100 12 -33 26 -63 -16 -33 -13 -43 15
5313 15 -29 -34 37 -34 43 -5 34 65 -26 -6 52 5 -51 79 10 -41 -12 73 0 79 3 118 -6 -14 7 -56 -70 15 -17 7
5343 7 -2 -11 -83 -58 -10 23 19 -59 -10 -45 -54 -53 123 -3 -85 3 -32 38 -48 40 54 -39 -23 -37 16 29 -77 -45 -37 -28 -132 -64
5375 -64 -8 -13 51 -51 -85 26 72 5 -4 -20 50 -51 -46 22 54 37 -99 32 52 -19 14 24 -53 -11 20 -44 80 -65
5403 -65 -59 22 -20 -86 -85 -202 4 56 53 -73 -87 19 138 -49 -34 72 56 82 47 -53 -17 -56 51 -30 -33 20 126
5430 126 -11 129 24 -57 39 -44 -82 -32 14 -78 2 30 54 79 5 -36 31 79 0 -55 2 -3 -78 17 49 -37 -90 -109 -49
5459 -49 8 -13 178 -18 8 -43 17 29 -6 37 106 55 -37 85 -78 -89 -19 -45 -19 -153 -32 -23 -6 19 1 78 -2 -26
5487 -26 163 -89 -9 -49 -13 36 73 64 8 19 -145 82 7 3 86 52 -43 -12 -21 -86 -23 -1 -46 5 30 3 31 -62 -95 -78
5517g8P4K2q1M5j28K34n9K5m7m9m1J71j27pj9J10jj5n3J9j9Q0m9J9M2m6n5qN4
5546A3j05R9j42K50r9j7qn7R5k1j3m3j0O5J6k5n8L4K4n5J14j26j2J78o6j5j14
5573i8M1N1OR3J0k35J30m2o0J26K6n9J0j2l8J23n0j40J59j3j58J54J7J05r0p6
5599b0M1L1r7J72q9J2jn0L5r6J04K3l3l8K8j7O6LL4oj38J7O0j05J6L7J2n1k9O5
5629a4j5J2L8n6P7j26L3N9L7r0P9q0J00j06L0L7%K6j6P0k80K58j01J73k27J76
5655I4k14O5nL6OO5%Q2q3L9j35J74j14m0Nj6JO8L6q5J4N2N2j91J70j13Q3J6l7
5684B5r0J19n7K1Q7p6M6j11j7J71r1kk3Rp3N9Q8j03K5QN4j15J21p7Q7k8o3l9L3
5713a2K1o7k2%J07k1r7O5K0q8P3L6MO4k07R2J01j23K7O3j08L9L7r4R4l4N1L9l1
$$ plain form
5517 -78 -4 18 -63 -18 -146 88 29 54 7 -42 -83 88 -39 -46 -65 45 44 29 -24 -5 -24 56 7 26 68 22 -33 -41 13
5546 13 -92 7 -135 115 16 -1 -9 -66 29 8 -5 -48 -58 7 23 -2 -60 -26 -2 -57 57 -69 -81 97 31 16 -98
5573 -98 -57 -6 0 93 103 -132 -2 -44 -104 22 48 -11 -1 -13 -51 72 22 -118 41 28 -130 24 41 146 56 -20
5599 -20 21 52 -45 127 38 50 49 -1 34 -62 42 65 32 -6 22 5 71 74 108 102 -36 -19 41 -64 -48 -11 1 -50 -79 -14
5629 -14 -29 -17 21 -35 42 -84 -51 8 45 -45 34 -46 54 -52 -22 15 15 41 25 95 -185 73 -28 145 -82 94
5655 94 -120 -55 -60 -24 -18 47 47 129 46 85 -50 124 10 -30 -25 -41 -40 28 64 -21 -7 45 97 -94 76 -37 46 62 25
5684 25 -65 54 -3 18 105 29 75 -36 -53 118 27 25 2 11 -62 -3 85 -18 7 15 69 -46 75 -2 85 57 -6 -45 -12
5713 -12 9 -58 -80 -80 27 6 -91 -26 -6 -94 -21 15 19 83 -124 -32 69 -54 -27 36 -72 -33 4 -90 4 -30 21 60 29
5742B9j3L6j13Q5p2J89j16J00j39r6K70o8Kp5R6q3o3L7l0o5M1j47K19J1q0J59
5768A14j86LN9p7M6R6o0m7lP7Nq5J40p4Oj07o6J85m4L4L4j7j3nK5J7n3j38O9M4
5798b1J1RJ8J16j33p7K14k03P5Q2r8J04p2J6l5L1l0m3J5K9M4r0K7Q2l5J4j2o6
5826b8J03l9j16Q3qNn0oQ1j12R2k0j3On4J22j00P6l9N6p0J6Q3m1k9N6r9J35q9
5855Aq7N5J4Q6j08O6L8j22L8l6K5J06k4Q%q0K8K0K7r6j00P0M6L5l6N4j56J33J3
5884A8n9J28j15Q2l3N2j11Q4nj1L8j05PL8L2k6l4J46j26R0M8q7J0p4rm1P7P3j59
5913g2J65n4j2k5o1J24J1m0p4r7R3J76j71R8K0n8N4j41R8k3n6qJ3mN2k8O6o3m8
5942f5R7q8Q2q5JO4O3q4R7j74J90j16L5p9o2J33L2m6nmJ9L3j8l2L4P6j20L0L9
$$ plain form
5742 29 16 52 -61 24 -48 141 25 125 -14 -110 160 92 94 19 115 32 -31 6 -24 -89 -48 -195 24 35 -45 114
5768 114 -72 -69 -10 -87 -41 55 -5 -52 -55 22 27 -58 82 8 14 -93 -159 26 -18 16 50 33 20 15 40 57 4 -134 -65 -21
5798 -21 -10 -1 17 133 0 -77 137 -66 9 91 -7 97 25 41 6 37 7 -36 -21 8 52 -38 -11 71 36 50 38 -28
5826 -28 75 36 -80 3 -5 0 -50 -56 25 -87 5 -15 -28 -22 -76 46 -54 22 -17 39 -31 -15 68 27 -2 54 -45 90 1
5855 1 -86 -31 -17 69 -39 27 65 -57 -19 -55 -30 76 52 60 60 -20 8 28 55 -41 -141 -71 -25 10 -26 28 -128 5 18
5884 18 -41 87 -28 54 21 73 -38 46 41 30 68 -37 -30 8 40 14 -20 126 0 90 138 51 61 -13 -22 -63 14 87 -72
5913 -72 93 39 27 2 -59 65 76 36 -38 -135 -42 134 -37 61 81 23 77 -64 34 11 -45 -53 -40 -44 8 -20 46 -17 -65
5942 -65 32 -56 26 -59 -58 6 69 -15 82 -92 98 -18 17 -62 -124 9 41 -5 -10 -14 5 38 20 -12 22 98 -22 8 47
5971D7j01m7nP1J19j44J55q3K0j44J12nn6j6J03L5k7m8J5M5j07k2J98j28PmL5
5998B5k2n0RlQ4r3J37j89J46j83K12l3k3q0L1J33k25J7J80p4PL4j1j42J21j5j
6025hOo3R1p1J6j52K03n6J5pR5Q2j29o3kJ02j81R0J08j11m4J68k14J77j59P6J9
6052a2m6Q6J7p6K7Pk1p3J81j23l7J06p7O6On0M2RM6j66N0o2L7R4k22J90k4JM0
6081A6j9p5K8L8J43q6K5j10M7j8n4R2l6L2n9M2K8m2N6q7jL0N2l1%qo0J28j73J39
6111C7P9j15M3M7jn6o2M8qML2L0Oo9n1l1O9j2p0P7j04Q1J09J4p8p7J8K4ql9o6
6142a29N5K1P7m5j3NJK4N9r4Q5mr3l4Q8p8M7J26j23K1L1K6o2R9J6o2o5lQ0r5M8
6173Io1K4N8L0L7p4N6o3l1N5j00l5J05l0j1q1L0N0J21j02j33J35j03J20j19J28
$$ plain form
5971 47 -54 -101 -106 -35 84 -60 95 12 32 -112 0 -5 -61 -77 26 61 34 -14 1 46 -61 -83 115 -13 -6 -10 25
5998 25 3 -47 -38 -41 43 -50 87 -102 44 -139 73 40 17 -63 -32 101 -124 -107 73 -1 6 40 29 -113 8 -7 -8
6025 -8 -2 -65 26 -45 -29 -181 22 -34 -19 -26 69 151 22 -41 -43 59 -122 -32 76 -35 -79 89 -125 52 -107 -31 -12
6052 -12 -58 28 45 -31 -4 3 -18 -91 90 -33 -70 36 -41 25 31 -19 23 32 78 -88 -38 -100 -63 31 -191 -1 -25 -24 16
6081 16 -3 -78 -50 -12 131 45 70 -40 7 -11 -65 27 -9 23 -36 6 34 -8 48 -39 -40 -10 42 11 11 3 -57 71 -102 37
6111 37 116 1 44 91 90 34 -28 20 12 16 48 78 84 15 -36 -67 2 -10 -80 -3 -107 -26 83 97 19 -58 -40 -16 -24 -63 -129
6142 -129 -74 -53 24 -21 -34 -29 -28 -4 55 -39 46 42 -51 -85 3 -75 -28 98 -25 -4 27 53 -9 90 106 44 -21 -24 56 -39 9
6173 9 -52 -28 30 60 97 23 79 16 -15 40 -60 -95 10 -20 -31 -112 -82 -32 89 -13 -146 -11 -114 6 -113 15
6199A5OK1k1k3J1l9Q2k3N2j48M3Q5Nl4N1J2j45K9J00j09j9m1M4j5j42J92P7j21
6227e5K2m2OK4K7m3K09k97R7R2r5O8k2m2J35p6m2m0N2n9J05pK3j19K08j34P7q2
6255a0M1Kr3L5n6K4M0O4Rk0rNN3o9j14J62o4N1J%o4L1pJ00j05l1r7K9K26j69J11
6286G6o1J3L0n4j05J12Nr4L2n4J22p7rk1J24q9J31n3j18j1M3q7J30KJ0l4l4J59
6314H8Kj63Q4K1p2L0MO8j00Kl2l8J23o4J10k5N4p4LL7m1j8K8q7j2P7j9ojL4m7
6345c4L4N3r9N2Kj21P1P5J12k6k19J40o4O3M0q9K4n8kLJ01j62Q4J9J86j47j15
6372g7%P2J25r0j18R7l9O0q4J89j75M5p9J04m2J8r3J4P6l1R7o3rj01P1r5J33k4
6400a9K7J4l2J31j58R0kj21P0L9j17J42p7n7O2K36k81J11k9K6o6pJ12j52p8J44
$$ plain form
6199 15 21 42 21 -2 9 -30 52 29 81 -67 -24 61 66 32 83 95 -50 -21 79 -30 -49 -90 -46 -61 -203 -11 66 -55
6227 -55 -33 -75 -69 -45 -18 -61 148 -149 -52 40 -55 13 -9 -51 84 8 -34 -74 -22 -81 24 17 40 -79 129 -5 72 -10
6255 -10 31 33 -60 -25 -81 -57 -17 47 56 36 27 32 85 16 -98 64 0 51 52 52 -12 19 12 112 7 -24 -121 -92 134 -35 76
6286 76 15 28 58 4 -101 11 16 -78 -46 -100 22 -55 -64 -85 39 -50 81 28 -90 -101 -58 -145 -15 -13 -3 -37 -71 88
6314 88 90 -73 11 32 -40 -10 -6 62 -38 -36 -68 -106 17 -47 63 38 92 18 21 58 17 -1 27 -60 -72 5 -14 -20 -21 13 -34
6345 -34 0 53 -46 6 8 -113 -42 33 145 119 -100 40 -24 39 79 -10 14 -44 -46 -43 58 -104 -20 -1 185 38 -77
6372 -77 -77 -5 120 30 -88 9 -30 30 -54 135 -40 5 -74 30 -12 6 -87 -73 3 -28 69 6 -3 -104 -33 -128 5 -19
6400 -19 8 22 -10 121 -37 53 51 -70 0 39 -78 64 -13 -70 -8 228 -53 58 29 55 -11 -18 94 -58 -136 8
6426HO7j94R8KL1J4k08J21O5Jpj12M8J64o8j29J14l4k3Rp4J18rn9J4J07j69K48
6454A43j06L6n5M0L6j30K6n4J15p2N6p9J61j35j8J62k22K11j48O7l4j61J12J2
6478c7o4K18j23O9n1k7L0n7J30j05pN2q0K1O4K3pm8j8M6K8R1j73rj0J23k1q8m6
6507g6N1L5q0j3L8Q0j1%J3J2o0q1K3Q9K4j36Q4j10K00K0j65J18q5J00Jr7J3no
6536b4N2l1%K8j32Q4l7Q6o2J54j38o2M3l7M3j6l1O4R1k7p2p7J1N9K8j26Q7P3L7
6565F8j59J35k8m2O1j8p7J6R3r6q0J02P9k3l8m3J0O6k3L4n8J9k8O7n7J21j75P1
6593cM1j17L0J04p0q5J06ko6Q1o6O9K6m6o0J9p3J58m1k1mj3m4J41O7q5J01k78
6621a31J21R7k0j25M0K5K0p3J45o8r3J23j17J27j1q6L6Q7n2l1J0m3J3l8Q6l6r
$$ plain form
6426 8 75 -119 -21 -19 12 26 -182 -61 4 5 -2 -114 -66 98 30 -99 15 -19 -42 -33 -107 11 2 -57 -43 64 -105 143
6454 143 37 73 18 58 94 -36 -10 -64 51 -21 35 -44 117 -18 -36 126 -96 115 -33 34 0 -161 -49 -37
6478 -37 -101 117 -6 63 12 -15 15 -42 88 -17 -24 28 -52 -31 33 56 49 1 -17 29 57 148 -25 -34 -44 79 58 -30 -76
6507 -76 -25 10 -70 -83 -45 35 24 24 37 49 -11 -92 -69 20 44 -92 -8 -118 82 102 -63 55 -30 70 71 -26 -13 -18 -24
6536 -24 28 -3 -3 25 -107 -23 -60 26 -36 118 -20 -82 -39 -76 -33 -49 -80 -16 75 48 -24 -101 -90 -31 -3 -129 -42 31 68
6565 68 -91 44 16 -26 35 17 -60 -44 49 -47 -127 -25 54 31 -7 -50 -40 26 3 37 -21 -2 -30 37 -20 101 -74 -3
6593 -3 38 -79 -49 55 -15 -100 6 4 -62 19 -47 22 48 2 -58 -39 -112 46 5 -16 -20 -33 -77 64 131 46 147 -131
6621 -131 -10 87 67 -58 -18 7 27 -46 99 31 -62 61 -56 71 60 -26 10 97 45 14 24 -19 -6 -44 42 6 -3
6648cP0j19R5J7k10J16J8n5O9ln6M4o5QJ00o3R5q9q5J87oq6M9r7J11q3Q5L8p2
6677A0k7J1p9N8Q1o7o7M1O3l2m7J43k1%p4p0O2j5o2N7R5LK6q0LL6l5pjn3K3l1
6709e6M6Kn6Q6j26R3j4K6P4r6R4p5N0k6j04J70q3K9o5M8N4j28L5L5J4L1r5rO2
6738A6Q8Mj35Q2j37J10l7M0N7J1j02p1J72J0j55k3j2M2P4j27J12j20JJ69r6l4
6764f1J4R9m1q0P0N2q9P3m3R0n3l9k1J45j40RO2j0j37M9J01j09l7J97j00K3j07
6791h3J26n3m6P0k7P0m5J17j95NR2Np0L6m0J18o0n6N3k0O5p1l3M5O6j05P9n3K1
6820A1K7r1Q9j34M7n0K2P6O9j21P4k0J4L9n8J3j6O9j08l8Q2L4q9R1k12K59q4j00
6848a05R2K8k3o1N2O4o3m3O7%qL6k6r6J10q9KM9L2J1Q6j63R2l8L7n3J08o8J6L8
$$ plain form
6648 -3 67 -52 43 60 -150 -34 -16 -71 -2 -5 -61 -17 -82 -74 26 -37 58 -31 -116 71 65 -21 28 -69 42 -41 44 82 10
6677 10 -17 -6 -85 -27 54 -13 -80 -39 24 -8 -55 88 67 67 -7 -77 -15 -30 -92 -35 60 63 89 9 12 48 13 6 5 -48 -25 -56
6709 -56 -10 -8 -64 22 -104 -11 -25 1 75 -21 73 -2 48 22 -82 88 5 34 -31 17 71 -57 -22 13 27 58 -37 -46 16
6738 16 104 108 -27 55 -82 28 -9 31 88 99 -3 -74 98 108 -47 -70 -82 -40 34 -93 19 -101 -100 69 -27 -61
6764 -61 -47 52 11 -69 1 53 -36 37 -6 84 31 -8 -29 116 -24 -15 47 37 -100 -51 50 -59 -96 101 1 24 -83
6791 -83 43 -10 -56 14 -13 57 12 129 -66 -61 31 36 -34 2 -38 80 20 -36 17 -3 62 -9 -42 3 69 -36 43 -10 11
6820 11 38 -53 36 -98 -51 -101 -79 -3 66 -55 19 -1 13 52 -6 7 -9 60 -48 -86 -4 30 -59 32 -180 79 -5 -105
6848 -105 -13 15 -8 -69 -17 47 -16 -59 8 8 0 36 10 -86 24 -65 -63 -14 18 29 115 -48 44 6 43 -10 98 30 46 84
6878H4m9J06j36OO7j94P0K2o6J4J13p3j3R3j39J68l6p6j5j6K52r7j38mK1qk9O6
6906gNm3Q8j1k5j8o1J56r4L4q3J68j52J03n5Ok3K01k70k0k2K00j10K4Rko0j7J37
6935E8p4l1P4kn8r3P6J29j54kk4P9m9N8K1Q2j55R2J7m3J1l7P0j8j68K03j04K0
6963b2N0M9n9j33P2N4K9q0L8j1Pj1Pn6Q2j6L3jM2l2j19RQ8l0l3LJ04l5m7J27p3
6994C6k4m1j1j5J5O6K3k0m0J1R6q1N0q3J12j10q9P1MQ4j77J05M7J3P7q7k5j8M5
7023C4L9P5j29J7M0j65J37MK2p2k0qq6J37Q8j63P7L5j49Q9OQq4Q9l1K8p1L9m7
7052f1J04l4M0o4j58K04r0PJ27j35J83q7P0m6j06j6L5Q5lj9q0k0k0J32m2qM0P1
7080A09j91Q4m3l5K6J19j26rN6n1J12j7j0k4Ko4O9K5l1k7M0J05j73Q3K1M0p6r2
$$ plain form
6878 84 35 141 5 11 78 -116 -46 -24 -90 -76 37 -36 -49 44 -95 73 37 -39 -54 -70 182 85 -53 -57 -36 -44 -73 -7
6906 -7 -2 -45 43 32 7 -11 -72 84 -10 24 -59 109 -43 60 5 11 -12 189 -81 -101 -123 77 -33 -9 0 -2 -62 -79 58
6935 58 -16 -47 27 25 -33 -126 -50 79 -75 -77 -101 -22 -71 -13 8 90 -65 27 44 1 12 -25 45 27 -141 62 -42 -22
6963 -22 28 77 18 -115 -43 11 40 -40 -2 -13 -6 -17 -10 -66 16 0 33 32 74 42 -77 -68 20 -10 -43 -40 64 29 -18 109 36
6994 36 12 -29 -40 -55 -40 26 49 29 -11 0 96 15 65 -18 94 -16 -105 -34 -30 54 -123 -18 29 42 119 32 7 -11 34
7023 34 73 148 19 36 76 -89 48 52 74 2 -18 -26 -112 25 113 -50 27 62 -87 2 8 16 -68 21 -10 18 -53 -14 -61
7052 -61 43 9 49 -15 -173 31 -59 -52 75 -60 123 36 106 60 -46 -62 -27 58 55 36 -44 -64 -84 48 6 -2 38 109
7080 109 -82 2 -41 -76 -50 69 -57 -66 -10 -61 51 34 24 0 2 -62 7 32 1 -26 14 119 -54 29 50 90 14 -78
7108g8J02q0n4O1p5L0J69n8j11k1RJ15j00P0j6R6oj1j62J47l2k3m7Q9p1N3o4J31
7136F3J10j59Q4j78L1J01o9np8J03L0j09Q7l1J9k2on0J79p3K0p9J9k0M0n7O2o7
7164e5J19j06r2O9j4N5r4J09N9L1J7l6Q1l3m6j41K3J55r1k7mk8Q8K5j4m0j0L1
7192C1n4N4n8j2j0J4K9rl5m6P1K7M8j24R8J9r7J06o1k0L5p2N4M8p5L0R7J1j39
7221d0j40J98Qj16J27k2Q1m8Kn3M2j37R4j04J48Nj2R1p0m7l1R1pj92P5J42q8J0
7249Gj3k3QM6j5kJ52j61J35j12n6J8k2Q2L8k0j54K5K8M3O7j44O1j20L9Q6j11J75
7277E7q1p3J05J23j43R5j69J06q2KJ37P4k55J31OL3m8k1j71K54nn4P1j02ol0k5
7304g1J27q1O2P7j16K0j31J82o7o8QL7k5J55j76K1lnkJ56j43n8J24J1O0J8j71
$$ plain form
7108 -78 24 -56 -110 -49 -124 -94 75 17 -94 -115 -106 9 -91 -21 -37 59 53 42 -120 27 -5 -28 -75 14 -57 -4 -68 63
7136 63 173 14 98 -80 -49 52 -17 -22 -100 3 33 -76 11 -20 -1 -23 -29 -79 100 27 47 -32 -13 -33 7 -50 12 -55
7164 -55 64 -42 -134 -65 -79 -24 -118 -9 50 81 98 62 143 110 64 -77 -54 101 10 -17 -21 -49 39 64 50 10 0 31
7192 31 -23 31 -27 -39 -49 -35 -6 -15 -50 -96 -25 2 50 -74 24 43 -54 52 -9 -29 6 -66 -12 36 -39 -9 88 99 -40
7221 -40 -180 18 26 -90 37 15 96 48 50 -3 39 -98 -4 -108 40 45 33 124 54 7 -24 67 60 -132 -57 85 -3 7
7249 7 -6 -29 -21 25 10 8 160 -1 134 22 -34 -16 -38 44 82 62 -92 -67 -39 4 71 -73 -12 -132 -93 -7 -118 57
7277 57 -24 -97 8 131 -12 83 -86 20 -62 -60 77 151 -104 27 33 66 18 -3 -174 80 75 21 92 -10 -16 -46 -71
7304 -71 56 -25 37 114 -2 18 -113 69 2 -66 -58 -21 -46 109 -67 -46 -49 -54 -56 100 -43 -101 23 34 94 112 -59
7331e9K6P4m2l4NJ3jL0M7K0m3r0J20p6J04Oj55M6J0Q3r5L4j00K0J9Q5q4P9j24
7360h2J08Mj02J46j01K5qJ1O6j24K0N2L9K7r9O4o8j2JQ2p5R1j5r4J41o2j10O0
7388a5K8K7n1l2l1J06p4L5K4o6O2J4om9J3n9J40j21J70j32l0J14j12P4N6j93P6
7415c2J06p1Nk3R6r5L2n5R0p6j2Q1r5K0M6N4nn9j01Q7%p3J37o6j7J4J8M0j0J23
7445A59k21K7k3%R6n9P3O9j69O5o3P9Qp1R5n3J3L0j4j08Q8l0Q4q5KQ7m2K6j12
$$ plain form
7331 -59 -33 41 -1 -35 -30 -17 -18 12 59 79 36 -54 66 -10 94 100 -55 -9 1 84 -11 23 -77 -57 -38 47 -37 42 -82
7360 -82 26 30 -72 74 -27 -2 -10 1 67 -57 -37 15 54 81 -18 46 -22 -34 -33 49 -26 65 50 -44 97 35 -75 -15
7388 -15 13 40 -11 -43 -74 32 -42 -7 17 -49 13 27 21 -28 -15 -74 66 -55 115 -17 -47 67 -45 29 85 -108 -32
7415 -32 74 3 8 -15 81 -14 18 -37 53 -23 -35 46 -49 -29 17 71 66 7 -94 -7 -7 -80 57 -9 -26 -12 6 46 36 159
7445 159 -62 -35 -58 -58 38 -21 52 121 -48 17 -46 33 41 -30 65 12 25 55 41 -67 21 -9 75 -10 -8 79 37 63 -49
$$ [...]
8191H8
##END NTUPLES=NMR FID
##END=
