##TITLE=1H_DE-80H_X3
 200.13MHz, d2o
 8 sc
 
 19ns.26.2.2025
##JCAMPDX= 6.0         $$ Bruker NMR JCAMP-DX V2.0
##DATA TYPE= NMR FID
##DATA CLASS= NTUPLES
##ORIGIN= UXNMR, Bruker Analytische Messtechnik GmbH
##OWNER= pz
$$ XWIN-NMR		Version 3.5
$$ Wed Jul 22 14:21:06 2026 Russian Standard Time (UT+4h)  Yarkov@DPX200
##.OBSERVE FREQUENCY= 200.1313
##.OBSERVE NUCLEUS= ^1H
##.DELAY= (6, 6)
##.ACQUISITION MODE= SIMULTANEOUS
##.ACQUISITION SCHEME= undefined
##.AVERAGES= 8
##.DIGITISER RES= 18
##SPECTROMETER/DATA SYSTEM= spect
##.PULSE SEQUENCE= zg30
##.SOLVENT NAME= DMSO
##.SHIFT REFERENCE= (INTERNAL, DMSO, 0, 14.3821)
##AUDIT TRAIL= $$ (NUMBER, WHEN, WHO, WHERE, WHAT)
$$ ##TITLE= Audit trail, XWIN-NMR		Version 3.5
$$ ##JCAMPDX= 5.01
$$ ##ORIGIN= Bruker BioSpin GmbH
$$ ##OWNER= Yarkov
$$ C:/Bruker/XWIN-NMR/data/yarkov2/nmr/H-C/1/audita.txt
$$ ##AUDIT TRAIL=  $$ (NUMBER, WHEN, WHO, WHERE, WHAT)
(   1,<2026-07-22 14:20:02.92 +0400>,<Yarkov>,<DPX200>,
      <created by zg, POWCHK disabled, PULCHK disabled
       configuration hash MD5:
       00 E9 B6 7A A2 85 ED C7 34 08 36 98 17 FE 4E 26
       data hash MD5: 16K
       DA 95 63 57 05 F8 96 4E 92 71 97 38 EF AA 12 89>)
$$ ##END=
$$ 
$$ hash MD5
$$ FB 53 AD B4 83 DB F3 AB 18 49 D9 9A 24 90 47 11
##$RELAX= 
##$RELAX= 
##$RELAX= 
##$RELAX= 
##$RELAX= 
##$RELAX= 
$$ Bruker specific parameters
$$ --------------------------
##$DU= <C:/Bruker/XWIN-NMR>
##$EXPNO= 1
##$NAME= <H-C>
##$PROCNO= 1
##$TYPE= <nmr>
##$USER= <yarkov2>
##$AMP= (0..31)
100 100 100 100 100 100 100 100 100 100 100 100 100 100 100 100 100 100 
100 100 100 100 100 100 100 100 100 100 100 100 100 100 
##$AQSEQ= 0
##$AQ_mod= 1
##$AUNM= <au_zg>
##$AUTOPOS= <>
##$BF1= 200.13
##$BF2= 200.13
##$BF3= 200.13
##$BF4= 200.13
##$BF5= 200.13
##$BF6= 200.13
##$BF7= 200.13
##$BF8= 200.13
##$BYTORDA= 1
##$CFDGTYP= 0
##$CFRGTYP= 5
##$CHEMSTR= <none>
##$CNST= (0..31)
1 1 145 1 1 1 1 1 1 1 1 1 1 1 1 1 1 1 1 1 1 1 1 1 1 1 1 1 1 1 1 1 
##$CPDPRG= <>
##$CPDPRG1= <>
##$CPDPRG2= <>
##$CPDPRG3= <>
##$CPDPRG4= <mlev>
##$CPDPRG5= <mlev>
##$CPDPRG6= <mlev>
##$CPDPRG7= <mlev>
##$CPDPRG8= <mlev>
##$CPDPRGB= <>
##$CPDPRGT= <>
##$D= (0..31)
0 0.7 0 0 0 0 0 0 0 0 0 0.03 0 0 0 0 0 0 0 0 0 0 0 0 0 0 0 0 0 0 0 0 
##$DATE= 1784715602
##$DBL= (0..7)
120 120 120 120 120 120 120 120 
##$DBP= (0..7)
150 150 150 150 150 150 150 150 
##$DBP07= 0
##$DBPNAM0= <>
##$DBPNAM1= <>
##$DBPNAM2= <>
##$DBPNAM3= <>
##$DBPNAM4= <>
##$DBPNAM5= <>
##$DBPNAM6= <>
##$DBPNAM7= <>
##$DBPOAL= (0..7)
0.5 0.5 0.5 0.5 0.5 0.5 0.5 0.5 
##$DBPOFFS= (0..7)
0 0 0 0 0 0 0 0 
##$DE= 6
##$DECBNUC= <off>
##$DECIM= 32
##$DECNUC= <off>
##$DECSTAT= 4
##$DIGMOD= 1
##$DIGTYP= 9
##$DL= (0..7)
0 120 120 120 120 120 120 120 
##$DP= (0..7)
150 150 150 150 150 150 150 150 
##$DP07= 0
##$DPNAME0= <>
##$DPNAME1= <>
##$DPNAME2= <>
##$DPNAME3= <>
##$DPNAME4= <>
##$DPNAME5= <>
##$DPNAME6= <>
##$DPNAME7= <>
##$DPOAL= (0..7)
0.5 0.5 0.5 0.5 0.5 0.5 0.5 0.5 
##$DPOFFS= (0..7)
0 0 0 0 0 0 0 0 
##$DQDMODE= 0
##$DR= 18
##$DS= 0
$$ [...]
##$SUBNAM2= <"">
##$SUBNAM3= <"">
##$SUBNAM4= <"">
##$SUBNAM5= <"">
##$SUBNAM6= <"">
##$SUBNAM7= <"">
##$SUBNAM8= <"">
##$SUBNAM9= <"">
##$SW= 18.0517328524113
##$SWIBOX= (0..15)
0 0 2 0 0 0 0 0 0 0 0 0 0 0 0 0 
##$SW_h= 3612.71676300578
##$TD= 16384
##$TD0= 1
##$TE= 0
##$TE2= 300
##$TE3= 300
##$TEG= 300
##$TL= (0..7)
0 120 120 120 120 120 120 120 
##$TP= (0..7)
150 150 150 150 150 150 150 150 
##$TP07= 0
##$TPNAME0= <>
##$TPNAME1= <>
##$TPNAME2= <>
##$TPNAME3= <>
##$TPNAME4= <>
##$TPNAME5= <>
##$TPNAME6= <>
##$TPNAME7= <>
##$TPOAL= (0..7)
0.5 0.5 0.5 0.5 0.5 0.5 0.5 0.5 
##$TPOFFS= (0..7)
0 0 0 0 0 0 0 0 
##$TUNHIN= 0
##$TUNHOUT= 0
##$TUNXOUT= 0
##$USERA1= <user>
##$USERA2= <user>
##$USERA3= <user>
##$USERA4= <user>
##$USERA5= <user>
##$V9= 5
##$VALIST= <valist>
##$VCLIST= <CCCCCCCCCCCCCCC>
##$VD= 0
##$VDLIST= <DDDDDDDDDDDDDDD>
##$VPLIST= <PPPPPPPPPPPPPPP>
##$VTLIST= <TTTTTTTTTTTTTTT>
##$WBST= 1024
##$WBSW= 4
##$XGAIN= (0..3)
0 0 0 0 
##$XL= 0
##$YL= 0
##$YMAX_a= 149115
##$YMIN_a= -121318
##$ZGOPTNS= <>
##$ZL1= 120
##$ZL2= 120
##$ZL3= 120
##$ZL4= 120
##$ABSF1= 10
##$ABSF2= 0
##$ABSG= 5
##$ABSL= 3
##$ALPHA= 0
##$AQORDER= 0
##$ASSFAC= 0
##$ASSFACI= 0
##$ASSFACX= 0
##$ASSWID= 0
##$AUNMP= <proc_1d>
##$AZFE= 0.1
##$AZFW= 0.1
##$BCFW= 1
##$BC_mod= 2
##$BYTORDP= 1
##$COROFFS= 0
##$CY= 83.5205535888672
##$DATMOD= 1
##$DC= 2
##$DFILT= <>
##$DTYPP= 0
##$F1P= 10.8118882576601
##$F2P= -7.23987719738617
##$FCOR= 0.5
##$FTSIZE= 0
##$FT_mod= 4
##$GAMMA= 1
##$GB= 0.15
##$INTBC= 1
##$INTSCL= 1
##$ISEN= 128
##$LB= 0.25
##$LEV0= 0
##$LPBIN= 0
##$MAXI= 10000
##$MC2= 0
##$MEAN= 0
##$ME_mod= 0
##$MI= 1.114404
##$NCOEF= 0
##$NC_proc= 0
##$NLEV= 6
##$NOISF1= 3.799351
##$NOISF2= 2.8
##$NSP= 1
##$NTH_PI= 0
##$NZP= 0
##$OFFSET= 14.38212
##$PC= 1
##$PHC0= -7264.547
##$PHC1= 21.42198
##$PH_mod= 1
##$PKNL= yes
##$PPARMOD= 0
##$PSCAL= 0
##$PSIGN= 0
##$REVERSE= no
##$SF= 200.129724274929
##$SI= 16384
##$SIGF1= 3
##$SIGF2= 2
##$SINO= 400
##$SIOLD= 16384
##$SREGLST= <1H.CDCl3>
##$SSB= 0
##$STSI= 0
##$STSR= 0
##$SW_p= 3205.1282051282
##$SYMM= 0
##$S_DEV= 0
##$TDeff= 0
##$TDoff= 0
##$TI= <>
##$TILT= no
##$TM1= 0
##$TM2= 0
##$TOPLEV= 0
##$USERP1= <user>
##$USERP2= <user>
##$USERP3= <user>
##$USERP4= <user>
##$USERP5= <user>
##$WDW= 1
##$XDIM= 8192
##$YMAX_p= 0
##$YMIN_p= 0
$$ End of Bruker specific parameters
$$ ---------------------------------
##NTUPLES= NMR FID
##VAR_NAME=  TIME,          FID/REAL,        FID/IMAG
##SYMBOL=    X,             R,               I
##VAR_TYPE=  INDEPENDENT,   DEPENDENT,       DEPENDENT
##VAR_FORM=  AFFN,          ASDF,            ASDF
##VAR_DIM=   8192,          8192,            8192
##UNITS=     SECONDS,       ARBITRARY UNITS, ARBITRARY UNITS
##FACTOR=    0.0002768,     1,               1
##FIRST=     0,             0,               0
##LAST=      2.2672688,     0,               0
##MIN=       0,             -121318,         0
##MAX=       2.2672688,     149115,          0
$$ Real data points
##PAGE= N=1
##DATA TABLE= (X++(R..R)), XYDATA
0 0 0 0 0 0 0 0 0 0 0 0 0 0 0 0 0 8 -8 8 -8 8 -8 16 -16 20 -24 24 -32 38 -40 48 -56 64 -72 80 -92 104 -116
37 -116 131 -146 164 -180 202 -223 248 -276 302 -334 369 -406 447 -493 543 -597 660 -729 808
56 808 -896 996 -1116 1255 -1420 1624 -1877 2208 -2657 3308 -4338 6229 -10912 49817 72801
71 72801 83524 149115 86248 54737 61616 19633 -37447 -29011 -45307 -77073 -68095 -54276 -71254
84 -71254 -51407 -26969 -27362 -1790 25591 6133 21204 57540 41562 29651 51218 35722 17790
97 17790 34227 20226 -18168 -10423 -2039 -34569 -42485 -25010 -42089 -46750 -19628 -23526 -24940
110 -24940 8742 10045 2416 36261 46058 25312 37097 42589 12461 7514 19903 -6878 -29621
123 -29621 -15488 -23320 -40471 -17331 -8843 -28169 -11670 5755 -7913 1410 18972 6470 6532
136 6532 22898 16494 9093 19644 17002 3853 7099 4099 -12802 -9934 -7216 -24967 -19833 -4341
150 -4341 -15728 -14153 4449 -122 -1051 15941 11495 -203 10348 14590 2067 3601 10249 -920
164 -920 -2816 7648 -2458 -9722 2618 -4600 -16662 -5025 -3734 -12584 -2861 2120 -5242 2141
178 2141 12494 6120 2636 10422 6934 -1873 3616 2934 -6409 -424 2708 -6466 -2172 2924 -4778
193 -4778 -3101 2082 -3989 -5459 -496 -1937 -3500 2322 4763 907 3689 7021 1425 2261 6131
208 6131 -1228 -2925 1759 -3767 -4720 1959 -789 -4378 -624 -33 -2295 -953 457 -2119 -1790 2535
224 2535 185 -1396 4767 4524 508 3594 2217 -1177 1945 486 -4422 -2476 -672 -2090 -2740 -1048
240 -1048 293 -217 303 -81 -2224 435 2472 -619 133 1977 799 3000 3463 370 1466 1734 -1350
257 -1350 -2557 -2746 -2022 -1536 -2097 -1954 -1530 291 2612 257 153 2346 -33 -451 1412 -190 345
274 345 2322 733 -97 959 1117 292 -1452 -1454 -1753 -3578 -1938 -784 -1624 308 1252 501 2270 2358
292 2358 1365 1798 855 227 -75 -1164 -139 481 -278 296 -692 -1085 480 -652 -1722 -1218 -1567 -574
310 -574 -247 -735 1521 2619 1595 1752 919 805 1564 37 -1035 -1392 -1775 -306 -507 -1603 83 652
328 652 -261 -431 -1306 -314 783 -406 -619 133 550 2032 1562 692 1647 691 39 -98 -1633 -1181 -235
347 -235 -1543 -1353 -773 -257 971 266 285 575 -402 335 601 -415 425 1046 11 758 726 374 1095 123
367 123 -623 -928 -1633 -970 -638 -1166 -203 -116 -209 891 933 541 1021 135 289 171 -898 250 624 -33
387 -33 382 -113 -348 634 -105 -856 -847 -1111 -379 -738 -953 528 645 238 1043 426 460 1286 537 -51 -227
408 -227 -782 298 230 -653 180 202 -14 53 -771 -376 227 -497 -364 -700 -559 894 634 401 854 351 537
429 537 871 -450 -288 242 -590 -506 -650 -545 154 79 -104 -264 -586 198 120 -592 216 -4 -448 733 393
450 393 -67 1052 780 -5 -20 -415 -40 -254 -460 -288 -894 -381 479 -175 104 595 -405 145 303 -550
470 -550 402 543 36 220 293 167 594 447 177 -488 -630 48 -620 -841 23 -306 -376 646 -431 -109
490 -109 963 210 -147 113 -205 65 209 279 51 -227 509 340 -563 8 131 -675 -197 -647 -1053 302
510 302 209 -474 298 172 194 533 310 80 -68 227 271 -545 -106 632 -112 66 169 -701 79 451 -579
531 -579 -300 -35 -367 -172 387 137 230 424 609 -27 -234 696 -9 -240 160 -694 -506 642 -330 -432
551 -432 393 -210 -452 57 -119 -388 -94 231 81 -433 345 567 -30 546 282 -510 193 73 -516 -93
571 -93 -155 -311 43 -58 -312 39 149 30 -412 -157 452 -1 210 484 -254 220 754 -150 -11 533 -177
592 -177 -102 -237 -437 -178 26 105 -267 -413 375 231 -241 412 -73 -302 231 -49 -147 371 20 27 173 -244
614 -244 -263 89 -51 -242 -578 -189 -2 -158 47 172 -189 320 255 -211 305 177 43 225 -213 -239 341
635 341 223 -20 61 -155 44 -15 -225 0 -208 25 154 -275 5 429 135 338 191 -310 249 400 -141
656 -141 -37 -19 -11 -51 -213 88 33 -175 264 -76 -520 111 24 -100 150 -195 -11 339 71 136 193 109 30 -164
680 -164 -165 -32 -128 46 -26 -323 -56 249 54 53 -70 -248 218 62 37 181 60 195 -12 -118 215 32 -14
703 -14 183 -234 -191 210 -96 -196 -92 -200 169 139 -95 77 19 -8 23 -111 -142 162 13 295 -10 -194 117
726 117 147 -174 18 -39 -52 -18 -209 87 181 83 125 -71 -122 179 160 -5 87 -171 48 103 -101 103 22 0 237
751 237 -82 -114 93 -23 99 -75 -106 25 148 19 259 -32 24 240 -22 -161 44 32 -83 120 -97 -107
773 -107 71 61 145 -88 -105 163 -49 -30 175 -183 140 111 -31 123 116 80 76 -131 -98 57 52 49 -102 -99 55 -7
799 -7 -112 126 -43 -8 205 -213 -206 135 20 190 -9 4 -32 14 73 128 -38 -45 14 -259 -44 -34 -109 275 53
824 53 -210 236 134 119 65 -192 -1 46 -137 90 -142 -143 149 -52 -37 -7 -90 -81 29 -240 -50 135 95 173 -17
849 -17 67 178 -52 -109 40 -47 22 33 -143 -54 12 0 188 -162 -71 -19 -66 202 5 -183 108 120 101 53 -13 171
875 171 13 90 33 50 -38 26 -92 -41 59 -133 -42 48 -49 14 63 28 -75 -17 65 143 -42 -147 14 -41 -18 87
901 87 -198 -41 133 -1 19 -60 13 -17 14 -98 64 149 81 -48 33 -28 81 -29 31 -43 1 64 -105 17 45
926 45 -41 96 5 -143 -102 42 17 -15 13 59 8 78 87 66 71 35 8 -138 33 55 -8 116 -81 -103 -30 -112 31 64
954 64 -68 -37 13 94 99 -80 88 240 22 -31 -13 -27 52 27 -126 -129 -14 -83 -48 -25 20 46 45 18 -42 -71 75 25
982 25 -148 35 -5 106 159 28 33 148 -60 22 -13 -38 -39 14 -32 -56 -25 142 61 -26 5 64 -6 66 46 23 -57 2
1010 2 17 -18 -176 1 33 33 -80 -24 -153 117 -143 -7 145 -60 14 134 13 -29 -34 -30 74 92 169 37 -32 -30
1036 -30 52 84 -95 -79 -104 -116 -115 -27 116 30 34 83 -77 159 6 -14 82 156 -147 -15 -66 -17 134 -130 111 -4
1062 -4 -66 -14 -140 92 70 21 -187 53 62 15 5 -128 -48 -3 2 18 -70 -85 32 -42 85 27 -126 75 55 -93 -23
1089 -23 -60 43 53 30 -69 45 -7 24 -17 -28 103 19 -114 -42 -66 -19 -12 -59 -5 -59 18 16 -18 -103 -81 4 -17 6 -50
1118 -50 -101 113 27 -86 -46 -136 33 49 -48 -130 -46 59 107 8 75 66 -97 -35 114 -63 -2 -96 -92 -50 -106 -21 126
1145 126 -1 -71 80 -4 26 -5 -91 22 60 17 10 -55 -6 80 -27 22 42 -67 84 -1 -72 -35 -71 48 -27 -121 85
1172 85 125 -58 -93 -58 -77 32 -70 -43 -48 47 80 -13 -14 -65 18 17 114 27 -91 196 11 -56 46 -54 79 91 57
1199 57 1 -86 20 57 133 53 121 -49 -138 14 -43 19 -41 37 4 8 78 97 91 -25 56 -5 41 -110 -17 57 -3 -41 -33
1228 -33 -45 39 -70 -152 -7 23 -121 -52 72 -44 5 -52 -130 113 -18 5 135 -53 102 65 6 -51 -50 -51 38 -29
1254 -29 -45 92 -83 -71 -130 -49 -100 -71 -78 -9 7 -13 -97 33 35 87 -55 7 -32 -92 -12 -61 -51 -22 93 37 33 -51 49
1283 49 -63 23 61 26 -71 -39 -80 38 -49 -22 -84 -28 -111 -67 17 10 -59 -59 -20 68 19 36 80 27 -41 32 29 10 50 7 -83
1314 -83 18 55 39 64 -79 -75 0 57 -28 7 16 118 -44 -8 -49 -17 -50 50 123 -42 -116 16 -89 -50 13 -35 31
1341 31 76 4 -1 -14 -7 48 -31 6 -60 75 -45 24 -46 97 69 -5 107 40 14 4 -39 7 -8 -24 42 -102 2 3 26
1370 26 82 3 -93 -68 15 18 -16 45 -88 -37 88 43 87 -101 34 -84 -133 -87 -25 74 99 27 -54 -25 -32 48 22 77 22
1399 22 2 70 -46 -52 55 15 78 38 104 10 -43 6 7 3 10 65 -28 -119 59 -27 -65 43 58 -22 91 -42 -50 39 -56 -54
1429 -54 24 -10 -87 -50 -123 41 -4 29 -77 50 -58 121 38 31 -63 -37 -49 -22 78 -9 -9 -5 -68 -24 -70 -31 18 -8 45
1458 45 -20 -32 19 44 -76 -133 83 29 -24 -25 1 67 -18 10 -6 59 -55 -13 2 -29 -20 46 -20 -60 27 -44 27 41 -4 -45
1488 -45 76 -134 6 10 -11 -5 38 -100 72 65 32 -31 83 92 38 -63 -41 51 -35 108 -41 -108 -156 30 42 76 21
1515 21 -54 -72 61 42 5 133 -45 -92 -112 -40 -74 71 1 -45 -74 30 -89 -48 111 44 -82 -69 50 -33 80
1540 80 9 41 130 0 151 -2 1 22 -29 -25 -60 36 55 -17 67 127 49 -27 92 49 -60 81 -89 -73 46 -13 -48
1567 -48 -84 45 64 79 47 -36 143 -60 -53 -48 5 -30 -87 -7 -5 -67 -70 64 123 -28 -24 20 -18 9 93 10 26 -6 -13 113
1597 113 -69 133 80 6 -69 27 8 25 -29 -38 -14 51 156 28 76 -2 -12 7 100 14 -56 -140 22 97 46 -9 -13 111
1625 111 -5 -45 57 51 26 -79 -96 -48 -44 65 46 92 31 -13 -17 30 -15 -2 -68 101 29 13 -23 -20 -16 -8 71 -157 -74 7
1655 7 70 77 35 7 2 -43 -30 -97 39 5 15 15 -53 -94 68 -8 -137 17 -19 77 61 22 45 -96 60 68 -55 40 -34
1684 -34 113 -6 -75 55 78 -58 46 -12 -57 -54 5 -114 35 22 -33 30 -42 -52 -12 -26 53 53 42 -19 97 130 -4
1711 -4 22 42 23 9 -25 14 12 4 67 -61 30 25 98 -3 19 9 77 22 19 -32 19 -77 -22 36 19 -93 14 -53 8 -3 97
1742 97 -74 119 -115 -116 -14 -89 -57 -41 9 0 -7 -12 42 22 19 -47 -26 -54 -11 -33 -54 34 -50 -34 -19 -52 -47 20 -46 50 -70
1773 -70 -9 113 9 -55 39 14 9 -10 27 -10 -45 -3 7 7 -26 -15 -37 59 -27 -16 2 37 47 -11 -61 8 -60 60 55 40
1803 40 -45 -26 -5 123 31 32 0 17 10 43 81 47 -46 54 -31 -18 36 -58 -7 111 90 -9 -111 72 77 6 110 55 62
1832 62 -64 -99 62 44 29 -8 4 -9 -28 24 37 24 -23 0 97 3 41 53 18 133 -35 -1 75 30 -33 43 22 -87
1860 -87 -137 -49 -14 -5 59 -51 18 -64 32 -22 9 74 -13 61 -79 14 -139 22 -79 -27 39 -6 52 -6 19 8 -27 -102
1888 -102 -27 -13 91 3 -15 69 98 44 2 -83 -8 27 -7 -28 -80 81 5 -3 -51 -105 -74 136 38 -13 -6 54 -94 6
1916 6 30 -55 -61 -52 188 -111 0 -51 6 121 -19 -49 14 114 82 16 -39 101 -40 96 87 73 -26 -7 16 102 0
1943 0 117 109 60 60 31 22 40 20 35 44 16 18 117 31 -90 -96 48 -106 -49 74 -54 60 3 128 -31 9 -92 -26 -3
1972 -3 -63 -25 -8 31 46 -23 -86 -13 -67 -86 1 -73 -21 -11 -11 35 21 14 24 39 -110 41 21 -77 -115 14 -63 34 -121 -32
2002 -32 18 22 51 -43 -94 43 -55 -13 -74 92 -42 104 1 -88 8 -10 55 123 -22 -51 -74 -4 127 9 -68 97
2028 97 16 63 55 -21 28 -47 65 23 21 76 56 63 24 16 -40 -85 50 -8 66 66 27 26 -75 50 22 3 51 7 111 -7
2058 -7 69 74 0 -60 1 26 18 63 25 29 -3 55 -109 -13 33 -16 63 -16 48 30 -11 60 -168 8 -58 -30 -19 -53 38 -8 10
2089 10 -62 -18 1 38 2 112 -152 11 4 27 -39 -35 38 -41 15 -1 -44 14 47 -51 58 13 85 43 -16 14 22 21 -33 -12
2119 -12 -29 -47 -16 43 3 -41 64 -20 -65 70 8 -95 -51 -1 -40 -108 29 103 -46 -84 29 -97 1 -70 32 -33
2145 -33 -35 -14 36 16 -87 37 14 -85 -132 24 -126 56 -107 22 -14 -27 29 12 49 -51 -44 -6 12 -7 -91 47 105
2172 105 -28 66 -34 -7 2 87 7 7 158 81 100 74 -32 39 55 50 16 103 -51 -95 37 136 8 -131 15 0 20
2199 20 25 -2 -38 -36 -19 -29 29 -12 103 -42 89 8 -63 -29 49 40 27 96 186 0 22 28 -1 13 59 -21 -39 -31 56 13 -56
2230 -56 -3 -20 -32 53 25 -68 95 79 36 34 98 69 26 44 13 40 64 -7 31 -75 -19 -56 -98 -76 5 8 6 -27 120 55
2260 55 -25 -132 80 -28 -80 20 -173 32 -12 92 -145 25 -65 -31 -74 -39 90 21 -2 -77 6 -110 -79 -49 110
2285 110 -1 -28 60 -42 -41 -13 -47 -105 -25 4 24 -55 53 26 -55 54 -32 -68 89 -38 -18 111 -149 5 -50 -18
2311 -18 14 9 -56 -25 117 25 28 44 -2 -23 -33 -31 -20 23 92 10 1 46 -109 143 111 31 5 -43 19 -40 33 11 4 -5 39 -16
2343 -16 -75 -110 36 -13 63 78 1 -1 -17 72 -62 -8 -22 121 -26 106 98 96 22 33 73 105 96 -39 82 57 68 -115
2371 -115 28 44 -46 110 -41 -7 53 43 65 90 -48 -67 -32 -80 70 -18 -55 28 39 -97 23 -16 -17 -5 -104 2
2397 2 -123 107 -12 -37 -26 35 -59 89 -63 65 36 -49 37 -63 63 -51 -10 -26 29 -47 98 97 11 16 5 -80 -29
2424 -29 18 13 -44 36 18 54 95 26 141 -53 -119 -14 133 -60 76 71 58 45 20 -34 70 -20 81 21 45 52 96 5
2452 5 -103 -96 64 5 8 -107 -40 -46 55 -64 -90 100 61 -16 50 76 92 -26 121 -3 33 33 2 -89 -47 -42 -130 33
2480 33 -26 -65 -48 12 49 -11 -42 62 25 65 25 29 -55 -12 26 -17 -47 55 73 -77 49 125 36 -42 10 89 40 -2 -68
2509 -68 -83 36 -88 -30 18 -24 -17 26 -33 -7 29 37 11 11 21 28 1 52 -65 19 71 -48 48 7 -59 -32 -52 -52 -47 62 10
2540 10 -85 -29 65 33 78 -31 17 -27 -31 -70 -39 78 17 90 -82 60 -24 99 6 -64 -69 91 34 24 65 -112 -53 20
2568 20 -86 -96 -94 -90 53 -28 -16 92 17 122 45 -6 17 -4 75 -49 -72 -58 46 58 -34 20 -49 21 21 59 -87 61
2596 61 -12 52 75 -41 -32 80 29 101 41 -63 -33 -52 -62 -57 7 3 63 21 -36 -35 -124 3 39 60 77 9 69 -86 -79 19
2626 19 -7 -5 -108 48 -1 -50 -30 -104 -132 27 89 -5 -11 -59 20 -62 -105 -53 39 30 31 86 107 31 63 -48 2 -5 -56 13 67
2657 67 -26 12 26 13 61 -17 -27 20 -51 -20 46 -56 47 108 -7 20 -31 -61 22 71 -28 32 -20 28 -92 -28 117 -38
2685 -38 -93 118 -19 -36 -65 67 68 6 -66 -28 37 10 14 -76 96 22 95 -102 87 -133 0 -23 14 -36 13 -43 -36 -110
2713 -110 -40 95 -5 -17 -65 102 67 10 41 -12 56 5 22 14 -72 85 75 3 117 149 -14 -108 49 12 93 -47
2739 -47 -9 -74 -114 -11 14 -27 20 -25 38 -8 -20 -39 -101 45 116 -70 205 57 -52 -65 -17 52 97 101 -8 -44 -5
2766 -5 -67 17 -98 42 20 -24 31 -17 36 77 -74 -61 -10 49 45 65 -44 -81 36 25 56 4 -47 54 -44 27 -36 -17
2794 -17 143 -1 -77 -77 48 -51 -55 -19 -39 51 55 21 62 -15 -16 -4 4 -70 30 -98 11 36 -5 55 -15 2 167 -8 68
2823 68 -94 4 -27 -113 -97 33 93 -7 88 -91 0 33 8 86 -99 75 -20 -15 -12 5 3 -17 0 -63 -33 35 -95 -6
2851 -6 -36 -42 -105 -159 66 67 8 33 12 40 -34 -125 -77 -16 46 -87 -38 -90 4 -87 35 74 33 -7 42 -15 35 42 35 56 -61
2882 -61 -58 -95 -53 14 26 -19 -104 64 -33 9 -92 -31 119 -22 62 -25 48 26 49 -77 -12 -10 66 -39 33 27 -27 -31 65
2911 65 83 -6 -37 20 40 87 -70 11 -98 98 69 -5 31 -6 -2 -43 14 -14 26 79 -73 -17 30 -93 45 -17 34 30
2939 30 -74 -18 72 -105 119 108 26 37 -93 -1 65 -54 -68 6 -30 56 96 -58 29 -6 35 20 34 63 12 1 -21
2966 -21 72 -79 -79 80 70 -76 -9 81 74 -25 -12 63 44 -17 -75 80 41 2 -8 -15 40 68 10 25 197 -52 89 93 37
2995 37 1 21 -47 -23 26 135 -40 13 82 30 -21 52 -27 13 9 21 -4 17 -18 18 50 -26 82 10 -65 4 -110 37
3023 37 -32 99 76 -41 -20 -37 29 46 86 67 54 75 16 -32 17 17 -64 41 -77 -3 5 82 38 35 10 -30 52 54 106 43
3053 43 61 -14 107 78 30 -1 -8 29 -68 -94 -54 48 -63 -18 -41 84 -21 -56 42 -26 -105 73 89 25 31 97 -78 -4
3081 -4 20 32 12 63 -23 -61 112 66 41 15 39 -10 7 25 43 39 -52 15 -108 25 70 39 -24 21 24 55 43 -30 151 23
3111 23 -58 -5 -41 13 23 -16 -45 -92 78 54 -16 41 14 23 -16 -41 67 -28 14 -56 79 -45 4 -106 -26 96 -93
3138 -93 -89 -43 8 65 -6 -12 -13 -41 -3 63 -11 -26 -51 164 -114 -101 48 54 11 70 100 123 -19 137 67 -1 74 -65 73
3167 73 -68 53 -42 109 -18 -83 -35 -18 -3 28 34 31 114 17 40 -1 70 34 -101 -26 -27 10 -91 67 -22 42 -27 -60
3195 -60 12 -2 55 77 -12 -43 32 -33 38 -27 77 -35 121 16 -33 -33 58 -53 20 -66 75 -3 -63 93 -13 -96 -13
3222 -13 9 -27 -6 -18 65 28 12 -107 20 -58 8 31 105 -41 -95 -87 -65 -74 -54 78 40 16 30 42 -21 -22 2 6 -46 157
3252 157 4 -86 4 -43 -44 8 6 -23 -43 -49 -15 5 -93 6 8 67 27 -15 92 36 56 -42 75 4 75 87 60 46 21 -32
3282 -32 -44 -26 -57 -31 -28 84 -22 -51 -48 61 -33 92 -38 116 13 -2 25 14 21 30 12 87 11 -205 63 4 -69 -50
3310 -50 -43 22 84 64 -4 -55 59 -66 35 80 -27 35 -40 -77 -39 15 -19 4 108 -56 31 28 -24 -20 -108 78 -12 -45
3338 -45 -69 -6 65 26 74 -31 -51 78 81 86 -62 -14 -19 -41 -120 -16 -9 -34 -59 -7 80 -56 26 8 -146 -23 -20 -133 1
3367 1 -39 115 80 8 102 -112 59 28 -12 56 -41 51 32 -121 18 -70 9 139 58 -16 114 115 32 60 6 6 69 1
3395 1 3 42 -10 -44 -153 -4 -4 2 30 5 5 74 34 50 54 -14 -49 9 7 -10 22 100 -52 -101 -66 -52 20 39 2 -36 26 -27
3427 -27 60 24 40 96 -3 -73 -186 26 -38 -2 8 -4 -37 -104 -4 9 120 -70 -95 17 20 -85 110 -45 57 2
3453 2 -11 -54 -55 -27 -36 55 31 79 -3 108 -47 -28 75 -4 81 123 -18 -17 34 -18 -34 92 -64 74 45 -91 -90 -12 16
3482 16 -15 34 22 4 70 -67 -73 -79 -31 115 31 -88 73 -7 -58 18 47 -85 -45 -27 -37 -20 62 -76 86 24 62 13
3510 13 -30 111 106 -11 27 80 -85 135 6 -43 0 69 -12 2 18 -112 -6 -37 17 31 -7 41 -50 56 -10 25 112
3537 112 -37 67 57 -93 -40 39 -95 -41 9 -62 -104 50 57 80 -66 -99 56 -55 18 -49 -55 -36 -9 35 79 5 32
3564 32 -115 64 43 56 22 -21 -70 -9 -70 29 -121 -25 16 63 24 81 -15 47 21 -53 -9 58 -56 2 -22 -7 5 92
3592 92 33 -63 23 -75 -70 58 23 -32 -25 51 -78 13 -1 -101 61 15 29 -105 -94 49 -27 -64 -51 68 -81 7 -59
3619 -59 39 33 -155 58 -33 1 68 -31 20 -66 146 59 -6 17 -132 129 91 16 24 -8 -13 16 81 25 68 65 18 -62 -52 56
3649 56 96 -40 -80 -9 48 -101 14 70 -13 -47 8 -15 -41 27 18 86 83 1 -6 -36 -70 -21 28 124 -124 64 64 90 -42
3678 -42 13 22 -13 -74 -41 -53 76 -17 14 -87 -12 -26 46 -66 -52 60 8 38 -68 56 -34 -10 -20 -26 -37 13 97 -19
3706 -19 -70 90 115 28 102 -40 -13 90 54 -52 -157 -30 -69 -22 -2 -8 6 128 103 40 37 39 31 89 110 26 -93 25
3734 25 -13 -86 -17 -166 48 -123 -36 -48 -61 5 5 107 17 -31 -54 89 20 87 -17 -71 71 34 2 10 -5 68 23 73
3762 73 -5 -14 21 62 48 -41 21 -9 -42 89 89 27 17 -50 101 67 -2 61 -143 -69 47 62 -73 36 29 -20 4 -54 88
3791 88 50 24 -8 -29 -60 25 -5 43 -38 97 26 57 82 3 -28 123 -85 95 6 81 61 -79 -5 -77 21 -25 -32 59
3819 59 5 -21 49 -85 29 -7 113 59 28 88 -68 -61 -79 -2 36 -110 110 195 11 29 -3 -47 -74 25 84 -21 -86
3846 -86 -42 -78 -78 -88 67 -28 -29 62 -31 62 -31 -81 -21 77 -11 2 -98 -50 41 -115 -19 -69 -49 -80 57 -23 -12 -31 -9
3875 -9 43 136 -73 -122 -70 -48 81 53 120 -46 62 -137 -28 -118 -81 -65 -14 3 47 -13 -76 -11 44 -46 -13 -32 86
3902 86 91 -28 -36 -5 -77 -70 47 -58 27 10 -55 36 24 -19 134 -11 -24 10 44 -33 -70 -39 24 76 131 61 8 -16 17
3931 17 -9 90 47 18 89 -102 -18 -15 39 -3 -44 -56 71 -71 -125 46 25 83 -37 -16 133 110 -6 83 99 4 151
3958 151 -54 -33 -160 -8 12 -55 -11 -104 -42 91 9 34 -5 -84 -37 -62 163 52 55 46 -34 37 -146 -54 65 5 -6
3985 -6 9 53 -32 15 -32 28 -6 -37 -7 -47 56 28 -24 -4 -73 58 9 -63 -80 80 -43 -68 -66 -27 -35 12 52 -7 -28 165
4015 165 -14 -71 46 -84 -95 46 47 -35 58 23 -84 -31 187 90 2 -98 -20 36 -99 22 -4 -74 -48 -34 -29 28
4041 28 57 178 -103 -18 132 -70 7 -18 78 1 116 -13 29 9 -31 -6 -97 -86 -54 -101 -27 61 -92 -62 -35 -34 28
4068 28 -5 7 46 -74 6 48 44 20 90 -32 -13 -58 -50 27 -25 -22 45 -50 116 -54 -35 -3 7 -22 -32 -60 -65 49 -46 69
4098 69 -68 16 -77 39 41 -26 51 29 108 -6 88 62 7 51 -135 70 123 56 38 -5 -34 39 90 17 -16 87 99 -36
4126 -36 94 40 -39 -91 -63 -30 64 5 -58 -30 46 -8 14 67 -64 11 -104 -29 82 17 -79 51 -46 7 -40 -38 71 -6
4154 -6 -35 -13 -65 -66 -89 10 114 93 -25 -56 -75 -13 -85 -15 20 -12 49 -62 -31 -64 70 39 36 -64 -26 20 -7 -38 -24
4183 -24 32 56 -48 7 -100 -55 49 40 69 40 83 -92 -35 116 -64 -133 92 -66 -52 -26 -42 73 -22 11 -1 82
4209 82 -15 -63 70 48 72 69 12 35 -17 -95 38 17 26 75 -59 4 -80 10 16 -28 -96 9 -15 -72 26 -36 -25 33 -74
4238 -74 -23 -43 76 50 82 61 -7 -58 -40 -22 13 3 141 56 34 9 9 21 -21 64 9 38 70 45 38 98 -18 145 -85
4267 -85 -3 26 27 -12 135 28 -198 -136 27 -21 116 83 22 44 -138 58 11 -22 -52 -141 -30 16 70 13 22 -99 18
4294 18 -25 86 -21 -12 62 41 58 83 -3 -57 2 71 85 57 -75 -78 48 -15 -83 -78 54 -21 -22 -53 -7 57 147 -40 -21
4323 -21 5 -90 -77 129 -28 70 54 -90 121 -82 51 92 13 22 123 -24 12 -37 31 -100 27 40 -23 0 90 -85
4349 -85 -38 -12 49 -79 -9 92 27 -65 -90 -79 39 -23 -26 -64 34 21 -81 67 4 -30 30 -8 -61 19 2 -67 -127 39
4377 39 -99 80 71 -88 -20 86 105 83 208 -21 -40 -71 -50 -149 -41 -15 4 -33 51 -31 49 47 -69 -120 16 57 48
4404 48 -12 -14 -23 3 20 35 8 1 -36 -26 0 -62 72 106 38 -79 16 31 20 -67 -51 -54 9 46 97 1 14 80 13 -83 59
4435 59 29 -74 53 -89 110 24 13 39 -102 -55 -66 45 106 -38 4 18 27 -5 2 -105 7 -33 14 27 99 49 74
4462 74 40 3 124 38 65 121 10 35 29 -4 78 -21 6 -35 -38 -1 -68 -44 -36 58 -48 17 0 -34 19 -18 -44 84 -81
4491 -81 1 3 -11 -72 30 -12 0 -53 -65 6 -22 -5 -67 -21 -85 13 107 -31 -87 -41 -35 -51 3 -25 33 -4 45 95 -4 38
4521 38 -8 11 -95 -45 -12 4 -1 -110 -81 -108 33 -37 -103 81 78 4 4 -43 -68 -24 5 29 0 31 -20 48 35 48 19 33
4551 33 20 32 59 31 3 10 -15 6 -14 -126 1 -22 1 41 6 -76 48 39 -79 -17 -66 43 70 -100 19 39 -13 67
4579 67 -63 -1 -82 102 60 64 26 -49 45 73 33 36 106 -19 9 28 -8 137 5 95 -16 -75 -26 -67 10 55 -22 -173
4607 -173 -74 -10 110 -47 -32 -55 86 -44 41 -50 71 -6 -86 32 22 -62 35 -42 73 -85 -20 26 22 -59 19 -59
4633 -59 -25 -84 64 45 89 139 55 -4 -37 27 54 -59 -16 56 32 74 -56 -113 -113 -98 -5 -32 -66 5 -4 15 -47 -88 23
4662 23 -100 -80 -26 43 63 -61 13 28 -14 116 -148 -4 -16 12 -8 4 14 -75 93 0 -42 -25 -61 72 26 -9 113
4689 113 53 39 91 -33 27 100 21 50 -12 152 61 -23 -28 -31 -86 -35 80 132 32 -44 -83 50 -23 -49 45 87 83 75 45
4718 45 -71 13 45 -34 -1 25 11 4 -28 -43 51 -43 94 -8 46 50 -7 38 10 -30 -22 -44 -68 -93 83 27 -111 -109 -77 52
4748 52 -100 -51 9 -26 -72 13 66 18 54 67 -83 0 45 -94 -99 22 26 50 30 42 54 32 31 9 53 13 -46 89 -84
4777 -84 -11 -26 -28 -36 -21 56 11 -17 -57 25 -123 -43 -72 -6 -39 -2 -60 -117 92 10 -111 136 -33 57 -44 22 9 -21
4805 -21 104 18 68 -28 -3 -85 -21 34 -90 74 -57 -54 -29 -32 -11 -9 -64 -120 -18 -51 2 -151 18 41 -51 26 -106 56
4833 56 33 55 -38 73 -10 2 42 113 -1 30 39 -27 -23 -81 55 -47 -59 -31 97 43 63 -73 50 -90 22 -80
4859 -80 -4 -12 80 -12 67 6 -171 -8 -30 -114 45 80 0 -90 -26 -53 54 -22 27 -60 8 64 10 -54 32 9 4 2 -176
4888 -176 135 -14 -7 0 3 42 73 72 9 -24 2 -55 -25 -1 -47 25 -83 -125 -31 -9 -12 -29 -44 -85 28 51 -86 -49 8 -18
4918 -18 130 -13 72 -8 -78 72 0 10 -23 52 -10 88 0 6 -26 -2 68 11 61 15 10 -37 -58 114 28 -46 -27 5 11 25
4948 25 -7 -65 -4 9 43 57 -15 43 84 -113 -83 52 -23 82 66 43 37 -68 -99 -1 -84 88 9 28 -14 1 33 -69
4976 -69 -52 22 57 46 -138 -187 -39 -26 -121 -64 97 -52 38 53 19 0 -41 -87 15 128 -76 8 -74 8 -71 35
5002 35 -82 1 93 16 -21 -6 -28 3 -63 -55 -21 16 58 2 -22 19 -29 -30 -137 -23 -7 -51 54 -99 91 -28 -24 15
5030 15 -13 -49 -7 -33 78 71 -7 -133 -22 -99 -15 27 -53 100 23 21 -110 64 -23 83 -55 -57 -17 5 64 42 -15 80
5058 80 -32 -14 54 -76 57 -33 -45 80 23 -3 110 89 36 -50 -65 -34 -73 23 23 24 -59 1 103 0 20 -9 19 -4
5086 -4 -94 106 -29 2 138 65 44 115 -21 8 -16 -10 50 -26 71 -15 3 -25 39 59 -75 -113 107 5 -73 83 -60
5113 -60 -9 97 -15 -9 27 -104 97 -70 16 -21 108 88 -2 -45 -24 -72 -45 -127 93 66 58 7 27 10 -13 62 24 123
5141 123 -104 70 18 42 -9 77 -42 -65 1 27 -13 -20 7 94 -83 107 -99 46 131 5 -2 3 -125 3 -12 -70
5167 -70 -99 -45 43 24 44 2 110 -34 -67 26 38 76 -9 110 -38 -73 10 -43 16 7 30 124 -112 -20 25 -124 12
5194 12 88 57 50 -17 -20 -45 -31 -79 -47 7 -34 33 -73 -54 -3 5 -4 59 -20 32 -18 -1 -66 0 -64 -9 164 -56 53 44 -23
5225 -23 140 12 66 -50 -66 -48 -58 -29 -3 -36 -89 -51 -59 -82 28 30 36 82 37 -10 -58 -22 19 57 0 -102 -38 -30 19 -22
5255 -22 -26 59 13 70 24 7 45 -55 8 -1 80 105 30 20 63 66 178 -84 24 63 67 11 -164 26 77 -4 68 -7 -35
5284 -35 71 70 82 30 61 -41 34 40 62 42 -96 5 79 51 24 50 -84 4 87 -34 -2 12 -2 111 -68 8 70
5311 70 73 109 -24 100 -49 -93 -68 149 -19 -18 28 23 56 -133 36 -7 -99 -67 -12 44 -89 -121 -5 -58 38 3 185
5338 185 21 -53 -50 -14 -43 49 67 -20 -99 198 90 61 -21 52 -35 -10 84 52 -13 -40 -10 43 45 -57 -4 -16 -34 20 -26
5367 -26 102 8 31 -63 6 -31 24 28 19 -97 -67 -14 -20 -23 -37 -115 63 66 -106 10 -66 21 78 -48 67 -6 11 83 -21
5396 -21 100 -35 22 -89 -102 1 -113 -33 54 -45 3 -89 100 -92 -85 71 61 25 -56 61 58 31 -80 107 -75
5421 -75 16 -69 69 -90 45 89 30 28 -48 76 -29 7 114 3 -4 54 -21 5 -25 -13 149 -5 -112 -23 -16 63 -71
5448 -71 -68 -35 -11 -74 -30 28 -50 -91 -17 -53 117 53 -71 -10 58 -23 -101 65 14 29 -141 19 -39 -2 -44 61 -54
5475 -54 -89 87 -1 10 42 27 -148 -89 70 92 -28 78 6 2 67 -2 7 -18 88 25 -35 -73 14 -115 7 -52 74
5502 74 -62 6 -12 -13 -3 19 -10 -57 37 18 -93 40 12 96 -40 34 -14 -55 17 19 56 17 24 -70 26 -30 33 14 -109
5531 -109 -7 115 -86 59 38 -1 -53 41 109 35 -5 43 -1 -54 90 15 32 -64 -49 4 93 -1 -44 -104 58 55 -1
5558 -1 -36 -11 91 140 38 -14 -73 72 122 38 -44 116 51 -13 28 -44 32 -25 113 -28 9 62 6 71 33 2 -11 31
5586 31 14 33 -9 -69 30 36 71 -41 -52 88 67 52 -26 94 -67 -37 83 -54 -71 -6 136 41 -31 73 95 -42
5612 -42 -17 18 34 28 23 41 86 -58 88 14 23 121 -30 63 54 53 -66 -102 -47 -116 11 41 6 68 -70 -11 91 20 -4
5641 -4 73 113 -122 -43 43 57 74 28 -21 -37 -39 45 -31 105 -12 59 -78 12 -32 -5 -79 -23 56 123 -11 -47 -12 -100 50
5670 50 0 -33 -17 89 104 -35 -6 -8 -33 38 -5 -23 38 94 14 -18 18 -63 47 45 -28 -33 83 -27 9 -14 24 26 -16 44
5700 44 -58 90 -60 -41 -17 67 56 8 92 -117 41 -22 27 41 74 -54 74 138 4 100 64 36 -62 10 -63 23
5726 23 -45 22 -25 2 96 108 -4 -58 -23 10 17 29 -155 -148 -17 -56 58 95 -25 50 107 46 -43 -56 -27 -21 83 -25
5754 -25 5 -128 46 -11 -5 52 -36 -138 70 129 -67 -6 76 6 0 106 56 48 12 -54 -33 -27 36 30 55 -66 5 26 -71
5783 -71 2 49 -21 -69 46 -52 -10 -18 69 -100 -5 61 -73 -95 29 -39 -15 8 48 -101 -45 24 -4 -10 -34 81 -85 0
5811 0 45 100 51 9 61 23 41 -10 -7 -30 12 19 41 57 27 -66 27 -95 61 -34 -9 8 64 23 -119 30 42 -95 -70
5840 -70 -20 31 -46 -88 -38 -35 106 126 5 4 29 -30 -74 -128 -63 37 -8 -34 -43 25 62 5 27 -13 86 6 3 -1 19 -13 -14 38
5872 38 15 23 -97 -76 -19 17 -4 -8 -42 9 14 29 6 -39 121 20 -20 -29 -74 -103 -89 -67 54 41 -34 72 -61 -14 -12 -66
5902 -66 -18 3 67 -10 -13 -25 59 -29 -51 -34 27 80 22 -10 83 -113 -6 -55 -2 148 27 94 -89 99 -15 -4 -28
5929 -28 -18 12 -18 -40 -82 -77 -17 18 -37 75 -62 -137 -22 38 30 96 -88 -28 -20 -12 -3 -158 41 -41 21 -4 -6 2 -58 -11 -10
5960 -10 -3 -24 104 68 -45 130 -13 25 56 -136 97 -33 -52 -113 27 55 -30 38 42 18 34 62 30 -52 -22 20 141
5987 141 -51 -25 28 372 -206 -20 1 80 94 -60 -72 151 -103 -30 35 28 -21 68 59 -46 111 -103 36 63 -40
6012 -40 -42 11 -18 52 -75 -71 -111 7 -52 24 -38 32 -88 95 39 -16 -24 1 50 -15 26 50 -50 6 129 73 16 27 139
6041 139 45 -16 -10 44 66 152 11 -8 -136 65 -31 -58 20 27 -60 51 62 -9 -8 -32 5 -56 -8 -63 -23 -42 24 59 65 55
6071 55 41 77 -15 44 6 78 36 -19 -46 -42 67 23 -36 -12 38 37 -63 -41 10 -13 -123 47 -45 -79 -14 -26 55 56 103 70
6101 70 -14 28 -49 -7 1 42 53 -37 -19 39 -27 4 1 -7 31 34 -118 140 -8 17 57 13 68 55 -60 -82 22 -44 -31 -43
6131 -43 50 -71 -84 -43 -92 79 -5 -15 -30 -158 -23 -69 -12 20 6 -64 64 -22 -94 63 63 -33 4 -58 -11 -53 -115 10
6159 10 -21 46 -67 62 -3 -19 19 15 -52 27 28 51 72 -28 -74 -158 -33 -76 -143 -89 -30 21 13 -52 132 88 -1 -15 62
6188 62 -69 -76 -82 -42 53 64 36 -9 -64 -31 -56 36 31 -42 68 23 -68 92 -74 69 1 -39 -78 53 98 -132 63 15
6216 15 -25 -64 14 23 91 -38 99 29 58 13 55 48 -68 23 21 53 6 -66 -25 19 -41 -27 -20 27 16 59 -28 69 -50 56
6246 56 -139 160 -61 71 -22 302 -542 -182 95 -99 97 1 80 -117 -100 -60 55 45 15 -65 -17 -30 -32 -190
6270 -190 72 -20 36 -40 55 -76 -76 -15 4 28 -47 -52 -52 5 -34 28 42 -33 68 -101 -36 11 -13 35 -76 29 -62 -30
6298 -30 -111 -17 -65 0 -16 29 -14 9 21 23 18 -108 10 24 88 -87 -63 5 -35 -43 2 57 -56 -89 0 5 3 -87 -82 -78 52
6329 52 34 50 -44 -103 -30 -23 20 -60 26 -74 11 -111 98 140 -34 8 4 9 77 -115 101 -91 -4 -89 20 8 -5 18
6357 18 -105 -69 60 20 33 -22 21 7 -3 6 -14 -30 25 82 51 -43 -106 115 -125 7 -43 187 75 98 0 13 17 81
6385 81 -18 -80 -28 39 -12 -63 28 19 56 70 -13 -112 -22 85 102 -29 -48 -24 65 92 58 100 21 -8 -6 -102 -127 52 -12 17
6415 17 -43 94 31 -61 -94 31 -104 -37 -14 99 -2 69 27 -34 32 -56 -17 21 28 -83 -24 31 40 -21 45 -9 -67 38
6443 38 -12 -104 -73 69 -46 -47 -80 -23 25 -45 -43 74 5 113 83 24 100 82 83 20 -111 -8 -63 127 -93 175 -45
6470 -45 -71 -129 -29 -12 -93 95 -45 6 60 5 -14 -40 -132 34 18 -94 63 44 -22 18 -22 -6 38 50 -16 81 -32
6497 -32 92 -159 -58 75 98 -2 -19 32 -62 -29 -104 16 -35 -73 86 -54 -82 -36 -6 -18 9 42 -42 41 15 -63
6523 -63 42 9 62 -96 -19 -33 -2 -1 -24 29 18 47 74 35 -5 -37 22 31 -29 31 92 -33 13 -66 -40 -98 -35 -27 14 -43
6553 -43 -64 -46 -42 3 -7 -79 32 -16 14 -20 -94 -67 -69 14 -5 48 -98 -84 76 52 29 23 35 68 -70 1 97 82 35 -10
6583 -10 49 -52 -37 -72 -3 -137 -41 -105 -156 -6 1 -21 -57 42 8 53 -14 -30 -10 -32 -28 33 45 -88 -36 -49 84 80 5
6612 5 90 57 -42 23 -6 -35 30 -20 94 33 -48 -65 22 -8 47 -40 -4 -52 15 83 -94 84 44 64 -19 3 -52 -35 -81
6641 -81 -24 3 -71 48 46 -18 27 -17 -28 -5 31 88 -70 -7 -52 106 57 100 -81 -6 24 16 -15 16 10 15 18 25 49 10 -102
6672 -102 2 35 8 102 -32 56 -6 89 -73 -60 2 29 -10 -133 30 57 95 46 77 -85 7 1 -42 -26 -67 63 -51
6699 -51 80 9 -1 53 18 64 22 -13 12 68 -34 5 -65 5 -1 -63 10 119 -2 2 -43 -8 -114 -25 -74 18 -18 -93 -29
6728 -29 -44 -24 -24 -60 7 31 -41 -131 21 -72 -13 37 -29 39 95 62 4 -31 -107 20 -11 23 -78 -46 54 123 -1 -35
6756 -35 78 -88 101 -4 -117 22 23 104 -74 21 -78 -16 84 24 -2 24 -101 43 108 3 -9 82 4 39 -32
6781 -32 49 -8 13 -59 4 -39 -50 38 -4 -63 -32 46 18 -107 -149 -35 6 -17 -83 -11 65 -46 7 67 -53 31 -38 129
6809 129 70 93 31 38 -3 -68 -33 32 13 20 -18 -10 10 188 -75 50 -72 -153 55 81 -41 -62 39 59 95 26 6 89
6837 89 -75 34 -31 137 -18 5 0 7 19 64 36 -111 1 -90 -8 -50 76 82 -161 1 -16 30 64 -52 19 -15 -87
6864 -87 -25 -23 -27 27 61 37 22 53 33 61 22 10 -11 -65 11 -32 0 13 118 35 7 32 -1 28 -39 104 -68 -33 -40 18
6894 18 48 -30 10 -7 -35 -132 16 -35 28 39 132 -32 22 57 -46 111 44 -8 1 -211 23 -82 93 -9 43 52 51
6921 51 26 -32 45 -80 -37 15 -36 104 39 -74 3 66 -143 11 -4 87 122 -14 -34 0 -55 21 -6 -31 -73 -27 6
6948 6 -78 67 -30 59 -41 87 20 35 143 158 20 -1 -18 107 -28 1 46 29 -82 164 19 91 50 24 97 0
6974 0 46 -90 -42 49 -55 29 -6 -2 -22 33 -2 -95 59 32 22 52 62 26 -10 -78 -100 -118 -20 35 18 -61 -36 -54 -16 -9
7004 -9 45 12 18 -52 -91 -27 49 -47 -85 -58 -28 0 68 -19 -35 -65 17 -117 6 -29 -5 10 -91 -99 28 32 -56 -90 -28 30
7034 30 34 52 105 33 -33 -9 175 -78 2 27 25 27 -31 30 44 62 89 23 13 15 136 117 18 43 -17 11 -86 33 59 44
7064 44 56 -35 -195 52 -42 -10 62 -2 -2 27 16 23 45 9 85 55 41 29 130 -33 2 -4 10 -22 58 -70 -95 138 -101
7093 -101 -8 37 -71 34 -57 9 -51 95 -75 -5 -38 -43 111 -37 29 -71 52 -29 -113 -20 29 -126 40 -23 -17 -21
7119 -21 -57 2 -31 31 91 4 78 21 45 -21 42 -18 -22 162 39 49 -145 92 -23 44 6 6 149 -89 -49 7 88 -47
7147 -47 -58 -2 60 -9 -88 -51 -22 -23 -121 -56 29 26 -54 24 -124 -66 -81 -105 -47 -134 8 9 96 -62 14 -50 12 2 -3 -85 26
7178 26 -95 43 73 -13 -23 -58 66 -68 41 68 -73 -27 -63 -34 -94 5 -126 -56 -26 15 -102 -9 37 78 -102 -85
7204 -85 -56 -35 -60 43 -91 -109 30 4 34 -7 22 -5 87 -18 -84 80 57 -10 0 -58 -54 37 -16 46 89 -18 -42 26
7232 26 78 -39 -23 52 7 -53 67 67 78 116 121 21 -94 -157 -53 46 12 80 3 27 -13 31 12 39 -46 -32 100 23
7260 23 46 -28 -4 -14 326 91 26 -13 117 30 -46 25 88 66 -46 -69 -23 -93 17 -88 -18 -26 17 4 -43 125 -14
7287 -14 109 -9 -121 37 5 -7 100 -58 -23 -2 -14 34 85 -56 55 -108 92 11 46 63 169 -31 0 -32
7311 -32 23 -77 -45 120 -93 104 -26 22 -10 67 87 -75 55 27 119 -10 29 14 30 3 29 26 61 28 -136 6
7337 6 -59 48 107 18 -75 4 -118 53 32 79 1 -67 30 44 47 40 18 17 38 11 29 30 12 29 -55 -34 -44 -37 -8 151 -46
7368 -46 11 20 -31 -22 -60 -55 -76 -5 -37 13 39 -85 116 48 -8 4 -44 12 -31 -9 1 43 60 55 -29 -3 56 12 51 2 -32
7399 -32 -20 -56 -79 93 -48 -15 8 -101 -28 -65 47 -59 -74 -70 -28 -71 -8 -70 -74 53 -35 109 39 -30 50 -26 -74 -27
7427 -27 26 58 -7 28 32 14 -35 -13 -50 28 65 9 49 -22 -117 70 -112 -16 -60 -62 -100 76 0 20 -7 10 19 6 -191 -65
7457 -65 137 35 11 -69 22 80 161 -51 69 -16 75 -3 -72 125 -82 -97 38 19 38 71 -41 -37 -1 -11 2 -19 -36
7484 -36 4 -33 -29 -83 -69 -102 -31 80 -63 -70 19 -15 20 18 -120 -111 -85 18 12 18 -123 -13 128 24 0 93 62 35 -52
7513 -52 -40 61 -1 68 -97 38 125 113 96 7 76 74 -97 -23 24 90 -120 -153 105 5 -14 2 11 10 -69 165 -50
7540 -50 100 -16 -55 73 -67 -6 76 -62 107 -41 -49 74 -99 133 25 -61 -100 17 -48 7 -60 85 25 -54
7564 -54 54 50 56 -28 12 101 13 -115 -80 34 2 -72 39 -43 24 -61 89 48 54 18 -6 -66 70 37 -21 94 -31 64
7592 64 -65 98 -27 78 -31 21 34 -20 27 50 18 -23 -117 -42 -101 100 79 -72 -83 -70 4 12 -42 35 -5 6 27
7619 27 126 -44 7 -58 -10 -58 41 -70 46 -37 44 -8 -35 50 125 -142 47 82 56 134 -80 -12 -98 14 -42 129
7645 129 -100 86 92 20 -75 19 -78 55 10 -6 -78 100 173 -111 -113 52 25 -32 -35 35 11 75 31 61 -12 29 97 -57
7673 -57 105 -69 23 -65 -21 -77 92 37 40 148 -56 -62 -21 75 97 -106 -5 -47 -42 -40 16 -144 26 -96 -49 24 63
7700 63 -23 -32 -34 -68 -78 18 -73 -37 -79 -26 56 103 -43 70 33 35 -7 24 -28 2 32 -2 118 -49 -20 58 82 34 -42 -1
7730 -1 -103 60 -81 50 104 -75 6 -71 46 -21 34 -38 1 56 -134 -140 -13 46 50 -37 4 -25 -65 -51 68 -24 20
7757 20 -128 -25 -3 -116 94 38 85 47 -18 107 27 8 16 44 118 29 44 19 19 -88 62 -59 59 -85 10 -57
7783 -57 46 -37 -42 -1 59 -1 108 7 -81 11 -36 25 -52 16 -70 -63 107 -34 104 -9 62 40 -65 -15 -56 78 88
7810 88 59 -71 103 -129 24 -177 -134 48 14 77 9 -4 53 45 -51 34 -150 77 3 -89 95 36 22 -69 41 1
7836 1 -62 79 50 -37 -30 20 -45 -22 39 3 -8 -46 17 31 -58 78 25 40 15 -31 -15 19 23 65 -5 25 41 -5 102 145
7866 145 81 -32 -60 49 2 67 -83 9 5 -99 64 -69 -39 -20 -18 -89 144 22 76 -81 22 -83 -82 68 -6
7891 -6 123 31 56 5 91 -14 97 -5 23 66 -48 27 33 136 18 51 -53 -38 -50 -12 51 -125 -62 -177 26 33
7917 33 -54 -39 -111 -79 64 -38 -11 114 70 -74 28 -80 23 -12 89 -49 -49 -20 118 -67 -30 57 59 9 18 61
7943 61 7 53 -23 -9 20 -61 -93 -95 -88 31 -18 47 -61 94 -111 17 -22 77 -1 -65 -20 47 -18 27 24 0 32 45 -119
7972 -119 24 4 47 -29 34 -23 67 -29 -26 61 -32 23 -31 39 -20 -31 3 5 123 -47 17 7 -31 87 -7 -59 53 32
8000 32 49 52 2 47 23 108 -116 59 42 -116 -1 -59 35 15 58 -115 -51 6 97 21 -28 -52 -20 6 -39 161 75 -42
8028 -42 137 33 -90 85 35 -45 -2 -15 -88 20 -36 -50 -34 -33 -27 45 47 27 -1 6 -99 47 90 118 -26 -45 -10 -57
8056 -57 -5 9 41 -9 -42 9 39 19 -54 -74 -54 20 -42 58 75 39 -26 -16 -29 37 -19 81 -7 55 7 -100 -122 87
8084 87 -65 -30 -58 52 55 -28 8 -57 -11 71 -130 -124 66 -41 89 -105 -1 21 22 -66 72 114 1 -86 -57 22 3
8111 3 -59 1 -56 -97 -36 96 53 -89 17 -107 52 -119 -56 -27 11 44 7 34 47 -2 6 11 40 86 81 14 -119 44
8139 44 -66 62 37 -40 82 15 -8 93 -43 51 48 -57 10 37 -17 -84 76 94 35 85 -9 73 -33 -45 32 -131
8165 -131 -33 -40 39 -29 -63 55 -55 -133 -53 15 -35 -38 -51 44 166 -5 73 -61 -113 113 -127 -46 -14 -99 -112 4
8191D
$$ Imaginary data points
##PAGE= N=2
##DATA TABLE= (X++(I..I)), XYDATA
0 0 0 0 0 0 0 0 0 0 0 0 0 0 0 0 8 -8 8 -8 8 -16 16 -16 24 -24 32 -32 40 -48 56 -64 72 -80 88 -104 112 -128
36 -128 144 -161 183 -201 224 -249 277 -308 340 -375 413 -456 502 -556 611 -672 741 -819 905
55 905 -1002 1112 -1240 1388 -1566 1777 -2037 2367 -2801 3400 -4279 5705 -8404 15331 -73845
70 -73845 -121318 14479 9983 21812 88323 111466 79800 104201 99939 51764 28071 20499 -26701
83 -26701 -43778 -37043 -53047 -54883 -32249 -49689 -45902 -6692 -13146 -30629 452 7374 -2644
96 -2644 25266 38646 18505 36740 63205 39826 22504 36590 14744 -15617 -9436 -24347 -52273
109 -52273 -37625 -36307 -53448 -25564 -3195 -18062 -2452 24254 12541 14508 40923 29524
121 29524 8284 25258 27091 2696 10965 16179 -15431 -18387 -4258 -25038 -30597 -13139 -22642
134 -22642 -26622 -4468 -914 -5757 10548 18770 10412 15773 21676 9351 9191 16292 742 -3397
148 -3397 9876 -3373 -15020 -1467 -6861 -18076 -5755 -6347 -19163 -7632 4274 -3726 -1328
161 -1328 11862 7520 4394 16677 11768 328 9995 7431 -8679 -1154 3488 -9575 -6259 94
175 94 -9302 -7458 2718 -3361 -9183 -176 1723 -5145 1337 7415 285 4119 11059 1908 1528 8368
191 8368 -76 -3332 2178 -3211 -7236 -1628 -1786 -4869 -773 1808 -2828 -2396 2197 -1577 -2442 3682
207 3682 114 -2328 5034 3236 294 6731 4624 -1777 711 1547 -2569 -2945 -1777 -3837 -4221 -201
223 -201 -681 -3351 1829 3117 -2091 527 2075 -1460 1685 2968 -1347 699 4048 2021 359 1134
239 1134 1222 -656 -2001 -2419 -4147 -2679 166 -2570 -2567 1115 474 1585 3123 294 942 2639 151
256 151 -563 607 1251 1544 152 -298 -211 41 674 -1855 -3733 -1051 -2114 -3174 -59 -89 -130 2830
274 2830 1766 662 2464 2404 1345 -182 -349 -10 -1479 -775 883 -975 -658 109 -1538 -941 -354
291 -354 -1587 -1045 -709 -846 248 662 1755 2866 1836 1679 1169 57 950 -29 -2059 -1543 -1511 -1330
309 -1330 -493 -1275 -8 1181 -396 -447 -216 -280 1039 382 -532 561 820 1806 2036 192 846 1201 -684
328 -684 -1372 -1722 -1394 -285 -1547 -2007 -503 127 1236 924 -171 900 652 -115 555 -9 56 1301
346 1301 144 -350 477 309 575 -278 -1416 -932 -1404 -1327 -238 -1023 -330 1071 282 683 1416 678 1127
365 1127 637 -315 -78 -412 -25 664 -281 -67 206 -507 113 -52 -1133 -616 -821 -757 -183 -617 516 1486
385 1486 427 736 872 337 1090 384 -925 -653 -589 -484 -273 -892 166 493 -595 -183 -174 -472 409 -154
405 -154 -753 -188 -157 762 1063 302 720 876 248 320 -381 -471 -13 -656 -1005 -726 -639 492 476 -312 187 116
427 116 82 518 -317 -315 696 64 -6 506 312 886 634 -176 -191 -537 -204 -26 -1039 -581 -313 -828 267
448 267 394 -268 695 724 -322 -167 53 281 304 58 127 -73 -19 753 60 -494 201 -613 -660 -4 -917 -356
470 -356 476 -309 -197 305 461 628 608 144 -174 -259 308 213 -525 401 216 -391 355 -111 -588 540 -74
491 -74 -1002 -423 -273 -199 407 262 162 160 490 838 -257 147 664 -314 -326 -189 -647 171 470 -591 -272
512 -272 74 -257 2 -170 -346 -351 -34 304 -80 92 1037 329 63 553 -244 50 616 -586 -620 182 -442
533 -442 -153 262 -104 -140 47 175 -94 -277 392 312 -258 280 -100 -256 1041 488 -355 492 87 -524 63
554 63 -25 -582 -336 116 -156 -589 89 574 -238 -139 297 -467 74 511 -355 22 252 -209 234 177 -134 -106
576 -106 62 -312 -626 -541 225 -24 -241 185 -133 -60 728 -114 -211 465 -28 -119 96 15 127 373 -50 -212
598 -212 -251 168 73 -438 -235 -220 -489 141 108 -247 346 326 60 194 -33 57 324 5 -174 -223 -48 178 -35
621 -35 -181 238 -209 39 125 -471 -124 180 -305 -24 -38 -153 483 317 17 110 -74 -65 48 -298 -137 -10
643 -10 -196 119 -155 -12 316 -71 -106 -78 -259 64 297 -74 -71 320 96 259 127 217 215 -150 73 -110 -437
666 -437 -16 133 -319 -138 -200 -55 312 100 -175 60 31 -41 -18 -105 269 22 103 60 -161 18 134 -226 -29
689 -29 -165 -297 4 -79 -332 11 120 110 107 -46 43 195 -119 49 -22 -240 255 180 12 113 -127 46 167
712 167 -104 -30 -54 -96 -35 -223 -123 244 146 100 82 -45 196 299 -224 -36 14 -136 -28 -89 -58 293 85 -27
736 -27 -64 -283 135 23 -237 77 -35 -74 73 23 -20 172 33 -35 -31 -201 33 101 -45 -102 -93 -65 158 121 58
761 58 -51 -205 184 -2 -197 193 181 -66 53 4 9 199 96 -85 -165 -170 53 14 -92 123 -54 34 265 77
785 77 124 192 -27 52 -134 -6 158 32 -61 -85 -50 30 118 -92 -6 85 -164 18 -90 -152 127 165 -69 66 -15
810 -15 48 19 72 -5 -150 -55 78 -90 85 110 -81 -6 51 -169 -84 41 -138 -22 -45 -98 146 85 -9 78 4 107
836 107 -102 -116 139 -43 -111 -31 -243 -81 128 -43 -52 -55 -67 95 7 -26 62 3 -8 -20 -38 49 127 106 98 -132 -137 174
864 174 67 -90 -4 -52 -52 -28 62 -9 80 61 109 -44 67 198 -20 56 214 1 197 16 -69 -8 -13 3 -34 -189
890 -189 -30 5 153 -127 -47 -100 32 35 -65 117 20 -82 100 -12 -107 85 -145 -6 36 -248 -24 -45 -96 45
914 45 -108 -116 142 44 34 31 -133 40 2 -9 7 19 -23 -11 -98 61 111 -44 155 -54 -30 50 -73 -13 -125 -113 19
941 19 122 65 32 153 -26 34 -71 -168 104 -60 -66 -69 -152 25 19 -33 -34 -83 -137 -55 -125 -56 77 -144 113 93 -41
968 -41 -3 198 43 51 -17 -85 111 -18 -134 10 4 19 69 -158 11 4 -53 29 -66 0 49 -23 20 59 -13 52 7 -58
996 -58 37 82 85 -35 -80 -6 143 5 68 -70 -119 93 31 -83 -53 27 -21 43 -29 49 117 27 43 -58 -43 -32 89
1023 89 65 -72 -51 -31 9 -144 -47 17 67 167 37 -146 -57 56 36 61 -40 -4 1 -23 75 -62 28 146 63 -8
1049 -8 49 98 19 43 -22 -63 -117 54 -13 -45 -25 103 13 83 76 -93 -65 3 0 -13 14 -2 21 -54 -131 12 -4 -3 62 -92
1079 -92 94 -123 -20 -88 -5 41 58 -36 -94 136 5 41 34 -38 65 25 6 50 -5 -49 5 3 -8 -23 -87 -124 -40 -53
1107 -53 88 -17 54 6 4 50 30 -48 26 62 2 88 1 -51 -131 19 46 43 -47 33 3 6 22 -4 6 62 25 9 74 -23
1137 -23 82 -153 13 43 -12 42 107 16 88 -6 20 29 11 -18 58 57 -10 -158 87 7 59 -47 -21 -73 -134 66 -37
1164 -37 -131 116 45 -72 53 -93 48 -35 14 -102 -12 36 67 36 -53 -11 -25 -78 48 -39 83 -31 -39 -96 83 59
1190 59 4 18 -17 68 -42 -126 -68 -85 -43 13 65 -17 -11 -136 -103 107 -58 157 38 43 9 1 -81 -33 -28 120 -34 -35 58
1219 58 -75 -1 -91 11 11 -72 -64 -80 -18 55 -56 58 44 102 51 74 -48 13 -19 -91 20 -14 52 -76 -57 24 -37 10
1247 10 -44 33 75 -25 9 -65 99 -93 -76 55 12 9 30 -105 -45 42 -83 -32 -127 -35 -22 -15 22 29 16 -35 -18 -16 -87
1276 -87 33 25 29 48 69 69 78 -43 9 -70 -37 -50 -55 -66 30 42 -13 -109 18 86 -49 -52 27 18 54 -20 116 -30 89 9
1306 9 15 40 7 2 -16 -94 -18 -20 88 59 -86 -81 14 35 81 2 22 11 52 59 46 -30 69 85 3 93 8 39 -7 -82 -47 -61
1338 -61 -25 -7 46 -41 20 58 50 -14 2 39 -42 -56 40 93 12 89 -121 20 87 -49 -74 -43 61 -22 -52 24 -100 78
1366 78 37 -56 41 -17 -33 115 76 55 -32 -17 -1 -57 106 -3 119 27 79 9 26 -84 14 117 111 -143 31 -29 -58
1393 -58 29 -11 0 29 -14 -108 65 84 3 -40 107 -7 -36 9 -51 -51 39 -18 -95 -36 -63 -77 24 -55 61 4 -12 76
1421 76 -45 59 42 -62 -9 13 -37 -24 -27 -44 -86 47 -51 1 5 99 -8 -120 -87 -108 -106 -62 6 -125 53 -33 53 -46
1449 -46 31 -12 117 73 -73 -8 20 -7 -97 6 40 -24 -21 80 24 -19 19 21 36 50 -81 99 -49 -72 39 -105 -37
1476 -37 19 17 70 -44 84 28 -33 -36 102 -85 17 -61 127 70 -27 -97 92 -39 -20 -17 49 83 100 -46 -69 -86 35
1503 35 20 -40 28 101 -88 121 58 -67 48 157 7 21 4 -89 21 71 82 80 89 -68 -62 -30 18 -9 -6 0 -41 -27 19
1532 19 -101 9 141 -24 -47 77 -89 -12 22 -18 -38 83 -5 17 -109 89 40 -41 -1 -11 -98 50 20 -94 -49
1557 -49 -80 -47 -48 12 16 6 -7 10 109 -28 -22 -5 27 55 -87 63 98 -37 26 37 -94 -1 30 -12 100 -72 120 -41
1585 -41 88 -124 -2 -21 21 103 13 13 64 -21 100 43 59 85 33 31 -26 -44 -147 20 -54 58 -42 -5 -73 -26 -23 14
1613 14 -26 -56 71 39 130 -6 69 -5 1 51 105 -17 -22 51 26 69 12 -84 -30 106 62 -9 -38 -29 -8 31 9 -21 -51 -93
1643 -93 -33 -35 31 49 -65 -28 6 19 -38 -80 -28 -59 -60 -26 -21 -93 -82 14 91 91 -157 -11 67 -39 -46 -64 -23 82 -72 25
1673 25 -52 7 109 9 -35 -23 2 103 -67 -53 7 47 -26 -110 -30 -108 -23 -63 44 20 20 -68 122 -30 18 11 -50 7
1701 7 -26 -6 45 24 -12 -42 69 68 -77 -88 58 -67 35 -26 11 13 55 56 -4 28 -32 -89 28 -24 -93 -47 31 11 -48
1730 -48 -71 31 -71 36 6 -18 99 -71 44 -36 -82 13 43 -13 81 -21 66 -139 -2 -25 -15 55 0 55 47 132
1756 132 43 66 -34 -46 -10 10 85 -18 -60 -54 13 96 25 17 106 -30 -15 -6 -53 -55 37 74 132 -4 70 -102 134 108 136
1785 136 82 59 -33 -12 -3 -39 -61 -79 16 -7 -31 15 -1 8 -30 -54 -24 -64 94 37 49 -33 -55 2 124 64 -52 -31 41
1814 41 -131 41 -64 -25 67 117 8 -50 -63 -139 11 -39 36 -26 -14 -124 -66 -47 49 38 -44 -6 -83 -72 -69 -8 1 -18
1842 -18 82 16 49 -134 46 -18 65 -39 -18 -61 -7 -61 -60 -26 -12 59 52 -62 -47 75 -95 -1 12 -96 107 -83
1868 -83 -21 -38 19 20 -63 -144 -20 -70 -133 18 15 -62 28 -101 144 59 66 60 -46 -49 -89 21 -9 -80 72 -15 -33 -94 68
1897 68 37 4 27 1 -28 34 25 -17 -30 -26 -15 56 -14 -72 47 -46 -50 123 -95 7 90 -114 -42 -37 124 5 -80 -60 48
1926 48 2 46 75 -59 2 -48 -21 44 23 49 -59 -122 50 -43 -70 10 28 -63 47 -121 55 -138 23 122 -5 86
1952 86 27 69 -93 67 37 11 -35 70 -48 -35 30 -52 27 108 56 -88 100 39 40 1 8 -7 -39 38 -24 5 -3 -143
1980 -143 -5 -140 93 -1 -46 -42 -45 -127 14 68 -26 108 -59 -63 -35 -24 -103 -92 -53 101 -67 -92 55 3 -41 -30 -73
2007 -73 -5 -88 -29 9 8 3 -139 -62 72 -42 -67 40 -82 17 1 35 27 44 103 -49 16 55 70 -38 -33 57 8 0 -1 -2
2037 -2 17 -2 -55 -18 -108 -41 67 -101 -60 64 -46 28 67 202 31 -10 28 25 3 -12 60 -85 33 -43 73 92 -40
2064 -40 96 18 -4 103 -47 -2 0 -64 12 22 30 -88 75 -23 120 18 -14 -38 32 -97 -7 16 31 -35 -25 -64 -14
2091 -14 3 -26 -1 -15 53 -12 10 -111 -24 94 -5 103 -104 -48 43 91 -20 -17 24 23 -100 -33 103 72 -7 80 31 79
2119 79 -58 55 18 25 20 12 -4 54 -51 14 -26 13 54 -120 113 -141 -7 4 -40 21 21 -4 -55 32 70 24 29 36 -56 61
2149 61 -60 -74 -56 69 -48 -9 -47 -94 -10 16 -33 22 60 -17 76 30 65 -65 -7 -9 -64 78 76 36 32 22 -24 109 81
2178 81 -59 -129 15 -15 -2 1 -21 30 -11 -12 73 45 80 2 -16 102 -39 54 -87 55 21 52 -80 22 15 8 -41 44
2206 44 48 -73 -174 17 -64 32 33 -17 16 72 9 64 -1 17 74 -39 -83 -111 -10 -159 49 -41 -5 31 3 -48 -37 -7
2234 -7 -25 -32 -127 -78 -7 152 50 126 60 72 -91 -54 -42 51 107 27 133 21 1 17 78 -31 -12 -77 46 95 -118
2261 -118 -87 -103 88 -113 -37 36 27 -43 131 -36 89 37 -102 110 -90 46 30 5 109 29 -59 39 53 34 -15
2286 -15 103 -60 -103 -53 -24 -19 57 3 -55 -23 57 -95 -117 72 18 124 67 -7 50 -49 55 71 34 -15 -85 -25 -83 10
2314 10 3 48 36 -27 -13 62 1 -63 89 -21 -77 76 -40 68 12 -53 98 31 -42 42 -6 22 -3 2 -20 38 -35 -20
2342 -20 23 30 76 22 -18 45 24 -73 43 74 128 4 25 22 -71 21 22 -6 -6 28 93 -31 -3 -91 74 -10 0 -7 9 -33 9
2373 9 142 -109 -71 -13 -1 -70 19 -8 -36 0 -49 -37 7 36 -31 -34 30 117 20 -91 66 -64 51 -44 102 -72 19
2400 19 42 25 11 -16 -94 18 55 3 -102 20 34 -20 37 69 78 61 -72 153 43 -50 10 2 -53 -10 -130 -13 76
2427 76 -40 -13 38 41 -39 -5 28 70 -56 55 -44 -35 9 117 103 -19 36 -5 38 1 -72 0 -43 -25 31 29 67 28 -31
2456 -31 87 -59 -35 28 -110 43 44 68 132 100 25 -32 45 2 24 -113 -10 22 46 42 32 70 7 54 68 65 41 -65
2484 -65 31 -43 115 93 2 47 66 -55 -83 45 -51 -80 82 -45 -30 -89 26 -44 13 -3 -14 -35 42 90 -89 49
2510 49 -81 3 37 51 41 30 10 -45 79 150 -43 -32 -36 6 -67 18 -106 25 -81 121 51 54 -6 27 -56 -5 44 -23
2538 -23 -88 -18 -13 -39 -61 -55 74 156 141 -165 -53 117 -5 6 71 -102 32 -55 -70 46 37 -49 24 64 -39 -3 14
2565 14 32 -49 -76 122 5 -81 -37 -42 -65 95 26 -45 -67 7 -10 -115 -31 -69 -9 -70 42 -75 -55 99 -34 -111 13
2592 13 65 31 -1 -31 40 15 94 -70 11 49 19 -12 22 -101 68 28 -6 -67 17 20 -8 79 -88 28 49 -70 25 -28
2620 -28 -113 -37 -40 -30 -5 -53 90 8 -98 87 -80 71 111 -20 -67 58 121 -14 22 76 -46 69 -30 -45 -73 68
2646 68 -54 -81 -57 26 71 17 -37 -23 22 -2 64 163 11 15 59 101 34 -109 -17 -63 -18 31 -28 -52 48 -42 -89 -23 -26
2675 -26 91 14 -72 -14 27 45 63 -25 -58 29 -59 94 -20 -102 67 -84 -77 23 114 -28 10 94 4 120 20 15 -53
2702 -53 36 108 11 56 20 -81 -105 44 -42 -80 -80 -43 -32 41 44 -78 -8 18 37 35 3 3 -20 16 -15 -36 52 53 18 -22 148
2733 148 -34 -49 37 -90 142 -47 5 20 -4 108 50 -97 39 19 -31 -14 -19 15 -59 35 -33 -2 -93 -68 -61 12 53
2760 53 108 -1 -47 -124 94 -96 -70 -19 -25 -19 6 -29 7 -9 -90 4 11 22 42 76 -36 -28 87 -38 -35 46 9 73 17 45
2790 45 28 -29 31 -78 22 -4 62 10 -2 -121 -48 99 17 -7 -25 -57 -44 -9 61 16 12 -27 -26 128 -16 -33 -83 -10
2818 -10 45 -1 -70 -61 -155 -67 -14 -71 81 -26 -8 0 -42 -25 51 -77 -134 -1 8 -39 36 -4 -33 -22 75 -14 22 41 1 -23
2848 -23 17 68 -26 -137 45 -8 -56 52 36 29 -27 28 -33 -28 65 47 46 -18 11 -157 -33 80 4 81 -74 -157 7 -62
2876 -62 43 -28 24 -36 148 22 -24 -6 4 80 -68 46 8 -101 -7 -10 39 33 -25 13 87 92 -35 58 -95 -38 -12 -59
2904 -59 61 44 15 66 93 -92 -70 -57 95 7 9 81 -79 -41 -96 -52 -4 -59 -114 34 -49 -11 -3 -26 60 47 27 28 25 -44
2934 -44 42 19 61 3 -53 -82 43 0 -30 -2 107 -56 -35 -76 5 46 -3 -32 27 -14 -140 49 -31 15 -45 79 92
2961 92 72 69 64 -39 13 -26 -72 -25 -50 10 31 -32 -6 -36 20 -27 41 31 -69 -119 6 20 -90 22 70 -114 60 -14
2989 -14 47 39 -84 -37 -32 -50 -48 31 22 -102 -35 -9 -48 57 -56 91 50 -120 76 53 -101 62 -3 -21 -71 -87 -85 36
3017 36 -12 -12 113 -84 -12 -58 45 2 -40 64 -44 27 -8 -172 74 59 -7 -53 -44 -60 72 78 26 -6 143 36 42
3044 42 20 -16 8 -32 39 76 25 67 8 -44 -90 -12 108 67 -51 18 74 21 27 -22 32 -21 -22 11 105 -51 39 -29 2 -120
3074 -120 -110 40 32 59 0 -122 64 81 -11 -81 -62 -57 -28 -54 -34 -4 125 -116 -8 -71 100 3 33 123 -114 42
3100 42 -12 -81 -48 -41 1 84 -35 -20 -11 33 84 7 -44 76 6 -52 0 -24 20 -14 -34 25 63 -8 22 -44 -72 84 -135
3129 -135 -162 69 111 37 146 9 -33 38 119 2 120 83 106 -14 -100 83 -16 -30 27 113 16 -7 15 79 3 15
3155 15 139 -23 37 -21 93 -50 20 -6 17 88 113 27 -81 -19 -6 -68 90 48 15 -89 11 -32 -40 -59 56 10
3181 10 -20 12 -113 65 46 118 108 26 -30 115 -17 -69 -93 66 39 18 23 -3 125 27 91 36 -18 42 42 -34 85 30
3209 30 26 62 7 11 9 -26 50 85 21 -11 103 66 -101 56 -27 48 29 31 -21 44 48 -7 138 -2 108 -6 38 -59 -69
3238 -69 -55 25 -76 -21 56 -20 -50 1 -72 -4 -13 -10 -23 -54 166 97 33 -46 -19 25 -38 135 -35 -57 57 -76 42 -51
3266 -51 -19 14 21 -42 -78 85 31 -73 -102 -46 17 106 0 -25 -30 -53 65 59 -52 -2 -22 -80 57 -24 -66 -37 -30 -33 -19 42
3296 42 13 52 -6 -59 -75 19 7 -38 116 6 -5 -35 -95 32 21 -77 -48 58 -52 -107 -12 -67 37 100 -72 4 13
3323 13 21 79 106 50 70 -189 58 -20 71 -41 43 60 18 -8 5 -81 -13 38 -127 -32 9 -45 -10 -67 -69 -67 30 77 -57
3352 -57 36 34 -62 -54 93 -16 -73 19 85 -41 -27 43 109 -32 15 -16 -12 -25 -11 -41 26 -61 -125 76 5 -60 84 48 56
3381 56 -10 -11 21 3 -81 14 52 1 25 57 28 26 -43 19 -32 52 134 71 -14 -11 61 48 94 42 34 83 -48 -34 65 92 -49
3412 -49 15 -38 9 -8 -127 76 -55 51 -106 -47 120 59 28 20 83 8 10 -43 45 19 -14 38 51 -135 51 29 76
3439 76 5 -4 -34 40 -75 -73 -33 12 33 -130 51 -1 63 25 -97 6 -18 16 -55 -91 -96 -51 -45 -76 -72 -58 48 7 40 -38
3469 -38 -82 10 -37 -33 7 104 62 12 36 75 90 -15 58 6 -24 38 -6 101 33 21 16 151 -45 91 66 -17 -28 -19 64
3498 64 36 -7 74 67 -36 79 -96 -13 -2 -63 -24 -96 -91 -51 12 45 -38 64 -9 62 72 -8 -49 -61 -6 -19 -33 146 -15
3527 -15 -14 -30 -45 4 -25 67 -48 29 -16 -17 17 -16 41 122 -14 15 92 -36 -25 31 -86 10 -55 35 -11 -11 68 26 34 9
3557 9 77 39 27 58 154 33 -92 -62 12 170 2 16 28 19 -11 -61 11 5 90 1 167 -143 53 19 10 -13 -16 -8 -37 -75
3587 -75 107 2 -114 32 57 35 106 -2 -72 50 -58 -72 33 -69 -23 0 -1 -19 -167 -66 -26 30 -88 76
3611 76 -15 -45 31 40 33 15 -111 1 28 90 8 55 -6 18 -23 -11 55 -30 -1 -4 -113 -34 57 -42 12 -80 17 65 15 -35
3641 -35 36 -46 13 -12 71 114 53 -17 -7 -63 96 -58 16 11 -9 -95 -22 -30 15 -133 -36 40 -96 35 27 -10 -15 -69 127
3670 127 -19 58 75 128 -59 -107 -25 -91 -45 -19 -41 -42 -24 97 36 -53 67 42 25 2 -6 20 -123 61 37 -9 3 8
3698 8 12 62 44 -36 -110 -35 -47 -14 21 -51 62 -11 91 38 -42 27 -42 -82 -12 109 25 -37 8 40 22 -142 -88 73 45
3727 45 -7 -52 -80 -101 15 49 -21 -20 4 -36 -39 -50 -88 -18 51 27 -76 30 -21 -72 -21 -42 -43 -20 94 29 85 137 113 41
3757 41 62 28 98 24 12 69 -82 -80 -22 -19 20 -34 -59 84 -82 83 -105 4 -7 -31 21 -36 -90 87 88 21 -45 28
3785 28 -28 -4 100 -14 66 -59 -24 47 97 24 -4 25 84 -25 25 -136 -53 63 47 -91 -24 -95 -16 7 -69 -48 -56
3812 -56 -12 15 -25 -81 -71 85 5 -38 126 -9 120 1 44 -28 17 10 -96 29 68 45 94 65 24 5 -36 97 56
3839 56 68 15 -46 -24 -8 -113 -37 49 -42 -49 72 -21 -7 78 33 121 -46 66 116 56 2 -90 -34 -69 -66 54 -11 -19 -38
3868 -38 -84 45 59 9 -73 18 -132 -4 -29 22 -67 -5 18 -108 -3 65 51 -3 23 -52 59 26 14 4 72 42 -14
3895 -14 -41 2 -48 62 -12 -16 -29 112 114 100 62 -30 85 135 38 -32 15 -21 -155 -16 20 -72 142 -100 -28 -5 -89 47
3923 47 18 -6 13 -95 -28 -80 -56 -43 -18 -50 -76 6 -25 76 68 139 -87 -102 -32 58 77 34 26 20 68 -18 28 -14 139 -68
3953 -68 -41 19 35 -24 -2 -32 14 -60 -76 -1 70 67 -42 69 -150 35 -22 -108 -13 -35 19 -5 40 -17 42 16 59 -11 23
3982 23 -14 86 11 -22 -47 -64 -49 -23 46 130 -27 15 -72 -17 -45 25 16 -74 6 126 111 98 67 -86 25 -25 -16 -9 94
4011 94 68 49 -23 63 -79 68 -17 -70 35 -50 20 -73 -50 -46 44 27 -108 2 48 -28 59 36 -11 -46 2 -77 -97 -1
4039 -1 -82 -122 14 61 31 111 48 48 -66 -23 38 -7 -31 20 12 11 14 -33 -126 108 28 73 -68 -106 49 -23 63 -179 -70
4068 -70 -7 -16 38 -51 58 50 -59 9 4 -84 0 -5 3 39 135 -29 -22 63 -22 -41 57 -48 48 129 -30 -17 -8 -162 74 -65
4098 -65 -3 83 -5 -38 -29 26 6 18 -135 -40 27 55 -102 99 13 19 -53 -24 -96 -112 133 44 38 85 23 32 22 -66 -3 -4 -83
4129 -83 -54 6 79 -36 -28 -52 -28 -23 57 -37 -83 26 -22 -76 31 -47 -43 36 87 62 72 16 -52 6 -29 -29 -95 24 -56 68
4159 68 20 10 32 21 -55 -36 -51 -91 -28 40 19 58 30 37 -106 101 54 -28 -21 -28 3 16 108 12 -56 -32 68 7 -41 -85
4189 -85 -65 34 41 -25 9 -43 -47 -9 43 37 -114 20 -83 15 -64 11 0 28 61 -148 65 36 21 75 -77 81 60 -39
4217 -39 98 92 -10 -121 81 17 34 64 51 43 -6 -68 -139 -191 -12 14 -8 59 -16 32 -77 44 -42 11 -4 106 26
4244 26 46 -169 -20 -13 -57 23 24 21 -29 16 63 109 53 -28 -2 47 -120 18 12 -24 101 -44 -46 39 -50 -99 -5 -17 148
4273 148 -33 42 -70 -16 82 -53 -73 -74 53 61 -35 36 21 -22 -74 13 8 70 -70 -11 84 2 31 20 -14 65 -14 -5 80
4302 80 63 4 -3 -111 -31 -49 29 -11 44 22 1 30 64 68 -35 50 -30 -49 40 -112 18 48 90 60 2 60 41 -24 -37
4331 -37 -6 67 72 -21 -57 -41 -3 63 -76 13 38 61 74 -19 60 11 12 -46 -70 87 27 3 64 32 -80 -12 -67 -60 -57 -34 -20
4362 -20 -70 -4 -57 47 41 151 -25 59 52 26 7 7 -80 62 6 -50 -103 -109 66 59 -43 24 -23 29 -41 6 -49 17 99 -13
4392 -13 16 71 22 -36 91 -58 -43 -31 -5 94 78 59 6 -12 8 39 -14 -70 -54 -36 99 -25 -25 51 -2 91 43 -10 -48
4421 -48 2 65 -17 -57 -7 126 49 8 -84 168 -57 -40 9 -25 -10 -18 -2 -18 43 9 26 141 -168 -37 42 27 24 61
4449 61 -38 -22 -17 42 9 -45 44 41 6 41 -31 -30 72 -64 16 -14 -45 -88 14 79 -75 9 0 -31 -46 -22 -20 -28 30 61 -50
4480 -50 18 -141 -62 114 115 78 28 5 8 58 10 16 -32 61 9 -17 -65 10 46 33 87 -59 -54 -62 -48 -83 20 -68 -61 -54 73
4511 73 13 1 37 -65 -88 -25 17 -28 83 -38 -46 -53 79 -12 56 19 83 -36 -96 -20 45 -15 35 37 -21 2 -60 -72 52
4540 52 23 53 3 76 49 2 79 -148 -26 -11 14 -85 -46 -77 -42 39 39 -10 -14 84 25 -142 -96 -41 -37 -41 -10 -33 45 5 78
4571 78 -21 -3 -14 -52 -4 -53 -16 -49 21 -56 41 -14 3 -13 3 -51 -94 -16 -44 66 7 -13 -35 -79 -107 82 -53 -54 -13
4600 -13 105 25 -49 128 34 -8 58 5 27 100 -113 103 75 -8 0 10 -59 -240 20 37 -18 15 -2 -6 -121 45 52 104
4628 104 4 -89 23 153 47 49 -3 9 14 14 119 59 -86 -13 56 -14 26 15 -81 -12 3 -123 33 5 -120 69
4654 69 -4 29 88 43 -14 51 -27 32 -55 -39 24 -54 55 24 -67 -53 66 -39 58 -57 32 59 -89 95 6 23 47
4681 47 48 14 2 -5 11 25 -35 57 -77 -137 17 136 -71 30 -6 37 22 61 -26 99 -72 -18 -60 50 -100 -98 -38
4708 -38 -64 7 65 67 -61 31 -30 -123 -22 -37 -122 -38 -2 -35 67 114 8 68 55 -37 -18 69 85 -159 -46 -69 -32 -4
4736 -4 -56 -10 30 76 55 86 117 -12 12 -45 39 54 37 -44 -44 -15 24 14 -46 58 84 -82 52 -30 -23 62 -36 60 -15 -58
4766 -58 -25 -43 36 0 47 -53 -41 13 30 14 -62 -59 -44 -56 -109 -30 -32 -10 39 23 63 -14 -62 -48 22 36 8 -6 35 132 -59
4797 -59 -45 -28 12 34 52 -33 -5 5 -23 -153 -49 108 -1 37 -158 -52 11 138 -13 130 115 15 -24 -201 -6
4822 -6 14 15 -25 -49 -44 -97 139 68 5 40 -62 13 -52 -22 -73 -22 38 -3 75 -21 22 -82 35 -36 17 19 17 -38 -71 -2 6
4853 6 -22 -82 -25 -15 0 -113 -116 18 -21 16 65 -55 -28 -119 -123 21 70 -117 -113 -6 -43 -41 18 10 -45 30 1 -36 16 88
4883 88 5 12 42 -81 94 -45 -4 -79 104 -61 41 69 -63 -2 75 59 -38 43 -79 -44 17 -51 -46 -15 -104 25 31
4910 31 -64 -82 -31 34 33 -25 -51 34 36 83 -27 -37 4 36 -80 104 93 -69 -74 132 11 -17 124 -149 12 94 -91
4937 -91 -55 -187 -12 65 82 69 -47 56 15 -74 27 98 -49 44 -3 54 20 19 -24 8 -9 51 -12 -112 19 -84
4963 -84 -23 -128 14 96 -4 -65 -2 65 -32 -66 -64 -14 -43 45 -72 27 67 18 56 45 -42 -19 -48 55 -91 -63 14 -77
4991 -77 78 -112 -81 -135 66 141 -52 -20 -60 -13 -8 87 83 -8 0 107 7 28 99 -52 -31 -72 82 -2 -24 146 9
5018 9 53 -84 47 100 35 131 -49 -3 -13 -17 8 93 -7 -123 43 -47 8 112 117 -154 -21 25 77 89 77 73 81 -69
5046 -69 -8 9 3 -118 31 -96 -105 40 44 -54 -63 -32 -55 -88 50 7 -37 21 71 71 33 -92 74 11 52 112 -61 19 116
5075 116 48 -32 -49 25 45 15 58 -111 5 9 43 -52 -48 -81 5 48 60 -59 27 -67 25 18 79 -33 42 123 1 27 13
5104 13 8 -56 -30 98 1 -2 -78 -48 -23 -59 94 -24 73 -32 70 -41 34 -49 184 135 133 4 -190 135 -3 -8 -64
5131 -64 -25 103 69 39 17 -88 7 -113 8 -115 42 -29 -23 -19 -121 -34 -43 -74 11 36 -50 34 43 1 33 50 -83 8
5159 8 0 100 -22 30 29 -36 -22 -48 -43 40 35 -9 -3 -1 -76 -41 61 -10 -67 -59 47 -3 -52 52 -32 37 -84 81 34 112 -21
5190 -21 -16 -8 -4 54 -88 -8 -44 -132 171 -41 58 53 -36 89 66 90 117 12 -11 36 -44 78 -5 23 -86 21 -35 -48
5218 -48 -38 -88 126 95 -35 -23 25 -99 -13 -70 -17 -55 36 49 -47 -41 42 34 98 35 -39 25 -29 100 -34 58 -33 -39 3
5247 3 -127 2 -31 16 -4 12 -2 -1 -9 0 -111 -66 -101 -57 36 67 -37 59 -62 -43 -6 -24 26 -24 -22 112 -22 -94 83
5276 83 132 -51 -10 13 59 69 -30 -11 16 46 39 -43 -126 -72 36 -41 35 30 -70 45 -86 113 9 0 18 -51 43 -51
5304 -51 48 15 -65 39 15 42 77 17 35 -22 -60 116 -110 -23 90 -74 79 16 -13 -97 -30 2 85 -70 41 -152
5330 -152 13 12 -5 76 10 7 -8 -44 -45 -19 4 54 -46 -16 -5 -129 29 3 -14 17 8 97 -50 -6 150 -127 -122 -50 -78
5359 -78 37 -5 29 -44 45 13 -22 -67 -10 74 72 12 -102 -10 -84 10 -97 48 -117 -40 40 14 -96 -41 11 -34 63 23
5387 23 3 17 -57 24 33 6 63 50 -62 71 101 111 1 78 -72 21 81 158 -190 95 -93 30 48 7 -22 78
5413 78 -15 -40 61 -76 6 -131 5 95 -45 -75 12 29 -19 23 -6 -132 24 -20 -52 -46 48 -12 -36 38 15 17 1 47
5441 47 -64 -54 78 13 64 -144 -57 -3 26 -16 -65 -28 61 5 55 64 -13 -78 -4 -69 -16 -97 -9 -6 22 -7 79 8 -1 -6 29
5472 29 -26 32 -73 -45 70 125 -52 -51 -24 49 -10 -37 45 45 36 -88 12 -112 92 -44 113 -17 -1 -49 19 -92
5498 -92 -31 -74 -23 13 -21 90 -58 -8 -8 50 26 11 37 57 28 -15 -96 20 -11 -37 132 130 18 -135 -21 72 -30
5525 -30 19 28 4 6 18 69 2 -64 -29 22 -44 61 3 101 -33 -28 44 -34 -36 -61 -65 -8 32 -38 -4 118 -74 -28 -11 21 -29
5556 -29 -43 -11 -12 -111 59 65 -9 23 -4 -81 35 67 -1 27 24 -39 -38 47 -16 17 -73 33 -21 -30 -70 23 -61 14 -51 -33 40
5587 40 38 18 -25 3 -37 71 -35 -108 89 128 -62 5 22 -24 125 -37 19 51 13 -36 19 -13 100 31 -25 14 -7
5614 -7 43 -8 6 -90 -15 28 40 78 54 12 35 10 -49 26 20 -82 -147 2 34 33 -27 54 48 -28 34 5 61 -88 -39 45 -99
5645 -99 26 23 96 43 40 2 -7 -40 53 88 -55 4 -17 82 -6 -51 -63 -78 -24 34 26 -79 -75 67 -10 0 -27 71 -13 131
5675 131 13 0 -129 -112 45 85 18 -7 36 11 105 25 -36 42 -55 -31 -48 144 20 47 101 -76 39 -31 -22 36 -126
5702 -126 55 62 116 82 60 36 -98 -41 -6 -51 -105 1 53 -106 -23 -36 -108 -6 93 57 -4 54 -39 42 57 131 55 18
5730 18 115 50 42 6 20 -44 -24 26 1 146 35 -17 64 36 -14 83 21 1 30 -68 78 32 -3 -51 -54 -5 -55 -11 -18 59
5760 59 -55 -25 -34 -21 52 -126 -116 86 1 67 -159 10 -68 54 68 7 58 -2 -22 -69 106 16 29 29 81 12 -85 33
5788 33 14 -40 -18 88 56 -29 -5 -62 -82 145 -14 80 32 30 46 -59 67 37 66 -14 -40 -41 -29 -10 43 15 57 42 22
5817 22 40 -17 70 70 -73 38 22 24 -50 44 -13 -17 119 -84 -19 -69 -47 -60 -11 -24 -47 107 -97 137 28 -97 -43
5844 -43 52 -32 49 -49 -99 -50 10 2 -9 73 -74 -68 14 100 102 79 11 33 -13 -49 29 -37 -85 9 119 87 -129 7 -1 -26
5874 -26 41 -200 -73 16 42 -46 57 -64 33 5 -33 74 -78 -47 6 72 13 -30 -43 -51 2 -32 -34 86 44 -60 -12
5901 -12 -1 12 -11 -61 22 -74 20 1 69 72 -54 -37 45 41 -36 -86 -46 -11 58 -3 64 -107 25 -41 -33 22 -47 30 20 -48
5931 -48 89 -28 -37 83 -42 43 66 3 36 -82 -23 -48 75 6 -93 60 73 103 -1 51 20 26 -55 -94 -135 -42 45
5958 45 -116 -61 -64 83 -149 24 43 -16 -58 -127 44 47 -63 7 24 -11 1 -78 -56 9 88 -23 15 12 -9 -28 -30 42 113
5987 113 -37 219 133 -42 159 8 41 41 -59 13 234 7 -5 -38 5 26 47 37 -57 -25 34 -29 -5 -71 -82 -38
6013 -38 37 93 27 57 24 -54 13 102 -33 -108 55 -114 129 22 70 8 -1 -4 -80 -12 93 -60 -14 3 -37 58 -109
6040 -109 33 16 -90 22 -118 69 52 69 93 32 52 -1 35 11 113 0 38 -99 -58 63 80 110 48 70 -9
6065 -9 36 -47 -28 60 4 -2 -51 117 63 22 -58 -12 47 -45 49 -28 51 69 -22 -6 64 -37 55 6 -75 36 39 13 37 -67
6095 -67 -29 -52 -51 -52 134 99 -16 -20 22 -49 10 58 28 10 -71 -52 -32 107 -36 69 -30 120 -26 83 35 -25 -34 27
6123 27 53 104 80 -53 -33 -6 -96 -89 -41 2 -86 -12 -43 -16 -16 -32 -64 27 109 -50 17 -79 -40 28 64 -30 -25 -21 -57 36 9
6154 9 -4 12 -47 -54 -93 4 -40 1 -28 33 -70 96 -13 40 -12 12 -8 -77 125 163 27 26 29 -139 -3 27 50 49 -107
6183 -107 38 -104 -65 -23 7 9 -87 -66 7 -38 -13 30 70 -9 21 -39 43 100 27 29 2 -24 7 -68 12 10 -3 67 113 22
6213 22 7 -47 84 -145 26 66 -27 14 -9 -53 -61 25 -13 8 31 26 -91 -54 21 74 -37 -24 59 -3 2 25 31 -64 69
6242 69 7 -100 -67 40 22 -5 18 -50 -94 -33 -194 73 -52 21 30 52 -38 19 72 -86 -4 -35 22 -46 -41 -45 -42 60 69
6271 69 27 84 -50 -49 64 -25 1 99 -85 -20 49 -66 -39 36 -75 11 -13 63 14 29 -1 105 -11 -101 68 96 -47
6298 -47 -31 32 65 -2 -67 41 -57 28 70 -28 18 52 -67 -75 -145 35 73 -55 35 -29 -5 -46 1 -30 1 53 54 76 -56
6327 -56 99 9 74 -36 94 66 -90 -20 -38 108 42 3 -3 -1 -67 133 -10 -20 -18 -33 -19 -2 -48 3 -59 -14 -42 29
6355 29 61 20 117 -5 95 59 91 -49 -34 137 56 -47 -11 11 -16 17 -2 103 16 -32 -32 29 3 -59 35 4 16 -22
6383 -22 -77 -129 0 51 16 -64 -24 -22 -24 -22 69 -10 21 -19 -5 71 13 -2 46 -1 15 -43 -137 -19 -68 -18 50 8 -7 65 -41
6414 -41 -39 37 63 41 56 26 42 14 -31 19 26 -6 -117 -17 18 65 4 26 -3 12 171 79 15 -86 -40 -169 -4 39
6442 39 8 -11 -116 22 -71 27 15 -7 -66 108 -87 -39 65 -4 98 56 -21 20 -56 22 31 27 66 4 39 -58 -26 52
6470 52 52 28 145 -13 -5 -38 46 -53 36 -11 -66 -52 55 21 -45 -23 133 -53 109 68 -3 -35 -99 13 44 -88 14
6497 14 115 135 0 -36 40 -11 -28 -14 -74 24 -31 -41 28 47 -37 69 -38 59 -56 -103 -17 36 32 0 25 -45 32 67
6525 67 -89 -18 45 19 -60 97 67 -83 48 -46 -18 74 -65 36 11 -69 68 26 118 56 -92 -76 -79 -35 2 -30 31
6552 31 133 -39 125 -80 16 -17 64 87 -89 -42 -11 74 6 120 125 34 -34 20 -48 77 -14 -13 -63 -57 60 5 50 35
6580 35 -5 3 3 118 -23 6 -68 87 -27 -40 -18 -26 -55 -57 -11 36 -5 -70 -10 -66 95 21 -37 -58 16 22 34 86 -42 -19
6610 -19 -120 -40 53 -26 -95 26 47 52 -24 -37 43 -44 133 -93 58 0 37 -37 -102 24 115 -102 -30 -98 9 21 15
6637 15 84 51 16 26 -76 -26 21 19 -1 21 56 -42 4 -57 -30 2 37 -21 66 -121 -1 25 22 -103 29 -92 25 56
6665 56 117 38 -55 -75 -33 19 86 96 30 -35 60 -53 -59 -5 -134 97 44 -66 -105 19 -42 -63 -108 89 13 -93 -28
6692 -28 43 -89 25 -77 158 67 5 -23 -53 106 66 -31 -58 82 35 75 -14 -88 -48 -87 32 54 62 14 83 -36 -4
6719 -4 -28 -44 -123 87 7 -13 57 59 -88 -5 16 43 94 -5 127 -10 35 0 -33 -18 41 -69 -81 74 -2 25 53 96
6747 96 35 -9 90 50 27 -95 44 27 -44 -110 34 -99 39 0 7 16 -108 -68 -53 -105 47 -82 49 108 -14 -159
6773 -159 -30 -20 8 -74 42 80 63 77 -29 -124 32 50 18 -14 -87 80 -17 73 1 -5 -84 -4 11 52 4 -8 -73 -127
6801 -127 -91 5 -110 54 -60 -79 -25 64 -16 89 -53 -3 23 29 -4 145 -20 -31 -33 -16 16 79 9 31 36 -31 45 -22
6829 -22 12 -11 -55 -39 -30 -1 -61 -45 59 86 -74 -59 48 -94 -62 -70 -24 49 -41 -63 98 -78 8 56 92 -43 -53 -59
6857 -59 -72 -146 -34 -86 -91 -22 -96 -28 96 -49 -14 28 -11 123 29 32 125 -28 8 -61 68 111 22 22 -40 70 -11 -68
6885 -68 -15 1 -18 57 16 92 -56 -40 3 60 -7 55 30 -54 -80 -87 -35 -53 64 -69 0 -2 10 -93 9 -8 -52 56
6913 56 17 -31 26 91 -39 -9 2 9 -3 -62 -122 34 6 71 -76 39 58 13 47 67 13 -66 78 -37 65 -44 28
6940 28 -64 4 72 -51 -14 76 -31 -64 29 -13 61 51 -138 -19 12 39 12 19 -81 5 65 -57 42 -7 -116 -43 -138
6967 -138 -49 -65 -36 -55 -47 -140 96 99 -14 59 -89 62 -67 21 13 30 7 29 101 109 83 31 1 -12 -66 -63 -29 -33 -115 -43
6997 -43 0 1 23 33 4 74 80 -144 -87 -23 18 -11 35 5 34 -78 -41 -7 29 23 5 -32 -31 -89 -67 104 -7 -91 26 23
7027 23 15 76 68 73 30 60 89 5 -2 76 -50 25 29 7 99 -14 38 -56 94 -13 -79 -99 -69 72 77 79 36 27 12 104 49 8
7059 8 95 -52 29 -3 -63 50 -59 46 -38 -62 -29 18 10 -21 14 11 106 -51 -33 74 79 19 46 87 -30 84 45 -84
7087 -84 28 6 28 -11 27 -177 29 -89 -26 49 8 -47 8 24 45 84 -14 62 -46 -14 -41 75 -23 4 -106 18
7113 18 12 3 -1 75 43 -15 -10 77 -66 29 -27 42 22 0 97 3 61 -62 -31 64 -45 -67 44 -4 38 -43 61 -68 -35
7142 -35 28 -63 21 0 62 -59 64 12 78 78 67 -105 -26 159 36 25 -58 -21 134 3 116 87 -128 -62 -53 18 25
7169 25 -39 94 116 57 2 -77 -84 -8 -115 -29 -33 -77 -97 21 24 15 63 24 31 -46 -21 24 -170 -70 -26 -48 34 -1 43 -63
7199 -63 -96 1 -25 -56 -63 -98 -50 44 -34 -28 -52 106 -108 14 71 60 -55 -15 -1 54 94 0 2 -66 -27 54 21 -78 84
7228 84 -14 43 4 -26 -123 -67 -4 32 -67 -63 27 73 -16 -125 29 68 35 -6 -112 -87 35 98 37 48 -42 53 62 -14 10
7257 10 94 3 -61 -65 180 -99 -3 32 -112 -7 -64 45 -36 -15 -100 28 13 55 -95 24 32 -6 -62 98 34 -57 110
7284 110 40 22 -92 -3 -22 36 -5 -12 44 -29 -8 -94 11 19 -73 15 56 -26 -31 37 -46 39 -84 -3 36 59 14 -36 -27 -81
7314 -81 53 80 -7 -56 78 -52 -2 13 64 55 52 82 -55 -11 -10 62 -36 2 -26 -102 -33 105 49 71 73 -10 25 99 91 49
7344 49 -41 99 -100 -29 20 -2 -29 -77 -30 -13 7 31 64 72 -54 -6 -67 -59 18 -31 -14 -83 -9 7 14 -3 16 8 52 20 28
7375 28 -14 3 -10 39 -22 64 -75 -50 81 30 43 -23 7 -8 9 42 -31 -32 -88 13 -9 41 4 -43 9 90 -67 -13 12
7404 12 -88 -37 -80 50 -72 35 -39 179 -41 -71 49 -65 141 15 -54 -78 -74 28 -9 -43 -39 31 -24 -68 104
7429 104 -25 1 44 93 -67 -48 25 -30 50 -6 -50 59 -22 -14 64 -1 81 68 44 -71 78 -20 -70 54 67 -44 -22
7456 -22 -33 32 103 -2 -63 1 -45 15 -45 69 -27 85 3 60 -13 -35 40 45 29 21 -54 -51 12 -100 67 53 150 48 -75
7485 -75 111 23 -43 -59 16 23 -61 111 33 -77 -31 -70 38 -27 -104 -110 33 29 -10 61 -44 -27 -10 -89 -50 30 -43 -9 46
7514 46 -96 65 67 34 -12 -34 -96 12 -79 -72 38 -63 55 -114 -7 -52 82 -22 -56 122 -105 -82 -8 0 4 68
7540 68 -63 -17 121 44 -15 -51 15 -17 -67 -36 50 -12 19 -23 -66 -13 -129 -109 -81 -9 28 11 -42 10 -20 -137 11 -121
7568 -121 -4 43 -57 10 -76 107 -28 37 -90 98 -17 -82 -13 5 1 137 -8 -57 -36 -51 13 40 79 -33 -76
7593 -76 63 85 15 8 29 -33 -131 -28 43 -42 -94 81 37 -57 -7 2 69 51 -30 83 -46 -115 -1 -94 61 -1 -30 15
7621 15 -3 3 14 -72 8 66 -115 -9 93 52 4 -86 64 -32 1 65 35 -81 2 -27 -54 5 -18 -64 -14 57 -1 66
7649 66 -41 -73 -2 45 48 58 -34 -44 -84 -3 -20 8 46 92 65 -46 -3 74 -85 -32 -11 -19 16 73 -5 12 11 -35 -40 -91 20
7680 20 -101 99 67 -69 -23 40 7 -3 -37 -28 -73 -51 -9 -23 54 21 20 -67 -6 20 -120 9 26 -105 1 75 -19 5
7708 5 -109 61 79 2 139 -30 -68 141 -36 -103 -89 9 -33 53 12 94 -88 -27 -52 -60 -3 116 -13 -18 -64 -57 56
7735 56 -23 17 -62 -20 -1 45 -101 -6 29 -113 -92 -23 12 -48 39 -11 29 89 66 100 -25 -27 -72 -82 89 -32 64 -33
7763 -33 -19 46 14 -78 103 58 35 38 -16 6 59 26 -91 16 91 -27 21 96 7 39 -73 81 -64 11 -25 73 -22
7790 -22 -59 -37 14 -8 47 50 -78 -85 26 92 44 27 -62 -3 100 -2 75 48 10 -7 55 -23 -110 -15 30 38 59 29 48 -70
7820 -70 -32 -29 40 -45 -77 -1 -8 -10 0 14 6 -69 -43 -77 63 96 0 -61 -66 -46 16 38 -58 13 30 -45 -58 19 -44 -74 -8 92
7852 92 20 50 -74 -53 30 51 64 -73 8 20 -6 -16 -90 87 26 20 16 12 -106 -8 81 64 -67 -82 13 11 157 -49 146
7881 146 -67 -15 7 -2 -21 9 -54 82 -35 4 -7 36 48 24 -37 -20 -7 -1 56 87 13 -9 -82 73 -16 -1 192 19
7909 19 5 -140 13 -97 -44 -115 -7 89 -32 37 32 44 56 96 -33 -46 30 73 -165 -34 -37 -68 -20 -36 -28 33 -29 -9
7937 -9 -114 -5 -14 29 116 40 -2 44 -76 37 -17 -71 29 -35 -43 46 -29 -66 -17 63 100 -13 -38 -45 -59 -17 121 -24
7965 -24 -119 90 24 -60 -137 -59 37 -127 60 55 -2 37 48 65 90 28 16 16 -90 85 -89 44 44 4 7 17 -27 73
7993 73 -84 71 -62 59 -74 25 20 28 73 -54 1 -35 66 34 5 -121 5 -12 -231 -98 59 -13 -36 -2 70
8018 70 -45 -1 38 86 -20 -17 -53 -6 9 -119 45 1 18 -187 -29 102 6 27 -19 -152 -79 -28 2 -54 64 -8
8044 -8 43 129 -102 -2 -47 -31 -55 -26 -18 30 23 -103 21 96 60 10 15 28 71 -10 -75 46 -46 -4 -88 -9 95 -42 -44
8073 -44 4 7 -44 4 27 -54 -7 -4 -14 65 24 -75 -33 14 20 144 39 -39 -66 47 28 -17 -50 -8 17 36 -22 -59 -12 53
8103 53 26 -3 -37 -82 -5 33 -9 26 -49 64 128 -4 -75 17 -58 -48 25 32 37 -94 -50 -53 10 15 21 2 -10 -116 17 43
8133 43 -26 -79 -14 -13 -10 -70 -1 17 -19 -92 31 39 40 -32 42 -32 25 -26 32 52 -38 7 -92 -72 -106 134 -20 13 4 4 7 -4
8165 -4 -16 57 -71 29 -57 114 118 49 -43 62 -20 -40 9 -5 33 -34 154 0 42 84 -11 -41 53 32 -57 47
8191D7
##END NTUPLES=NMR FID
##END=
