##TITLE=1H_DE-80H_X3
 200.13MHz, d2o
 8 sc
 
 19ns.26.2.2025
##JCAMPDX= 6.0         $$ Bruker NMR JCAMP-DX V2.0
##DATA TYPE= NMR FID
##DATA CLASS= NTUPLES
##ORIGIN= UXNMR, Bruker Analytische Messtechnik GmbH
##OWNER= pz
$$ XWIN-NMR		Version 3.5
$$ Tue Apr  7 11:43:56 2026 Russian Standard Time (UT+4h)  Yarkov@DPX200
##.OBSERVE FREQUENCY= 200.1313
##.OBSERVE NUCLEUS= ^1H
##.DELAY= (6, 6)
##.ACQUISITION MODE= SIMULTANEOUS
##.ACQUISITION SCHEME= undefined
##.AVERAGES= 8
##.DIGITISER RES= 18
##SPECTROMETER/DATA SYSTEM= spect
##.PULSE SEQUENCE= zg30
##.SOLVENT NAME= DMSO
##.SHIFT REFERENCE= (INTERNAL, DMSO, 0, 14.3821)
##AUDIT TRAIL= $$ (NUMBER, WHEN, WHO, WHERE, WHAT)
$$ ##TITLE= Audit trail, XWIN-NMR		Version 3.5
$$ ##JCAMPDX= 5.01
$$ ##ORIGIN= Bruker BioSpin GmbH
$$ ##OWNER= Yarkov
$$ C:/Bruker/XWIN-NMR/data/yarkov2/nmr/H-C/1/audita.txt
$$ ##AUDIT TRAIL=  $$ (NUMBER, WHEN, WHO, WHERE, WHAT)
(   1,<2026-04-07 11:42:11.00 +0400>,<Yarkov>,<DPX200>,
      <created by zg, POWCHK disabled, PULCHK disabled
       configuration hash MD5:
       00 E9 B6 7A A2 85 ED C7 34 08 36 98 17 FE 4E 26
       data hash MD5: 16K
       CC 69 F7 45 3B 60 67 62 8B FF E6 52 53 D1 96 13>)
$$ ##END=
$$ 
$$ hash MD5
$$ 2E 44 99 7D 15 9F 82 A9 DB B3 19 C6 CA 77 98 C2
##$RELAX= 
##$RELAX= 
##$RELAX= 
##$RELAX= 
##$RELAX= 
##$RELAX= 
$$ Bruker specific parameters
$$ --------------------------
##$DU= <C:/Bruker/XWIN-NMR>
##$EXPNO= 1
##$NAME= <H-C>
##$PROCNO= 1
##$TYPE= <nmr>
##$USER= <yarkov2>
##$AMP= (0..31)
100 100 100 100 100 100 100 100 100 100 100 100 100 100 100 100 100 100 
100 100 100 100 100 100 100 100 100 100 100 100 100 100 
##$AQSEQ= 0
##$AQ_mod= 1
##$AUNM= <au_zg>
##$AUTOPOS= <>
##$BF1= 200.13
##$BF2= 200.13
##$BF3= 200.13
##$BF4= 200.13
##$BF5= 200.13
##$BF6= 200.13
##$BF7= 200.13
##$BF8= 200.13
##$BYTORDA= 1
##$CFDGTYP= 0
##$CFRGTYP= 5
##$CHEMSTR= <none>
##$CNST= (0..31)
1 1 145 1 1 1 1 1 1 1 1 1 1 1 1 1 1 1 1 1 1 1 1 1 1 1 1 1 1 1 1 1 
##$CPDPRG= <>
##$CPDPRG1= <>
##$CPDPRG2= <>
##$CPDPRG3= <>
##$CPDPRG4= <mlev>
##$CPDPRG5= <mlev>
##$CPDPRG6= <mlev>
##$CPDPRG7= <mlev>
##$CPDPRG8= <mlev>
##$CPDPRGB= <>
##$CPDPRGT= <>
##$D= (0..31)
0 0.7 0 0 0 0 0 0 0 0 0 0.03 0 0 0 0 0 0 0 0 0 0 0 0 0 0 0 0 0 0 0 0 
##$DATE= 1775547730
##$DBL= (0..7)
120 120 120 120 120 120 120 120 
##$DBP= (0..7)
150 150 150 150 150 150 150 150 
##$DBP07= 0
##$DBPNAM0= <>
##$DBPNAM1= <>
##$DBPNAM2= <>
##$DBPNAM3= <>
##$DBPNAM4= <>
##$DBPNAM5= <>
##$DBPNAM6= <>
##$DBPNAM7= <>
##$DBPOAL= (0..7)
0.5 0.5 0.5 0.5 0.5 0.5 0.5 0.5 
##$DBPOFFS= (0..7)
0 0 0 0 0 0 0 0 
##$DE= 6
##$DECBNUC= <off>
##$DECIM= 32
##$DECNUC= <off>
##$DECSTAT= 4
##$DIGMOD= 1
##$DIGTYP= 9
##$DL= (0..7)
0 120 120 120 120 120 120 120 
##$DP= (0..7)
150 150 150 150 150 150 150 150 
##$DP07= 0
##$DPNAME0= <>
##$DPNAME1= <>
##$DPNAME2= <>
##$DPNAME3= <>
##$DPNAME4= <>
##$DPNAME5= <>
##$DPNAME6= <>
##$DPNAME7= <>
##$DPOAL= (0..7)
0.5 0.5 0.5 0.5 0.5 0.5 0.5 0.5 
##$DPOFFS= (0..7)
0 0 0 0 0 0 0 0 
##$DQDMODE= 0
##$DR= 18
##$DS= 0
$$ [...]
##$SUBNAM2= <"">
##$SUBNAM3= <"">
##$SUBNAM4= <"">
##$SUBNAM5= <"">
##$SUBNAM6= <"">
##$SUBNAM7= <"">
##$SUBNAM8= <"">
##$SUBNAM9= <"">
##$SW= 18.0517328524113
##$SWIBOX= (0..15)
0 0 2 0 0 0 0 0 0 0 0 0 0 0 0 0 
##$SW_h= 3612.71676300578
##$TD= 16384
##$TD0= 1
##$TE= 0
##$TE2= 300
##$TE3= 300
##$TEG= 300
##$TL= (0..7)
0 120 120 120 120 120 120 120 
##$TP= (0..7)
150 150 150 150 150 150 150 150 
##$TP07= 0
##$TPNAME0= <>
##$TPNAME1= <>
##$TPNAME2= <>
##$TPNAME3= <>
##$TPNAME4= <>
##$TPNAME5= <>
##$TPNAME6= <>
##$TPNAME7= <>
##$TPOAL= (0..7)
0.5 0.5 0.5 0.5 0.5 0.5 0.5 0.5 
##$TPOFFS= (0..7)
0 0 0 0 0 0 0 0 
##$TUNHIN= 0
##$TUNHOUT= 0
##$TUNXOUT= 0
##$USERA1= <user>
##$USERA2= <user>
##$USERA3= <user>
##$USERA4= <user>
##$USERA5= <user>
##$V9= 5
##$VALIST= <valist>
##$VCLIST= <CCCCCCCCCCCCCCC>
##$VD= 0
##$VDLIST= <DDDDDDDDDDDDDDD>
##$VPLIST= <PPPPPPPPPPPPPPP>
##$VTLIST= <TTTTTTTTTTTTTTT>
##$WBST= 1024
##$WBSW= 4
##$XGAIN= (0..3)
0 0 0 0 
##$XL= 0
##$YL= 0
##$YMAX_a= 61922
##$YMIN_a= -49292
##$ZGOPTNS= <>
##$ZL1= 120
##$ZL2= 120
##$ZL3= 120
##$ZL4= 120
##$ABSF1= 10
##$ABSF2= 0
##$ABSG= 5
##$ABSL= 3
##$ALPHA= 0
##$AQORDER= 0
##$ASSFAC= 0
##$ASSFACI= 0
##$ASSFACX= 0
##$ASSWID= 0
##$AUNMP= <proc_1d>
##$AZFE= 0.1
##$AZFW= 0.1
##$BCFW= 1
##$BC_mod= 2
##$BYTORDP= 1
##$COROFFS= 0
##$CY= 83.5205535888672
##$DATMOD= 1
##$DC= 2
##$DFILT= <>
##$DTYPP= 0
##$F1P= 10.8118882576601
##$F2P= -7.23987719738617
##$FCOR= 0.5
##$FTSIZE= 0
##$FT_mod= 4
##$GAMMA= 1
##$GB= 0.15
##$INTBC= 1
##$INTSCL= 1
##$ISEN= 128
##$LB= 0.25
##$LEV0= 0
##$LPBIN= 0
##$MAXI= 10000
##$MC2= 0
##$MEAN= 0
##$ME_mod= 0
##$MI= 1.114404
##$NCOEF= 0
##$NC_proc= 0
##$NLEV= 6
##$NOISF1= 3.799351
##$NOISF2= 2.8
##$NSP= 1
##$NTH_PI= 0
##$NZP= 0
##$OFFSET= 14.38212
##$PC= 1
##$PHC0= -5301.948
##$PHC1= 6.821927
##$PH_mod= 1
##$PKNL= yes
##$PPARMOD= 0
##$PSCAL= 0
##$PSIGN= 0
##$REVERSE= no
##$SF= 200.129724274929
##$SI= 16384
##$SIGF1= 3
##$SIGF2= 2
##$SINO= 400
##$SIOLD= 16384
##$SREGLST= <1H.CDCl3>
##$SSB= 0
##$STSI= 0
##$STSR= 0
##$SW_p= 3205.1282051282
##$SYMM= 0
##$S_DEV= 0
##$TDeff= 0
##$TDoff= 0
##$TI= <>
##$TILT= no
##$TM1= 0
##$TM2= 0
##$TOPLEV= 0
##$USERP1= <user>
##$USERP2= <user>
##$USERP3= <user>
##$USERP4= <user>
##$USERP5= <user>
##$WDW= 1
##$XDIM= 8192
##$YMAX_p= 0
##$YMIN_p= 0
$$ End of Bruker specific parameters
$$ ---------------------------------
##NTUPLES= NMR FID
##VAR_NAME=  TIME,          FID/REAL,        FID/IMAG
##SYMBOL=    X,             R,               I
##VAR_TYPE=  INDEPENDENT,   DEPENDENT,       DEPENDENT
##VAR_FORM=  AFFN,          ASDF,            ASDF
##VAR_DIM=   8192,          8192,            8192
##UNITS=     SECONDS,       ARBITRARY UNITS, ARBITRARY UNITS
##FACTOR=    0.0002768,     1,               1
##FIRST=     0,             0,               0
##LAST=      2.2672688,     0,               0
##MIN=       0,             -49292,          0
##MAX=       2.2672688,     61922,           0
$$ Real data points
##PAGE= N=1
##DATA TABLE= (X++(R..R)), XYDATA
0@%%%%%%%%%%%%%%%%%Qj6J6j6J6k4L2l7M5n3O1p2Q6r9J14j31J50j73J97k22K51
$$ 0 0 0 0 0 0 0 0 0 0 0 0 0 0 0 0 0 0 8 -8 8 -8 8 -16 16 -21 24 -29 32 -40 46 -53 61 -70 80 -93 104 -118 133
38A33k84L21l61M05m53N05n60O21o88P62q42R27j021J123j235J357j489J636j799
$$ 133 -151 170 -191 214 -239 266 -294 327 -361 401 -441 486 -535 588 -647 710 -779 857 -942
57i42J981k186K417k681K990l359L809m374N110o140P723j0629J7625J4487l9523
$$ -942 1039 -1147 1270 -1411 1579 -1780 2029 -2345 2765 -3375 4348 -6281 11344 25831 -13692
72a3692L8201k9291K4425j4482K833l4723J2763j0886K5348o101J8484k6083N8649
$$ -13692 24509 -4782 19643 5161 7994 -26729 -13966 -24852 496 -5605 12879 -13204 45445
85D5445m7153L0918n5812L3561n0669N7283n1829M9729l1841N2202j3850J3034
$$ 45445 -1708 29210 -26602 6959 -43710 13573 -38256 11473 -20368 31834 17984 31018
97C1018l1488J3803k2554M960k3413J5951k0732N2933k0923K9078k1585J7107
$$ 31018 -470 13333 -9221 -4261 -27674 -11723 -32455 20478 -445 28633 7048 24155
109B4155j1296m661k1813j1269J4571k1989M2569k1545K0328L161J6273j9400
$$ 24155 12859 8198 -13615 -24884 -10313 -32302 10267 -11278 9050 12211 28484 9084
121I084K359k4405O171j1323J0853k5979M6936l9294O5915m3191L0606l6704L6680
$$ 9084 11443 -12962 -6791 -18114 -7261 -33240 13696 -25598 40317 -2874 27732 -8972 27708
134B7708n2557L3963m1808L0805j7387L0706j8535L4289l4428L7833l3819J9030
$$ 27708 -24849 9114 -32694 -1889 -19276 11430 -7105 27184 -7244 30589 -3230 15800
146A5800l9284L3865m1085L8922k3149K1468q548J6799o527N688j4461k541K999
$$ 15800 -23484 10381 -30704 8218 -14931 6537 -2011 14788 8261 13949 -512 -3053 -54
159e4r326j575P381n079R363R434q485P155q863P747j6995J8261l4422L8289l5099
$$ -54 -9380 -10955 -3574 -8653 710 10144 1659 8814 -49 7698 -9297 8964 -25458 12831 -22268
174b2268L4207j9468K0756k6212L5304l2864K4004k6840K1723k5188L4715m1194
$$ -22268 11939 -7529 13227 -12985 22319 -10545 13459 -13381 8342 -16846 17869 -23325
186b3325M3385l9478L6853k6333K7485l6832L8457l4002K6012k0630J4546j8853
$$ -23325 20060 -19418 17435 -8898 18587 -18245 20212 -13790 12222 -8408 6138 -12715
198a2715K2951j9828J9625j8808J1563l630J1668j8365J3924j0156L259L157p933
$$ -12715 10236 -9592 10033 -8775 2788 -842 10826 -7539 6385 -3771 -512 2645 -5288
211e288M53j367J1272j0783J6321k0813K2839j4776R876j6585J6017k6570K9552
$$ -5288 -4835 -6202 5070 -5713 10608 -10205 12634 -2142 7734 -8851 7166 -19404 10148
224A0148k2219J9341k0696L1458k8777L7560m1863L0039k8780K4314k8819K9166
$$ 10148 -12071 7270 -13426 18032 -10745 26815 -15048 14991 -13789 10525 -18294 10872
236A0872l6235L9937k0042K1487k3060K6105k9522K9442l3925J7345j8697J7414
$$ 10872 -25363 14574 -5468 16019 -7041 19064 -10458 18984 -14941 2404 -16293 1121
248A121j2722K3371k1001J9663l768L002q118q0j1706N262N51n661Q889m344J4847
$$ 1121 -11601 11770 -9231 10432 6664 9666 1548 1468 -10238 -4976 -4425 -10086 -1197 -5541 9306
263I306r66K753j5530J6458k2104J4511k0511J4613j7422L3310k4380K9970k6263
$$ 9306 8340 11093 -4437 12021 -10083 4428 -16083 -1470 -18892 14418 -9962 20008 -6255
276f255K5106k2456J9826l6630K8288l1237K9157j8592K5379k7387L9241k8998
$$ -6255 18851 -3605 16221 -20409 7879 -23358 5799 -12793 12586 -14801 24440 -4558
288d558K6347l0039J4379k0470K1480k8211K5437j8563K1016l495J1924j9192
$$ -4558 21789 -8250 6129 -14341 7139 -21072 4365 -14198 6818 3323 15247 -3945
300c945J6642j6007N453p977m199R27O500Q44N676L379q243J4784j1693J520j3585
$$ -3945 12697 -3310 2143 -5834 -10033 -9106 -2606 -1762 3914 7293 -950 13834 2141 3661 -9924
315i924J0230j6559K3673k0915K1477j4312K3132j8805K0312l2934K6457k4681
$$ -9924 306 -16253 7420 -13495 7982 -6330 16802 -2003 18309 -14625 11832 -12849
327a2849J9459k5499K8569k8094L5909k4532K2941k3647K2499k5507K5071l2320
$$ -12849 6610 -18889 9680 -18414 17495 -7037 15904 -7743 14756 -10751 14320 -18000
339a8000K1902j6685J9236j5400K2454k3848K1974j1157O079j2062O383r925J3457
$$ -18000 3902 -12783 6453 -8947 13507 -10341 11633 476 6555 -5507 876 -9049 4408
352D408j0223L277L501j360M114J768m860m817J1076j4369J2911j3820J0543p929
$$ 4408 -5815 -2538 963 -397 3717 5485 625 -4192 6884 -7485 5426 -8394 2149 -5780
366e780J5575j7943K0383k3745K1719j5785J6227k5910K8031k6170K6654k3907
$$ -5780 9795 -8148 12235 -11510 10209 -5576 10651 -15259 12772 -13398 13256 -10651
378a0651J9762k2439K7237k5980K5957k7236K2800j7449K1734k7108K4958k3260
$$ -10651 9111 -13328 13909 -12071 13886 -13350 9450 -7999 13735 -13373 11585 -11675
390a1675J8220j2927J2403j7073J8654j3611J5968j1796L651m251P534j0457O030
$$ -11675 6545 -6382 6021 -11052 7602 -6009 9959 -1837 1814 -2437 5097 -5360 670
403F70m757k214J0814m356J794j600N261o281R959j9266J3422j2926J2025j0795
$$ 670 -4087 -6301 4513 157 1951 351 5612 -669 9290 -9976 3446 -9480 2545 -8250
417h250J7624k1904K7502j8419J6980k0737J6248k3683K5331k7352K3328k0892
$$ -8250 9374 -12530 14972 -3447 13533 -7204 9044 -14639 10692 -16660 6668 -14224
429a4224K4134j6379K5562k9453K4539k0522J5349k1533J6166k1289K3763j4475
$$ -14224 9910 -6469 19093 -10360 14179 -6343 9006 -12527 3639 -17650 6113 -8362
441h362J7244j1522J2800j0902J3917j8190M472n884J067m91N748l820N315P384
$$ -8362 8882 -2640 10160 -742 13175 -5015 -543 -6427 -5360 -5851 -103 -3923 1392 8776
455H776l753M572j1624K730n015M056j4472J7502j4542K0939q515J1943j6632
$$ 8776 5023 9595 -2029 701 -4314 -258 -14730 2772 -11770 9169 654 12597 -4035
468d035J9223k3465J8331k5205J5649j6020K2855k0224K8767k3860K3263j5574
$$ -4035 15188 -8277 10054 -15151 498 -15522 7333 -12891 15876 -7984 15279 -295
480b95J4361k5967J8648k4185K2177j8214J7404j2702K1527j4646J8176j8504
$$ -295 14066 -11901 6747 -17438 4739 -13475 3929 -8773 12754 -1892 16284 -2220
492b220O550q260N682j3440R766o987R262K512K792o98L88j396l317J278j4101
$$ -2220 4330 -3930 1752 -11688 -1922 -8909 353 2865 5657 4959 5347 3951 634 1912 -12189
507a2189J0231n854Q613m119J2263j3687J9888j6771J1076j8615J2256j6827K1096
$$ -12189 -1958 -7812 801 -3318 8945 -4742 15146 -1625 9451 -9164 3092 -13735 7361
520G361k3686K3923j4550J8683j4557J9286k7334K2715k2803J6522j8708J6749
$$ 7361 -16325 7598 -6952 11731 -2826 16460 -10874 11841 -10962 5560 -13148 3601
532C601j6460K4430j8819J9351j4787J0584j1927J3231k0030J1789r249R924m733
$$ 3601 -12859 11571 -7248 12103 -2684 7900 -4027 9204 -10826 963 -8286 1638 -3095
545c095P030o215R001m633Q36j616n895K790K0J211m853J0449r057J1549q371
$$ -3095 3935 -2280 6721 2088 2924 1308 -4587 -1797 -1777 -566 -5419 5030 -4027 7522 -849
560h49O931j2409J2740j5829J7989j9601J5202j0569J6833j9167K1075k2765J9715
$$ -849 6082 -6327 6413 -9416 8573 -11028 4174 -6395 10438 -8729 12346 -10419 9296
573I296j6301J4978k0199K1420k0745K3575j9682J4499j2874J4585j8004J9695
$$ 9296 -7005 7973 -12226 9194 -11551 12024 -7658 6841 -6033 8552 -9452 10243
585A0243k0125J3624q823J2116j2083J1687j2587J1839p093J344l313K697k956
$$ 10243 -9882 3742 -5081 7035 -5048 6639 -5948 5891 -1202 142 -3171 -474 -3430
598c430O882k627k888O034l065K318n735L409q064J1257j1164J2632j0877J1346
$$ -3430 3452 825 -2063 3971 906 3224 -2511 898 -7166 4091 -7073 5559 -5318 6028
612F028q991J5220k0550J6160j6950J4200j5094J6466j9712K3433j6620J9239
$$ 6028 -2963 12257 -8293 7867 -9083 5117 -9977 6489 -13223 10210 -6410 12829
624A2829j7472J3584j7365J9753k4541J7949j5929J4629j0143J7514j6946J6810
$$ 12829 -4643 8941 -8424 11329 -13212 4737 -11192 3437 -6706 10808 -6138 10672
636A0672j3059J0390j0711L323j0245J1352r510R237j826J987J928M272n339k558
$$ 10672 -2387 8003 -2708 615 -9630 1722 -7788 1449 -377 1610 3538 7810 2471 -87
650h7l21n721O621q395O338k430R871o208J2565j5791J0973j1375Q582j7239J5290
$$ -87 -408 -6129 492 -7903 -1565 -3995 5876 -332 12233 -3558 7415 -3960 4622 -12617 2673
665B673j6401K0485j3062J6966j4393J6918j8801J8737k3472J2723j4838J6727
$$ 2673 -13728 6757 -6305 10661 -3732 13186 -5615 13122 -10350 2373 -12465 4262
677D262j6618K1053j6728J8522j0174J1324j5297J0028j6720J4007j3102O841
$$ 4262 -12356 8697 -8031 10491 317 11641 -3656 6372 -10348 3659 -9443 -2602
689b602l055J0012n224J0602p099M62p32l197j720k462j400K116P376n658J0506
$$ -2602 -5657 4355 -869 9733 2634 3096 2364 -833 -2553 -5015 -6415 -4299 3077 -2581 7925
704G925p433O651o462O034j7045J2471j3240J4353j1423J3673j0798J8654j7341
$$ 7925 492 7143 681 6715 -10330 2141 -11099 3254 -8169 5504 -5294 13360 -3981
717c981J6259j8605J1432j5310J6468k0393J9290j4280J7738j1826J5333j7362
$$ -3981 12278 -6327 5105 -10205 6263 -14130 5160 -9120 8618 -3208 12125 -5237
729e237J5423j7223J2820j3792P720r577J6091j1498J1296o083M970l884L997
$$ -5237 10186 -7037 5783 -8009 -289 -9866 6225 -5273 6023 -60 4910 1026 5023
742E023r207L623l914J693L251l382L455J795K304n000P054j2885Q821p816P301
$$ 5023 -4184 -561 -4475 -2782 469 -2913 542 2337 4641 -359 6695 -6190 2631 -5185 2116
757B116r148J0923j0765J7368j5209J2336j2767J2193j5449J7168k0072J6178
$$ 2116 -7032 3891 -6874 10494 -4715 7621 -5146 7047 -8402 8766 -11306 4872
769D872j2291J5655j4900J5961j7045J7597j6295J2592j3896J2569j3879J7219
$$ 4872 -7419 8236 -6664 9297 -7748 9849 -6446 6146 -7750 4819 -9060 8159
781H159j3469R771q022R625j0070R523j1324P298l992M123k755K690l730N264
$$ 8159 -5310 4461 -3561 6064 -4006 5517 -5807 1491 -2501 1622 -1133 1557 -2173 3091
795C091j97n746M296m122K591j623L853o961J0671r535J1047j0833O598r675J3176
$$ 3091 2894 -2852 1444 -2678 -87 -1710 2143 -4818 5853 -3682 7365 -3468 3130 -6545 6631
810F631j6339J6222j4436J3419r834J4814j7542J6092j7381J6298j5869J1625
$$ 6631 -9708 6514 -7922 5497 -4337 10477 -7065 9027 -8354 7944 -7925 3700
822C700j3988J7713j5434J7574j3442J0907j0956J2373j5453J0433j1903R899
$$ 3700 -10288 7425 -8009 9565 -3877 7030 -3926 8447 -7006 3427 -8476 1423
834A423o270Q323o603Q904o172N591k980k704l175K715k163k21L327k988Q199
$$ 1423 -4847 3476 -3127 5777 -395 5196 2216 -488 -3663 -948 -3111 -3332 -5 -2993 5206
849E206l470M063o469M711j0161J1036j4570R963o902J1477r691J6013j5968J4989
$$ 5206 1736 5799 -670 4041 -6120 4916 -9654 309 -6593 4884 -4807 11206 -4762 10227
863A0227j4565J1431j5519J1739j6682J9829j5380J5786j0570J3772j3408J5333
$$ 10227 -4338 7093 -8426 3313 -13369 6460 -8920 6866 -3704 10068 -3340 11993
875A1993j8456J0676j2901J0603j0220J0704r537J4093o978O903n368L031q240
$$ 11993 -6463 4213 -8688 1915 -8305 2399 -7138 6955 -23 6880 1512 4543 -3697
888c697N315o103L68Q4J939L368J574J531k645M126p968N329r156L472m694J0829
$$ -3697 1618 -4485 -4117 -4033 -2094 1274 2848 4379 1734 5860 -2108 3221 -5935 -2463 -7157 3672
904C672j0220J3552r793J1968j0263R585j5792J2685j6795J5421j2774J2151j0124
$$ 3672 -6548 7004 -2789 9179 -1084 8501 -7291 5394 -11401 4020 -8754 3397 -6727
917f727J7381j5322J6514j5929J0713j3109J0899j4238J2614j2107J5466q165
$$ -6727 10654 -4668 11846 -4083 6630 -6479 4420 -9818 2796 -9311 6155 -2010
929b010Q694q516R898j0880Q409r795K570l482M640j902M561j988K014L217m623
$$ -2010 6684 -1832 8066 -2814 5595 -4200 -1630 -5112 -472 -2374 2187 199 2213 5430 807
944H07k29k081n9l428P753q560Q205n266R619q549R673j3864J2867j3196J0719
$$ 807 578 -1503 -1562 -4990 2763 -5797 2408 -2858 6761 -1788 7885 -5979 6888 -6308 4411
959D411j2126J1649j2514J7362j4008J3063j2529J2081j4055J4179j6261J3401
$$ 4411 -7715 3934 -8580 8782 -5226 7837 -4692 7389 -6666 7513 -8748 4653
971D653j1883J2130r548J1364j2985J4694j1681P712q443N650o581Q587p429N940
$$ 4653 -7230 4900 -4648 6716 -6269 8425 -3256 4456 -3987 1663 -4918 3669 -3760 2180
985B180l517L119k34P9m052K614N24l286M193m046L612k280N476p283O895r200
$$ 2180 -1337 1782 1548 1627 -2425 189 713 -2573 1620 -2426 1186 -1094 4382 -2901 3994 -5206
1001e206R708q671P338r184J1818j1951J4560j2878R548j1549J3728j4988J3503
$$ -5206 4502 -4169 3169 -6015 5803 -6148 8412 -4466 5082 -6467 7261 -7727 5776
1014E776j4100J3734j0297J2238j2992J3648j4713J3626j1605P415j0172J2145
$$ 5776 -8324 5410 -4887 7351 -5641 8007 -6706 6920 -4685 2730 -7442 4703
1026D703j0855J1522q469P032m892N774p062M990p985M416j4l27j3K431J35P96
$$ 4703 -6152 5370 -3099 3933 -959 4815 -2247 2743 -5242 -826 -840 -1167 -1180 1251 1386 2182
1042B182K139o519M095n564M773n700N081o343J2262r474R994r038Q281j1618
$$ 2182 4321 -2198 1897 -3667 1106 -4594 487 -5856 6406 -3068 6926 -2112 6169 -5449
1056e449J1792j4726J1284j1783J3394r903J3264j3167J4731j3286J1265j2886
$$ -5449 6343 -8383 2901 -8882 4512 -5391 7873 -5294 9437 -3849 7416 -5470
1068e470R072j3695J4449j1654J0622p547J0608p423R247j1156P242q666L954
$$ -5470 3602 -10093 4356 -7298 3324 -4223 6385 -1038 8209 -2947 4295 -4371 -417
1081d17l873L811m766P267q29J638J011k291j93j272r64l736L564n358R804n097
$$ -417 -4290 -479 -5245 2022 1193 2831 3842 1551 1358 86 -878 -4614 -1050 -6408 3396 -1701
1097a701N880m660Q170j0551Q919j2519Q060r387J0615j0111J3390j1791J5025
$$ -1701 4179 -481 7689 -2862 6057 -6462 1598 -7789 2826 -7285 6105 -5686 9339
1110I339j1334R948j2691J0772j4925J2864j2023J0386r388J3538r464J1529j1351
$$ 9339 -1995 7953 -4738 6034 -8891 3973 -8050 2336 -7052 6486 -2978 8551 -2800
1123b800Q676q600N426q862P293q039Q223k225L363k123M014l258J186k468k736
$$ -2800 5876 -2724 2702 -6160 1133 -6906 1317 -908 2455 332 4346 1088 2274 -194 -2930
1138b930J788k905L421m94K601k953Q429q153N897p812N172p709Q702j0570J1538
$$ -2930 -1142 -4047 -626 -1120 1481 -1472 6957 -1196 4701 -3111 2061 -5648 3054 -7516 4022
1153D022r509J1723q180Q973j2391J2980j3897J0643j1324R940j0302J3416j1159
$$ 4022 -5487 6236 -1944 7029 -5362 7618 -6279 4364 -6960 2980 -7322 6094 -5065
1166e065J2256j1257J0180r288Q418j1616R447q673P603m566N815o176P657n202
$$ -5065 7191 -4066 6114 -3174 5244 -6372 3075 -5598 2005 -2561 3254 -2922 4735 -467
1180d67L092l946J153j299J562j601P97J850k705N152l496J126l456M774o364
$$ -467 2625 -1321 -168 -1467 95 -1506 -709 1141 -1564 3588 92 1218 -2238 2536 -3828
1195c828P527r034Q952o497P745p862Q612j1761J1504r508P301r466J0860j0669
$$ -3828 3699 -5335 3617 -2880 4865 -2997 5615 -6146 5358 -4150 3151 -6315 4545 -6124
1209f124J3694j3097J1370j0225R826j0475J0073j2492J1299p989Q132p577Q917
$$ -6124 7570 -5527 5843 -4382 5444 -5031 5042 -7450 3849 -4140 3992 -3585 5332
1222E332r087Q600p183M565n982M400l467M953m363L108L74L96k39o81j133j911
$$ 5332 -3755 4845 -2338 2227 -3755 645 -2822 2131 -2232 876 1250 1646 1407 726 -407 -2318
1238b318L696m789M147l450N616l565N688p943Q091r585P374p605O804r458J2449
$$ -2318 1378 -3411 736 -2714 2902 -663 5025 -2918 5173 -4412 2962 -4643 2161 -7297 5152
1253E152r876J1135r500R131r556R971j2784J0272j1684J0140o856Q947r463J1987
$$ 5152 -4724 6411 -3089 6042 -3514 6457 -6327 3945 -7739 2401 -4455 4492 -4971 7016
1267G016r175Q269q543N236p758O606o958O873m951M906n42L223l910K483l330
$$ 7016 -2159 6110 -2433 2803 -4955 1651 -5307 1566 -3385 1521 979 4202 292 2775 -555
1282e55m37J54j947N69j06L931j407M127n359N827n871L347o998O026q514J0184
$$ -555 -992 -838 -2785 -2216 -2322 1609 202 4329 -1030 4797 -1074 2273 -4725 1301 -7213 2971
1298B971p236Q472p136J0028r482R651j2402Q600r799Q237q661J1146j0792J2674
$$ 2971 -4265 4207 -2929 7099 -2383 7268 -5134 3466 -6333 1904 -6757 4389 -6403 6271
1312F271p454P663q861P299r969Q417r353O431m926O262l473P011o576N199l085
$$ 6271 -1183 6480 -2381 4918 -5051 3366 -5987 444 -4482 1780 -1693 5318 -1258 3941 856
1327H56L73k993N94k212J923R02L5K838k390L549k275J142n689M900o544O104
$$ 856 1229 -1764 -1170 -3382 -1459 -557 -522 2316 -74 3475 1200 2342 -3347 1553 -4991 1113
1343A113n231O271n677R643q002P884r656P620q372P535j0457J0915r233J0189
$$ 1113 -4118 2153 -3524 6119 -1883 6001 -3655 3965 -4407 3128 -7329 3586 -5647 4542
1357D542p035Q491r698R924j0188Q165r301O533o488Q146p081Q602o729N425l148
$$ 4542 -2493 5998 -3700 6224 -3964 4201 -5100 1433 -5055 3091 -3990 4612 -2117 3308 160
1372A60K988o209M161m014L039j222N63N97J222k58L07pl638L936l776K484l244
$$ 160 3148 -3061 1100 -2914 125 -1097 -534 63 1285 1027 1334 1327 -2311 1625 -2151 333 -2911
1389b911M718m653P052o276O009o977O387o784O968r464R396p305Q157p818Q758
$$ -2911 1807 -2846 4206 -2070 3939 -3038 3349 -3435 3533 -5931 3465 -3840 4317 -3501 5257
1404E257r663R662q989P257q707Q275p735R224q786Q244o198N804o205O248q051
$$ 5257 -4406 5256 -3733 3524 -5183 3092 -4643 4581 -4205 4039 -2159 3645 -2560 3688 -4363
1419d363N851m015L769k981L288k597M012k978M94m61j514J078M2k04j225M182
$$ -4363 1488 -2527 1242 -1739 1549 -1048 2964 -14 480 19 -1495 -417 -375 -579 -1804 2378
1435B378l265M160m463L472m420M347o441O764p480P656m882O645p507Q465q926
$$ 2378 -887 3273 -1190 2282 -2138 2209 -4232 2532 -4948 2708 -2174 4471 -3036 5429 -3497
1450c497P823q587O672q100Q598p367R234q235P850n928O735q863P075p996N789
$$ -3497 4326 -4261 2411 -5689 2909 -4458 4776 -3459 4391 -1537 5198 -3665 3410 -4586 1203
1465A203m891N550n015O257m129M971m036J471k496J439k985K004q33k71L270
$$ 1203 -3688 1862 -3153 3104 -1025 3946 -90 1381 -1115 324 -2661 -657 -1490 -1761 1509
1480A509m45R61j333J444l024K687n984M572m304N049l221O341o801P955o732
$$ 1509 1064 2025 692 2136 -888 1799 -4185 387 -3917 1132 -2089 4252 -2549 5406 -1326
1495a326N335p509N591p771Q069p769Q868o889P791n898P767r319O653p498N716
$$ -1326 4009 -3500 2091 -5680 2389 -5380 3488 -3401 4390 -1508 6259 -3060 3593 -3905 1811
1510A811o669O401o181P693m543N836m589L164m113L439n256K083j498J604k40
$$ 1811 -4858 1543 -4638 3055 -1488 4348 -241 2923 -1190 2249 -3007 -924 -2422 -818 -1058
1525a058K605q94N92J117j941J072l707J335j759K929l315N829m875N900l797
$$ -1058 1547 653 1245 2362 421 1493 -2214 -879 -2638 291 -3024 2805 -2070 3830 33
1540C3L842o767N772p318O654p139O565n131P651o732Q479q642O575o676N593
$$ 33 3875 -2892 2880 -4438 2216 -4923 1642 -3489 4162 -2570 5909 -2733 3842 -2834 2759
1555B759p792O981o828P713n258O161n185N281n721N365o203K646k513L328k846
$$ 2759 -5033 1948 -4880 2833 -2425 3736 -1449 3832 -1889 3476 -2727 -81 -2594 734 -2112
1570b112L317j845K219l55j7q35q88j12o71J501k776L705j964K905k318L338n643
$$ -2112 1205 -640 1579 1224 1207 372 -516 -628 -1299 202 -2574 1131 -833 2072 -246 3092 -2551
1587b551N007n166M672n612N182m734P430p147O807o212N478o030O295q483P778
$$ -2551 2456 -2710 1962 -3650 1532 -3202 4228 -2919 3888 -2324 3154 -2876 3419 -5064 2714
1602B714o477O875n724N913n776O553o813N624n592L623l808N378n055M366k803
$$ 2714 -3763 3112 -2612 3301 -2475 4078 -2735 2889 -2703 920 -2888 2490 -2565 1801 -1002
1617a002K971j982J377k554J388j252N97K69r09J512L01Q96k325K603l780L006
$$ -1002 1969 -13 1364 -1190 198 -1054 -457 -188 -1097 415 716 1612 -713 1890 -1890 1116
1633A116l185K899l725M892m130N985n890N025m859M883o743O423p268O506m752
$$ 1116 -2069 830 -2895 1997 -2133 3852 -2038 2987 -1872 3011 -3732 2691 -4577 1929 -2823
1648b823O237n965O643o612P009p327M681n452N223n482O572n260M888k808L847
$$ -2823 3414 -2551 4092 -2520 4489 -2838 1843 -3609 1614 -3868 2704 -2556 2332 -476 3371
1663C371m366K997m229K810k542J312o26J336l30K241m36j404J144j731O13k310
$$ 3371 -995 2002 -2227 583 -1959 -647 -1273 63 -267 1974 1538 134 1278 -453 160 -2150
1679b150J709k326M127k836M549l884L736l921M222o750M973n417N270m740O502
$$ -2150 -441 -2767 1360 -1476 3073 -811 2925 -996 3226 -3524 1449 -3968 1302 -3438 3064
1694C064n713O957n760N856o426M184o145O249o740O069m397N109l497N456n679
$$ 3064 -2649 4308 -1452 4404 -2022 2162 -3983 2266 -4474 1595 -2802 2307 -1190 4266 -1413
1709a413M359m697L078l869K188k616L917k178K813m81J32n21L93j369j058K83
$$ -1413 2946 -1751 1327 -2542 -354 -2970 947 -1231 1582 1101 1233 712 1105 -264 -1322 -1039
1725a039j194K584j750K736j502K792l038L689n631L516m075M069m854N693m767
$$ -1039 -2233 351 -1399 1337 -165 2627 -411 3278 -2353 1163 -2912 1157 -3697 1996 -2771
1740b771O360m812N171n650M768o268N675o552N133m393N923m932O336n405M572
$$ -2771 3589 -1223 3948 -1702 3066 -3202 2473 -4079 1054 -3339 2584 -2348 3988 -1417 3155
1755C155m521L598m809L326m301M815k866K597j308K481k299K004k384Ol70k34
$$ 3155 -1366 2232 -2577 749 -3552 1263 -1603 994 -314 2167 -132 1872 -512 -506 -876 -1110
1771a110N54l15Q79R3J914k442K694l314J810k647L009m376M578l840N329m093
$$ -1110 -556 -871 8 101 2015 -427 2267 -1047 763 -1884 1125 -3251 1327 -2513 2816 -1277
1787a277M242m759M941o008N398n981M700m303O092n812N853n027N005n014M498
$$ -1277 2965 -1794 3147 -2861 2537 -3444 1256 -3047 3045 -2767 3086 -1941 3064 -1950 2548
1802B548n434M514m842M907l422L251k982M170l651K479k543J151j443J624j394
$$ 2548 -2886 1628 -3214 1693 -1729 1522 -1460 2710 -941 1538 -1005 146 -1297 327 -1067
1817a067J044k09O60J031j522O79r84O90j925K588l285L450k273L306l219L367
$$ -1067 -23 -232 428 1459 -63 616 -368 322 -1603 985 -2300 1150 -1123 2183 -1036 2331
1833B331m263M677n470M237m380M469m376O182n628N111m673M906n523M588n653
$$ 2331 -1932 2745 -2725 1512 -2868 1601 -2775 3407 -2221 2890 -1783 3123 -2400 2188 -3465
1848c465N320m913M935l898M608m197M836m366K593l312K715k984K775k268K414
$$ -3465 1855 -3058 1877 -2021 2587 -1610 3226 -1140 1453 -1859 856 -2128 647 -1621 793
1863G93r72J510m81O1j198K93K7j723J355j023J838p30K362k678K963l688L201
$$ 793 -179 1331 850 911 -287 6 33 -1690 -335 -1358 480 -250 2112 -566 2397 -1291 1910
1880A910m002K542l405M550m532N661m178M116l916M715n827M596n896N173m512
$$ 1910 -2092 450 -2955 1595 -2937 2724 -1454 2662 -1254 3461 -2366 2230 -3666 1507 -3005
1895c005M504m094N613m483N217m690K938m175L721m319L220l028L615j681K607
$$ -3005 1499 -2595 3018 -1465 3752 -938 2000 -2175 1546 -2773 447 -2581 1034 -647 1960
1910A960j844J832k255R95j074o58m17O47N90j52J752j376J991j962J554k984
$$ 1960 116 1948 -307 688 -386 -1044 -1461 -814 -224 -376 1376 0 1991 29 1583 -1401
1926a401J717l304M197l800L818k525M157l925M711n691M260m972M142m460M426
$$ -1401 316 -2988 1209 -2591 1227 -1298 2859 -1066 3645 -2046 2214 -2758 1384 -3076 1350
1941A350m626O193m650M837m020L672m883M397n153L601l615L958k419L308l069
$$ 1350 -3276 2917 -1733 3104 -916 2756 -2127 2270 -2883 718 -2897 1061 -1358 1950 -1119
1956a119L562k689J583k008O63j842J539n33N48M84L60P16o99M75j752J385k573
$$ -1119 2443 -246 1337 -671 -8 -1850 -311 -844 -296 188 548 1264 565 1040 -712 673 -1900
1973a900K456k567K427j887L879l615L873l961L323m088L705m748M692m533N395
$$ -1900 556 -2011 416 -1471 2408 -1207 2666 -1295 2028 -2060 1645 -3103 1589 -2944 2451
1988B451m155M167m144M930n575M582m759L682l736M177l735M287l845L927k708
$$ 2451 -1704 2463 -1681 3249 -2326 2256 -2503 1179 -2557 1620 -2115 2172 -1673 2254 -454
2003d54K041k921K489k991K254j491J139o21J440l39K71p17k85O12j377Q79q97
$$ -454 1587 -1334 1155 -1836 418 -1073 66 -555 885 546 817 100 -185 427 -950 -71 -968
2020i68J382j332K860k807K483k602K629l385L026l862M071l757M259l497L941
$$ -968 414 -918 1942 -865 1618 -984 1645 -1740 1286 -2576 1495 -2262 1997 -1500 2441
2035B441m427M994n010L733m347M121m126M822m481M669l727L645l389K813m067
$$ 2441 -1986 3008 -2002 1731 -2616 1505 -2621 2201 -2280 2389 -1338 2307 -1082 1731 -2336
2050b336L766l305K386j839K441k046K623j844J140j224J00k11p4m96L88R64p34
$$ -2336 1430 -1875 511 -1328 1113 -933 1690 -154 986 -238 -138 -349 -423 -919 -531 433 -301
2067c01J700j567J279j672J811k983K522l173L555k801L381k879L850m309M196
$$ -301 1399 -168 1111 -561 1250 -1733 789 -2384 1171 -1630 1751 -1128 2722 -1587 2609
2082B609m314L168m367M468m212M743m022M361l602L957m374L862m901L858l334
$$ 2609 -1705 1463 -2904 1564 -2648 2095 -1927 2434 -1168 2789 -1585 2277 -2624 1234 -2100
2097b100K742k835L874k762L110k214J707k004J232j961J242j573J136N22l7P66
$$ -2100 642 -2193 1681 -1081 2029 -185 1522 -482 750 -1211 31 -1542 -406 116 79 845
2113H45j45J88q41Q81k258J433j999K348j777K485k275L737l390L125l602K593
$$ 845 700 888 47 928 -1330 103 -1896 452 -1325 1160 -1115 2622 -768 2357 -1245 1348
2129A348m075M087m074M025l509M421l312M025m380L989m560L333l664L300l833
$$ 1348 -2727 1360 -2714 1311 -2198 2223 -1089 2936 -1444 2545 -2015 1318 -2346 954 -2879
2144b879M543k914L340k771K714k829K340l041J794j940J358m62J380q99J326
$$ -2879 1664 -1250 2090 -681 2033 -796 1544 -1497 297 -1643 -285 -747 633 -266 1060
2159A060l39k43J63r88J23q47Q76r74J844j848L074k155K060k760K544l668L280
$$ 1060 721 478 641 -347 -224 -1071 -195 -1169 675 -1173 1901 -254 1806 -954 1590 -2078 1202
2176A202l497L112k891M108l341L898m243M053l976L179l967L565l939M397l281
$$ 1202 -2295 817 -2074 2034 -1307 2591 -1652 2401 -1575 1604 -2363 1202 -2737 1660 -1621
2191a621L593l218L581l315K977l654K473k562K051j759K409j944J954n87N88
$$ -1621 1972 -1246 2335 -980 1997 -1657 816 -1746 305 -1454 955 -989 965 378 966
2206I66j099L44p15J07Q9o60J291q75J542r29J055j937K179k799K243k667K686
$$ 966 -133 211 -504 -397 -308 -968 323 -552 990 61 1116 -821 1358 -1441 802 -1865 821
2223H21k493L554l187L534l721L402l115K701l963M076l903L990l415L654l323
$$ 821 -1672 1882 -1305 2229 -1492 1910 -1205 1496 -2467 1609 -2294 1696 -1719 1935 -1388
2238a388L718l577L246l891K980k779K683k843L196k133K108j626J550k064J307
$$ -1388 2330 -1247 1999 -1892 1088 -1691 992 -1851 1345 -788 1320 -306 1244 -820 487
2253D87j167O56o15L84K85K95K56m41O19j409J396j649R78j450K200k077K741
$$ 487 -680 -24 -639 -255 30 325 581 140 759 -650 746 -903 75 -1375 825 -1252 1489
2270A489k468K817k612K401l042K832l887L692l106L395l144L827l568L813l801
$$ 1489 -979 1838 -774 1627 -1415 1417 -2470 1222 -1884 1511 -1633 2194 -1374 2439 -1362
2285a362L000l519K895l061L380l498L636k140K427k442K322k842J956k041J456
$$ -1362 1638 -1881 1014 -2047 1333 -2165 1471 -669 1758 -684 1638 -1204 752 -1289 167
2300A67j455J281m72J328m99K68J07n84J05q73L48j118J768j214J866j528K212
$$ 167 -1288 -7 -479 849 350 618 725 141 246 -627 -279 -1397 371 -843 1023 -505 1707
2317A707j988J832k913K474l071K650k366K807k931M076l330L313l339K808l559
$$ 1707 -281 1551 -1362 1112 -1959 691 -1675 1132 -1799 2277 -1053 2260 -1079 1729 -1830
2332a830L171l797L663l352L325k000K894l084L168l146K042k382J676k043K125
$$ -1830 1341 -2456 1207 -2145 1180 -820 2074 -1010 2158 -988 1054 -1328 348 -1695 430
2347D30j453K071j209J122m31L22j133J96m44m33Q78m94R41o26J506j252J424
$$ 430 -1023 1048 -161 961 530 852 -281 -85 -529 -962 -84 -578 363 -263 1243 -9 1415
2364A415k167J577k206J885k280K772k798L393k349K883l112K891l352K865l562
$$ 1415 -752 825 -1381 504 -1776 996 -1802 1591 -758 2125 -987 1904 -1448 1417 -2145
2379b145L043k823L039k486L619l493L284k875K187k813K282k627K564k009K232
$$ -2145 898 -1925 1114 -1372 2247 -1246 2038 -837 1350 -1463 819 -1808 756 -1253 979
2394I79j480J540j142J449j882Q83q05K26m35M30J23L30L98n09R74j557J176j412
$$ 979 -501 1039 -103 1346 -536 347 -458 -232 -667 -237 -114 216 614 105 1079 -478 698 -714
2412g14J055j750K130j984K378j741K241k578K496k797K535l054K678k680L133
$$ -714 341 -1409 721 -1263 1115 -626 1615 -963 1533 -1264 1271 -1783 895 -1785 1348
2427A348k982L453k955K832k665K574l412K886k809K664k402K490j951K333k107
$$ 1348 -1634 1819 -1136 1696 -969 1605 -1807 1079 -1730 934 -1468 1022 -929 1404 -703
2442g03K089k189J196j150J164j321J106n54P42J2r5O8k70j54m33M86j103J675
$$ -703 1386 -803 393 -757 407 -914 192 -362 380 392 297 365 95 -59 -492 -6 -1109 566
2460E66j194J556j390J657j919J949k328K063k549K345k222K999k805L046k583
$$ 566 -628 928 -462 1195 -724 1225 -1103 960 -1589 756 -1466 1533 -1272 1774 -809
2475h09K508k867K629l247K704k484K618k521K825k244K725k777K214k170J580
$$ -809 1699 -1168 1461 -1786 918 -1566 1052 -1469 1356 -888 1837 -940 1274 -896 684
2490F84j975J786j676J604r24J385r24R04r23L72o32j07K43o71R01j65O90p62
$$ 684 -1291 495 -1181 423 -501 884 -40 864 -59 313 -319 -426 -183 -854 47 -118 572 -190
2508a90J290j388J275j843J195j636J710j868K673k478K709j953K248k775K340
$$ -190 1100 -288 987 -856 339 -1297 413 -1455 1218 -1260 1449 -504 1744 -1031 1309
2523A309k775K329k625K799k602K909k203K750k619J987k146K021k681K249k245
$$ 1309 -1466 863 -1762 1037 -1565 1344 -859 1891 -728 1259 -887 1134 -1547 702 -1543
2538a543K076j316J871j377J431j254Q86j111J83n68M30l78N63M07l64Q80o32
$$ -1543 533 -783 1088 -289 1142 -112 774 -337 -154 -722 -292 -670 -107 300 -64 816 184
2555A84N52j082O09j279J337j560J698j240J780j396K031k526K159k438J898k384
$$ 184 736 -346 263 -1016 321 -1239 459 -781 999 -397 1634 -892 1267 -1171 727 -1657
2571a657K505k539L027k535L017k554K176k256K179k920K190k158K169j789K221
$$ -1657 848 -1691 1336 -1199 1818 -736 1440 -816 1363 -1557 633 -1525 644 -1145 1076
2586A076j794J990j607J329j502P62j152R34q50P90j07L91k7L60k82m09L33p32
$$ 1076 -718 1272 -335 994 -508 254 -898 36 -814 -24 -131 260 233 593 311 -98 235 -497
2604d97N32q97R71n95J243j248J802j955J592j762J659k336K215k144K550k110
$$ -497 35 -862 109 -486 757 -491 1311 -644 948 -814 845 -1491 724 -1420 1130 -980
2620i80K279k090K253k625K663k953K084j945K126k190K491j898J998j700J534
$$ -980 1299 -791 1462 -1163 1500 -1453 631 -1314 812 -1378 1113 -785 1213 -487 1047
2635A047j821J233j556J682j396J129q72J257q32O88o36J64k16p3m6j51M04k27
$$ 1047 -774 459 -1097 585 -811 318 -554 703 -129 559 -77 87 -129 -202 -248 -399 5 -222
2653b22J041j140J189j047P58j353J337j721J773j627K001j708J917j970K236
$$ -222 819 -321 868 -179 579 -774 563 -1158 615 -1012 989 -719 1198 -772 1464
2668A464k429K027k326J829j960K398k178K303j882K185k170J644j850J718k127
$$ 1464 -965 1062 -1264 565 -1395 1003 -1175 1128 -754 1431 -739 905 -945 773 -1354
2683a354J957j506J377j099J761j409J184j132N82q21M44m61K48n8L91M49m16
$$ -1354 603 -903 474 -625 1136 -273 911 -221 361 -460 -16 -477 -229 -287 104 553 137
2700A37M36m10L70j034O89j196J253j084J660j402J714j627J942k189J486j850
$$ 137 573 163 533 -501 188 -1008 245 -839 821 -581 1133 -494 1448 -741 745 -1105
2716a105J793k139K486k234K216j731K177k230J965k358J998k155J537j442J951
$$ -1105 688 -1451 1035 -1199 1017 -714 1463 -767 1198 -1160 838 -1317 220 -1222 729
2731G29j540K104j736J256j077R48j351Q59r40P58n15N53J51K92l23L17p3o70
$$ 729 -811 1293 -443 813 -264 684 -667 192 -748 10 -505 48 199 491 168 485 412 -258
2749b58K30p19Q05q49J031p44J485j360J547j806J395j711J626k095K015j607
$$ -258 -28 -747 58 -791 240 -504 981 -379 1168 -638 757 -954 672 -1423 592 -1015
2765a015J940j658K143j929J853k219J911k324J748j811K158j865K103j503J563
$$ -1015 925 -733 1410 -519 1334 -885 1026 -1298 450 -1361 797 -1068 1035 -468 1095
2780A095j473J525j903J128j353J128p84Q72o72J083n93N71l54k44k78M8j63j13
$$ 1095 -378 1147 -756 372 -981 147 -637 235 -437 646 53 624 270 26 -252 -204 -367 -480
2798d80M15k08R96q69J002j001Q18j410J342j772J503j361J858j483J805j675
$$ -480 -65 -273 723 -146 856 -145 673 -737 605 -1167 336 -1025 833 -650 1155 -520
2814e20J656j804J599k036J745j887K148j857J912j562J836j816J579j702J350
$$ -520 1136 -668 931 -1105 640 -1247 901 -956 956 -606 1230 -586 993 -709 641
2829F41j668J483j228J306j176J327q48P44p24N73r32N75n35K14M7J32L71k19
$$ 641 -1027 456 -772 534 -642 685 -163 581 -143 430 -502 73 -462 -248 -201 -69 302 83
2847H3K40l97N72j204J011r27P94q34J440j393J552j484J588j644J400j831J665
$$ 83 323 -74 498 -706 305 -622 172 -662 778 -615 937 -547 1041 -603 797 -1034 631
2864F31j858K121j703J808j741K094j994J633j970J647j764J563j371J494j241
$$ 631 -1227 894 -809 999 -742 1352 -642 991 -979 668 -1096 467 -904 590 -651
2879f51J516j109R80j225J085j324Q53o19N44m17P62k42K79k87o1M4m72J39k59
$$ -651 865 -244 736 -489 596 -728 125 -494 50 -367 395 153 432 145 84 128 -344 -205 -464
2898d64N58n61R99q77J028q66J046j510J213j701J734j647J707j374J645j603
$$ -464 94 -467 532 -345 683 -183 863 -647 566 -1135 599 -1048 659 -715 930 -673
2914f73J826j871J710j957J675j939J768j618J889j548J776j299J364j777J458
$$ -673 1153 -718 992 -965 710 -1229 539 -1079 810 -738 1038 -261 1103 -674 784
2929G84j636J092j102J033p11R91n37N71m55L43l59m4m02M4K95l09N82k13O39
$$ 784 -852 240 -862 171 -540 451 -86 485 30 373 14 -30 -432 -388 -93 -402 180 -33 606
2948F06m09N39j121Q06j238J106j313J356j067J582j441J851j599J149j531J438
$$ 606 197 736 -385 421 -817 289 -1024 332 -735 847 -594 1257 -342 807 -724 714
2964G14j863J690j762J958j507J837j568J666j821J514j606J045j382J563j143
$$ 714 -1149 541 -1221 737 -770 1067 -501 1165 -656 858 -748 297 -1085 478 -665
2979f65J249r36J213j052Q07q70N01o95L22k42J44M0K78J42j34L97o35L91p84
$$ -665 584 -352 861 -191 616 -254 247 -448 -126 -368 -224 -184 94 236 102 499 -136 255 -529
2998e29O49r19R08q65J513j078J120j034J011j438J386j664J294j406J656j380
$$ -529 120 -799 109 -756 757 -321 799 -235 776 -662 724 -940 354 -1052 604 -776
3014g76J769j629J875j864J427j506J240j751J751j388J434j090J307j062J068
$$ -776 993 -636 1239 -625 802 -704 536 -1215 536 -852 582 -508 799 -263 805
3029H05j209J008j275Q78n60M78m81O27k16J51p8p0K8l08J40m02O13o98J059p31
$$ 805 -404 604 -671 207 -353 125 -356 271 55 206 128 58 86 -222 -82 -484 129 -569 490 -241
3049b41P71p96Q93j226J061j243J268j431J640j344J566j734J705j389J231j661
$$ -241 530 -266 627 -599 462 -781 487 -944 696 -648 918 -816 889 -500 731 -930
3065i30J658j711J691j420J418j370J527j293J263j530J164j065Q21p58R94q63
$$ -930 728 -983 708 -712 706 -664 863 -430 833 -697 467 -598 223 -535 459 -404
3081d04R56n41M03m48K15l07M0k93O5L24j93L70j09L70o34P56r16P06j038R81
$$ -404 552 11 414 -34 181 -126 -86 -379 -314 10 -183 187 78 448 -186 570 -346 360 -678 303
3101C03r94J233j063J319j294J379j283J169j687J441j458J427j302J476j381
$$ 303 -691 542 -521 798 -496 883 -400 769 -918 523 -935 492 -810 666 -715
3116g15J778j511J367j587J354j426J145j394J538j035J090q32Q86q88O85p56
$$ -715 1063 -448 919 -668 686 -740 405 -989 549 -486 604 -228 658 -230 455 -301
3132c01N18p56L52m7L28k03M46m3j97L61p11L47n81O07p10Q68p62J246j007J147
$$ -301 217 -539 -187 -234 94 -109 337 294 97 458 -253 94 -487 120 -590 278 -484 762 -245 902
3152I02j173J092j533J213j395J290j323J562j166J600j449J440j701J417j681
$$ 902 -271 821 -712 501 -894 396 -927 635 -531 1069 -380 1060 -641 776 -905
3167i05J466j728J599j060J373j139J286j119R19j002P14q42M50m53O23l68M39
$$ -905 561 -1167 432 -628 745 -394 892 -227 692 -310 404 -438 12 -441 182 -186 253
3184B53r4Q9n0q5j39j90J27l99N53l66P12m24O11q46R82j330J058j267J215j286
$$ 253 159 248 198 113 -26 -216 -89 -488 65 -301 411 -13 598 -248 734 -596 462 -805 410 -876
3204h76J514j286J504j437J557j493J171j464J406j614J517j220J290j243J494
$$ -876 638 -648 856 -581 976 -517 654 -810 596 -1018 499 -721 569 -674 820
3219H20j267J138j182R04j233J072r68J119p74P70m28M51n63N19n28L8j08k2J43
$$ 820 -447 691 -491 413 -820 252 -716 403 -371 399 -29 422 -141 378 -150 -112 -220 -242 -99
3238i9j01L34r7M65o33N77o80M98o96P81j023J275r21J004j169J265j271J137
$$ -99 -200 134 37 502 -131 446 -234 264 -432 349 -674 601 -320 684 -485 780 -491 646
3256F46j475J317j337J488j467J599j521J639j306J122j403J238j284J183j230
$$ 646 -829 488 -849 639 -828 771 -750 889 -417 705 -698 540 -744 439 -791
3271g91J295r93J067q57R76j002P29p47M75n65M88l38L79r0N7J77j79K20l48P9
$$ -791 504 -489 578 -279 697 -305 424 -323 152 -413 75 -263 116 26 83 260 81 301 -47 32
3291C2n31P28o23O68n74Q31q34J078j215R15j093R42j050J128j119J549j369J396
$$ 32 -499 229 -394 274 -300 531 -303 775 -440 475 -618 324 -726 402 -717 832 -537 859
3309H59j312J317j657J405j459J259j357J362r19J209j041J061j136R27j050P37
$$ 859 -453 864 -793 612 -847 412 -945 417 -502 707 -334 727 -409 518 -532 205
3325B05q70Q21n36P53m81N31l05K00k26j7k43j83L43k47L16k52P17n72O42q41
$$ 205 -665 156 -380 373 -108 423 118 318 92 75 -168 -351 -8 -255 61 -191 526 -46 596 -245
3345b45O40r49P54r02J123j176J435q69R31j121J205j496J244j283J186j312J193
$$ -245 395 -554 200 -702 421 -755 680 -189 742 -379 826 -670 574 -709 477 -835 358
3362C58r13J389j232J199j055Q13j222R63j060J024p16P72n59P50n56N81p42K98
$$ 358 -555 834 -398 801 -254 559 -663 300 -760 264 -452 320 -239 511 -45 536 -206 92
3380I2l00O0j89J85k8Q4L25j97K96l92L73o58M43n92O75o28Q54p54J109j093J164
$$ 92 -208 -148 -337 -152 -180 -96 229 32 328 -64 309 -349 94 -498 177 -451 403 -351 758 -335 829
3401H29j270R85j251J089j185J261j111J457j342J240j124J089j278J164j264
$$ 829 -441 544 -707 382 -803 458 -653 804 -538 702 -422 667 -611 553 -711
3416g11J065r77R55p48J007j002J074r23N03m88L12n01N37l13K83J8J54l5j22
$$ -711 354 -623 332 -416 591 -411 663 -260 243 -245 67 -434 103 -210 73 91 245 210 88
3435H8nj81K36n26N11m80N92m70O97p45P83r00Q78j018R76j178J201j057J207
$$ 88 83 -98 138 -388 123 -357 235 -235 462 -283 500 -400 478 -540 436 -742 459 -598 609
3454F09r57J117j187J129j419J268j208J030j125J160p77R64r94J035j036P58
$$ 609 -348 769 -418 711 -708 560 -648 382 -743 417 -360 604 -390 645 -391 367
3470C67p14O55r09O86l04N01l51M65l83K16l40K13k25j31K11QK81l75O58p24O03
$$ 367 -347 308 -601 85 -219 282 -69 396 13 229 -111 102 -123 -254 -43 -35 246 -129 529 -195 408
3491D08o36M01o54O75p28R43q46R23p75Q50j027J072j158R32j093J061j123J280
$$ 408 -228 173 -481 194 -534 409 -437 486 -289 561 -466 606 -552 380 -713 348 -775 505
3509E05j001J203j186J193j184R92j149Q92p82P56o87Q17o19P47o93N21n59L00
$$ 505 -496 707 -479 714 -470 522 -627 265 -517 239 -448 369 -250 497 -196 325 -234 66
3527F6l22J79k14K60J24j7K32k49O7k17J55l35M03n55O31n87P49n79R02r32Q30
$$ 66 -256 -77 -291 -31 93 76 308 59 126 -91 64 -271 132 -423 208 -379 370 -209 693 -239 591
3548E91j071Q06j019J005j070J266q26J015j089J077j140R87j183J012j080J077
$$ 591 -480 326 -693 312 -758 508 -318 697 -392 685 -455 532 -651 361 -719 358
3564C58q51R70p41P82p08O60o67M72o96N07m66M79k02K01o2K58j77q6l4k54J53
$$ 358 -493 477 -264 518 -190 470 -197 275 -421 86 -380 99 -103 98 36 294 117 31 -3 -257 -104
3585a04k71L73l05N39l15O62q85P91q78O76p99P43q44R76q03J033r73J005q44
$$ -104 -375 -2 -307 232 -83 579 -306 485 -393 283 -516 227 -617 359 -444 589 -384 621 -223
3604b23O79j052R87r72Q12p99J071q92R59p74Q16r76P35p84N95n68M36k97N02
$$ -223 456 -596 391 -581 231 -568 503 -389 570 -204 612 -364 371 -413 182 -386 50 -247 255
3623B55l61N72m98K65l53J39j96L1R1j45L96k28M00m03K36l77M43o73N56n47P40
$$ 255 -106 466 -32 233 -120 19 -177 -146 -55 -200 196 -32 368 -35 201 -176 267 -406 150 -397 343
3644C43o62P19n35N81p63R67j174Q42q74R00r14J032q96R47q37R67q96O65r44
$$ 343 -319 400 -135 446 -317 650 -524 318 -556 344 -570 462 -434 513 -324 643 -253 412 -532
3663e32Q03q18P73n62P90o86O67m96K80m48M18m63K18j02J13J14k7J37j14J2j96
$$ -532 271 -547 226 -336 454 -232 435 -61 219 -229 189 -274 -56 -158 -45 69 42 179 65 77 -119
3684a19K68m51L82m09N24m39O13n95P17p93O68p48N29o58R19q49P87o98Q40p82
$$ -119 149 -302 80 -329 195 -244 369 -226 491 -302 366 -382 147 -511 408 -441 346 -352 488 -294
3704b94R02r67P80r72Q34p52P24p35R20p26P63p83O85p71O41n47L00k96M57k98
$$ -294 608 -359 421 -551 283 -469 255 -480 440 -286 477 -306 379 -392 249 -298 2 -294 163 -135
3724a35L35k74K96k09j8j08j38K04p4L67k84L49k99L21m93L06m08N07q12Q17n62
$$ -135 200 -74 222 13 -5 -113 -251 -47 -121 246 -38 311 12 333 -160 146 -262 245 -567 250 -312
3745c12O91o56Q08q12Q22r42O99p32P35p92Q65r19J129q26P43p06O67q24N58o65
$$ -312 379 -277 531 -281 541 -401 298 -434 301 -491 374 -545 584 -242 501 -205 462 -362 196 -469
3765d69N85m10N44l77L17k32L02l03J17k70K70l10J41L4O3J43q4J61l08K02l18
$$ -469 116 -294 250 -127 190 -42 260 -43 74 -196 74 -236 -95 -61 2 145 61 222 -86 116 -202
3786b02L70m53L70m34O21n44Q61p62O33p28M79o67O44p68Q30p02Q67o60P04p43
$$ -202 168 -285 85 -349 272 -272 589 -173 460 -268 211 -456 188 -580 250 -452 415 -245 459 -284
3806b84Q12q95O95q23P26o40O67n35P76o94N36n43L68m19M33m27K02k28L37n4
$$ -284 528 -367 328 -495 231 -409 258 -277 499 -195 341 -202 166 -253 180 -247 -45 -273 64 10
3826A0J33ok8K8j84P9k15Q4j70N22l85M84n20M64n04N70o30L97n61P62p02O84
$$ 10 143 137 109 137 -47 32 -183 -99 -269 253 -132 352 -168 296 -208 362 -268 129 -432 330 -372 312
3848C12o09Q64r13Q00q27O46p89Q79q35P87o82R10o76N26o15O49p97N64m62L64
$$ 312 -297 567 -346 454 -373 273 -516 363 -472 315 -367 543 -133 393 -222 427 -370 194 -268 96
3868I6l20L48k07L17j46J58k06L5p8j19K2J7K32j84J36p9J76l25L79n80N15n17
$$ 96 -224 124 -83 234 88 246 40 75 -3 -122 -100 -83 149 -35 101 22 198 -127 252 -328 187 -330
3890c30M88n37O84n69P08p24O93o76M40o43P24p94Q60n96Q35q70Q02q47P77p93
$$ -330 158 -379 305 -264 444 -280 413 -263 177 -466 258 -536 324 -272 563 -307 495 -352 425 -368
3910c68O60o94N45m22O94n63M10k90K14m38L98l56K56k35Q1P7M0k1J44qk42J62
$$ -368 292 -402 143 -279 415 -148 262 -28 186 -252 146 -210 46 -189 -108 -31 9 -12 132 124 -118 44
3932D4k30J93k69L59k98N56m67O21o24N07p78O27q07Q83o49O88p15P88o34O55
$$ 44 -186 7 -262 97 -201 355 -112 509 -115 392 -386 241 -566 317 -332 356 -359 429 -205 450
3952D50o56N56o70O53p54N63n26P16m75N58n20M57n89N91p07M27l19L19k34M05
$$ 450 -206 350 -320 333 -421 142 -384 332 -143 415 -105 352 -237 354 -353 74 -245 74 -160 245
3972B45k82L26k40p2L6j43P0j05J23k41M56l17M79l40L76n93L92n63N25n36P02
$$ 245 -37 289 49 -23 13 -130 -60 -165 -42 -283 173 -144 335 -5 371 -222 170 -393 132 -404 298
3993B98n28P11o56O70q56Q51p23L99o28O57o48P72m69O64o52M33n46N21n37K90
$$ 298 -230 481 -175 495 -361 490 -233 166 -462 195 -453 319 -150 514 -138 295 -251 270 -267 23
4013B3l98N83m69L84k45K57k27K45k64J40j31M2Mn3J22O3O7r1K17m18K72m10L33
$$ 23 -375 208 -261 123 -122 135 -92 153 -111 29 -102 -60 -56 -109 13 76 143 52 269 -149 123 -287 46
4036D6l99N42n16O88m91N26n64M42m81N48p72O12o49P81n81O93o69O27o49N70
$$ 46 -353 189 -327 361 -130 396 -168 274 -207 341 -431 181 -468 313 -268 425 -244 383 -266 304
4056C04p64N76n20N31m45N60l84N24m53L07l65L51l98J86k12K95n9J06j10Q7O9
$$ 304 -460 116 -404 127 -318 242 -142 382 -71 236 -129 222 -176 10 -202 93 34 140 30 117 186
4077A86k32Q5j37J53k63M04k63L39m22M36m03K71m45N99p00N37m04N53n88O61
$$ 186 -46 39 -98 55 -208 196 -67 272 -150 286 -117 154 -291 308 -392 145 -259 294 -294 367
4097C67o13O57o65O15o66N53o73P82o65O60n46N51n96N21m22L07m63M56l88M66
$$ 367 -246 411 -254 361 -305 248 -425 357 -308 352 -194 357 -239 282 -140 167 -296 160 -228 238
4117B38l62L86k84J33q4M2k53R5K4j0J28k02L86j97O7k19L22m27L50n42N87n24
$$ 238 -124 262 -22 111 27 69 -184 -89 -65 -75 53 -149 237 40 107 -112 210 -217 133 -409 178 -346
4139c46N61n06P17n83M87n92N77p46P03q32P72n22O53o07P17p31O08p04N73n06
$$ -346 215 -291 426 -157 330 -262 315 -431 272 -560 212 -310 343 -264 453 -278 330 -374 199 -307
4159c07N14m16M46m59M31k56K43l67K99m10L56k30J42J1P9J8n2O6j41J30l39L99
$$ -307 207 -209 237 -222 209 -47 196 -171 128 -282 74 -156 -14 -3 76 94 42 108 -33 97 -242 157
4181A57n13L61l16N78m07M93m73N41o25M99p70O15m70N29m57O82p48Q14o60N69
$$ 157 -356 5 -311 267 -140 353 -120 421 -204 295 -475 140 -330 199 -258 424 -324 490 -170 399
4201C99o52N11o04N54n01N17n16N75m30M64m75L98m47L12l43K15k25L68n0J23
$$ 399 -253 258 -346 208 -293 224 -292 283 -147 317 -158 240 -207 105 -238 -23 -248 120 70 193
4221A93q7j31J04j75Q2j17R2j93M40l14L39k16M25p24N28n74M95n97O41n21N88
$$ 193 106 -25 79 -96 -14 -131 -39 -232 208 -106 233 17 442 -282 246 -328 167 -430 211 -310 278
4242B78n36P16p02N43o10O51o77M46m81N38n38P16m16M46o43N54o05M97m90L75
$$ 278 -258 458 -244 299 -311 340 -337 109 -372 166 -372 344 -72 374 -269 285 -320 177 -313 62
4262F2l68N63m00K32j93K53j39P1j90O6q7M3J10k01L56j83J45k14K84m45M24l22
$$ 62 -306 257 -143 89 -104 149 10 81 -109 -43 -130 -87 23 -178 178 -5 140 -74 210 -235 189 -133
4284a33L13m55N35m02N54o64O08o50N21n21N20o34O57o13P63n87N23o70O06n73
$$ -133 180 -275 260 -142 412 -252 356 -294 227 -294 226 -408 249 -364 399 -188 335 -335 271 -302
4304c02M25m79O27n04L84l60N01m82M26m29L03k98K27j56R2m0K70J8j30pj01J36
$$ -302 123 -356 271 -233 151 -209 292 -190 236 -193 110 -188 39 -117 -25 -65 205 223 93 86 -15 121
4326A21l36J28K4J72k65L90k83L97m35K72m87N43n74M29l76N74n42N68n84O28
$$ 121 -215 -87 -63 109 -156 234 -49 348 -87 185 -302 241 -333 96 -280 294 -248 320 -264 364
4346C64n80M53n04M95o61O23l96M06m55N69m84N12m61L86n15L54m66L97j43K54
$$ 364 -216 237 -267 228 -433 190 -206 200 -255 314 -170 342 -119 267 -248 106 -360 37 -106 148
4366A48j83K39j68J67j30j48Lj34J45j09K85j99L76k52K00m75L58l58L55m14M47
$$ 148 -35 204 36 203 73 -75 -72 -206 -61 -170 115 -84 292 40 240 -235 123 -235 120 -294 153
4387A53m54O92n99O08n60N06o01M26o41O25n20O80n79O88n68N04o76N24m28L76
$$ 153 -301 391 -208 400 -160 346 -255 171 -470 155 -365 315 -264 424 -144 360 -316 208 -220 156
4407A56m41N70n07M68k93K81k82J65j48J6p4K3JkJ34l4R0q5J54l30K09l71L23
$$ 156 -285 285 -222 246 -47 234 -48 117 -31 -15 -89 -66 -65 -67 67 33 123 38 192 -138 71 -300 23
4430B3k99M18l31L54l02L56m24N07m86M38o28M48l73O37n31O19n79N80p27O03
$$ 23 -276 142 -189 165 -137 219 -205 302 -184 254 -374 74 -299 338 -193 426 -153 427 -300 303
4450C03o69O63o06O20n12L87l09L79l87K75k50K28l16K17q9N7p7J59j2m1L3m7
$$ 303 -366 297 -309 311 -201 186 -123 256 -131 144 -106 122 -194 23 -66 -9 -86 73 61 20 53 6
4472FM3k43J52p6K05j54K93l42M49m67L98m61M69n16M64n44O40n70N91m58M97
$$ 6 49 -194 -42 -118 87 -67 226 -116 333 -134 264 -197 272 -244 220 -324 316 -254 337 -121 376
4493C76n40M47p49P07o48O28l81M42m89N09n58M45l70K99l80K77k43K93k55L29
$$ 376 -164 283 -466 241 -407 221 -160 282 -207 302 -256 189 -181 118 -262 15 -228 65 -190 139
4513A39j58Q5o1J2p1p9R7j03K19j14J94j67K26j86R6l01L64m23M05l66M39l82
$$ 139 -19 66 5 17 -54 -133 -36 -139 80 -34 160 -7 219 33 129 -172 192 -231 174 -192 247 -135
4535a35L81m55O43p39N40o74N40m70N57m93N70m72M45m11M60m72M30o51M47k57
$$ -135 246 -209 434 -305 235 -439 101 -369 188 -305 265 -207 238 -173 287 -185 245 -406 41 -216
4555b16L97k14K26l10L73l37K57l65J74j96K08k31J16J84K0Q3j86O5j82J74k17
$$ -216 181 -33 193 -117 256 -81 176 -189 -15 -211 -3 -234 -118 66 86 169 -17 48 -134 40 -177
4576a77J88k43L62l28M53l67L96m36K60m11N36n98N81m94O13n72N93n07N03o75
$$ -177 11 -232 130 -198 255 -112 284 -152 108 -303 233 -365 216 -278 335 -237 356 -151 352 -323
4596c23N45m80L58l71M32k92L21k32L39m04L50l08K48m35K32q8J09q3K28l6o1
$$ -323 222 -258 100 -271 161 -131 190 -42 297 -107 243 -65 183 -252 -20 -108 1 -82 146 110 49
4617D9M5j79Kj1J67k09J43j25K64j36K87n28M46m27M40n17M39m55M89k94M15m10
$$ 49 94 -85 -83 -94 73 -136 7 -118 146 10 297 -231 215 -212 228 -289 150 -305 184 -110 305 -105
4639a05N74p37M63m97N73o49N56m04M84l52K90l12L23l58J68k53L90k92K23j07
$$ -105 469 -268 195 -302 271 -378 178 -226 258 -94 196 -116 207 -151 17 -236 154 -138 85 -22
4659b2J55j77K83k74J04j82J37l8O8L4r4J09j50L06l29K22l60J31j15L40m16L67
$$ -22 133 -44 239 -35 69 -113 24 -14 54 88 -6 103 -47 259 -70 152 -208 -77 -192 148 -268 99
4681I9k81M43m69N93n60M64m94M26o52N94l89M71m17M17l69L23m97M96l22K68
$$ 99 -182 261 -208 385 -175 289 -205 221 -431 163 -226 245 -172 245 -124 199 -298 198 -124 144
4701A44l28L66m82N73l93L60l13N7j37J20r5R7m8J37m3l3%j28J88j73J49k91K92
$$ 144 -184 182 -300 273 -120 240 -73 -16 -153 -33 -128 -31 -79 58 15 -18 -18 -146 42 -131 18 -273 19
4724A9j38K78k02K52l14M03m51L97m82L67l48M61m04L86k86L78m89M00m78M40
$$ 19 -119 159 -43 209 -105 298 -153 244 -238 129 -219 242 -162 224 -62 316 -173 227 -251 189
4744A89o06P17n49M87m12M58m85N25l78K05l46K54j96L03l67K55j17J11n4R0j51
$$ 189 -417 300 -249 238 -174 284 -201 324 -54 151 -195 59 -137 166 -201 54 -63 48 -6 84 -67
4765f7M8J02l37L20k55J84K5K01k20J76k13J86l97M81n00M58l85M48l22L13l53
$$ -67 -19 83 -254 66 -189 -5 20 221 1 177 -36 150 -247 234 -266 192 -193 255 -67 246 -107
4786a07L87n40K99l97N17m87M47l70L70k15L92m56M08m95M41m69L85k97L14k54
$$ -107 280 -260 39 -358 159 -328 119 -251 119 -96 296 -160 248 -247 194 -275 110 -187 127 -127
4806a27L22k27J68j42Lk5k4P5J4J1j47K33j01Q3k10K16l01K46j95K44k60K76j86
$$ -127 195 -32 136 -6 -3 -28 -52 23 37 48 -99 134 33 116 -94 122 -179 67 -128 116 -144 132 -54
4829e4K17k20L99n58L95m65N72n54N45n10O12o45O13o05L66m12M79n22L81k75
$$ -54 163 -57 342 -216 179 -286 286 -268 277 -233 379 -266 347 -258 108 -304 175 -347 34 -241
4849b41L81k66K52j72J67l12K76j71o3N1J55r7O9J7p8Q2p1M5j81K27j77P9o2L40
$$ -241 140 -126 126 -46 121 -191 85 -86 -149 -98 57 -40 29 46 -32 50 -21 24 -157 70 -107 -28 -90 250
4873B50k75M01n09M16l58J74l02L55m61M84l74M83m65M51l85K56l39L48m47M52
$$ 250 -25 376 -133 283 -75 99 -203 152 -309 175 -199 284 -181 270 -115 141 -198 150 -297 155
4893A55l17M29m00L24j88J98l54K84l32L07k95K65k34K70j72J42r6m0P0n5O6n9
$$ 155 -162 267 -133 191 3 201 -153 131 -201 106 -189 76 -158 112 -60 82 -14 -54 16 -39 27 -32
4915c2J33j76J33k12J99m4P1j05J81k14L4j88K32k21M75m11L82m59M62n27L98
$$ -32 101 -75 58 -154 45 1 72 -33 148 -66 -32 -220 12 -209 266 -145 237 -222 240 -287 111
4936A11l57M35m70M90l75L84k13K66m71M10m11L51l88M08l18L11k69K27j51J90
$$ 111 -246 189 -281 209 -166 218 5 271 -200 210 -201 150 -238 170 -148 163 -106 121 -30 160
4956A60k05J06r6l8LM0L8L2J13j42K5m8L0k92K38j02L10k81K84j84J82k91L36
$$ 160 -45 61 -35 -73 -70 -30 8 40 153 11 36 -12 18 -274 -36 -138 172 -109 175 -9 173 -118 218
4979B18l54L28n87M95k88M69m65M79m20L95m42L34m02L33l34M04l40M42k92K84
$$ 218 -136 192 -395 100 -188 281 -184 295 -125 270 -172 162 -240 93 -241 163 -177 265 -27 257
4999B57l76K76k43J71k76J74p0P6O9j2K7J0n4o3M5o6L7k5l7p5L10j45K97l60K82
$$ 257 -119 157 -86 85 -191 -17 -87 -11 58 46 73 83 29 -34 11 -55 -18 -43 -80 -155 155 10 307 -53 229
5024B29l76K67l92L43j25K83m08M68l99M02n37M12m52M98m26L53l65N08l96L47
$$ 229 -147 120 -272 71 -54 229 -179 289 -110 292 -245 167 -285 213 -213 140 -225 283 -113 234
5044B34k92L14m40L53k44L2j42L48j93K25j90J57k22Np2rO2n7J27J12N8k68L29
$$ 234 -58 256 -184 169 -75 -43 -185 163 -30 195 5 162 -60 -55 -127 -136 -74 -131 -4 108 166 -102 227
5067B27k28P0j56K38k40K70l83L19j69L62k70J00k96M75n51L29l68N14m39K79
$$ 227 -1 69 -87 151 -89 181 -202 117 -52 310 40 140 -156 319 -232 97 -271 243 -196 83
5087H3k24M64m25L48m88M37m97L68j62J71j65J77q7J38j84J30m1N2k72J61q2J68
$$ 83 -141 323 -102 246 -242 195 -302 66 -96 75 -90 87 0 138 -46 84 43 95 -177 -16 -98 70
5109G0l3Q8j69Q3K7j48J13k20K04j45K70j51K70k45K40l66L26m19K95k65L27l33
$$ 70 37 125 -44 39 66 -82 31 -189 15 -130 140 -11 259 14 254 -112 214 -205 90 -175 152 -181
5131a81M64m55L82m99N16m54K66k63K84k51L27k28K76l07K38k29J87k34J89j53
$$ -181 283 -172 210 -289 227 -227 39 -224 60 -191 136 -92 184 -123 115 -114 73 -161 28 -125
5151a25K08k88L35j90J05L7m7j01O1m3RJ36k65K63j91K73k17K54l49L32l32J47
$$ -125 83 -205 130 -60 45 82 35 -66 -5 -48 -39 97 -168 95 -96 177 -40 214 -135 197 -135 12
5173A2j31J87l39N21l89M60n97N02l31J94l36M08l61L52k17M10m56L58l49K05
$$ 12 -119 68 -271 250 -139 321 -276 226 -105 89 -247 161 -200 152 -65 345 -111 247 -102 103
5193A03l37L35l54L91j14J62j46O2p7j2LM3j77M9KJ2J40j24K09j80J11p5R5j76
$$ 103 -234 101 -253 138 24 186 40 102 25 13 16 59 -118 -69 -67 -55 85 -39 170 -10 101 26 121 -55
5217e5J64k43K37j90J46j12K65k77K31k73K92l93L04k78L65l97M74k93K98l52
$$ -55 109 -134 103 -87 59 -53 212 -65 166 -107 185 -208 96 -182 183 -214 260 -33 265 -87
5237h7L25l91K61l87L37l50M91l03L11k62L22l60K07k46J74k61N3K50r7P2J3n9
$$ -87 238 -153 108 -279 58 -292 199 -104 207 -55 267 -93 114 -132 42 -219 -166 84 -13 59 72 13
5259A3m0QR9r4n7J5k5J95k08L17l27K63k01K78n42N25m95L99l43M81l97L65l73
$$ 13 -27 -19 80 -14 -71 -56 -81 114 -94 223 -104 159 -42 236 -306 219 -276 123 -220 261 -136 229 -144
5282a44M00m07K62k69K57l37M27k20K68m48L19k48L51n56L68j94J72k2J95j01
$$ -144 256 -151 111 -158 99 -238 189 -31 237 -211 108 -140 211 -345 23 -171 1 -21 174 73
5302G3L1l2r7qk0J85j87Q5j60J29M8R4j52J37k41J79j94K52k36J21j87L27k48
$$ 73 104 72 -25 -33 -53 132 -55 30 -130 -1 47 141 -11 126 -115 64 -130 122 -114 7 -180 147 -101
5325a01K70j92K71m95L20l16M68m45K80k68L36m20N39m83K87l89M70k39Q7j30
$$ -101 169 -23 248 -247 73 -243 225 -220 60 -208 128 -292 247 -236 51 -338 132 -107 -20 -150
5345a50K69l05L31k28K04k18K09j47k1N8kJ77q7j0j06K7n6R9q8K0j46K89k32L36
$$ -150 119 -186 145 -83 121 -97 112 -35 -56 2 0 177 90 80 -26 1 -55 44 -44 -24 -170 119 -113 223
5369B23l02K17k30L42m26L58m21M63l88L22l09M14m58N34n18L48l04K16m24M48
$$ 223 -79 138 -92 250 -176 182 -239 224 -164 158 -151 263 -195 339 -179 169 -135 81 -343 105
5389A05l14L46q6K24l13J89k58P8l4O4j39K55j96J73%j0j9r2J4j04J59j08Q1n3
$$ 105 -209 137 51 275 -38 151 -107 -29 -63 1 -138 117 -79 94 94 84 65 -27 -13 -117 42 -66 15 -38
5413c8Q3j01K71k40J67k82R8k21M02j92J85k98M03l47L27m01L01l69M09m15L31
$$ -38 45 -56 215 -25 142 -140 -42 -263 139 -53 132 -166 237 -110 217 -184 117 -252 157 -258 73
5434G3l14M52k47K62k53K65m73M24m35L26l04K74j53K46p7p7K5l7M8j16O5n4M9
$$ 73 -241 211 -36 226 -27 238 -235 189 -246 80 -224 50 -103 143 66 -11 14 -23 25 -91 -26 -80 -31
5457c1P6m6n4J26o9J2k36K69k58J49o0K25k85L96k44L06l15K19n10M19l39L59
$$ -31 45 -1 -55 71 2 14 -222 47 -211 -62 -122 103 -182 214 -30 276 -39 180 -330 89 -250 109
5479A09l30M66m17M69m54L53l87L97m76L95k68J87k08K65j81J89r2J41l08J28
$$ 109 -221 245 -172 297 -157 196 -191 206 -270 125 -143 44 -164 101 -80 109 17 158 -150 -22
5499b2n9J04j15K68k18R8J1L1L4j77M2j54Q7p1K10k50K43k45M27m21L01k96K70
$$ -22 -81 23 -92 176 -42 56 67 98 132 -45 -3 -157 -70 -141 69 -181 62 -183 244 -177 124 -172 98
5522I8l97N22l11K48l05M30m45L50l81L99m12L55m54L80l24M27k60K52l57K76
$$ 98 -299 223 -88 160 -145 285 -160 190 -191 208 -204 151 -303 77 -247 180 -80 172 -185 91
5542I1l00K47j74J94k7j8j2J04j76O0L3j2k0l3O1j00K01k01K06k38K02j78K92
$$ 91 -209 38 -136 58 31 13 1 105 -71 -11 22 10 -10 -43 18 -82 119 -82 124 -114 88 -90 202
5565B02k79J40l38K87p4K08k79L72l22K99m48M48l44K17k94M05l03K94l61L83
$$ 202 -77 63 -275 12 -62 146 -133 239 -83 216 -232 216 -128 89 -205 200 -103 191 -170 213
5585B13l12K47m41M11k56K27j93K80j68J31j68J76l12J73K1k9m6L4M2J14j18j2
$$ 213 -99 148 -293 118 -138 89 -104 176 8 139 -29 147 -165 8 29 0 -46 -12 30 144 26 14
5607A4Q5j94J25j83J78l15L53j64K67k26L71l80K74k97J89l22L54k84K68k48K93
$$ 14 99 -95 30 -153 25 -290 63 -101 166 -60 311 -69 205 -92 97 -225 129 -155 113 -135 158
5628A58k66L74m31L36l02L06m38L19k55L22k66L25k11J48j95K21k39R5n0QPJ55
$$ 158 -108 266 -165 171 -131 175 -263 56 -199 123 -143 182 -29 119 -76 145 -94 1 -49 -41 -34 121
5650A21p4J5L7p9L0j44J90k44K86k78K82j28J22k30L12l07K75k46J11k58M03l49
$$ 121 47 62 99 20 50 -94 96 -148 138 -140 142 14 136 -94 218 -89 186 -60 51 -207 196 -153
5672a53L81l97L25l98M56l50J61k92L16k92L88k52K06k54M14l30K37l87K66j37
$$ -153 228 -169 156 -242 214 -136 25 -267 49 -243 145 -107 99 -155 259 -71 166 -221 45 -92
5692i2J15j07M9J0J25j51J30j25L4M2r6R1j31J23j47J76o8J66k74K73l63M00l11
$$ -92 23 -84 -35 -25 100 -51 79 -46 -12 30 -66 25 -106 17 -130 46 -22 144 -130 143 -220 180 -131
5715a31L00k98K77j33J29r9J25l86K99k70L23m07L62k12K51j70K03l36K57l38
$$ -131 169 -129 148 15 144 45 170 -216 83 -187 136 -271 91 -121 130 -40 163 -173 84 -254
5735b54L30k68K90k36K65k20L77l82K30j52N8o4k3N2j69J37NJ05r0J21j81J83
$$ -254 76 -192 98 -138 127 -93 284 -98 132 -20 38 -26 -49 3 -166 -29 -24 81 -9 112 -69 114
5757A14j53N8k7L1p0J73k22L59l21J62k18K24l01K36k42L86l04L06k21J39k61
$$ 114 -39 19 -8 23 -47 126 -96 263 -58 104 -114 110 -191 45 -197 189 -115 191 -30 109 -152
5778a52K96l08K54k16K73k94K12k16M36l69K06j54O9j75J50Kk1P1k4L4q6O7nl3
$$ -152 144 -164 90 -126 147 -147 65 -151 285 -84 122 -32 37 -138 12 14 -7 64 40 74 -12 55 50 17
5802A7M0n7o8J19j60J70r8J32j22J27j29J11k12J22j43L20j54J34j53J55k60K81
$$ 17 57 0 -68 51 -109 61 -37 95 -27 100 -29 82 -130 -8 -151 169 15 149 -4 151 -109 172
5824A72l07M02m25K14k23L31k89L19k52K47k44J80l24K66j98K50k28K06j38J68
$$ 172 -135 267 -158 56 -167 164 -125 194 -58 189 -55 125 -199 67 -131 119 -109 97 -41 127
5844A27p4p6rk2k3n1R5N7L1M3J9n6R0j21O8j94K48l56K75k48L08k48L35k98K04
$$ 127 53 -23 -32 -54 -77 -128 -33 24 55 98 117 61 151 30 98 -96 152 -204 71 -177 131 -117 218 -80 124
5869A24k41K17l73L68k22J73j97L95l10K87l17K38l35K27k55J34o4J88n8R8r7
$$ 124 -117 100 -273 95 -127 46 -151 244 -66 221 -96 142 -193 34 -221 -87 -151 37 -21 77 -20
5890b0J36j98kj03K53o0o8J54J4L2j54K3k4N8j36J76j93K42k45K50j19N6j90K03
$$ -20 116 -82 -84 -187 66 6 -62 92 106 138 -16 7 -17 41 -95 81 -112 130 -115 135 16 72 -118 85
5914H5k93L30l61L43k91L38k51K14k47L57l00L04l92J83q1J77k06K46k38Q8j67
$$ 85 -208 122 -239 104 -187 151 -100 114 -133 224 -76 228 -164 19 -62 115 -91 155 -83 5 -162
5935a62K81j66J41k43J98j30J47j01R6J1m8K4j3k3r4J17m7%j6J90k63J23q4N0
$$ -162 119 -47 94 -149 49 -81 66 -35 61 72 24 48 35 12 -82 35 -12 -12 -28 162 -101 22 -62 -12
5959a2n6J93j92J11k17K38j64L23l72L15l28L38l79K78k44K50j94K59j92K50l10
$$ -12 -68 125 -67 44 -173 65 -99 224 -148 167 -161 177 -202 76 -168 82 -112 147 -45 205 -105
5980a05J79k92L43k92K03p1O0p6J26j95J17JM9jj9j54J01nJ3J02j32J2j15J25
$$ -105 74 -218 125 -167 36 -35 25 -51 75 -120 -3 -2 47 46 27 -127 -26 -31 -18 84 -48 -36 -151 -26
6004b6J6J19j59J47j77J79j09J99j83J68l06K52l19J54j18K89l19M56l66K99l44
$$ -26 -10 109 -50 97 -80 99 -10 189 6 174 -132 120 -199 -45 -163 126 -193 263 -103 196 -148
6025a48L32k73K21k90J53r9K24k62J78l5l9n8J16j19J19o9J35j63J91p6K6l8n3
$$ -148 184 -89 132 -158 -5 -104 120 -142 36 1 -38 -96 20 -99 20 -49 86 -77 114 38 64 26 -27
6048b7J50k86J13j2J10J5qn2P7q4O9j09K15k70J82k12K10k97L63j98L79m43L04
$$ -27 123 -163 -50 -62 48 63 55 3 80 -4 65 -44 171 -99 83 -129 81 -216 147 -51 328 -115 189
6071A89k60L5j00K48j80J73j99K58k93J71o3J58j50N1j83J29p1M6O4j2l5R4m2
$$ 189 -71 -36 -136 112 -68 105 -94 164 -129 42 -21 137 -13 38 -145 -16 -87 -41 23 11 -24 70 28
6094B8k7l9N7p6M4P8n7J5q7J52j06J30j67J37j73J93k03J47j53K32j34K84l44
$$ 28 1 -38 19 -57 -13 65 8 23 -64 88 -18 112 -55 82 -91 102 -101 46 -107 125 -9 275 -69
6117f9K40j86K07l09J79r9R1j57K16k60K39k60L21j99L1o5M1M4k0o0J21rlj58
$$ -69 171 -15 192 -117 62 -37 54 -103 113 -147 92 -168 153 -46 -15 -80 -39 5 -15 -75 46 37 34 -124
6141a24M3P7nJ8m4R4j49J66n9N6j32J32q0P4j05J4j24L22j88J74j35L2j31J31
$$ -124 -81 -4 -9 9 -35 59 -90 76 17 73 -59 73 -7 67 -38 -24 -148 174 -14 160 25 57 -74 57
6165E7k34K88k22K38l00L39j97R2k40K49k52K75k18K55j89Q3n2O1j56J79o3K1
$$ 57 -177 111 -111 127 -173 166 -31 61 -179 70 -182 93 -125 130 -59 24 -28 33 -123 56 -7 14
6187A4RRm5R5j1O6j45N3j4j30J67j89R1l2J27j5J22k24J14k26K18k65K45j86K08
$$ 14 23 32 -13 82 71 137 -8 45 31 -99 68 -121 -30 -62 65 50 172 -52 62 -164 54 -211 34 -152 56
6212E6j02J32m1J37k11Q4r5M8j06P6j85L69k45K71k03R6j75K44j59Q0l16J99p
$$ 56 -46 86 45 182 -29 55 -40 8 -98 -22 -207 162 -83 188 -15 81 -94 150 -9 71 -245 -46 -53
6235e3P0%Rn0l5N7P7j20J02n5j75J59p5K67j71P8n5J7q3J27j95J02j36K48j48
$$ -53 17 17 26 -24 -59 -2 75 -45 57 2 -173 -14 -89 178 7 85 30 47 -36 91 -104 -2 -138 110 -38
6260c8J63j41J54l49K34k21M19k57K47l06J62j13J33j36J66k18K36k12R5q3J40
$$ -38 125 -16 138 -211 23 -198 221 -36 211 -95 67 -46 87 -49 117 -101 135 -77 18 -65 75
6281G5l6J34j58M2o8O0j46J6J02K1l6R8j40L6k2qP0m1j07M8J17j96J22k8J73j76
$$ 75 39 173 15 57 -11 49 -97 -81 21 42 6 104 -36 0 -22 -30 40 -1 -108 -60 57 -139 -17 -45 128 -48
6307d8J20k22K68k14K94l10R0j34K55k54L41k38P8n8J40j46R1j01K52l32J83k2
$$ -48 72 -150 118 -96 198 -112 -22 -156 99 -155 186 -52 26 -32 108 -38 53 -48 204 -128 55 33
6329C3o5n9P0j37J58n8P5j05J19P0r9m6J53k31J0J07p0Jk5K00j40K6J1J59k13
$$ 33 -32 -91 -21 -158 0 -58 17 -88 31 101 2 -44 109 -122 -112 -5 -75 -74 -99 101 -39 -13 -2 157 -56
6354e6J50k69L09j13l3rR2j16J51j11J15k16K65k50K31j81J19k00K37k41K55k87
$$ -56 94 -175 134 21 -12 -21 71 -45 106 -5 110 -106 159 -91 140 -41 78 -122 115 -126 129 -158
6376a58K90k67K44j61J36k13K84j64M9p0R6k04J95j34P4o1n1K56j26J49j90O1
$$ -158 132 -135 109 -52 84 -129 155 -9 40 -30 66 -138 57 -77 -3 -64 -115 141 15 164 -26 35
6398C5K6lj40K23j56J71j68J59j63J20j60O8j32L75l48K36j43M8l20M69l03J99
$$ 35 61 58 -82 141 -15 156 -12 147 -16 104 -56 12 -120 255 -93 143 0 48 -272 197 -106 93
6420I3j10J25k43J38j97J90r3J60j14L04l05J36k06J11p6q7J34J03q4k1J29r4
$$ 93 -17 108 -135 3 -194 -4 -97 63 -51 253 -52 84 -122 -11 -87 -174 -40 63 -21 -42 87 -7
6442gJ10j60R6p5L6pn9m2K93k11O3n0J71l36K41k71K82j50J25j38K18j96K04k25
$$ -7 103 -57 39 -36 0 -7 -66 -108 185 -26 37 -13 158 -178 63 -208 74 -76 49 -89 129 -67 137 -88
6466h8K13k62K08k56K42j91K16o0M5j23J11k40K34j41R7q6N5k8P1L6N6r6l3qm4
$$ -88 125 -137 71 -185 57 -134 82 22 67 -56 55 -185 49 -92 5 -81 -26 -54 17 53 109 13 -20 -28 -72
6491g2M7J8J0p4J37j09J59j71J52q3mj79J52j40K82j59P6j64K70l40K42k14L55
$$ -72 -25 -7 3 -71 66 -43 116 -55 97 14 10 -169 -17 -157 125 -34 42 -122 148 -192 50 -164 191
6514A91k59J18j44J75k81K30o7J31k11J55j83J38j35K47j48J30j43Q3p0O5r9R8
$$ 191 -68 50 -94 81 -200 30 -37 94 -117 38 -145 -7 -142 105 -43 87 -56 27 -43 22 -77 21
6536B1N3m0o4O4j23K3J23o9J55l94J55L8J37n6K7j11J46j74K58k90J40k19L67
$$ 21 74 34 -30 34 -89 -66 57 -12 143 -251 -96 -58 79 23 50 -61 85 -89 169 -121 19 -200 167
6559A67l42L48j32L0j23K03j76J04j96J48n4J39j72J87j24Ll2J04j51J07n3N4
$$ 167 -175 173 41 71 -52 151 -25 79 -117 31 -23 116 -56 131 7 10 -22 82 -69 38 -15 39
6581C9j41K3J20j3k4J37l2j14pj30k6J79no0Q8m4J23k05J56j82J66l4N4k07J76
$$ 39 -102 -79 41 28 4 141 109 -5 -12 -142 -168 11 6 -54 34 -10 113 -92 64 -118 48 14 68 -139 37
6606C7j82K48k01J54o4K39l44J38k10K95k93L04j44J09j09J61k54J70j29J78j87
$$ 37 -145 103 -98 56 -8 231 -113 25 -185 110 -183 121 -23 86 -23 138 -116 54 -75 103 -84
6627h4J22j42L8k7J85r5L9L0l4j40J13Mr0O9o1J96j24J06k60K25k68J44n1J89
$$ -84 38 -104 -66 -93 92 -3 36 66 32 -108 5 9 -81 -12 -73 123 -1 105 -155 70 -198 -54 -105 84
6651H4j30K00j73J23j38J16j74J83r4K0j15J18%P3k56K78j89M1k8K02j72ko3K12
$$ 84 -46 154 -19 104 -34 82 -92 91 -3 17 -98 20 20 93 -163 115 -74 -33 -61 141 -31 -33 -96 116
6675A16l34K38n2P0m9O5m5JM1o6p2J57l6l5n3Q3O5j51J86l28L36k02K00r0Q4j48
$$ 116 -218 20 -32 38 -11 54 9 10 51 -15 -87 70 34 -1 -54 29 94 -57 129 -199 137 -65 135 45 129 -19
6701a9j6j3J34j75K33k52K84k12J67j69J61j82J54j55J21j46K17k80J14LQ6j45
$$ -19 -35 -48 86 -89 144 -108 176 -36 131 -38 123 -59 95 -60 61 -85 132 -148 -34 -31 55 -90
6723i0J95j07k9j21K10p4j21J04R6n4J20o2j09Q2j06J15r6J17m8L5n6K11k14r
$$ -90 105 -2 -31 -152 58 -16 -137 -33 63 9 129 67 -42 40 -66 49 -47 70 22 57 1 212 -2 -11
6747a1mN9q8R2o2J94k38J39j72J76m3M2q8J37k00J31k02L24k02O4k23J42J8J19
$$ -11 -15 44 -44 48 -14 180 -58 81 -91 85 42 84 -4 133 -67 64 -138 186 -16 48 -175 -33 -15 104
6771A04j53M4j6J08n3o7L4R0K8L5j29K6p6Q5m2j5l0N2Q5r1P6k08K11p3Qj52J86
$$ 104 -49 -5 -21 87 34 -33 1 91 119 154 25 51 -25 60 18 3 -27 25 110 19 95 -113 98 25 33 -119 67
6798F7j33J39r1O1j20J70j56J16j07J30j88J57j13J65j80J49n6N3n7N1j64J60
$$ 67 -66 73 -18 43 -77 93 -63 53 -54 76 -112 45 -68 97 -83 66 10 63 6 57 -107 53
6820E3j06J18j0O6j57op6J70p5K4j8J2N6r0l0J03k5j17K39j36L8j36P7rJ41j23
$$ 53 -53 65 55 121 -36 -42 -118 52 -23 1 -17 -5 51 -39 -69 34 9 -108 131 -5 33 -103 -26 -35 106 -17
6846a7N2q3R0j70K23k40K02j69K64j13J28j76J92j59J4q0J12k04J85j94K13o1
$$ -17 35 -48 42 -128 95 -145 57 -112 152 39 167 -9 183 24 38 -42 70 -134 51 -143 70 9
6868IJ04o2l3j81J73j31J48ko6O2m9K4K5j8L4nj3n0l5jM9Q9k07J31k7J84j42j
$$ 9 113 51 18 -163 10 -121 27 25 -41 21 -28 -4 21 3 37 32 19 -31 -66 -67 -18 71 -136 -5 -32 152 10 9
6896Ik06K70j61J84j53J41m2N6k08J55j42J45j55J19p1Q9q4J39j61J83n6L6j60
$$ 9 -197 73 -88 96 -57 84 42 98 -110 45 -97 48 -107 12 -59 30 -54 85 -76 107 51 87 -73
6919g3J17j01J16j07J49j63O9m7Q5l0j90J72%K7m5N0j3M5J7K2j03J3j76J10N4
$$ -73 44 -57 59 -48 101 -62 7 -40 45 15 -175 -3 -3 24 -21 29 16 61 78 100 -3 10 -166 -56 -2
6944bL8p9Q5j08J10p9M3m2O3k34K75j46K30k34K02r3N0j62K04l28K66j45J29p0
$$ -2 36 -43 42 -66 44 -35 8 -34 29 -205 70 -76 154 -80 122 29 79 -83 121 -207 59 -86 43 -27
6968b7P2j5Qj09J40j09O2r3P2L5M5r4K5p8P1j4pR3k16J46j30J01nJ05j14J50j57
$$ -27 45 30 38 -71 69 -40 22 -71 1 36 81 -13 12 -66 5 -9 -16 77 -139 7 -123 -22 -27 78 -36 114 -43
6995d3J08j46J40k56K26m0R9j89J44k13K05j02L8k9J17j74J55r7J29n1R2j56M5
$$ -43 65 -81 59 -197 29 -11 88 -101 43 -170 35 -67 -29 -58 59 -115 40 -57 72 21 113 -43 2
7018Bk9P0r1J46j83J56q2J95k13k3P4ml3km8pP6J1noM6K4j27n6J33r5R4p0J72
$$ 2 -27 43 -48 98 -85 71 -11 184 -29 -52 22 18 -15 -17 -65 -72 4 15 10 4 50 74 -53 -109 24 -71 23 -47 125
7047A25k57K90j90J01j49N1o1J47j45J28j36K15j45jq8J77j82J98j80J82n8o7
$$ 125 -132 158 -32 69 -80 -29 -90 57 -88 40 -96 119 -26 -27 -115 62 -120 78 -102 80 22 -45
7069d5j8J88p5J3j26N6M4q7O1n7L1j6k1n9J20l5PK8K6j12J4K0J06j26J56k27N2
$$ -45 -63 125 50 63 -63 -7 37 -50 11 -46 -15 -31 -52 -111 9 -26 -19 9 35 -77 -63 -43 63 -63 93 -134 -82
7096h2P6l1l9J50j25J45k55J56m2J10m8K0p0J76k07J99r6K4j24K31j71m0J29l0
$$ -82 -6 -37 -76 74 -51 94 -161 -5 -47 63 15 35 -35 141 -66 133 37 61 -63 168 -3 -43 86 56
7120E6j40R0q9P2j46K10j29J30j45J51m9n3J06j8p0K9P5j95J20M0l0L3L2q7l4
$$ 56 -84 6 -83 -11 -157 53 -76 54 -91 60 11 -42 64 46 -24 5 80 -115 5 45 15 48 80 -7 -41
7145d1j2L8K3L1o2P8Qqj55J35r9J23k48L46k35J48j44J68r0j2n3P9j44J71p4R7
$$ -41 -53 -15 8 39 -23 55 63 55 -100 35 -64 59 -189 157 -78 70 -74 94 4 -8 -61 18 -126 45 -29 68
7171F8j31J26j03L3j3j6NM8q8Q8j0P3p9O4oj89J54n0J1R0n5k6J52j56J23j44K19
$$ 68 -63 63 -40 -7 -20 -36 -31 17 -71 17 7 80 1 65 59 -130 24 -26 -15 75 20 -6 146 -10 113 -31 188
7198A88l56L16k88K47j47J49j12J29k90K27j52O3j1K04k63K59k49J70j33O3l7
$$ 188 -168 148 -140 107 -40 109 -3 126 -164 63 -89 -26 -37 167 -96 163 -86 84 -49 14 -23
7219b3J03q3M9o0l2Q1n0N1R9q5n9JM8r4q5J11m2M2O4K8j12Q8p6O3q9J54k30P1
$$ -23 80 -3 46 -14 -46 35 -15 36 135 50 -9 -8 40 -54 -139 -28 -70 -28 36 64 -48 40 -36 27 -62 92 -138 -67
7247f7k5J90k05K42m1l0p6m3kJ03n2n6R2R6j57J23j95K32k13K05j21J69k05kM3
$$ -67 -92 98 -107 135 94 64 -12 -55 -57 46 -6 -62 30 126 -31 92 -103 129 -84 121 0 169 -36 -38 5
7272Eo7K9J14o7K3p4P1l3O5J4k6l8k6J40j82J28n6jj18J00r8J84o1R2j52J45j47
$$ 5 -62 -33 81 14 37 -37 34 1 66 80 54 16 -10 130 -52 76 20 19 -99 1 -97 87 26 118 -34 111 -36
7299c6M6m1M3j10Q8m6ML8J18j42M6q9J10j26R2j6J30k05J38j9Q0j7j29RK3Qm1
$$ -36 10 -31 12 -98 -10 -56 -52 -14 104 -38 8 -81 29 -97 -5 -21 109 -96 42 23 103 86 -43 -34 -11 -3 -44
7326d4N0k10J85N0j20J0J32rN1j26K6p4R7OJ24k49J83q6kj59K71k37J12j9J41
$$ -44 6 -204 -19 31 -89 -79 53 44 95 -31 -5 -79 18 24 148 -101 82 -4 -6 -165 106 -131 -19 -38 103
7351A03q5J12k87J67j00J87o9J16j79L7o7Q7j23J66j13j3R2r7K9k0J20q9J0O0
$$ 103 18 130 -157 10 -90 97 28 144 -35 2 -65 22 -101 65 -48 -61 31 -66 -37 -57 63 -26 -16 44
7375D4k8m1K0Nq8J57j37Q8r7K8l8k4J66n9kj00J07j23K05j70K58l66K95o5J9o8
$$ 44 16 -25 -5 0 -88 69 -68 20 -77 -49 -87 -111 55 -4 -6 -106 1 -122 83 -87 171 -195 100 35 54 -14
7401a4O3j56Q5j2M8n8J77j13O9j06J28j32J56j66M5j81K44j57N1M5j5m9P2j18
$$ -14 49 -107 -22 -34 14 -44 133 20 89 -17 111 -21 135 -31 14 -167 77 -80 -29 16 1 -48 24 -94
7425i4m2J8J57p1L8P5ML3j59k2m4J80j06O6j65J90m4Q3j13J42k14J28j0P6k35
$$ -94 -136 -118 39 -32 6 81 85 118 -41 -63 -107 73 -33 33 -132 58 14 97 -16 126 -88 40 30 106 -129
7450a29J63L1Q6j94R8r6R1j07J04j78L9M1J2LP4j42J58j10O7n9K1QJ6q9J20n9
$$ -129 34 65 151 -43 55 -41 50 -57 47 -131 -92 -51 -39 -36 38 -104 54 -56 11 -48 -27 -19 -3 -92 28 -31
7476c1O0j10L5M0L6o4p9Q4O3J0j00R5j1N3j87Q0JM4m6J39k13K83k12R3p8P0j80
$$ -31 29 -81 -46 -6 30 -34 -113 -29 34 44 -56 39 28 81 -106 -26 -25 19 -27 112 -101 182 -30 63 -15 55 -125
7503a25J39j20J36j24J10j25K21j78Q2j16P9M4L3q4M0j0J18j09L4L2j62J04M5
$$ -125 14 -106 30 -94 16 -109 112 -66 16 -100 -21 23 56 -28 12 2 120 11 45 77 -85 19 64
7526F4n7p2J12K4j2j03J68j55RK7M8j36J07j45J41q2K5K5o1M4J66j87J04j31K7
$$ 64 7 -65 47 71 59 -44 124 -31 -22 5 53 -83 24 -121 20 -62 -37 -12 -73 -29 137 -50 54 -77 -50
7551e0QJ27j85kN4K2l0jj6M3Q2k8l4Q6j38J24q8J2M0k7N5r7O3l5J41q2q6l5J54
$$ -50 -42 85 -100 -102 -48 -26 -56 -57 -73 -30 52 24 -10 76 -62 62 -26 -14 26 -1 54 -43 20 -15 126 44 -42 -77 77
7580G7KNj26J5j5r5J40P5k03Q6%P0j03J01q4L7m4J14j06J69k51K68o1N6j26R6
$$ 77 79 84 -42 -27 -42 -137 3 78 -125 -39 -39 31 -72 29 -55 -18 -62 52 -54 115 -136 132 71 127 1 97
7606I7q2P2r8mJ0J18k35L12j77O0n5M6l4m0j09Q5M2r4J09m2M3j27P3O8K9j22N5
$$ 97 15 87 -11 -15 -5 113 -122 190 13 73 18 64 30 -10 -119 -34 8 -86 23 -19 24 -103 -30 38 67 -55 0
7633@MJ80k68J20j35R6j08J65j54J15k0J54k76J74Jk1j30J83j42J62j97K14j33
$$ 0 4 184 -84 36 -99 -3 -111 54 -100 15 -5 149 -127 47 48 27 -103 80 -62 100 -97 117 -16
7656a6O8r5Pm9Q8k1Q3j04M3q6J14jj63K38j54J6Q4q4m4Q5p9RJ46L2j66K18k66
$$ -16 52 -43 -36 -85 3 -18 65 -39 4 -82 32 31 -132 106 -48 -32 52 -32 -76 9 -70 -61 85 117 -49 169 -97
7683i7J16lJ23j95J55p9Q5k47L06j11l8k9L0j12K83k33Jl7J38n9J23j89P4j23
$$ -97 19 16 139 -56 99 20 105 -142 164 53 15 -14 16 -96 187 -46 -45 -82 56 -3 120 -69 5 -118
7707a18J77j32J37j00M5q9P4j71K12j52J47k6j38J03Q7N7j69J08j11Q0p4M5k8
$$ -118 59 -73 64 -36 9 -80 -6 -177 35 -117 30 4 -134 -31 56 113 -56 52 -59 21 -53 -8 -36
7730c6J00j68J12j1L5n0O1j70K01r0J15j41J21k13J26j05J53k27K35j02J14j45
$$ -36 64 -104 8 -3 32 -18 43 -127 74 -16 99 -42 79 -134 -8 -113 40 -187 48 -54 60 -85
7752h5P8QJ47k07J06k8L5o6M8l2K9q1m3J51p0n4kJ38J9n8j38P9pJ3N7R3j97nR2
$$ -85 -7 1 148 -59 47 19 54 -12 36 4 33 -48 -91 60 -10 -64 -66 72 91 33 -105 -26 -33 -20 37 130 -67 -72 20
7781B0k2J6K8j01K9j36K77j68k0o9J05LK30k42R9j16J10j73Q3m9K09k15K27j88
$$ 20 -2 14 42 -59 -30 -166 111 -57 -77 -146 -41 -38 192 -50 49 -67 43 -130 -47 -96 113 -102 125 -63
7805f3J23j10N0o1J34j45J93j18J36j62R7j64J17j13K6N8N9M3r5Pk1p3P1J4L0
$$ -63 60 -50 0 -61 73 -72 121 3 139 -23 74 -90 27 -86 -60 -2 57 100 5 12 -9 -82 -11 3 33
7830C3n0o1R7j17J46j75J87j88K53k83K00r2N4m6M4m2J16j28R3j8P0j75N0o5O8
$$ 33 -17 -78 19 -98 48 -127 60 -128 125 -158 42 -50 4 -42 2 -40 76 -52 41 23 93 -82 -32 -97 -29
7855b9QK4m7Q1j47K10j77K30k9j52K8q2J39p2j13J18j24L3J04m5pp0J08j16J24
$$ -29 -21 3 -44 37 -110 100 -77 153 124 -28 0 -82 57 -15 -128 -10 -134 -101 3 -42 -49 -119 -11 -127 -3
7880cP5J3q0N7j20J39j70J89j76kK9J91j28k0j16J72j58J56j83K01j69J53m6J18
$$ -3 72 85 5 62 -58 81 -89 100 -76 -78 -49 142 14 -6 -122 50 -108 48 -135 66 -103 50 4 122
7904A22k24J42q2N2m5K3o3J22q2P4rl5O6r0l5Q3K4p6P4j52J06j7J13m9q3R4K2
$$ 122 -102 40 -42 10 -35 -12 -75 47 -35 39 30 -5 61 -29 -64 19 43 -33 41 -111 -5 -22 91 42 -41 53 75
7931G5oO5k02O2l1K21j52j12R0P0j79O9j51K97r9j2o7J29q8M7Qmj18R6o6j8QK6
$$ 75 69 134 -68 -6 -37 184 32 -80 10 80 -99 -30 -181 116 17 5 -62 67 -21 26 34 30 -88 8 -58 -76 -68 -42
7959d2pL1QP4J8j86J57j52P3mQ5l6l4Q2o6l9K5K5Ml4K6n1Q7L7k2Nj09%J02j23
$$ -42 -49 -18 -10 64 82 -104 53 -99 -26 -30 55 19 -15 67 1 -38 -13 12 16 -18 8 -43 44 81 59 64 -45 -45 57 -66
7989f6K25j37k5k5J05r5O4k08K33k24J61j59K43r0J7Q5p6J0J4j25P5j23J33l7
$$ -66 159 22 -3 -28 77 -18 46 -162 71 -153 8 -151 92 2 19 104 28 38 52 -73 2 -121 12 -25
8013b5J02m5P6r3p9L3j06Q9O5P3l2q0K8K3r4J75n5m1m3j1p8O3nR2o9N5lk7l7K0
$$ -25 77 32 108 15 -64 -31 -137 -48 17 90 58 -22 6 29 -65 110 55 14 -29 -40 -118 -55 -60 32 -37 18 15 -12 -49 -29
8043b9K9P9k06K13j81K11j73N5K3O4j71N4q2J19M8j52m2J86o9J27o4J8j42J17
$$ -29 0 79 -127 86 -95 116 -57 -2 21 85 -86 -32 -114 5 53 -99 -141 45 -24 103 39 57 -85 32
8067C2m7LJ32j34J27j26Q8p2L0j75J79o6J29m2R6k06jO8N7r4Q1j35J50k14J82
$$ 32 -15 -12 120 -14 113 -13 75 3 33 -142 37 -29 100 58 154 -52 -53 15 72 -22 59 -76 74 -140 42
8092D2k31J94q7K8k9Q5p1J74j85J18j01O2j5J9M8O0q3j4P1j59K64j34j19P6o8
$$ 42 -189 5 -82 -54 -83 2 -69 105 -80 38 -63 -1 -16 3 51 111 28 14 85 -74 190 56 -63 13 -55
8117e5N0O6l6NN4j19l0O1l8J62k03O0L7Q2k14J08q9k1R3J13j08N1r3J12m1m6M4
$$ -55 -5 61 25 30 84 -35 -65 -4 -42 120 -83 -23 14 96 -118 -10 -99 -120 -27 86 -22 29 -64 48 7 -39 5
8144ER0j48K5j08J78j9R0q2K9j35J26m7l3lO9n8J51j59N3%Qp4o4N5m7R5qk1nK11
$$ 5 95 -53 -28 -136 42 23 113 31 60 -75 51 4 -29 -32 37 -21 130 -29 24 24 32 -42 -106 -51 -98 -3 -11 -32 -37 174
8174A74r8R4k99K17j34J10j86J77j8N7k48J30j07J81n5K7L7
$$ 174 76 170 -129 88 -46 64 -122 55 37 94 -154 -24 -131 50 -5 22 59
8191E9
$$ Imaginary data points
##PAGE= N=2
##DATA TABLE= (X++(I..I)), XYDATA
0@%%%%%%%%%%%%%Qj6J6j6K2l0L2m0N3o1P2q8J05j27J50j76K08k41K78l20L69m24
$$ 0 0 0 0 0 0 0 0 0 0 0 0 0 0 8 -8 8 -8 14 -16 16 -24 29 -32 40 -48 57 -70 80 -96 112 -129 149 -171 198 -226
35b26M86n55O31p17Q12r15J031j160J301j457J629j819K028k259K511k787L091
$$ -226 260 -295 336 -381 431 -484 547 -613 688 -769 860 -959 1069 -1190 1321 -1466 1625
52A625l428L801m213M671n180N749o389P117p952Q918j0059J1437j3150J5369
$$ 1625 -1803 1998 -2215 2456 -2724 3025 -3364 3753 -4199 4719 -5340 6097 -7053 8316
66H316j8444K3205l2442Q1287l7773K058k7782j3297j0588p293j4123K5086J6095
$$ 8316 -10128 13077 -19365 61922 24149 26207 -1575 -14872 -25460 -32753 -46876 -21790 -5695
79e695L1449j870J5767l1091K9191l7174j5371j9677J081N350J5138J8124r153
$$ -5695 25754 23884 39651 8560 37751 577 -14794 -34471 -33390 -28040 -12902 5222 -3931
92c931L7655k0066L4036n3353R386l3167K3507k9300K3831r607K9685L228L1020
$$ -3931 33724 13658 47694 -5659 3727 -29440 -5933 -35233 -11402 -21009 8676 11904 42924
105D2924m2428L3042n0345M0732n9592L5585m9210O7003m3831N8431k8525J8603
$$ 42924 496 33538 -16807 23925 -35667 -82 -49292 17711 -26120 32311 3786 22389
117B2389j2549J8794m0490J2959l1696K6588k0385L5087l5431N4406l3461L4670
$$ 22389 9840 28634 -11856 1103 -30593 -4005 -24390 10697 -24734 29672 -3789 30881
129C0881k1210q982q969N457j3886j196R967m246K3340l913O986l796l720q690
$$ 30881 9671 689 -8280 -2823 -16709 -17905 -7938 -12184 11156 7243 14229 10433 6713 -1977
143a977P346k4073J0322q156K0489j8063L9845l8094M1022l5938L2338m0904K6060
$$ -1977 5369 -18704 -8382 -16538 3951 -14112 25733 -12361 28661 -7277 25061 -15843 10217
156A0217l7849L9616l2039K6742j6185K7471k6502L8150m2000K9463l4216L0982
$$ 10217 -27632 11984 -20055 6687 -9498 17973 -8529 29621 -12379 17084 -17132 13850
168A3850l7932L7861l9931M0190k3183J8723p683P577j8022J9467j6113L089n789
$$ 13850 -24082 13779 -26152 14038 -9145 9578 1895 9472 -8550 10917 -5196 -2107 -7896
181g896O713o601J5445j4128Q935J379p124J3532j3771M449p111J6399k4899K7335
$$ -7896 -1183 -7784 7661 -6467 2468 3847 -3277 10255 -3516 933 -6178 10221 -14678 12657
195A2657k6832K2470j6286K1459k4161K5230k9699L3512k5998J8369k7119L3154
$$ 12657 -14175 8295 -7991 13468 -10693 14537 -15162 18350 -7648 10721 -16398 16756
207A6756l7077L8818l7503L0411k6759L6819l4592L2068l3464K7944k0981J4309
$$ 16756 -20321 18497 -19006 11405 -15354 21465 -13127 18941 -14523 13421 -7560 6749
219F749k3421K4806k5944K7873j5051J2674j4535K1924j9084J4451j7604R65K936
$$ 6749 -16672 8134 -17810 10063 -4988 7686 -6849 15075 -4009 10442 -7162 -6197 -3261
232c261j596P07K766M02J893J6721j8709P576r265N968j2315J2328k3980K8864
$$ -3261 -4857 -4150 -1384 -982 911 17632 -1077 6499 -2766 3202 -9113 3215 -20765 8099
246H099j9161K6262j7612J9463k7224L4375l8070K3194k9990K4429k3883L5880
$$ 8099 -11062 15200 -2412 17051 -10173 24202 -13868 9326 -20664 3765 -20118 15762
258A5762l2414L4398k5423K9401k4416J7522l5284L0621k8943K1879j9897K2537
$$ 15762 -16652 17746 -7677 21724 -2692 14830 -20454 10167 -18776 3103 -16794 5743
270E743j6256L0614k0231J3475j4806O335r619M118j5656J0772L62M351Q243j083
$$ 5743 -10513 20101 -130 13345 -1461 4874 -4745 -627 -16283 -5511 -5149 -798 7445 6362
284F362k063L539L039j7029Q296j9899J7594q983J1826j1708K4860k0999K8682
$$ 6362 4299 7838 10877 -6152 2144 -17755 -161 -9144 2682 -9026 15834 -5165 23517
297B3517k6504J1131k1467K3167l1727L0405l0529L2007j7330K6234k5055K7038
$$ 23517 -2987 8144 -13323 9844 -21883 8522 -22007 10000 -7330 18904 -6151 20887
309B0887l4568K9978k8393J5544k4870K7920k3125L0748k1235J8874j3171J6261
$$ 20887 -13681 16297 -12096 3448 -21422 6498 -16627 14121 -7114 11760 -1411 14850
321A4850j8752J1255k1838J3543n274M952n744J1550l888O533K344j0171L445
$$ 14850 -3902 7353 -14485 -942 -6216 -1264 -7008 4542 654 7187 9531 -640 2805
334B805o523L777o290N335j1942K2021j3835J5801j3024J1867j9196K5312l0380
$$ 2805 -3718 59 -6231 -896 -12838 9183 -4652 11149 -1875 9992 -9204 16108 -14272
347a4272K0389k1247K2216j7111K3366k8533L2134k6620K3876k2279J8075k8066
$$ -14272 6117 -15130 7086 -10025 13341 -15192 16942 -9678 14198 -8081 9994 -18072
359a8072L2413k9099K3863k0394J9275j5948K2200k4133K0447k0044J5498r734
$$ -18072 14341 -14758 9105 -11289 7986 -7962 14238 -9895 10552 -9492 6006 -3728
371c728R836j7354J7008r067O508l666l4j513N408k197j963K702o817J1145p837
$$ -3728 6108 -11246 5762 -3305 3203 -463 -497 -2010 3398 1201 -762 1940 -4877 6268 -1569
386a569L169q597J3815j7014K0449j8244J3988j2808J9204k0334K0654k7676K4246
$$ -1569 1600 -6997 6818 -10196 10253 -7991 5997 -6811 12393 -7941 12713 -14963 9283
399I283j9199J7809k2273K6160k7033L1920k2976J6839j9921K2148k4657K3340
$$ 9283 -9916 7893 -14380 11780 -15253 16667 -6309 10530 -9391 12757 -11900 11440
411A1440k8118K1429j4460J7413j4686K0310k1257J9493j1341M126j1667P598
$$ 11440 -16678 4751 -9709 7704 -6982 13328 -7929 11564 223 4349 -7318 280
423B80j0115J2377o923L808K549J955K966j184m775o768J0176j3673Q418q981
$$ 280 -9835 2542 -4381 -573 1976 3931 6897 5713 938 -5830 4346 -9327 -909 -9890
437i890J2007o447J8133j7524J7310j9355J5727j8426J3499k5328K7285k1630
$$ -9890 2117 -4330 13803 -3721 13589 -5766 9961 -8465 5034 -20294 6991 -14639
449a4639K4809j6386J9714k0331K6809k7473J8031k5704J7530j6373K0789k3212
$$ -14639 10170 -6216 13498 -6833 19976 -7497 10534 -15170 2360 -14013 6776 -16436
461a6436K7624j6216J8694j1110Q496j9328J5435j7326R502r840P007l56J1345
$$ -16436 11188 -5028 13666 2556 11052 -8276 7159 -10167 -665 -10505 -3498 -3854 7491
474G491n743P228l859m180M599q884l738k052O442l691J3120j0666J4843r226
$$ 7491 1748 8976 5117 937 5536 -3348 -7086 -9138 -2696 -6387 6733 -3933 10910 1684
488A684J0834j6766J1345k3751K1275j7571J5365j4157K3269j8121K5489k3197
$$ 1684 12518 -4248 7097 -16654 4621 -12950 2415 -11742 11527 -6594 18895 -4302
500d302J7000k2226J7886k3204K1056k5348K4880j2389J8129j5239J9282k2234
$$ -4302 12698 -9528 8358 -14846 6210 -19138 5742 -6647 11482 -3757 15525 -6709
512f709J8953j7844P405j3914J1949r650J6018j0921R600jJ643m367K268j0194
$$ -6709 12244 -5600 1805 -12109 -160 -9810 6208 -4713 4887 4886 6529 2162 4430 -5764
526e764J497K944n873P158l837P854j608O858j2398J2170j7374J2816j1896Q747
$$ -5764 -4267 -1323 -7196 -38 -3875 3979 2371 9229 -3169 9001 -8373 4443 -7453 1294
540A294j4475K2021j6811K0117j7807J6405j7238J8567k4121K0178k2803K0862
$$ 1294 -13181 8840 -7971 12146 -5661 10744 -6494 12073 -12048 8130 -14673 6189
552F189j4765J8391k0220K3421j9697J7308j6406J2596j7797J7788j6255J6103
$$ 6189 -8576 9815 -10405 13016 -6681 10627 -5779 6817 -10980 6808 -9447 6656
564F656j3166R417m386R952j2964R286q413L296M23o41k922M107Q18j357M845
$$ 6656 -6510 2907 -1479 8473 -4491 4795 -3618 -322 101 -540 -3462 645 1463 106 4951
579D951j0562R771o938M266n351Q399j3758J8311j3533J1512j3955J3944j5830
$$ 4951 -5611 4160 -2778 1488 -3863 4536 -9222 9089 -4444 7068 -6887 7057 -8773
592h773J9139k2463J9000j5629J7113j4261J7757k2899K1910j8198J4845j8489
$$ -8773 10366 -12097 6903 -8726 8387 -5874 11883 -11016 10894 -7304 7541 -10948
604a0948J7231j7830K1173j6890J5864j3360J2591j2251J3786j8180J0330p500
$$ -10948 6283 -11547 9626 -7264 8600 -4760 7831 -4420 9366 -8814 1516 -5984
616e984P141n671Q433p546Q865j281r75j596m046J70R54p97n015J1432p927J1649
$$ -5984 1157 -4514 3919 -3627 5238 3957 2982 1386 -2660 -2490 -1536 -2333 -7348 4084 -3843 7806
632G806o590N340j1092J2725j7123J3941j7525J4069q757J5983j5764K1077k0273
$$ 7806 1216 6556 -4536 8189 -8934 5007 -12518 1551 -7206 8777 -6987 14090 -6183
645f183J7982j6080J1469k1185J9032j8884K1060j6469J6574j0834J7000j6937
$$ -6183 11799 -4281 7188 -13997 5035 -13849 7211 -9258 7316 -3518 13482 -3455
657c455J5136j9754J0566j0473R591j3477J4620p616J1960m048L828n893K989
$$ -3455 11681 -8073 2493 -7980 1611 -11866 2754 -4862 7098 3050 6878 985 3974
670C974o894K021l848l824O646R91L430p42N849q148J0591j3757N187j1136R076
$$ 3974 -2920 -899 -4747 -8571 -1925 -934 2496 1754 7603 -545 10046 -3711 1476 -9660 -584
685e84q907J5388j6158K0489j1605J3394j4748J3397k2553J8582j9088J5204j4314
$$ -584 -9491 5897 -10261 10228 -1377 12017 -2731 10666 -11887 6695 -12393 2811 -11503
698a1503J6539j1975K1487j9364J7205j6404J0977j4517J2188j9040J5968q532
$$ -11503 5036 -6939 14548 -4816 12389 -4015 6962 -7555 4633 -14407 1561 -6971
710f971J2375p318R276p912R916j0823L110o050K32r44M921k618K224N456k777
$$ -6971 5404 -1914 7362 -550 9366 -1457 1653 -4397 -4165 -5109 -188 -2806 -582 4874 2097
725B097M886o205J090o739O373j0039J1023j1709J3460n358J1028j4910J6063
$$ 2097 6983 778 1868 -4871 1502 -8537 2486 -9223 4237 -1121 9907 -5003 11060
738A1060j7986J4371j5190J0715j4800J8265j6056K0647j7844J5754j2401J3996
$$ 11060 -6926 7445 -7745 2970 -11830 6435 -9621 11026 -6818 8936 -3465 10531
750A0531j9342J7030j9537J4577r875J1692j1885J4272j1945J4090j2213N294
$$ 10531 -8811 8219 -11318 3259 -6616 5076 -6809 7463 -4482 9608 -2605 2689
762B689o867O650q107Q141o511L227K549R19j498l65k73j656L425p329O811o091
$$ 2689 -4178 2472 -5635 2506 -4005 -778 1771 2690 1192 827 554 -1102 2323 -5006 1805 -4286
778d286P114m958R039j3331J3104j1142R664j1697J1367j3928J7654j5525J5117
$$ -4286 2828 -2130 6909 -6422 6682 -4460 5204 -6493 4874 -9054 8600 -6925 8192
791H192j4973J3938j3769J6877k1282J7099j3599J3303j2059J4767j6598J7452
$$ 8192 -6781 7157 -6612 10265 -11017 6082 -7517 5786 -6273 8494 -8104 9348
803I348j4694J2071j2427Q200j0060J3732j2769J0519n726M900k996N386q654
$$ 9348 -5346 6725 -5702 2498 -7562 6170 -6599 3920 -1806 3094 98 5484 -3170
816c170L648k831J183P10k855L005J557K726m375O438j0074P567p570N312r745
$$ -3170 478 -2353 -1170 -460 -3315 -310 1247 3973 -402 6036 -4038 3529 -4041 1271 -8474
831h474J1928j0252J4959j1989J2031j1918J2597j6091J4955j8969J3589j0660
$$ -8474 3454 -6798 8161 -3828 8203 -3715 8882 -7209 7746 -11223 2366 -8294
843h294J4768j4846J8057j5205J6899j4435J0431j5414J2487j5324J5613j3107
$$ -8294 6474 -8372 9685 -5520 11379 -3056 7375 -8039 4448 -10876 4737 -8370
855h370J0688m803J0767j0002J0654j1535N016n384J788m369L539k445O620J553
$$ -8370 2318 -2485 8282 -1720 8934 -2601 2415 -2969 -1181 -5550 -2011 -4456 2164 3717
869C717k639M611m038J018m114J117q750R785p230J0568p609J0520q081J2205
$$ 3717 1078 5689 1651 2669 -1445 -328 -9078 707 -6523 4045 -3564 6956 -1125 11080
883A1080j5927J1939j5108R869j1743J4415j5345J8142j1999J5985j3620J2255
$$ 11080 -4847 7092 -8016 1853 -9890 4525 -10820 7322 -4677 11308 -2312 9943
895I943j6817J4160j7055J2967j2896J1194q161J6181j3222J2276r434P177r057
$$ 9943 -6874 7286 -9769 3198 -9698 1496 -6665 9516 -3706 8570 -864 6313 -2744
908b744N261j0577P717n724O247j10J514J64M349l575j907N68o957N497m239M163
$$ -2744 2517 -8060 -343 -6067 180 70 1584 1748 6097 2522 615 1183 -5774 -277 -4516 -353
924c53l832Q291n595J1030j1900Q345r305P603j2546J2198j5051J5429r361J4242
$$ -353 -4185 4106 -1489 9541 -2359 5986 -3319 4284 -8262 3936 -11115 4314 -5047 9195
938I195j3236J3465j4921J4941j6481J1256j3652J4124j3273J6821j4437J3532
$$ 9195 -4041 9424 -5497 9444 -7037 4219 -9433 4691 -8582 8239 -6198 7334
950G334j0634J1506j0975Q566j2912R556p201N342m010O889n306P489m343k92
$$ 7334 -3300 8206 -2769 5797 -7115 2441 -4760 582 -3428 3461 -1845 5644 1301 1009
964A009j033J1k029J468l02k648O631n537P534o438L892n540R001j2995J0286
$$ 1009 -24 -13 -2042 -574 -876 -3524 3107 -2430 5104 -1334 2558 -2982 6019 -6976 3310
979C310r732J0373q166J1287j2927J3777j3284J2981j4238J0545j1937J4952j5069
$$ 3310 -6422 3951 -4215 7072 -5855 7922 -5362 7619 -6619 3926 -8011 6941 -8128
992h128J5494j3745J2475j0883J2623j4580J1851j1708J1326r046Q086q802J0724
$$ -8128 7366 -6379 6096 -4787 7836 -6744 5107 -6601 4725 -4321 3765 -5037 5687
1005E687r060Q176o626K236l841N815m831K340n70P78K673j911l6j738J896m321
$$ 5687 -3373 4803 -1823 413 -3428 2387 -2444 -104 -674 104 2777 866 830 -908 988 -3333
1021c333O708r221P219l723P155p904J0104j2026J1371j1234R040j1521J0727
$$ -3333 3375 -5846 1373 -2350 4805 -3099 7005 -5021 6350 -4884 4156 -7365 3362
1034C362j1735J6604j4198J2551j0259J1805j3301J2908j6717J2779j1263J1585
$$ 3362 -8373 8231 -5967 6584 -3675 8130 -5171 7737 -8980 3799 -7464 4121
1046D121j0385J1389j0171J4015j1020P380q338N931q924Q003p512N099j731M936
$$ 4121 -6264 5125 -5046 8969 -2051 5329 -3009 2922 -6002 2001 -5511 -412 -2143 2793
1060B793r82K071l133P37l45l849J821l839L108p09O801p245R168p107P168r160
$$ 2793 1811 3882 749 1486 1141 -2708 -887 -4726 -1618 -2327 4474 -2771 6397 -710 6458 -2702
1076b702N453j0482J0525j1803J3465r838J0850q460J3606j4990J2338j4317R926
$$ -2702 2751 -7731 2794 -9009 4456 -5382 5468 -2992 10614 -4376 7962 -6355 3571
1089C571j1244J0773j2541J4586j1470J4972r960P950r599R812j2858Q197r117
$$ 3571 -7673 3100 -9441 5145 -6325 8647 -1313 6637 -2962 6850 -6008 2189 -6928
1102f928O392m051P908n000O955m828L766k440j771k474K37j050K80M078l182
$$ -6928 -536 -4587 3321 -1679 5276 448 4214 1774 3 -2471 -2234 -3284 -3004 1074 -2108
1117b108N405k002M606o732M477r080Q318r828Q096p176J0233q621J3723j2692
$$ -2108 3297 1295 5901 -831 3646 -5434 2884 -6944 1152 -6024 4209 -4412 9311 -3381
1131c381J0382j0781R536j2985J1251j3662J3609j0217J1957q637J0424j1866
$$ -3381 7001 -3780 5756 -7229 4022 -9640 3969 -6248 5709 -2928 7496 -4370
1143d370J3184j3435P646r156P747p981J0194q547Q955n300N811m268K255o132
$$ -4370 8814 -4621 3025 -6131 1616 -6365 3829 -4718 4237 -1063 4748 480 2735 -3397
1157c397M511l416j9J248j32J562J058J590l194L095n535N400o575M559n908Q943
$$ -3397 1114 -2302 -2321 -1073 -1205 357 1415 3005 -189 2906 -2629 2771 -3804 755 -5153 3790
1173C790q426J0880r187P811q351R677j2249J0531j1980J1958r689J0328j0670
$$ 3790 -4636 6244 -2943 4868 -3483 6194 -6055 4476 -7504 4454 -5235 5093 -5577
1186e577J2497j1988J2113j0789P248r542J0641j0942J0705q937Q939o793P093
$$ -5577 6920 -5068 7045 -3744 3504 -6038 4603 -6339 4366 -4571 4368 -2425 4668
1199D668p852O818p826N735k954J656k979M745k292K545j736j361K052k731J976
$$ 4668 -3184 3634 -4192 1543 -1411 245 -2734 2011 -281 2264 528 -833 1219 -1512 464
1214D64k482K331l103P338o973O153n708N399p468Q558j0606R266q790J0564q674
$$ 464 -2018 313 -2790 4548 -2425 3728 -1980 3419 -4049 4509 -6097 3169 -5621 4943 -3731
1229c731R454j0892J2551j1854R523j0801R278j0816J2683j0994J0364q464R953
$$ -3731 5723 -5169 7382 -4472 5051 -5750 3528 -7288 5395 -5599 4765 -3699 6254
1242F254q845Q429j1068Q626q225O106n016N599n838Q381m175K705k647O04k134
$$ 6254 -2591 5838 -5230 3396 -4829 1277 -3739 1860 -3978 4403 228 2933 286 890 -1244
1257a244J322k683J12J838j313N273k872J944k181M070p487N596q282O804n581
$$ -1244 78 -2605 -2493 -655 -1968 3305 433 2377 196 4266 -3221 2375 -5907 897 -4684
1272d684P891p110R736r100J1034j0049O647j0021R142j1391J1558r985J0478
$$ -4684 3207 -3903 5833 -3267 7767 -2282 4365 -5656 3486 -7905 3653 -6332 4146
1285D146q055J1527r883R124j1302Q762q836O051q227Q900p248R190m739M790
$$ 4146 -3909 7618 -2265 6859 -4443 4319 -4517 1534 -6693 2207 -5041 4149 -590 4200
1299D200m689M872n706K514m740J174K50R76P71J901J2k30L690o085K244m575
$$ 4200 -489 4383 -1323 1191 -3549 -2375 -2125 -1149 -378 1523 1535 1305 4995 -1090 1154 -3421
1315c421L393m407N847o563R486o304Q091o890N560r427R576j1545Q569q484R380
$$ -3421 -28 -4435 1412 -5151 4335 -1969 6122 -768 4792 -4635 4941 -6604 1965 -6519 2861
1330B861p516J1148r628J0132j0179Q530r014O605j0277R923q000Q585n804O984
$$ 2861 -4655 6493 -3135 6997 -3182 5348 -3666 2939 -7338 2585 -5415 3170 -2634 4350
1344D350o183P550o935L750n882L235k819L183l214L938j5N12J100j409r85r76
$$ 4350 -1833 5717 -1218 2532 -3350 -115 -2934 249 -2965 973 958 1470 2570 1161 176 -800
1360h00J357l907L854m463O044l239M696n036O299q408Q274q595N350p048R213
$$ -800 557 -3350 504 -3959 2085 -1154 3542 -1494 4805 -3603 4671 -3924 1426 -5622 3591
1375C591q448J0017r353R499p798P493r032Q254j0859J0410q068P241o904Q701
$$ 3591 -4857 5160 -4193 5306 -2492 5001 -4031 4223 -6636 3774 -4294 2947 -3957 4744
1389D744p918Q433p670N208o006N210n221N253n592N195j670J991k311J854k281
$$ 4744 -3174 5259 -2411 2797 -3209 2001 -3220 2033 -3559 1636 -34 1957 -354 1500 -781
1404g81P36K80k009J409q08K522j593K321l991N401o043M628n018M495o178Q852
$$ -781 -45 235 -1774 -365 -1173 1349 -244 2077 -1914 3487 -2556 2072 -2946 1549 -4629 4223
1420D223p729P683p185P331p172P330r993R250r149Q793o837P413q239J0175q815
$$ 4223 -3506 4177 -3008 4323 -2849 4481 -5512 3738 -5411 3382 -3455 3958 -4281 5894 -2921
1435b921P151p758O022o683O760p045P219n604N580k804L396n185L984m033J943
$$ -2921 4230 -3528 2494 -4189 2571 -4474 2745 -2859 2721 -83 3313 -1872 2112 -1921 22
1450B2j740O96m06J826O72Q2Q39k535K788l339J030l345M297m810O649m570N456
$$ 22 -1718 -1022 -1428 398 1070 1152 1991 -544 2244 -1095 -65 -3410 887 -3923 2726 -1844 3612
1467C612m934O120p184O257r171P479o993O937o780R225q489R889p294N801q011
$$ 3612 -1322 4798 -2386 3871 -5300 2179 -4814 2123 -4657 4568 -3921 5968 -1326 4475 -3536
1482c536O880q365P546q293P686m787O353m675O338p091N139m395J529l652K740
$$ -3536 3344 -5021 2525 -5768 1918 -2869 3484 -1191 5147 -1944 3195 -1200 329 -3323 -583
1497e83k394L941j232J673M11n49N94j107j264k425K852l137L738k346M214l015
$$ -583 -2977 964 -268 1405 1816 1267 1861 754 -510 -2935 -83 -3220 518 -1828 2386 -629
1513f29N535o098M845p313N614o091N466o863R003o627P809n979O482q276P636
$$ -629 4906 -1192 3653 -3660 1954 -4137 1329 -5534 3469 -3158 4651 -1328 5154 -3122 4514
1528D514q831O661p784O570n017P596o611P892o535N337m754L116o402N123m338
$$ 4514 -4317 2344 -5440 1130 -3887 3709 -2902 4990 -1545 3792 -962 2154 -4248 875 -3463
1543c463M158k450K745o48K554k475J473k111j365J416j574N87l98K733j633L934
$$ -3463 695 -1755 990 342 2896 421 1894 -217 -1582 -166 -1740 -1153 -1551 1182 -451 3483
1559C483m104L438m662L816m903M437o650P640n109N879n658O855o963O985p712
$$ 3483 -621 2817 -1845 1971 -2932 1505 -5145 2495 -2614 3265 -2393 4462 -2501 4484 -3228
1574c228N695p218O942o252P493p130P526n291N349o203N603p331N991m693M152
$$ -3228 2467 -4751 2191 -4061 3432 -3698 3828 -1463 3886 -2317 3286 -4045 1946 -2747 1405
1589A405l996M407l027M393l943K036j714N57j284J541k037R80J797j341K057
$$ 1405 -2591 1816 -1211 3182 -761 1275 -439 118 -1166 375 -1662 -682 1115 -226 1831
1604A831k320J776k080K008l842M259m861N108l240M058n259O335o284N871o735
$$ 1831 -489 1287 -793 1215 -2627 1632 -3229 1879 -1361 2697 -2562 3773 -2511 3360 -3375
1619c375N373n881O740o336P110o758O863n484N652p654O578o525N551m939N310
$$ -3375 1998 -3883 2857 -3479 3631 -3127 3736 -1748 3904 -3750 2828 -3697 1854 -3085 2225
1634B225m923N812m507M752m894K765k825K692l718L076j819J557P42N42r51K74
$$ 2225 -2698 3114 -1393 3359 -1535 1230 -1595 1097 -2621 455 -1364 193 935 1477 526 800
1650H00l37r45P29l101L123j828K689j914L689m624N349n129L471n271M562n150
$$ 800 463 -482 247 -2854 269 -1559 1130 -784 2905 -1719 3630 -1499 1972 -3299 1263 -3887
1666c887O344n966O863n280N835n232N450q012O315o258N488n906O306m963O794
$$ -3887 2457 -3509 3354 -1926 3909 -1323 4127 -3885 2430 -3828 1660 -4246 2060 -2903 3891
1681C891n113M923n207L707m395L722n278L753k009K873j445K963k063J399j153
$$ 3891 -1222 3701 -1506 2201 -2194 1528 -3750 3 -2006 867 -578 2385 322 1721 568
1696E68n03p46j353O96L93J134j232L380k513L106l024J891m613M106m917M776
$$ 568 65 -681 -2034 -1338 -945 189 -1043 2337 -176 2930 -94 1797 -2816 1290 -3627 1149
1712A149m688N330l262N478n631O166p223N253n743M640o123O555n265O898n132
$$ 1149 -3539 1791 -1471 4007 -1624 4542 -2681 2572 -3171 1469 -4654 1901 -3364 3534 -1598
1727a598N221m857M749n840M590n862L711k719L974l390M274k462K792k172P75
$$ -1598 3623 -1234 3515 -2325 2265 -3597 114 -2605 1369 -2021 2253 -209 2583 411 1186
1742A186k112N54j368R16O8l97K210m79J099j265J435l464K961l799K854l331
$$ 1186 -926 -372 -1740 -824 -756 -1153 1057 578 1677 412 1847 -1617 1344 -2455 399 -2932
1758b932M084k876N207n396N404m785L838n231M701o357O403n199N797m797N383
$$ -2932 1152 -1724 3483 -1913 3491 -1294 2544 -2687 2014 -4343 2060 -3139 2658 -2139 3244
1773C244m965N765o604M973n356L902l962N033m891M944l069L767l298K134l075
$$ 3244 -1721 4044 -2560 2413 -2943 959 -3003 2030 -2861 2083 -986 2781 -517 1617 -1458
1788a458K476k618J516j032P99K08J211m66n87J133j800J141k023J825k259K992
$$ -1458 1018 -1600 -84 -1116 -317 -109 1102 636 49 1182 -618 523 -1500 325 -1934 1058
1804A058k517M205m276L694l216L525n291M810n267N264m338M775m880N637n269
$$ 1058 -1459 2746 -1530 2164 -1052 2473 -2818 1992 -3275 1989 -2349 2426 -2454 3183 -2086
1819b086N654o209M390m369M600n354N906n007M859l473L804m237L487m355L782
$$ -2086 3568 -2641 1749 -2620 1980 -3374 2532 -2475 2384 -1089 2715 -1522 1965 -2390 1392
1834A392l330K240j568K375j666K449j707P4j65j01n48n18N35l33K052j953K746
$$ 1392 -1938 302 -1266 1109 -557 1892 185 259 94 -7 -555 -1073 -538 -871 1181 -772 1974
1851A974k565K254k624K721m660L880l545M082l754M911m534N195m941M606n596
$$ 1974 -591 1663 -961 1760 -2900 980 -2565 1517 -2237 2674 -1860 3335 -1606 3000 -2596
1866b596L971m655N604n872N449l950M860m023M640n487M302m577L399l683K923
$$ -2596 1375 -3280 2324 -3548 1901 -2049 2811 -1212 3428 -2059 2243 -2334 1065 -2618 305
1881C05k512M382l120L092j999J092j726J201k168O97n41N48J219o88J255k31
$$ 305 -2207 2175 -945 2147 148 1240 -486 715 -1453 -756 -1297 -749 470 -218 1037 806
1897H06Q38k053J784l719K434k174K850l239M434l222M648m364L750m710L800
$$ 806 1644 -409 1375 -2344 90 -2084 766 -2473 1961 -1261 3387 -977 2773 -1937 1863
1912A863n170M990n285M966l706N470m873N234n128M388m705L405m557L771l699
$$ 1863 -3307 1683 -3602 1364 -2342 3128 -1745 3489 -1639 2749 -1956 1449 -3108 663 -3036
1927c036N133l441L176k009K708l253K282l209J379j165J078m25J106k07J157
$$ -3036 2097 -1344 1832 -177 2531 -722 1560 -1649 -270 -1435 -357 -782 324 117 1274
1942A274K57j502J044j997O83j310J693k362L407k217L648l237K877l714L735
$$ 1274 1531 29 1073 -924 -241 -1551 142 -2220 1187 -1030 2618 -619 2258 -1456 2279
1957B279m996M157m568M164l476N124m752N189m409M285m967L815m938M410m361
$$ 2279 -2717 1440 -3128 1036 -2440 2684 -2068 3121 -1288 2997 -1970 1845 -3093 1317 -3044
1972c044M728l451L654l058M321m262K703l138K278k341K069k174K256r94J585
$$ -3044 1684 -1767 1887 -1171 3150 -1112 1591 -1547 731 -1610 459 -1715 541 -453 1132
1987A132j98m11n08M00o67q33J211j747K294j367K190k043K330k889L033l928
$$ 1132 934 523 15 415 -252 -1085 126 -1621 673 -694 1496 -547 1783 -1106 1927 -2001
2003b001K926l143L470l613M827m504M483l806M061m853L972m637M750m748M565
$$ -2001 925 -2218 1252 -2361 2466 -2038 2445 -1361 2700 -2153 1819 -2818 1932 -2816 1749
2018A749l609M163m033M592m317K883l235L124l322K984k828L136j966K119j659
$$ 1749 -1860 2303 -1730 2862 -1455 1428 -1807 1317 -2005 979 -1849 1287 -679 1440 -219
2033b19J279j943J367q05n09K78K72N13j94R67j342J694k232K129k763J845k104
$$ -219 1060 -883 484 -321 -830 -552 -280 233 39 1006 -336 1358 -874 1255 -1508 337 -1767
2050a767L238l573M192l245L381l432L585m683L957m580M601m001L967l559M900
$$ -1767 1471 -2102 2090 -1155 2226 -1206 2379 -2304 1653 -2927 1674 -2327 1640 -1919 2981
2065B981m587M382m369L278m037L854m076L769l123L704k503K486k440K482k943
$$ 2981 -1606 2776 -1593 1685 -2352 1502 -2574 1195 -1928 1776 -727 1759 -681 1801 -1142
2080a142J704j774Q15r49J568l71N98L20l65N76j059K72j386J053j638K840k501
$$ -1142 562 -1212 -397 -1346 222 -149 449 769 404 980 -79 193 -1193 -140 -1778 1062 -1439
2097a439K805j727K751l310L146m128L225l873L569l495M075l690N171m303L780
$$ -1439 1366 -361 2390 -920 2226 -1902 1323 -2550 1019 -2476 1599 -2091 3080 -1223 2557
2112B557l793L283m444L975m554M089l350M085k864L385l437L571l497J840k378
$$ 2557 -1236 2047 -2397 1578 -2976 1113 -2237 1848 -1016 2369 -1068 2503 -994 846 -1532
2127a532J626k015K417j326J673p10J115n09n8p45m55K87j138J446r87J428q06
$$ -1532 94 -1921 496 -830 843 133 1248 739 681 -64 -519 -232 -1370 76 -911 517 -289
2144b89K541k835K386k874K343l303K883l442L960l436M436l382L301l496L987
$$ -289 2252 -583 1803 -1071 1272 -2031 852 -2590 1370 -2066 2370 -1012 2289 -1207 2780
$$ [...]
8191f7
##END NTUPLES=NMR FID
##END=
