##TITLE=1H_DE-80H_X3
 200.13MHz, d2o
 8 sc
 
 19ns.26.2.2025
##JCAMPDX= 6.0         $$ Bruker NMR JCAMP-DX V2.0
##DATA TYPE= NMR FID
##DATA CLASS= NTUPLES
##ORIGIN= UXNMR, Bruker Analytische Messtechnik GmbH
##OWNER= pz
$$ XWIN-NMR		Version 3.5
$$ Wed Jun 24 11:31:08 2026 Russian Standard Time (UT+4h)  Yarkov@DPX200
##.OBSERVE FREQUENCY= 200.1313
##.OBSERVE NUCLEUS= ^1H
##.DELAY= (6, 6)
##.ACQUISITION MODE= SIMULTANEOUS
##.ACQUISITION SCHEME= undefined
##.AVERAGES= 8
##.DIGITISER RES= 18
##SPECTROMETER/DATA SYSTEM= spect
##.PULSE SEQUENCE= zg30
##.SOLVENT NAME= DMSO
##.SHIFT REFERENCE= (INTERNAL, DMSO, 0, 14.3821)
##AUDIT TRAIL= $$ (NUMBER, WHEN, WHO, WHERE, WHAT)
$$ ##TITLE= Audit trail, XWIN-NMR		Version 3.5
$$ ##JCAMPDX= 5.01
$$ ##ORIGIN= Bruker BioSpin GmbH
$$ ##OWNER= Yarkov
$$ C:/Bruker/XWIN-NMR/data/yarkov2/nmr/H-C/1/audita.txt
$$ ##AUDIT TRAIL=  $$ (NUMBER, WHEN, WHO, WHERE, WHAT)
(   1,<2026-06-24 11:30:19.90 +0400>,<Yarkov>,<DPX200>,
      <created by zg, POWCHK disabled, PULCHK disabled
       configuration hash MD5:
       00 E9 B6 7A A2 85 ED C7 34 08 36 98 17 FE 4E 26
       data hash MD5: 16K
       C1 CA 5A B0 1C E6 47 CE 53 B2 FE 91 A8 9F 89 48>)
$$ ##END=
$$ 
$$ hash MD5
$$ DF 45 8E 24 7D 67 6B DC B7 CE BE 0E 78 2C B0 FD
##$RELAX= 
##$RELAX= 
##$RELAX= 
##$RELAX= 
##$RELAX= 
##$RELAX= 
$$ Bruker specific parameters
$$ --------------------------
##$DU= <C:/Bruker/XWIN-NMR>
##$EXPNO= 1
##$NAME= <H-C>
##$PROCNO= 1
##$TYPE= <nmr>
##$USER= <yarkov2>
##$AMP= (0..31)
100 100 100 100 100 100 100 100 100 100 100 100 100 100 100 100 100 100 
100 100 100 100 100 100 100 100 100 100 100 100 100 100 
##$AQSEQ= 0
##$AQ_mod= 1
##$AUNM= <au_zg>
##$AUTOPOS= <>
##$BF1= 200.13
##$BF2= 200.13
##$BF3= 200.13
##$BF4= 200.13
##$BF5= 200.13
##$BF6= 200.13
##$BF7= 200.13
##$BF8= 200.13
##$BYTORDA= 1
##$CFDGTYP= 0
##$CFRGTYP= 5
##$CHEMSTR= <none>
##$CNST= (0..31)
1 1 145 1 1 1 1 1 1 1 1 1 1 1 1 1 1 1 1 1 1 1 1 1 1 1 1 1 1 1 1 1 
##$CPDPRG= <>
##$CPDPRG1= <>
##$CPDPRG2= <>
##$CPDPRG3= <>
##$CPDPRG4= <mlev>
##$CPDPRG5= <mlev>
##$CPDPRG6= <mlev>
##$CPDPRG7= <mlev>
##$CPDPRG8= <mlev>
##$CPDPRGB= <>
##$CPDPRGT= <>
##$D= (0..31)
0 0.7 0 0 0 0 0 0 0 0 0 0.03 0 0 0 0 0 0 0 0 0 0 0 0 0 0 0 0 0 0 0 0 
##$DATE= 1782286219
##$DBL= (0..7)
120 120 120 120 120 120 120 120 
##$DBP= (0..7)
150 150 150 150 150 150 150 150 
##$DBP07= 0
##$DBPNAM0= <>
##$DBPNAM1= <>
##$DBPNAM2= <>
##$DBPNAM3= <>
##$DBPNAM4= <>
##$DBPNAM5= <>
##$DBPNAM6= <>
##$DBPNAM7= <>
##$DBPOAL= (0..7)
0.5 0.5 0.5 0.5 0.5 0.5 0.5 0.5 
##$DBPOFFS= (0..7)
0 0 0 0 0 0 0 0 
##$DE= 6
##$DECBNUC= <off>
##$DECIM= 32
##$DECNUC= <off>
##$DECSTAT= 4
##$DIGMOD= 1
##$DIGTYP= 9
##$DL= (0..7)
0 120 120 120 120 120 120 120 
##$DP= (0..7)
150 150 150 150 150 150 150 150 
##$DP07= 0
##$DPNAME0= <>
##$DPNAME1= <>
##$DPNAME2= <>
##$DPNAME3= <>
##$DPNAME4= <>
##$DPNAME5= <>
##$DPNAME6= <>
##$DPNAME7= <>
##$DPOAL= (0..7)
0.5 0.5 0.5 0.5 0.5 0.5 0.5 0.5 
##$DPOFFS= (0..7)
0 0 0 0 0 0 0 0 
##$DQDMODE= 0
##$DR= 18
##$DS= 0
$$ [...]
##$SUBNAM2= <"">
##$SUBNAM3= <"">
##$SUBNAM4= <"">
##$SUBNAM5= <"">
##$SUBNAM6= <"">
##$SUBNAM7= <"">
##$SUBNAM8= <"">
##$SUBNAM9= <"">
##$SW= 18.0517328524113
##$SWIBOX= (0..15)
0 0 2 0 0 0 0 0 0 0 0 0 0 0 0 0 
##$SW_h= 3612.71676300578
##$TD= 16384
##$TD0= 1
##$TE= 0
##$TE2= 300
##$TE3= 300
##$TEG= 300
##$TL= (0..7)
0 120 120 120 120 120 120 120 
##$TP= (0..7)
150 150 150 150 150 150 150 150 
##$TP07= 0
##$TPNAME0= <>
##$TPNAME1= <>
##$TPNAME2= <>
##$TPNAME3= <>
##$TPNAME4= <>
##$TPNAME5= <>
##$TPNAME6= <>
##$TPNAME7= <>
##$TPOAL= (0..7)
0.5 0.5 0.5 0.5 0.5 0.5 0.5 0.5 
##$TPOFFS= (0..7)
0 0 0 0 0 0 0 0 
##$TUNHIN= 0
##$TUNHOUT= 0
##$TUNXOUT= 0
##$USERA1= <user>
##$USERA2= <user>
##$USERA3= <user>
##$USERA4= <user>
##$USERA5= <user>
##$V9= 5
##$VALIST= <valist>
##$VCLIST= <CCCCCCCCCCCCCCC>
##$VD= 0
##$VDLIST= <DDDDDDDDDDDDDDD>
##$VPLIST= <PPPPPPPPPPPPPPP>
##$VTLIST= <TTTTTTTTTTTTTTT>
##$WBST= 1024
##$WBSW= 4
##$XGAIN= (0..3)
0 0 0 0 
##$XL= 0
##$YL= 0
##$YMAX_a= 14530
##$YMIN_a= -13797
##$ZGOPTNS= <>
##$ZL1= 120
##$ZL2= 120
##$ZL3= 120
##$ZL4= 120
##$ABSF1= 10
##$ABSF2= 0
##$ABSG= 5
##$ABSL= 3
##$ALPHA= 0
##$AQORDER= 0
##$ASSFAC= 0
##$ASSFACI= 0
##$ASSFACX= 0
##$ASSWID= 0
##$AUNMP= <proc_1d>
##$AZFE= 0.1
##$AZFW= 0.1
##$BCFW= 1
##$BC_mod= 2
##$BYTORDP= 1
##$COROFFS= 0
##$CY= 83.5205535888672
##$DATMOD= 1
##$DC= 2
##$DFILT= <>
##$DTYPP= 0
##$F1P= 10.8118882576601
##$F2P= -7.23987719738617
##$FCOR= 0.5
##$FTSIZE= 0
##$FT_mod= 4
##$GAMMA= 1
##$GB= 0.15
##$INTBC= 1
##$INTSCL= 1
##$ISEN= 128
##$LB= 0.25
##$LEV0= 0
##$LPBIN= 0
##$MAXI= 10000
##$MC2= 0
##$MEAN= 0
##$ME_mod= 0
##$MI= 1.114404
##$NCOEF= 0
##$NC_proc= 0
##$NLEV= 6
##$NOISF1= 3.799351
##$NOISF2= 2.8
##$NSP= 1
##$NTH_PI= 0
##$NZP= 0
##$OFFSET= 14.38212
##$PC= 1
##$PHC0= -6900.419
##$PHC1= 13.42196
##$PH_mod= 1
##$PKNL= yes
##$PPARMOD= 0
##$PSCAL= 0
##$PSIGN= 0
##$REVERSE= no
##$SF= 200.129724274929
##$SI= 16384
##$SIGF1= 3
##$SIGF2= 2
##$SINO= 400
##$SIOLD= 16384
##$SREGLST= <1H.CDCl3>
##$SSB= 0
##$STSI= 0
##$STSR= 0
##$SW_p= 3205.1282051282
##$SYMM= 0
##$S_DEV= 0
##$TDeff= 0
##$TDoff= 0
##$TI= <>
##$TILT= no
##$TM1= 0
##$TM2= 0
##$TOPLEV= 0
##$USERP1= <user>
##$USERP2= <user>
##$USERP3= <user>
##$USERP4= <user>
##$USERP5= <user>
##$WDW= 1
##$XDIM= 8192
##$YMAX_p= 0
##$YMIN_p= 0
$$ End of Bruker specific parameters
$$ ---------------------------------
##NTUPLES= NMR FID
##VAR_NAME=  TIME,          FID/REAL,        FID/IMAG
##SYMBOL=    X,             R,               I
##VAR_TYPE=  INDEPENDENT,   DEPENDENT,       DEPENDENT
##VAR_FORM=  AFFN,          ASDF,            ASDF
##VAR_DIM=   8192,          8192,            8192
##UNITS=     SECONDS,       ARBITRARY UNITS, ARBITRARY UNITS
##FACTOR=    0.0002768,     1,               1
##FIRST=     0,             0,               0
##LAST=      2.2672688,     0,               0
##MIN=       0,             -13797,          0
##MAX=       2.2672688,     14530,           0
$$ Real data points
##PAGE= N=1
##DATA TABLE= (X++(R..R)), XYDATA
$$ [...]
340C31J020k127k33J406N75j269q43J969m08j973J936R66k163JJ295J94j208m52
$$ 331 1351 -776 -1009 397 972 -297 -1140 829 421 -1552 384 1350 -813 -812 483 677 -531 -983
358i83K128l70k493J720J169j795J12J032k60j000K9J860n95k154J818J040k060
$$ -983 1145 775 -1718 2 1171 -624 -512 520 260 -740 -711 1149 554 -1600 218 1258 -802
375h02J07J272n3q64m32J361l14j416J670N16k008L50J242j86p57k93J332j94
$$ -802 -695 577 524 -340 -772 589 275 -1141 529 1045 -963 -613 629 443 -314 -607 725 531
393E31j699J282Q54j528K58P84m48m75Q7J203m29j646J272R75j639J85J127n47
$$ 531 -1168 114 968 -560 -302 482 34 -441 -354 849 420 -1226 46 1021 -618 -433 694 147
411A47m50LQ00j89j236J328N25j871M61J261m62o16L5P65k44j076J089O87j655
$$ 147 -303 -300 500 311 -925 403 928 -943 -482 779 317 -299 -264 501 257 -819 270 957 -698
430f98L54J021p02m10L73O71k71j355R85R71j441K27Q78p18j81K98M33j12r72
$$ -698 -344 677 -25 -435 -62 609 338 -1017 -32 939 -502 -275 603 -115 -296 2 435 323 -649
449f49P95O21j342J20J071m48l41r4M15J68p34N91N20j221J92J004o14l79K09
$$ -649 146 767 -575 -455 616 168 -173 -267 148 316 -418 173 693 -528 -336 668 54 -325 -116
468a16N52j55r29O49P95j087Q4P12o69q4M45J00k15n26N69M72j076K56Q59o65
$$ -116 436 281 -648 1 796 -291 -207 505 -164 -248 197 297 82 -444 125 597 -479 -223 636 -29
488b9k14K38L5K29m48K22M70j067K81R39o02k83K62J94q2m67L08O10q22o4P65
$$ -29 -243 -5 30 259 -189 33 503 -564 -283 656 54 -229 33 227 145 -322 -14 596 -226 -290 475
509D75o63q6N47l0k08m36M08N28p83qP50n80k24M90m8j9k80K44K82p83J65Q80
$$ 475 -188 -274 273 243 35 -401 7 535 -248 -256 494 -86 -310 180 132 113 -167 77 359 -424 -259 621
531F21n12m82M34L7Ql11J87M16o13m6P18n19k20N18jl24j96K21N49n98k30O34
$$ 621 109 -373 61 98 106 -205 -18 398 -215 -261 457 -62 -282 236 235 -89 -285 -64 485 -113 -343 291
553B91m04j78N16m3k91J56k31N21m49j82P89l58m19J86J63K9j18q5L38l84j62
$$ 291 -113 -291 225 182 -109 47 -184 337 -112 -294 495 137 -282 -96 67 96 -22 -107 231 -153 -315
574c15O53l13l42M58j00j12q2J23L16l97q0M44l46j27N49k91k04J61m9K05k49
$$ -315 338 25 -317 141 41 -71 -153 -30 286 -111 -191 253 -93 -220 329 38 -166 -5 -54 151 -98
595i8q2M41k54l30M31j05pR3j42J18k05p1N49k62m67M34J03k53%R8J61k60r3M17
$$ -98 -180 261 7 -323 108 3 -4 89 -53 65 -140 -211 338 76 -391 43 146 -107 -107 -9 152 -108 -201 216
619B16j97k74N09j59l85K38P2J34j51k57L82j39k53L60l5j86J66o6K1p8q5M02
$$ 216 19 -255 254 95 -290 -52 20 154 3 -254 128 -11 -264 96 61 -125 41 -25 -4 -82 -167 235
641B35j40m76L55J99k56Q0k1L9p9j18L89j27l38M06J4m24J41J26P0m1k45K38M1
$$ 235 95 -381 -26 173 -83 -3 -24 15 -64 -182 207 80 -258 148 162 -262 -121 5 75 34 -211 27 68
664F8k34K32L2k77K34j00N1j5j58L99j07l34K46K8j39J24m3j01P9j07K60p1k91
$$ 68 -166 66 98 -179 55 -45 6 -9 -167 232 125 -209 37 65 -74 50 7 -94 -15 -122 138 67 -224
687b24L16Ml27K03J66r9J5j82J40P0j90K51p1k58K27Oq3L2n2J18Mk55J92J48k19
$$ -224 92 96 -231 -28 138 39 54 -128 12 82 -108 143 72 -186 41 47 -36 -4 -56 62 66 -189 3 151 -68
712f8J03p3o1J3O1J68k6l69L24J10l68J56J62j59Ll7N8J00j95J89J5l43K13J26
$$ -68 35 -38 -99 -86 -25 143 117 -252 72 182 -186 -30 132 -27 -24 -61 -3 97 -98 91 106 -237 -24 102
736A02j51O3o3L7O7j52J14J05k33O3J05j34P5N0k4O8k12J58J06j91%R2j38R2P1
$$ 102 -49 14 -49 -12 55 -97 17 122 -111 -48 57 -77 -2 48 24 92 -120 38 144 -47 -47 45 -93 -1 70
761G0q2J40j80N9J12l09K04K00k18N6j05J7P2q5K6J24k31J19J79k54O2J01p7L3
$$ 70 -12 128 -52 7 119 -190 14 214 -4 52 -53 -36 36 -49 -23 101 -130 -11 168 -86 -24 77 0 33
785C3j74R1J94j94J1J14j77R8Q4n7l3j0JJ56k59J53J31j66k1N8j09J70n0m7J21
$$ 33 -141 -50 144 -50 -39 75 -102 -4 80 23 -10 -20 -19 137 -122 31 162 -4 -25 33 -76 94 44 -3 118
810A18j80L5J72j64m0J25k6j0k3m0J49j25n2J32j56N1J29j14J2r4L4K11j79J3
$$ 118 -62 -27 145 -19 -59 66 40 30 7 -33 116 -9 -61 71 -85 -34 95 -19 -7 -101 -67 144 -35 -22
834b2J30j54qP1p8J03Q2j48Q6r3rJ72j22p9J44j53R0Ql1M0j4k9P3j09O6J29j39
$$ -22 108 -46 -54 17 -61 42 124 -24 62 -31 -40 132 10 -69 75 -78 12 20 -11 29 15 -14 59 -50 16 145 6
861Fn0K8o6J72o7j23J59r5p3K12j39m5J25m0J4p6K2J85j60j86K63q7M3O4j01M7
$$ 6 -44 -16 -82 90 23 -100 59 -36 -109 103 -36 -81 44 4 18 -58 -36 149 -11 -197 66 -21 22 86 -15 32
887C2k2n4J39j10p7K09j14k9Q0r6J13Jj44J43p7j08J89j17k7Q7j00Q3j9k5J19
$$ 32 10 -44 95 -15 -92 117 3 -26 54 -42 71 72 -72 71 -6 -114 75 -42 -69 18 -82 1 -18 -43 76
912G6k0j22J31o6QN4j26K0M9n0J13j4j28J23r3l9J84j36L4P3j30Q5mp4J43j06
$$ 76 56 -66 65 -1 7 61 -65 -45 4 -46 67 53 -75 48 -45 -84 100 -36 -2 71 -59 26 22 -52 91 -15
938a5j18J35j0l3J04r9k0P1o4J11j06pJ06k1j03P9PJ3o3j31K07l4q9J70j30k4
$$ -15 -133 2 -8 -41 63 -36 -56 15 -49 62 -44 -51 55 34 -69 10 17 30 -33 -164 43 9 -80 90 -40 -64
964f4J00j40R2j4j0J60j38j18J20l9O7N5j13J6R3r4K7K5p9J49r0r5J52n6j0Q8
$$ -64 36 -104 -12 -26 -36 124 -14 -132 -12 -51 16 71 -42 -26 67 -27 0 25 -54 95 5 -90 62 6 -4 84
990H4k47J26L0j3P7q5m6J54n3o4J4j09J44N0j49J30m4n4J70j78j5J01Mj2j1r9
$$ 84 -163 -37 -7 -20 57 -28 -74 80 27 -37 -23 -132 12 62 -87 43 -1 -55 115 -63 -78 23 27 15 4 -95
1016i5J13O0j44J40j31QJ02j24LJ75j82J27m2j30J77l7n9O8j02M0J05j52J17M2
$$ -95 18 78 -66 74 -57 -49 53 -71 -68 107 -75 52 10 -120 57 20 -39 29 -73 -33 72 -80 37 79
1040G9j23O5k0j01J43n9J8k4r5J89jj53J46r6rP7n1J2O3r7N6J8k02J86J19j55
$$ 79 -44 21 1 -100 43 -16 2 -22 -117 72 71 -82 64 -32 -41 36 -15 -3 60 -37 19 37 -165 21 140 -15
1066a5K8j15O4J04j14O6j0j21J11L7j02Q9L7j26Q9r5L7J23j05L7rj06J30nm2Q5
$$ -15 13 -102 -38 66 -48 18 8 -113 -2 35 -67 22 59 -67 22 -73 -36 87 -18 19 10 -96 34 29 -13 72
1092G2n0l5L9o2K7J01j53O7l2OO3l0l0M6j03J17P7j25Q1p9lJ28j85M0J35j34M3
$$ 72 22 -13 26 -36 -9 92 -61 6 -26 -20 43 13 -17 29 -74 43 120 -5 76 -3 -6 122 -63 -23 112 -22 21
1119B1O4j90K23k2j43Q3j05O5O8r3L5J16j34J0M3p2P8J8j01P7j63J54M1j56P7
$$ 21 85 -105 118 96 -47 36 -69 -4 64 -29 6 122 -12 -2 41 -31 47 65 -36 41 -122 32 73 -83 -6
1144fJ3l0N8L7k7L2j01J4K1o5J04K4j24O1Nl9J15j20L6J0j08J13J5j00R3o2N8
$$ -6 7 -23 35 72 45 77 -24 -10 11 -54 50 74 -50 11 16 -23 92 -28 8 18 -90 23 38 -62 31 -31 27
1171B7J0o4L6J01j19m3J20j13J05l0j63J70l6m6J32j86J38Q1j89P5Ko4J60j01
$$ 27 37 -27 9 110 -9 -52 68 -45 60 30 -133 37 1 -45 87 -99 39 120 -69 6 8 -56 104 3
1195Cq8P4pP3L6j37Q0j4q1N9J0j8M8r7qJ73k09J55Lj05LN1l3Q4j16P5M3q4L3K2
$$ 3 -85 -11 -18 55 91 -46 34 20 -61 -2 8 -10 38 -59 -67 106 -103 52 55 -50 -47 4 -29 55 -61 14 57 -27 6 28
1225B8j42J84m2j6L6MK2k0j13M9P0r6O8j7o3J01m8k3M5o6L5%l1QpL0J8o0L0O4
$$ 28 -114 70 28 12 48 52 74 54 -59 -10 60 -36 32 15 -48 53 5 -18 27 -39 -4 -4 -35 -27 -34 -4 14 -46 -16 48
1255D8m7l4P3q8R2m2o4R8l0l8P9p0m2M8k4R0o6l3P2ql4M6k5o7J50j34J09n8k8
$$ 48 1 -33 40 -48 44 2 -62 36 6 -32 47 -23 -65 -17 -41 49 -17 -50 22 14 -20 26 1 -66 84 -50 59 1 -27
1284b7J27j32o6J51k5q7P5n8L5J15j49R4j02K9Q8o9o7J45p9L7Qj43J30lp5J32
$$ -27 100 -32 -98 53 28 -59 16 -42 -7 108 -41 53 -49 -20 68 -1 -68 77 -2 35 43 -100 30 27 -48 84
1310H4j61j00J84k64K63N0J07l01J42R2L0k8n7l50L15P3J02l55L26k98L4J17p8
$$ 84 -77 -177 7 -257 6 56 163 -138 4 96 126 98 41 -309 6 79 181 -174 152 -146 -112 5 -73
1333g3N0L71m74J25K88o81M73L66j34k73R4k14R4j0O8o7N7k1r4j21J63J16p1n9
$$ -73 -23 348 -126 -1 287 -394 79 445 311 38 132 -82 12 2 70 3 60 39 -55 -176 -13 103 32 -27
1357b7M2j6J3r8J50k4J59l29M03m53K18l24J17N34l92q3k23O22m50K32m20N09
$$ -27 15 -1 12 -86 64 40 199 -130 273 -180 38 -286 -169 365 -27 -110 -333 289 -161 71 -349 160
1379A60J49k68l7N0k93K99r9J70Q8n44j13L05J10K77m01j76J35J02J34L31p05
$$ 160 309 41 4 54 -239 60 -39 131 219 -325 -438 -133 -23 254 -147 -323 -188 -86 48 379 -326
1400c26K76L95l91N6J9k1L02k58k84L08j65J06k92K93o3n3l7L37r1j47Q7m8Q3
$$ -326 -50 345 -46 10 29 8 310 52 -232 76 -89 17 -275 18 -45 -98 -135 202 111 -36 51 3 86
1423H6j88N0J43L7k09L5Q3J7l9j0m6L8o8Q4k0r4J38o5j2Q1l4rM1q6L5M0n6J20
$$ 86 -102 -52 91 128 -81 -46 37 54 15 5 -41 -3 -71 13 -7 -101 37 -28 -40 41 7 -2 39 -47 -12 28 -28 92
1451I2j57P9M4p9K6j5m7J04l0k9MO5o9M6o8K3N4l6M9m1rL3j5m0N2m5PL2j9n1K3
$$ 92 -65 14 58 -21 5 -10 -57 47 17 -12 -8 57 -12 34 -34 -11 43 7 56 15 6 39 24 -16 36 -9 -2 30 11 -40 -17
1482a7m3J01n3m3P5J4K5Qn5kJ8j4J0n5J0N2j2k1P8r3R9j6p8j7J5N1on1jM9j05
$$ -17 -60 41 -12 -55 20 34 59 67 12 10 28 14 24 -31 -21 31 19 -2 76 -17 82 66 -12 -29 -14 37 31 -20 -21 28 -77
1513g7P1M2q5L1O6p0N6j7m3nRJ7J2JK3m9p9R7J3l0N6Lrk0K2M0p9K2N7j05j5O4
$$ -77 -6 36 -49 -18 48 -22 34 17 -26 -31 -22 -5 7 8 31 -18 -97 0 13 -17 39 42 33 13 35 75 -4 18 75 -30 -45 19
1545A9K2m4L8n8KN0l5j6K5nL6n0j2J7k3R7n7rlL0m9R0j21M3j5l5P0k5m0Q0J2o5
$$ 19 41 -3 35 -23 -21 29 -6 -22 3 -2 34 -16 -28 -11 -34 63 6 -3 -6 24 -25 65 -56 -13 -28 -63 7 -18 -58 22 34 -31
1577c1oQJ1M3k6j1O2r6Q6q1NR7r0J0qn8J35o2q2Q5M4o1N5m3k2M9J7K9p8q2O4Q
$$ -31 -37 -29 -18 25 -1 -12 50 -46 40 -41 -36 61 -29 -19 -27 -85 50 -12 -94 -9 35 -26 29 -14 -36 13 30 59 -19 -101 -37 -29
1609b9K4K1J0n7L6l8P8k9j0n0l4L9O7l4lL8j8j9j1L9l9L9j1n9L7kK9M0o0Q0r8
$$ -29 -5 16 26 -31 5 -33 45 16 6 -44 -78 -39 28 -6 -9 29 11 -8 -19 20 -19 20 9 -50 -13 -15 14 54 -6 74 -24
1640b4M5q4jJ31p4j6%J1k3M3n4L7M2p5P0m1RJ8rM5j7p0P5l6m5J3K0qN6o6L5N2
$$ -24 21 -63 -64 67 -7 -23 -23 -12 -35 8 -46 -9 33 -42 28 -13 -4 14 5 50 33 -37 38 2 -43 -30 -10 -18 38 -28 7 59
1672E9q1KM0m4ON2n1J8j7jJ9l1J3L1l1l5J34q5l9L7l2O6l0o3M7K6l1L8k8P6n1
$$ 59 -22 -20 20 -24 -18 34 -17 1 -16 -17 2 -29 -16 15 -16 -51 83 -2 -41 -4 -36 30 0 -63 -16 10 -21 17 -11 65 14
1703A4n1O8J7m8j6OLL2l7K2M6j7o0j4O2Nl9j6L1n4L1j7J3j0M8k7j2Qj1J4k3l4
$$ 14 -37 31 48 0 -16 -10 -7 25 -12 10 56 39 -21 -35 27 32 -7 -23 8 -46 -15 -32 -19 -29 19 -8 -20 -12 -23 -9 -32 -66
1735f6O2l0L6lJ5j4m9K9L7%jlm7Q0q6k8J19k5j8K1l3J8j6Nm7M5m7J02l9O1m3R
$$ -66 -4 -34 2 -1 14 0 -49 -20 17 17 16 13 -34 46 -40 -68 51 26 8 29 -4 14 -2 3 -44 1 -46 56 17 78 35 44
1767D4o5K0MO1o5j7L0K1o3rO4qk0qmK0J2PNj07J36j13L5M1j3L2ml8M2p1j2O1l2
$$ 44 -21 -1 3 64 -1 -18 12 33 -30 -39 25 17 -3 -11 -15 5 17 24 29 -78 58 -55 -20 21 8 40 36 -2 40 -31 -43 18 -14
1800a4k1P6l3j1J7k8k4L9pj0K4J1RPo0O7j12R2jn8R2k3m2K2j9J6k5Ql1RRJ7J1
$$ -14 -35 41 8 -3 14 -14 -38 1 -6 -16 8 19 28 35 -25 42 -70 22 21 -37 55 32 -10 12 -7 9 -16 -8 -39 -30 -21 -4 7
1833GJ1j5Qm3J6M2k3k1NM7k2j2k4L6j0K4m1MJ5j2J8j2j8J2K1%j2J7QLl6m5O7j8
$$ 7 18 3 11 -32 -16 26 3 -18 -13 34 12 0 -24 12 2 26 -15 -11 4 -8 10 -2 -20 -8 13 13 1 18 26 29 -7 -52 15 -3
1867cOk5K0Rl5L2J9o2P0omn0L9Pmj4m8O7n1L1k4K8M6q5kK7m5P4l5mO9j01J4P7
$$ -3 3 -22 -2 7 -28 4 23 -39 31 25 21 -29 10 17 13 -1 -49 18 -33 -2 -26 2 48 -37 -39 -12 -57 17 -18 -22 47 -54 -40 37
1901C7k2k8NJ6J8%n0k3Q9Lr6%L5N3p3j6J5Q9q6J8J5O8r7K0OJjkJ5m9P8Qo9L0j5
$$ 37 15 -13 -8 8 26 26 -24 -47 42 45 -51 -51 -16 37 -36 -52 -37 52 -34 -16 -1 67 -30 -10 -4 -3 -4 -6 9 -40 38 46 -23 7 -8
1936hJ6K7o9N6o5KJ8K7L3m9L0K0n8O9k5m4K9%j4OO7o1M6p1K3K5J3j4J6j6Kr0P2
$$ -8 8 35 -34 22 -43 -41 -23 4 37 -12 18 38 -20 49 24 -20 9 9 -5 1 68 7 53 -18 5 30 43 29 45 29 31 -59 13
1969A3j8P1r6K1J6J7K9Qm4o3N1k7k1j1M9M1n5J9j7l8O1M0p0l6P1j3KnN8m6J8%
$$ 13 -5 66 -30 -9 7 24 53 61 17 -46 5 -22 -43 -54 -5 36 -19 0 -17 -55 6 46 -24 -60 11 -2 0 -5 53 7 25 25
2001B5L0m0j1K3j0k8rl5M4K1j3k8J9Pl0qQ3k6m6Q9m8O9p8l9rP2mj1pN9q5N4n3
$$ 25 55 15 4 27 17 -11 -20 -55 -11 10 -3 -31 -12 -5 -35 -43 40 14 -32 57 9 78 0 -39 -48 24 20 9 2 61 -24 30 -23
2034b3jL3L1j8m3L0k6J4K3n8N4k2L2pj6m1K6J0m5M9K4m7N6n8L6J8k7L7p6L2K5
$$ -23 -24 9 40 22 -21 9 -17 -3 20 -38 16 -6 26 19 3 -38 -12 -2 -47 2 26 -21 35 -23 13 31 4 41 -35 -3 22
2065B2Mo9J05p9O3l0J6m1LK8jn4P1l0q7Q8n6O8j1l1K1j0K7Kk4Qk3J3K0pl5k3N9
$$ 22 26 -43 62 -17 46 16 32 -9 -6 22 21 -33 38 8 -79 9 -47 21 10 -21 0 -10 17 19 -5 3 -20 -7 13 6 -29 -52 7
2098Gl3O1k3k1Mn4K5J4P1lL6j16J24k53J05R9m0r9K14q9j23L9o0J54j12J78j36
$$ 7 -26 35 12 -9 -5 -59 -34 -20 51 48 84 -32 92 -161 -56 43 3 -96 118 29 -94 -55 -115 39 -73 105 -31
2125c1j63K29p3P0j06J03o3J47j11K02j75J36j45J90j75l9q3M8J7J8j27J48J02
$$ -31 -194 35 -38 32 -74 29 -34 113 2 204 29 165 20 210 35 -4 -87 -39 -22 -4 -131 17 119
2148A19l2j84J55m8m5K54l36J8R3R1j28pn8RJ70j7K3j11Q7P1M1k03q0jP3J31M
$$ 119 87 -97 58 10 -35 219 -117 -99 -6 85 -43 -50 -108 -99 71 54 77 -34 53 124 165 -38 -118 -119 -46 85 89
2175H9p1p3M15j97o4O7Mk88j24M06k4q2J9m63M48P3k13J81m07P74m00J22K04k84
$$ 89 18 -55 360 163 99 166 170 -118 -242 164 140 58 77 -386 62 135 -78 103 -304 470 70 192 396 112
2199A12p4J39J04k05Ok3K98l8j48R0R7l78p8Oj77K29J86L3k59K58j32j43L33L1
$$ 112 38 177 281 76 82 59 357 319 171 261 358 -20 -98 -92 -269 -40 146 179 -80 178 46 -97 236 267
2223B67k11R3l35k49N42M3j40j82Q9J54jn8l48K57K15k06j85K32K69l25L88j21
$$ 267 56 149 -186 -435 107 150 10 -172 -83 71 70 12 -336 -79 136 -70 -255 -23 246 -79 309 188
2245A88n41L37k50O55k58l12j38M91r3J1J99j31l6j90L27k28K33j40j5J17l53
$$ 188 -353 -16 -266 389 131 -181 -319 172 79 90 289 158 122 -68 259 31 264 124 109 226 -127
2266a27m1J45j25K97J2k30J43o4KJ28j24M6N4j62j62K33O8P6l90K25R7Pk72j08
$$ -127 -168 -23 -148 149 161 -69 74 10 12 140 16 62 116 -46 -208 25 93 169 -221 4 101 108 -164 -272
2290b72L70ol29Q1J62O2J37m28J84j74M49l43J93p8j6J02k54j35J11j02M34j92
$$ -272 98 92 -237 -156 6 68 205 -223 -39 -213 236 -107 86 8 -8 94 -160 -295 -184 -286 148 -44
2312d4K01k19J82k09m0K15j41Q6j40J02Kl00N20j54j10K81j86r2k7N5Q1j41%J62
$$ -44 157 -62 120 -89 -129 86 -55 31 -109 -7 -5 -305 215 61 -49 232 46 -46 -73 -18 63 -78 -78 84
2336H4j32K1L4l4Pj9l7J49r9N3k9JRJk5L9mJ1k6QKN0j0l4o7j9P8m0k9M8j4j9L3
$$ 84 -48 -27 7 -27 -20 -39 -76 73 -26 27 -2 -1 8 9 -16 23 19 30 4 12 14 64 54 20 -47 -66 12 -28 -57 -9 -23 -42 -9
2369irPJ2j7M4l9rN0k5L4j9qm1P5j26N9QPl7L2o5J19o5k5K3LLL2p8M1L0oJ4k8
$$ -9 -18 -11 1 -16 28 -11 -20 30 5 39 20 12 -29 46 -80 -21 -13 -6 -43 -11 -76 43 -22 -47 -24 -21 -18 14 -64 -23 7 1 15 -13
2403a3K9j5RL7n6LK5k0pn%K3qk3N0j4m6P8l1Jo0K1J4N5j5k2O1j17J23p6jJ9m0
$$ -13 16 1 10 47 -9 -6 19 -1 -8 -13 -13 10 2 -21 29 15 -31 47 16 17 -43 -22 -8 47 32 10 71 -46 77 1 0 19 -21
2436b1M6m0JM4j6K6Rj03K7M8k8RO5o9rk1J5N9n8M3J7p4L4j1Jj6L1J0j8l3mN7Q
$$ -21 25 -15 -14 30 14 40 49 -54 -27 21 -7 2 67 -2 -11 -32 -17 42 -16 27 44 -30 4 -7 -6 -22 9 19 1 -32 -36 21 29
2469B9Rl9j1J1Ln6N3L5K5l4k3QPk3jNK2j6on4PQ1Qj12R6oj4k9J9J1kM2l3lNl6
$$ 29 38 -1 -12 -1 2 -54 -1 34 59 25 2 10 17 -6 -7 -2 20 4 -2 -56 -49 32 40 -72 24 18 4 -25 -6 5 3 45 12 9 14 -22
2505b2P3n7j8k9P4K1m7ML8m1l7P4Nqm2k1K6mJ0M7n8m3Q0MJ4p9O4l0K3J4r3R7k9
$$ -22 51 -6 -24 -53 21 42 -5 -1 37 -4 -41 33 38 30 -12 -33 -7 -11 -1 46 -12 -55 25 29 43 -36 28 -2 21 35 -58 39 10
2538A0Rm9N9p9M2l2P5l7nK5L3m2J0Kn4K5k6R7k8p8K7mL8k6l1M7jk9LM3Nk5oK8
$$ 10 19 -30 29 -50 -8 -40 35 -2 -7 18 51 9 19 21 -33 -8 -34 63 35 -43 -16 -20 18 -8 -39 8 7 -22 -19 24 29 4 -2 26
2572B6j4l9P5qp9QQ5j9m6l0K4J4k0j3Q3o6k4pP2pj1k0M6rRj0k9oK0k7K0J8k5L9
$$ 26 12 -27 48 40 -39 -31 54 35 -11 -41 -17 -3 -23 -36 47 -19 -43 -50 22 15 4 -16 30 21 30 20 -9 -15 5 -22 -2 16 -9 30
2606C0mo5M8nk7l0L1M1l4k9M6K0o4J7L3KL3pm9J1k0j0O1n2%L0n5M3KjJ8l1N9j06
$$ 30 26 -39 9 4 -23 -53 -22 19 -15 -44 2 22 -42 -25 8 10 43 36 -13 -2 -22 -32 29 -23 -23 7 -48 -5 -3 -4 14 -17 42 -64
2640f4O0L9Ql9l0K6n2K0O2Jl4m4R7m9o3P9n9j4Q3p4O1k0Rl8l3K5M9L1o8K8n6J8
$$ -64 -4 35 43 4 -26 0 -52 -32 30 31 -3 -47 50 1 -62 17 -42 -56 27 -47 14 -6 3 -35 -68 -43 6 37 -31 -3 -59 -41
2672d1O3om4K1lKJ5p9P4L8m2k6L1K6O6p5m3oj6LQ5k5l7K0j7M0plk1LP7q6KK8p5
$$ -41 22 16 -28 -7 -10 -8 7 -72 2 40 -2 -28 3 29 95 20 -23 -29 -45 -42 43 18 -19 1 -16 24 17 14 -7 -4 73 -13 -11 17 -58
2707e8L9%N7l3J5j5k0n5O0Q2r6M4j4m9RK7J2Lm1M5k3m8P3L1j0L3m3m6M1j4k4j
$$ -58 -19 -19 38 5 20 5 -15 -70 -10 72 -24 20 6 -43 -34 -7 5 8 -33 12 -11 -59 14 45 35 68 25 -21 20 6 -18 -19
2739a9JP5p1M2j2k9j9J7q3R2J3l3K1l4Q0j7k9j5L2J1p2R8Oj04M9k6P5n6k9Q8n6
$$ -19 -18 57 -14 28 16 -13 -32 -15 -98 -6 7 -26 -5 -39 41 24 -5 -20 12 23 -49 49 55 -49 0 -26 49 -7 -36 52 -4
2770dO7p0K5k8N5m3J4l5%QROn2M9m6L7o1Q7m3JR4n8j6m3K9nk2M9j9O5n4Km2L0
$$ -4 63 -7 18 -10 45 2 16 -19 -19 -11 -2 4 -48 1 -45 -8 -69 18 -25 -24 70 12 -4 -47 -18 -23 -45 4 -15 50 -4 -2 -44 -14
2804a4O9j09L7L9o8L3M7KMl3j7M1On0qN9p4L3k9l0Q4k8k6J6RQk7J0M2j8M9n2K0
$$ -14 55 -54 -17 22 -46 -13 34 36 40 7 -10 31 37 -13 -21 38 -36 -3 -32 -62 22 -6 -32 -16 -7 1 -26 -16 26 8 57 5 25
2837B5k3MrJ3lrj1Nl0L9J8rp5Q3%kq7O8M8n9kJ6m7L3j1M7o6qJ23r2K5k0k6N4r1
$$ 25 2 6 -3 10 7 -2 -13 -8 -38 1 19 10 -65 18 18 16 -71 -3 45 -14 -16 0 -47 -14 -25 22 -44 -52 71 -21 4 -16 -42 12 -79
2872g9Q4q5Q3j22K62l24P9Q5L52l2n7m82L33q1l81N59j68J22k7J42j00l59L76
$$ -79 5 -80 3 -119 143 -181 -102 -17 335 303 246 -236 97 16 -365 194 26 148 121 263 163 -196 180
2895A80m09k59Q78o03O5K45k57K59k80J48m3J69k40M8K63l30J46Jk3q1L34l22
$$ 180 -229 -488 390 -213 -148 97 -160 99 -181 -33 -76 93 -147 -99 164 -166 -20 -19 -42 -123 211 -111
2917a11Q9J47k13%o5M15p7j06mk64J82o6N8j63O8J87R2j54k23L35J7k57O9J33
$$ -111 -22 125 -88 -88 -153 262 185 79 75 -189 -7 -73 -15 -178 -110 77 169 15 -208 127 144 -113 -44 89
2941H9n7k3j4K4o4n5K9J45K5k3j37j7J12R7jk31J31j37J50n4N3o7j1p2J39l9R7
$$ 89 32 9 -5 19 -45 -100 -71 74 99 76 -61 -78 34 131 130 -101 30 -107 43 -11 42 -25 -36 -108 31 -8 89
2968H9p3l3L49n57L54j89J55K3J47Q2k41rj82K19K17l16k23J92N1kJ48j65o2M2
$$ 89 16 -17 332 -225 129 -60 95 118 265 347 106 97 -85 134 351 35 -188 4 55 53 201 36 -26 16
2992A6R2j45O6o9M6ml1j7J13p7nj1Qj3J7m5L5M2o3K6QnK2o5L1L2nL1Ok3k7oO5
$$ 16 108 -37 29 -40 6 2 -29 -46 67 -10 -15 -26 -18 -31 -14 -59 -24 18 -45 -19 -11 -16 6 -59 -28 4 -1 30 36 13 -14 -20 45
3025D5m7j4J8K3J3j1k6J3mm0M0Mk0j7L%J2L3L1j25J26q3j1N8m4P5n4jj9l7O1l5
$$ 45 -2 -16 2 25 38 27 1 14 10 -30 10 14 -6 -23 -20 -20 -8 25 56 -69 57 -26 -37 21 -23 52 -2 -3 -22 -59 2 -33
3057c3Qk3K3O3q6O2%Rm4J4rk4M4m1QL3o1O2N0J4o4Qj6j9M8o0PM8J7r1K7j3L5M
$$ -33 -25 -48 -25 38 -48 14 14 23 -21 -7 -16 -40 4 -37 -29 4 -57 5 55 69 5 13 -3 -22 26 -34 -27 21 38 -53 -26 -39 -4 0
3091@nJ5Kl6rM6k5k3JJnK0K5J7J1J3n0L1L7q0L4l0L4j7M3n9jM0Qn5K1J8j4j%K5
$$ 0 -5 10 12 -24 -33 13 -12 -35 -34 -33 -38 -18 7 24 35 48 -2 29 66 -14 20 -10 24 7 50 -9 -10 30 38 -17 4 22 8 7 7 32
3127C2J0p4L7nL2j0Pm4J1qM1m2M1n6PM7o3K0M1l0JK1n9J3O3o3L2jN9r5J8J4j9
$$ 32 42 -32 5 0 32 22 29 -15 -4 -12 29 -13 28 -28 -21 26 -37 -17 24 -6 -5 16 -43 -30 33 -30 2 1 60 -35 -17 -3 -22
3160b2J7j4O2l7K7m5J8QM0r0K9m1lM2j8koK3K4pk1J8J0l2K0J4j4L5n5k3P6Qk0
$$ -22 -5 -19 43 6 33 -12 6 14 54 -36 -7 -48 -51 -9 -27 -29 -35 -12 12 5 -16 2 12 -20 0 14 0 35 -20 -43 33 41 21
3193B1L3q2Pj6L4n7Q1k4K5j9l2J7j8L5nK2l5L4k4J3qJ2j5lj6N1j2m9M9l9J9l9
$$ 21 54 -28 -21 -37 -3 -60 21 -3 22 3 -29 -12 -30 5 0 22 -13 21 -3 10 2 14 -1 -4 -20 31 19 -30 19 -20 -1 -40
3225d0J3L8%k9L9l5kK6%ol7M6K0J6q4N5j3Lk7M3j0n2L8j0L0N9l5j3n1K9p1K3L7
$$ -40 -27 11 11 -18 21 -14 -16 10 10 4 -33 13 33 49 -35 20 7 10 -17 26 16 -36 2 -8 22 81 46 33 -18 11 -60 -37 0
3258@N2n8J6nj4N7o6N5k8k4N0j7N8l5p1K9L0Lj0J9m3j5P1l7L0k4m1K3k3O9n1K0
$$ 0 52 -6 10 5 -9 48 -18 37 9 -15 35 18 76 41 -30 -1 29 32 22 41 -2 -17 54 17 47 23 -18 5 -18 51 0 20
3290B0N5p8lNJl8Q1o5L8K6m3KRj3K5j3K5l8j8lQ5j03M7j8L1Pn2m6K2O4k7K9m2
$$ 20 75 -3 -6 -1 0 -38 43 -22 16 42 -1 1 10 -3 22 9 34 -4 -22 -25 60 -43 4 -14 17 24 -28 -74 -52 12 -15 14 -28
3323b8pkO0m4K2l7P8n2L6l2prM2k1K8j8Lj03J04J0l1KK8m5J12j14J3j2j5P2m2
$$ -28 -35 -37 23 -21 1 -36 42 -10 26 -6 -13 -22 20 -1 27 9 12 -91 13 23 -8 -6 22 -23 89 -25 -12 -24 -39 33 -9
3354il7l3N8L3Pmn3L1k5J9j3k0M8j4J5J4l2J5OrN2n5M9k9MK4j1n0N0j8J3n6M9
$$ -9 -46 -79 -21 12 19 15 -38 -7 -32 -13 -26 -46 2 -12 3 17 -15 0 6 -3 49 -6 43 14 18 42 31 -19 31 13 26 -30 19
3387A9rqj0J2JK8j9l7J5k4K3k3J07n1kjn1l8O3k2K5Oj2J2N9j03QO0k4M3k5klM1
$$ 19 10 2 -8 4 5 33 14 -23 -8 -32 -9 -32 75 24 22 21 -30 -68 -5 -27 -2 4 -8 4 63 -40 -32 28 4 47 22 20 17 58
3421E8o0k0J1K4oj9k3O2j1l9jL1L1k0n1J04k4l1n1O0K3q9M3K0o6O1Rk0L3k5k5
$$ 58 -2 -22 -11 13 7 -12 -35 27 16 -23 -24 7 38 18 -33 71 47 16 -35 25 48 -41 2 22 -44 17 26 6 39 14 -11
3452a1%M8o0O4m7JJ6K4l5k1K4j7K2%l0J5K6M6q3j9j9N8r2R2m7mQ5Nm9Pjj3J5L5
$$ -11 -11 37 -23 41 -6 -5 11 35 0 -21 3 -14 8 8 -22 -7 19 65 -18 -37 -56 2 -90 2 -45 -49 36 41 -8 -1 -2 -15 0 35
3486C5lor9J06Np1J8mO7l4k6J6m0NN2j5L8l2K0p6N3n4O8pK6k2m4J0qpQrJ11J2
$$ 35 32 26 -73 33 38 -33 -15 -19 48 14 -12 4 -36 -31 21 6 44 12 32 -44 9 -45 23 16 42 20 -24 -14 -22 -29 -21 -30 81 93
3520I3q1Kl2q4L5O4l6J4K5l0K5J5l2L7n0K1pM6k8m1J8P6mon6L4n0J3K7Qn5L3m5
$$ 93 12 14 -18 -102 -67 -3 -39 -25 0 -30 -5 10 -22 15 -35 -14 -21 25 -3 -44 -26 50 46 40 -16 18 -32 -19 8 16 -39 -6 -51
3553e1O1K1j4j8M4l5k8J2O6n0l1J5K6o6J4M8j4k8L7NM2m9J0%j0j1j7qK5M3nq0
$$ -51 10 31 17 -1 43 8 -20 -8 58 8 -23 -8 18 -48 -34 14 0 -28 9 14 56 7 17 17 7 -4 -21 -29 -4 39 34 -46
3585d6O2n4N9MJ1o4j5L6prJ7L7n7L5k5kK6Nn5kJ7M2k0LM5n8OK0K5j2m0J3K5n3
$$ -46 16 -38 21 25 36 -28 -43 -7 -14 -23 -6 31 -26 9 -16 -18 8 13 -42 -44 -27 15 -5 -2 43 -15 -9 11 36 24 -16 -3 22 -31
3619c1k8L7n2O5On6P9o9L5O3o1N9p7N2n6M9O6p7J2k7J1L0q4O2l2J4l6R5J9q7N4
$$ -31 -59 -22 -74 -9 -3 -59 20 -49 -14 49 -12 47 -30 22 -34 15 81 4 16 -11 0 30 -54 8 -24 -10 -46 49 68 -19 35
3650C5j6m1k9J9L5L6lol6l2nL3k7O8o2L9J0l1k4j4O2j1j1N4j04J09j3Om0L8m9
$$ 35 19 -22 -51 -32 3 39 36 30 -6 -38 -43 -10 -37 31 -31 8 18 -13 -37 -51 11 0 -11 43 -61 48 35 41 1 39 -10
3681a0J2pqm0R7j49K85n82K49N14m39Q7LJ53j09j79J41k6mO2r3K3k4M0L0o0J9
$$ -10 2 -5 -13 -53 44 -105 180 -402 -153 361 -78 9 12 165 56 -123 18 -8 -12 50 -43 -20 -44 -4 26 -34 -15
3708a5L4j5Lk0%j1m7N9L1J6j5J2pj1QOj9j4L8l4Qml6O7k9k4oJ7L5Jl9Q0j08N1
$$ -15 19 4 7 -13 -13 -24 -71 -12 19 35 20 32 25 14 22 28 9 -5 33 -1 7 3 -33 34 5 -19 -25 -8 27 28 -11 69 -39 12
3742A2Jk4l7J2k1M1KL7m7R2p5MJ5M8n7j3j5N1j8k7lJ9M4l8L5l8m1N0n4M0J6l3
$$ 12 13 -11 -48 -36 -57 -16 -14 23 -24 68 -7 -3 12 60 3 -10 -25 26 8 -19 -22 -3 41 3 38 0 -41 9 -45 -5 11 -22
3774b2%O2k2MP9r0Kn1P6jJ9j12Q8o0O4p1K4L0rk0jNK3Qn6K9K2L3q8Q3m4l6J02
$$ -22 -22 40 18 22 101 11 13 -38 38 37 56 -56 32 -28 36 -35 -11 19 10 -10 -11 -6 17 25 -31 -2 20 53 -35 48 4 -32 70
3807G0p2L9l6J4J5m4RK4l0J6kl5O6n0L6qNj4rj6M0Jm1K5L8l2m0M9qJ1J1m1j0j
$$ 70 -2 37 1 15 30 -14 -5 19 -11 5 3 -32 34 -16 20 12 17 3 -6 -22 18 19 -22 3 41 9 -31 18 10 21 32 -9 -19 -20
3841b0J9M9l1j0K2k2n5O7J8l3L8l6PJk2K9Mo5M6QL0k4l3Nn1Q2L3q6K2l0K0m3M2
$$ -20 -1 48 17 7 29 7 -48 19 37 4 42 6 13 14 -8 21 25 -40 6 14 44 20 -13 -8 -59 23 56 -30 -8 -38 -18 -61 -19
3874a9P2o6J5L2l1j5L7k9j7RK3kL6j6k8j8L5J4Jnn1L0k9kM4J0l0j6NK5oj2l5L6
$$ -19 53 -13 2 34 3 -12 25 -4 -21 -12 11 9 45 29 1 -17 18 32 33 28 -23 7 -22 -24 20 30 0 -16 -11 14 8 -4 -39 -3
3908ck4K8k1N2K0m2K2j3mRn4L8M4j04Q1K2o1L8o0N7rm4K5k7L9k7P0j9Jjo6N0q
$$ -3 -27 1 -20 32 52 10 32 19 15 24 -30 8 52 -52 29 51 -10 28 -32 25 16 -28 -3 -30 9 -18 52 33 34 33 -33 17 9
3941Iq8L0PO1J4n8J1k3P2j0j8M1p5K8j6nj0kM1M4j05O1j5k9J0L4P9j07PL9k7N1
$$ 9 -79 -49 -42 19 33 -25 -14 -37 35 25 7 48 -27 1 -15 -20 -30 -32 9 53 -52 9 -6 -35 -25 9 88 -19 -12 27 0 51
3973E1p3L9L4r1P2j3jj4r%o2P4J3j7rk4K4lL9l0nK6l4K5Pp4Q5n9L0N2p4nN8l1
$$ 51 -22 17 51 -40 32 19 18 4 -5 -5 -67 7 20 3 -6 -30 -6 -9 30 0 -5 21 -13 12 19 -55 30 -29 1 53 -21 -26 32 1
4007Al1PM3mj8K3l0M8l2l3K7ll7J3N4m2j2N3m7P3j8m3OK5m7J9Rk0j0KP5m9J0l5
$$ 1 -30 -23 20 16 -2 21 -9 39 7 -26 1 -2 -39 -26 28 -14 -26 27 -20 53 35 -8 -2 23 -24 -5 4 -16 -26 -24 51 2 12 -23
4041b3k3Q9n2Rro9P9KN0k6Ll3K2lj2n6O5N4o5k0N5n5k8QL9oN7m3m0m3N9J8M9l0
$$ -23 -46 43 -9 0 -9 -78 1 3 53 27 30 -3 19 16 4 -52 13 67 2 -18 37 -18 -46 -38 1 -5 52 9 -31 -74 -15 3 52 22
4075B2n7O1j4J7l2Om0Ql6N6J2k3rrRO3l6k3Q3j9m1j1nmj4N4j8L1l0L9p5N7l6J5
$$ 22 -35 26 12 29 -3 3 -37 -29 -65 -9 3 -20 -29 -38 -29 34 -2 -25 58 39 -2 -13 -18 -22 -36 18 0 31 1 40 -35 22 -14 1
4109AK9jmk2L7l8k1k2N9l2k2O9J0p8L1L1l7j1KJ7pL2l6MM6j1o7L4J9k2k4O8o0
$$ 1 30 29 25 3 40 2 -19 -41 18 -14 -36 33 43 -35 -4 27 -10 -21 -19 -2 -9 23 -13 -9 37 26 -41 -7 12 -10 -34 34 -26
4142b6J9J1J7l4N0m9J4M0r1P8J6m1K4j0nj2L3m0l6N8l2%L7k3J6qmK6n6Q1Pq5J8
$$ -26 -7 4 21 -13 37 -12 2 42 -49 29 45 4 28 18 13 1 34 -6 -42 16 -16 -16 21 -2 14 6 2 28 -28 53 60 -25 -7
4175gJ6K6o6J2K7Rr3K8Q8l9J5m8L6J9k5%OL7l5lk2N3nj1k6K2m6N8j0Okk7K3l5
$$ -7 9 35 -31 -19 8 17 -76 -48 40 1 16 -32 4 23 -2 -2 4 41 6 3 -19 34 29 18 -8 14 -32 26 16 22 20 -7 16 -19
4209a9j5K4J3qk5kM3l1qOK5k4J3l9O1J6l6J7M3p7oN7Nn6L9K4l6K0mk4j2k7K9k4
$$ -19 -34 -10 3 -5 -30 -32 11 -20 -28 -22 3 -21 -8 -47 14 30 -6 11 54 -23 -29 28 33 -23 16 40 4 24 20 -4 -16 -43 -14 -38
4243c8R9m9Mk4k7N7J1l1ok0L4M3m5k9L0n2mO0n1K7k6L1l4P9j1j9k3qK9Jo0M1M2
$$ -38 61 12 16 -8 -35 22 33 2 -4 -24 10 53 8 -21 9 -43 -47 13 -38 -11 -37 -6 -40 39 28 9 -14 -22 7 8 -52 -11 31
4276C1n0J9kjJ8JJ8m8j1O5l5m9K7O1q5N8j9j5J6Ok4Ol6K7LNQ8m2k0rm4K1K0M1
$$ 31 -19 0 -2 -3 15 16 34 -14 -25 40 5 -44 -17 44 -41 17 -2 -17 -1 5 -19 -13 -49 -22 -19 -14 74 32 12 3 -41 -20 0 41
4310D1p5N6k7J9j6L5n3J6M4j5j9k8RJ4J6n4P0m4k0J07j23O3J9n7NN1Nn3l0N7m9
$$ 41 -34 22 -5 14 -2 33 -20 -4 40 25 6 -22 -13 1 17 -37 33 -11 -31 76 -47 16 35 -22 -17 34 39 -14 -44 13 -36
4341c6O9j5p5M8L9r2J02k8Pk%Lj6J5j5J6k0m8N9PJ8kq9P8M6r2N3j7lK7o1M8m6
$$ -36 33 18 -57 -9 30 -62 40 12 19 17 17 20 4 19 4 20 0 -48 11 18 36 34 -55 23 69 -23 30 13 10 37 -24 24 -22
4374b2O5r3M9L7Qn2mk7N7j6j4N9p5pK5J9j9j8Jl6O5kNq4J18o4O5K8m0k0K6m4N1
$$ -22 43 -50 -1 36 44 -8 -12 -39 18 2 -12 47 -28 -35 -10 9 -10 -28 -27 -63 2 0 5 -79 39 -25 40 68 28 8 34 -10 41
4407D1Qj6jk8J0rn4K4J3M0L6o5J4N7m3k7mK9o4MML1k9oK7L2J4m4K4l5M7o0M3l9
$$ 41 49 33 32 4 14 5 -49 -25 -12 28 64 -1 13 70 27 0 -4 25 -39 -35 -31 0 -29 -35 -8 24 38 -6 18 -17 30 -30 13 -26
4441b6M7pK3j09P0m2N3K3l9K3j0J0Qj1n0O0l4K5n8P2j2kL5m3J8om2L7L5p8M8k
$$ -26 21 14 37 -72 -2 -44 9 32 -7 16 6 16 24 13 -37 23 -11 14 -44 28 16 14 49 6 24 18 -24 13 48 -30 18 16
4473A6n2P3k1K0rl2j6J9J3m8J4J8K1j2rj6K7m0M8k9L2kk9Pj7LL4m7O5RRNn5N5
$$ 16 -36 37 16 36 27 -5 -21 -2 11 -37 -23 -5 16 4 -5 -21 6 -34 14 -15 17 15 -14 -7 -24 -21 13 -34 31 40 49 54 -1 54
4507E4j5l6m0O0j7L1o1O0o0k4L7mj6nL1K4l4L9m8K1nl3L8N5k5m4K2lJ5K6r7L1
$$ 54 39 3 -37 23 6 37 -24 36 -24 -48 -11 -15 -31 -36 -5 19 -15 24 -24 -3 -8 -41 -3 52 27 -17 5 2 17 43 -54 -23
4539b3J6m8M4L6k0K6j6pJ0J7l8J%J1K6l7k2qj7L9L1k4K4q6J12p8pL6oN3q6N4j2
$$ -23 -7 -55 -11 25 5 31 15 8 18 35 -3 -2 -2 9 35 -2 -24 -32 -49 -10 21 -3 21 -65 47 -31 -38 -2 -8 45 -41 13 1
4572AO7o0k2l0J6K0k4L1Jk3J1KR2l7n9K0rK8n2k3M2N3K1p8J4j5j3J0k9N3j7M2
$$ 1 68 8 -14 -44 -28 -8 -32 -1 0 -23 -12 -10 82 45 -14 6 -3 25 -27 -50 -8 45 66 -12 2 -13 -26 -16 -45 8 -9 33
4604C3m4M6n0l5M1K3l3L5m3J8NM2m5j4Q4n3m7J5P9j6q0LN1k6K5j8J3Jkl9K4j1
$$ 33 -11 35 -15 -50 -9 14 -19 16 -27 -9 -4 38 -7 -21 63 10 -37 -22 57 41 -39 -36 15 -11 14 -4 9 10 8 -31 -7 -18
4636a8M6K2k5oK2n3o0O7l5Nj4Q6Rm7M1Pr1P3lj7n7R6k3l1J3KL9l7l3k5M5NK3j9
$$ -18 28 50 25 19 41 -12 -72 -5 -40 -35 -49 37 46 -1 40 47 -44 29 26 9 -48 48 25 -6 7 9 48 11 -22 -47 -2 3 26 7
4670Gpm5K7Q1o4RQPr1J03jp8J6J9J0o3L2O0m9QN1o7k7P6n7P9o7K6j5K5l0nj4R0
$$ 7 0 -45 -18 63 -1 8 16 23 -68 35 34 -44 -28 -9 1 -62 -30 30 -19 -11 40 -27 -54 22 -35 44 -23 3 -12 13 -17 -22 -36 54
4704E4m1L1M5r8oNK4KJ8m6j7J2K5J1o7O2m6L4m0L4L3p2P0m5jN1n3j8M2O4q6N3
$$ 54 13 44 89 -9 -15 -10 14 16 34 -12 -29 -17 8 19 -48 14 -32 2 -38 -4 29 -43 27 -18 -19 32 -21 -39 3 67 -19 34
4736C4k6K9k4m8N6k6PnkNl7JK0L3J3j09K0Q6l8O6nm3pM4K9r5K2Pq3J22k2l2K4
$$ 34 8 37 13 -35 21 -5 2 -3 -5 0 -37 -36 -16 17 30 -79 -59 27 -11 55 50 7 0 44 73 -22 0 7 -76 46 24 -8 16
4769A6kn9J11p3m7N1m5J9M5J2o0L2j8K1RL5l4qO0m0Ro0K9j2L5J3l8l5L1qm1N8
$$ 16 14 -45 66 -7 -54 -3 -48 -29 16 28 -32 0 -18 3 12 47 13 5 65 25 34 -26 3 -9 26 39 1 -34 -3 -11 -52 6
4801Fm4L4M5j2n%l4J5Pk6j3K6l1oLM7j5k3K2J5jj2j2M8l6qj7j0M4K2l9L1nk3L2
$$ 6 -38 -4 41 29 24 24 -10 5 12 -14 -27 -1 -32 -38 -35 12 -3 -26 -4 11 10 -2 -14 34 -2 -10 -27 -37 7 29 -10 21 16 -7 25
4836B5q0J3R3nl4J5k2m0M2k4L5j7K5n6Q2k8k9M8n5lJ3j5l8L9N1l7M1o1L9l4L3
$$ 25 -55 -42 51 46 12 27 5 -35 7 -17 18 1 26 -30 52 24 -5 43 -12 -15 -2 -17 -55 -16 35 -2 39 -22 17 -17 16
4867A6k2j8M6oL9k3j6j2jL3p5N3qJ0J6j3k3ppJ8K5oJ3j32N0Q0ln4M2l2j2K5pp
$$ 16 -6 -24 22 16 55 32 16 4 3 36 -39 14 6 16 32 19 -4 -11 -18 0 25 19 32 -100 -50 30 27 -27 15 -17 -29 -4 -11 -18
4901a8J2m1Q7j2j9j3k5k9K1K6J6j4N5p9OK4l7M0M1r1O9j0N8j00O4m0MmJ3l0L4
$$ -18 -6 -47 40 28 9 -4 -29 -58 -37 -11 5 -9 46 -33 -27 -3 -40 0 41 -50 19 9 67 -33 31 -9 -5 -9 4 -26 8
4932HOj3jK3J8o6LN8L8k1km7j0J8j4J9K6j4Mo3J1L7l1lL3o2L2L7k1kj7MO1p5J3
$$ 8 14 1 0 23 41 -25 -22 36 74 53 51 4 -6 12 -2 17 43 29 33 -30 -19 18 -13 -16 17 -45 -13 24 3 1 -16 -12 49 -26 -13
4967a3L9k2PJ1Jrj1j7L3OJn2K0j2nqj9Q2m8K2Jj2k9P5n1k5J3M6Ln7O1j8N8o2R
$$ -13 26 4 11 22 23 14 3 -14 19 25 26 -26 -6 -18 -23 -31 -50 32 -16 6 7 -5 -34 41 -10 -35 -22 24 27 -30 31 13 71 9 18
5002A8j6L2l2K4k3Rj7N0k1j1k4N0J5p0J4K9Qj0KM3r4PJ6j1kL0L3j0q4N9K9Mj9
$$ 18 2 34 2 26 3 12 -5 45 24 13 -11 39 54 -16 -2 27 35 25 27 70 -24 -17 -1 -12 -14 16 49 39 -45 14 43 47 28
5035B8m4KlNL6j8K4kl0k1M1l2l3O7l1N3o9J9rQK1Kll7M8j5m1J7PQ3q4l1N6q0L3
$$ 28 -16 -14 -17 -12 24 6 30 28 -2 -23 18 -14 -47 20 -11 42 -27 -8 -17 -9 12 14 11 -26 22 7 -34 -17 -10 73 -11 -42 14 -66 -33
5070c3L5nP2n3o9J6N4j8J2nK9n7K6ONj2OOq2N4M0ko2J7J9K2n3QL8%k3M9j5q6M7
$$ -33 2 -3 69 16 -53 -37 17 -1 11 6 35 -22 4 10 15 3 9 15 -67 -13 27 25 -37 -20 -1 21 -32 -24 14 14 -9 40 25 -61 -14
5105a4l8Q4j9j9l3O5L0m2nj8jj2N0n5jR4r4M1M2l8lQ0j19j4Q9o9K1M6m7l2L6l
$$ -14 -52 32 13 -6 -39 26 56 14 9 -9 -10 -22 28 -27 -28 66 -28 13 55 17 14 94 -25 -39 50 -19 2 48 1 -31 5 2
5137BJ7j7L2k6m1J07q2J5Lj6K6M7o2l2L3m2L8N0j9m7j5J8j0M4l2NnK7m6K0n1r
$$ 2 19 2 34 8 -33 74 -8 7 10 -6 20 67 5 -27 6 -36 2 52 33 -14 -29 -11 -21 23 -9 -4 -9 18 -28 -8 -59 -68
5169f8O3P2q0M3j4l1L5om6Q7q2P4n5LJ7J1j3l7M6p2L7L8k2K7j6Ll5l7K4jN2j6
$$ -68 -5 67 -13 30 16 -15 20 14 -32 55 -27 47 -8 -5 12 23 10 -27 19 -53 -16 22 0 27 11 14 -21 -58 -34 -35 17 1
5201Arl0Q7%k8l9K7J7Kj1m6J4k8M8l6P8n4rK1k5P6n9k5K5Prk5J3mJ4kRL4L2q5
$$ 1 -8 -38 49 49 21 -18 9 26 28 17 -29 -15 -43 5 -31 47 -7 -16 5 -20 56 -3 -28 -3 4 -5 -30 -17 -21 -7 -9 0 34 66 -19
5236a9J4j4L4j6k2K2j4P1m4j4l2MN6km3k5J9ORM3o2N2l1l2KN5l0KK2j0Nl3M4%
$$ -19 -5 -19 15 -1 -23 -1 -15 56 12 -2 -34 -30 26 24 -19 -44 -25 -19 -10 33 -29 23 -8 -40 -38 17 -13 -11 11 1 6 -27 17 17
5270A7LJJ0M4o7n0LJ3pK5k3O3Pl0kJ5k2rrL5KJPq3N1JJ6kJ6k9PPk4K5j0K0k1k7
$$ 17 20 21 31 75 8 -42 -39 -26 -33 -8 -31 32 39 9 7 22 0 -9 -18 17 19 20 27 -56 -5 -4 12 10 26 -3 4 11 -13 12 2 22 1 -26
5308b6K8J5Qk8J1L1l7L1Pl6K0Nl2K9o8L9m0Q7n5pM3n6M1j3k3PQQ2l2q7R5k3Lm4
$$ -26 2 17 25 -3 8 39 2 33 40 4 24 29 -3 26 -42 -3 -43 44 -11 -18 25 -31 10 -3 -26 -19 -11 71 39 -48 47 24 27 -17
5342a7P1j7m1%n6R4pk5j7k4P5k1k3L7k5Q3p2k8kL2K8o6L6K3j0k3Ql9N8j0n6K3
$$ -17 54 37 -4 -4 -60 34 27 2 -15 -39 36 15 -8 29 4 87 15 -13 -15 17 45 -21 15 38 28 5 13 -26 32 22 -34 -11
5374a1J5n3K5K1k1R1n4Nl3j1QO1n1l7N6k9Q0k0Ok6nj4l1P2k1L7n3P6q5K6k0L3
$$ -11 4 -49 -24 -3 -24 67 13 18 -15 -26 -18 43 -8 -45 11 -18 62 42 48 22 17 3 -28 44 23 60 7 83 -2 24 4 37
5406C7j00P5lJ7Np0L3k9K8K5n5M6n1J7j9LO1K2n3K9j6l7O2j5rkk5N5k6M6m2l9
$$ 37 -63 12 9 26 31 -39 -6 -35 -7 18 -37 9 -42 -25 -44 -41 20 42 -11 18 2 -35 27 12 3 1 -24 31 5 51 9 -30
5438c0J5L5j0pl1P0l2l7LL1nK7l1k6M3j0o8R9L0j24Q3K2p5Pq1P0O4p5l6P9o0k54
$$ -30 -15 20 10 3 -28 42 10 -27 -24 7 2 29 -2 -28 15 5 -63 36 66 -58 25 47 -28 -21 -102 -32 32 -43 -79 0 -60 -314
5470c14O00j12k85L19k17j58k1K56j40k45K16l8k33N07k13N0r7P2L8j17K50k66
$$ -314 286 174 -111 208 -9 -167 -188 68 -72 -317 -101 -139 -372 135 -78 -28 -125 -53 -15 -132 118 -148
5492a48K44k32qK79j22m0NJ41l60K84k5J53m2j30O8j28J62k00K5o1J16m5k8o5
$$ -148 96 -136 -144 135 13 -27 -22 119 -241 43 18 171 129 -1 67 -61 101 -99 -74 -135 -19 -64 -92 -157
5516a57K15P1K0j99J89j50J82o1p5J31n3n3K3j25j75L31j79J59j23j13K9K28j78
$$ -157 58 129 149 -50 139 -11 171 110 35 166 113 60 83 -42 -217 114 -65 94 -29 -142 -113 115 -63
5539f3J51J51k03K9K50n35K30N3j27J61j86J32M1k34K42k62J12J35j5j29o5J5
$$ -63 88 239 36 65 315 -220 10 63 -64 97 -89 43 84 -150 92 -170 -58 77 62 -67 -132 -117
5561a17q8J10P5K0Q3m3j41kM7J21n8j42J10J48j63j66J22p7J72p8J11l5m8K25
$$ -117 -205 -95 -20 0 83 40 -101 -103 -56 65 7 -135 -25 123 -40 -206 -84 -161 11 -67 44 9 -39 186
5585A86k61r7J78j52m2J12l4J39O9q0M4mQ0p4l2o9L5M0J9j07Q0q9J97j52JMk9
$$ 186 -75 -172 6 -146 -188 -76 -110 29 98 18 62 58 138 64 32 -37 -2 38 57 -50 30 -59 138 -14 -13 -9 -38
5612c8J51R5j32l1j74M8K51k30m6k2J72j30K12n4k14K13l01K69o6OK6k1N0k76
$$ -38 113 208 76 45 -129 -81 170 -60 -106 -128 44 -86 126 72 -142 71 -230 39 -27 -21 5 -16 34 -242
5636b42K84m3k15K36Op3j09M72l21J29l40L50j82k33K52K47k62K58r0o67M17K48
$$ -242 42 -1 -216 20 26 -47 -156 316 -5 124 -216 134 -48 -281 -29 218 -44 214 124 -543 -126 122
5658A22J02o9j51O2J50m81J46l31O72l69N6Q3l6J8p2J74l7M8j45J05pQ8k08J3
$$ 122 224 155 4 66 216 -265 -119 -450 222 -147 -91 -8 -44 -26 -98 76 39 87 -58 47 40 128 -80 -67
5682f7J63q6O5j10J36pO0k12kM0k2K0KK2P4q5N7nl0j1m1M0Kj0K8Jn1KJL1K4p1
$$ -67 96 10 75 -35 101 94 154 -58 -60 -20 -42 -22 -20 2 76 -9 48 43 13 2 -39 1 3 -7 21 22 -29 -27 -26 5 29 -42
5714d2M0J9K9j41N8M2m7O8m5L1Ml5L1mK4k4JK8q6K1N5p1O1k0%qM1Nm2j2J2J6j
$$ -42 -2 17 46 -95 -37 5 -42 26 -19 12 16 -19 12 8 32 8 9 37 -49 -28 27 -44 17 -3 -3 -11 30 35 -7 -19 -7 9 8
5747Hk0j6J2O6J1m9l1lM1j2o0M5O0m6l4J7k3L3l4nN3j0oKL6o1J8L8k9JK3j3j9
$$ 8 -12 -28 -16 50 61 12 -19 -22 19 7 -53 -8 52 6 -28 -11 -34 -1 -35 -40 13 3 -3 -1 35 -26 -8 30 1 2 25 12 -7
5780gK7j3j3QN0l9n8M6m2K5Q9n0l8lK5k1J1K1l8K2LNj2K3j6j9L7k1Qk4K4j4oR
$$ -7 20 7 -6 2 52 13 -45 1 -41 -16 73 23 -15 -18 7 -14 -3 18 -20 2 5 10 -2 21 5 -14 23 2 10 -14 10 -4 -10 -1
5814aJ8j5pN0m2KJ8k2n7L2%P4q0K4j1L2L5k8j3O3r4L6j6l0Q4k6J6n1rk8P1J1n9
$$ -1 17 2 -5 45 3 5 23 1 -56 -24 -24 50 -30 -6 -17 15 50 22 9 72 -22 14 -2 -32 52 26 42 -9 -18 -46 25 36 -23
5847b3j5K8L6n7K9rOJ3m0P0n6rM0Mo3Q1J8j05L0J1J7mn0K2jMLL7j2l7P9Lq5R0
$$ -23 -38 -10 26 -31 -2 -11 -5 8 -32 38 -18 -27 13 17 -46 35 53 -52 -22 -11 6 2 -48 -26 -27 -23 -20 17 5 -32 47 50 -35 55
5881E5n8l6rO3N3r0L2kL0L8k3k9q6L6M9J2J4m5l9O2j4n2N0lo4M1pK9k2LLO1J3
$$ 55 -3 -39 -48 15 68 -22 10 8 38 76 53 24 -62 -26 23 35 49 4 -35 27 13 -39 11 8 -56 -15 -22 7 -15 -12 -9 52 65
5914F5q3j4K8J2m7OK6Rn5OK7K2kl4R1L2l7m9K9q9Q3Qj0j7j2k7M0jL6l2J7k8p1
$$ 65 -18 -32 -4 8 -39 -33 -7 2 -53 -47 -20 2 0 -34 57 89 52 3 32 -57 26 34 24 7 -5 -32 8 7 43 11 28 0 -71
5947g1J20n1J8kN0l7N9m8l9j9N2k8%M8Nm5k6M3q9O6K4n7N3J0n9K0OJ9o5O3Jl8
$$ -71 49 -2 16 14 64 27 86 38 -1 -20 32 4 4 52 57 12 -14 29 -60 6 30 -27 26 36 -23 -3 3 22 -43 20 21 -17
5979a7oM7M8n7L0q4K0J06l5l5qm4JM2P%l7j1M5k9j4O0o2J6K6RK6k3n0KK5ML9j3
$$ -17 -23 24 72 15 45 -39 -19 87 52 17 9 -35 -34 8 15 15 -22 -33 12 -17 -31 29 -33 -17 9 18 44 21 -29 -27 -2 2 41 28
6013B8k6Kl5N1k9j7K3M3o5J4k1J7k9O5Ok3j4J8k3K2l2J9L1j05Q4l7L2k8K2l0P5
$$ 28 2 4 -31 20 -9 -26 -3 40 -25 -11 -32 -15 -44 21 27 4 -10 8 -15 7 -25 -6 25 -80 4 -33 -1 -29 -7 -37 38
6044C8o8L4j3oK2L5q1L3J1J9n9N1k6j8K9O2pn2M3j3k5QKk3M3k0K7o4j0L4m6N8
$$ 38 -30 4 -9 -15 7 42 -39 -6 5 24 -35 16 -10 -28 1 63 56 4 47 34 9 17 19 -4 39 19 46 -18 -28 6 -40 18
6076A8L0r5L0MK0k7K9L6n2mk1K8j1K7k7N4k4kM3n3k2P2m7qn1K9M2o0R9r2j2k5
$$ 18 48 -47 -17 -13 7 -20 9 45 -7 -11 -32 -4 -15 12 -15 39 15 13 56 3 -19 53 6 -2 -53 -24 18 -42 57 -35 -47 -72
6108g2R6nm3NM4n4K8K4Rj4p6L4N1p3O6k5k4J2J9mN6p6L2L3m7M0o1K3J2pj5Ok6
$$ -72 24 19 -24 -19 25 -29 -1 23 32 18 -58 -24 27 -46 20 -5 -29 -17 2 -2 54 -22 10 43 -4 36 -25 -2 10 3 -12 -6 -32
6141c2M9Jq2J06l7j9L6n5Q0m5L5q1O2K1m7LJ9m1K2l8J08m3o1OJ4j1J1l0J9L7k2
$$ -32 17 18 -64 42 5 -14 22 -33 47 2 37 -44 18 39 -8 -5 14 -27 -5 -43 65 22 -39 -33 -19 -30 -19 -49 -30 7 -15
6172a5l2P1k3mm7L6OK0j8k1L3m6L8Klk0K1m9O7m0M3l7L5J1J5o1N3l8n1L8NM3k0
$$ -15 -47 24 1 -3 -50 -14 -8 12 -6 -27 6 -40 -2 0 -3 -23 -2 -51 16 -24 19 -18 17 28 43 -18 35 -3 -54 -16 -11 32 12
6205A2nL3q2Q0l6J1j0l8L3j5j1K0J7l7O7l9K0k5Qo8R5m8rk8J14l8l0n5L5l6R1
$$ 12 7 40 -42 38 2 13 3 -35 -2 -17 -28 -8 9 -28 39 0 20 -5 3 -65 30 -18 -27 -55 59 21 -9 -64 -29 -65 26
6236B6L9m0l8M7k4K2j5J1l6Q4j25R8Po5k5M6j6m3M5j2P2n9J9k1Ol2Q8k5j12R4
$$ 26 65 25 -13 34 10 32 17 28 -8 76 -49 49 56 -9 -34 12 -4 -47 -2 -14 58 -1 18 -3 3 -29 59 34 -78 16
6266A6Nk8k6N9Jk5m1k4K1O1j7K7no4QK6J9o9M0j1P2j6j5nj1j7llJ2O5j5k3J3k2
$$ 16 21 -7 -33 26 27 2 -39 -63 -42 19 2 29 24 -40 -32 -6 13 -56 -16 -27 45 29 14 9 -2 -19 -22 -25 -13 52 37 14 27 5
6300EJ2%k5R0n0r5j13Q1L5J54n7k01N7L46q4L7k73M2R0k09L99k36J91n25j54L51
$$ 5 17 17 -8 82 32 -63 -176 -95 -60 94 37 -164 -107 239 155 192 -81 -39 51 -158 241 5 196 -329 -483 -132
6326a32L63l07K87r2n7j68R4Mo4k2n9L61k80L0q8J99K32q2K28l41k85n2J82J60
$$ -132 231 -76 211 119 62 -106 -12 -8 -72 -94 -153 208 -72 -42 -130 69 301 219 447 106 -179 -231 -49 111
6350A11k01J6J18J90j76k55J28PJ93j71j8J64N3j43j71J99n0L2j26j4J29o0R4
$$ 111 -90 -74 44 234 58 -197 -69 -62 131 -40 -58 106 159 16 -155 44 -6 26 -100 -114 15 -45 49
6373D9j4n8M0O7j09O7k1K1m9J0J1J0p1O7J3m4j1jJ4jQnN1q0M3K0lk8N5l4n7J6
$$ 49 35 -23 17 84 -25 42 21 42 -7 3 14 24 -47 20 33 -11 -22 -23 -9 -10 -2 -7 44 -36 7 27 24 -4 51 17 -40 -24
6405b4qL8n0J2P9l4K1k6k5O0n2m2N3NJL9p7K6K7Rm6J8K0OoJK1q1N5n6L8pL7n2
$$ -24 -32 6 -44 -32 47 13 34 8 -17 43 -9 -51 2 7 8 47 -30 -4 23 32 -14 4 24 30 24 25 46 -35 20 -36 2 -5 32 -20
6439b0L0rJoRK3Qm9P2n9J1lrM3k8pj2nN6p4R4p2O8m7j3M9n9LO3l6Rl9J9m8K6Q7
$$ -20 10 1 2 -4 5 28 36 -13 59 0 11 8 -1 42 14 7 -5 -10 46 -28 66 -6 62 15 2 51 -8 -5 58 22 31 -8 11 -37 -11 76
6475G6k4l1j0j5nL4k7MK9l3j0K1m2L5J1j7Ln8N1N6ql0Om6L4m3J6L4J0k9j6M1J6
$$ 76 52 21 11 -4 -9 25 -2 2 31 -2 -12 9 -33 2 13 -4 -1 -59 -8 48 40 10 16 -30 4 -39 -23 11 21 -8 -24 17 33
6508C3p9J00k2o1M2n3R3n0K7l6J7%l7M6p0L9lk4N4pK8l8L2j0n0R5j11R8j2n4N3
$$ 33 -46 54 32 -29 13 -40 53 3 30 -6 11 11 -26 20 -50 -11 -14 -38 16 9 37 -1 31 21 -29 66 -45 53 41 -13 40
6539D0q3M1j8N3lnk0o8Q4k2m1N5K5o7J4N2k7mN9n4j2j8K2J1m9P1m3J2J4l9Nnj6
$$ 40 -43 -2 -20 33 30 25 5 -63 21 -1 -42 13 38 -29 -15 37 10 6 65 11 -1 -19 3 14 -35 36 -7 5 19 -20 -15 -20 -36
6572c6Jj9QK0N5J6p3J3N1Qn5LK4k4K4Pk5j6kK0J2M8n5K8q0R5m5pK1k8K0p4O6n0
$$ -36 -35 -54 -46 -26 29 45 -28 -15 36 44 -11 -8 16 -8 16 23 -2 -18 -20 0 12 60 5 33 -47 48 3 -4 17 -11 9 -65 1 -49
6606d9J8OJ1L4pK8o3L8nmpqJ8m0N5J7n0J8n1P7Lq0N2l7J4Nj4L0K7m4m2M3pK7k3
$$ -49 -31 -25 -14 20 13 41 -22 16 11 7 0 -8 10 -30 25 42 -8 10 -41 36 39 -41 11 -26 -12 -7 -21 9 36 -8 -50 -7 -14 13 -10
6641a0j6M1p9L7O3l2l0J2M7k2k6PloJ7J2j5Q2q4j4llk0N5Jj6LO2j14R4n8L4m6
$$ -10 -26 15 -64 -27 36 4 -26 -14 33 11 -15 -8 -11 -17 0 12 -3 79 -5 -19 -22 -25 -45 10 11 -5 -2 60 -54 40 -18 16 -30
6674c0J0N4Jl7OJ6kk6M8o3N8jk1Nlj2k7M8o5Q9p0j3O0K0j1p2N1k3lj8L3Mk0%J6
$$ -30 -20 34 35 -2 4 20 18 -8 40 -23 35 34 13 18 15 3 -24 24 -41 48 -22 -35 25 45 34 -38 13 -10 -13 -31 2 6 -14 -14 2
6709B%J2K1m3N4n5l3J0lM2Jq3M6O0J1n0K0J4LKJM2n3Lj9k2J9l2L1oLK0qpo6L1
$$ 2 2 14 35 -8 46 -9 -42 -32 -35 7 8 -75 -29 31 42 -8 12 26 29 31 32 74 21 24 5 -17 2 -30 1 -5 -2 18 10 3 -63 -32
6745c2M5l9rK6k7N0%kkP2l9n6mNJk0K8kL9m9M5j4o6K6L1LL3q0J9jL1m9nnqO2p
$$ -32 13 -26 -35 -9 -36 14 14 12 10 82 43 -13 -17 -12 -11 -31 -3 -5 34 -15 30 16 -50 -24 7 10 43 -37 -18 -19 12 -37 -42 -47 -55 7 0
6782@J9Mo5N9J0p9J1Kj8L3LJ9k1kJ9rQK3qL3l6n6Q2l6MK4Oo3jM4m6J4Q3o8M8o5
$$ 0 19 23 -42 17 27 -52 -41 -39 -57 -24 -21 -2 -23 -25 -6 -15 -7 16 8 41 5 -51 31 -5 -1 23 29 -34 -35 9 -37 -23 60 -8 40 -25
6818b5L7J4r8J20j4j21R8n4O2j6RPm3N7j7k2J6k0P1No0Rjm5P4n1L6n8N8k4l1K9
$$ -25 12 26 -72 48 34 -87 11 -43 19 3 12 19 -24 33 16 -6 10 -10 61 66 6 15 14 -31 43 -8 28 -30 28 4 -27 2
6850Bk6P1m4J5m2M3n9J30k9n3l1rL7j2LRQj5k4O1j0q9N9O7o1L2mkl4J6l1P1r2
$$ 2 -24 47 3 18 -24 19 -40 90 61 8 -23 -32 5 -7 -4 5 13 -2 -26 35 25 -64 -5 62 1 33 29 27 -7 9 -22 49 -43
6883d3M2Nl5K0M4l5P1o9L0OL6p5qL9j8L2m4l2M7m1J9J6m3K3lJ2lJ2k9J4lQ0n7
$$ -43 -1 4 -31 -11 33 -2 69 0 30 36 72 -3 -11 28 10 42 -2 -34 13 -28 -9 7 -36 -13 -16 -4 -7 5 -24 -10 -13 67 10
6916A0k2J9m2oM8l3J0j1M3nm8k2L9M4mQk9J6K5m3J8m6J0K4L1j2KJ2Kro0O4o1o0
$$ 10 -12 7 -35 -41 7 -26 -16 -27 16 11 -37 -59 -20 24 20 28 -1 15 40 -3 15 -31 -21 3 34 22 24 36 38 29 -31 33 -28 -88
6950h8M3J00o3K4j7KLL6l9n9M8K3m7LM5n3K1LKL8nM9q6NK9k2Mk9J04q4K8k3J0
$$ -88 -45 55 -8 16 -1 1 4 40 1 -58 -10 13 -34 -31 14 -39 -18 -15 -13 25 20 69 -17 -12 17 -5 -1 -30 74 -10 18 -5 5
6983E%Kl8J3MK1pnPm9J8Nj4J3j6k8O9l4J3%J06o8Jl6K7Rl1P7n0p0R5l6J9m0k4
$$ 5 5 7 -31 -18 -14 7 0 -5 2 -47 -29 -24 -38 -25 -41 -69 0 -34 -21 -21 85 17 18 -18 9 18 -13 64 14 -56 39 3 22 -18 -42
7018d2j3M6oJ2K4q1N2K9q3J20n4JQK1J9o5J6n7M6P7n8l7k8J6N2n0j9P0m7N3k4
$$ -42 -55 -9 -15 -3 21 -60 -8 21 -62 58 4 5 13 34 53 -12 4 -53 -7 70 12 -25 -53 -37 15 -35 -54 16 -31 22 -2
7049bqK2p4R1m3n5M0jN4m1J4k6L1L0l7J2k9P6o7J01m9o0k9L4J3l0N0m9M9o2J7
$$ -2 -10 12 -62 29 -14 -69 -29 -30 24 -17 -3 -29 2 32 -5 7 -22 54 -13 88 39 -21 -50 -16 -3 -33 17 -32 17 -45 -28
7080b8PO2Jp0k0L2NO5q1K9RN5o3l8N8k5L1p8O5KJ1J3Jj2j6J8rp8P7Qk9j7%Oj4
$$ -28 -21 41 42 -28 -48 -16 -11 54 -27 2 11 66 3 -35 23 -2 29 -49 16 18 29 42 43 31 15 33 24 -54 23 31 2 -15 -15 -9 -23
7115b3j2Q5j17M6L3J3m6J8%j1Pm6L4L2L4n1J2Qk5L0ojMnj2J3j3KL0o7J2O9n2o
$$ -23 -35 50 -67 -21 12 25 -21 -3 -3 -14 -7 -53 -19 13 47 -4 8 16 -9 21 15 14 18 13 1 14 1 3 33 -34 -22 47 -5 -11
7149a1PJ2L2N2o0J9l5Jj0n6N1j3N9j6k1N4p5K2k1k0L5N0p0K4j1K5q5R3r0K0N3
$$ -11 -4 8 40 92 32 51 16 17 7 -49 2 -11 48 32 11 65 -10 12 -9 -29 6 56 -14 10 -1 24 -61 32 -58 -38 15
7180A5k9K0J1M7n7Nr0O1L7m2L2nk7J8L9j9l3J5M0k9L9m3J8j7M4o6K4j5n8J12j8
$$ 15 -14 6 17 64 7 12 -78 -17 20 -22 10 5 -22 -4 35 16 -17 -2 38 9 48 5 23 6 50 -16 8 -7 -65 47 29
7211B9l2%K1k1rk9K2N1oJ5o7L7L2l3l9N2M9o3j8o0O2N0m1m7J8L9QN4k5ok3p9R0
$$ 29 -3 -3 18 -3 -12 -41 -19 32 26 41 -26 11 43 10 -29 23 72 9 -9 -69 -7 43 2 -45 -27 12 20 74 49 43 20 -59 31
7244C1j0j3l0J1Rj4J0J4l3j9J5J03r8M9j3k2M0k7j4N3m7K7nk8M3m7N7l6J3Oo3
$$ 31 21 8 -22 -11 -2 -16 -6 8 -25 -44 -29 74 -24 25 12 -10 30 3 -11 42 -5 22 17 -11 32 -15 42 6 19 25 -38
7275c8K9O6o8N3q4R0l6j1k0O9k1nL7l4n2J6L3l8lN8m1NQL1j10O4k1O0n2k2M1j1
$$ -38 -9 57 -11 42 -42 48 12 1 -19 50 29 24 61 27 -25 -9 24 -14 -17 41 0 5 13 44 -66 -2 -23 37 -15 -37 4 -7
7307gj7N1r2P7mj3M4o5j3O1Mj3l5Nj1M3O1r0kJ9j9j8j5K5N7m3K6j2Rk8L8n1NJ7
$$ -7 -24 27 -65 12 8 -5 39 -26 -39 22 26 13 -22 -17 -28 15 76 -14 -16 3 -16 -34 -49 -24 33 -10 16 4 13 -15 23 -28 -23 -6
7341fj0rK7K1p9L8L8m1M4m4j9J9J0k3M0N3q5O4m7J4k4kPj2R4p3oJ0%qN0n1RP0
$$ -6 -16 -25 2 23 -56 -18 20 -21 23 -21 -40 -21 -11 -34 6 59 -26 38 -9 5 -19 -21 -14 -26 68 -5 -11 -1 -1 -9 41 -10 -1 69
7375F9o7jjj2K0mj8N8r9L4nO8l9L9l5P5p9k2KN5q5L6mPj9M4j9J8m0k1M9KJ7Jm5
$$ 69 2 1 0 -12 8 4 -14 44 -55 -21 -26 42 3 42 7 82 3 -19 -17 38 -47 -11 -15 -8 -27 17 -2 16 -24 -45 4 6 23 24 -21
7410b1L1j8L9l6k4Q1l8l7MN0j5k4k2R1k3m8PJ8J1J7l7n0L3j0l7J4N6j6J6J4J3
$$ -21 10 -8 31 -5 -29 52 14 -23 -19 31 16 -8 -30 61 38 -10 -3 15 26 43 6 -44 -11 -21 -58 -44 12 -4 12 26 39
7441C9p1qO6K7Lj19J07j3KJ8J2l3J7o4K1l6k3K1J8O6m8l9J2j4K2O4l8j1K9m0Q
$$ 39 -32 -40 26 53 56 -63 44 31 33 51 63 30 47 -17 4 -32 -55 -34 -16 50 2 -37 -25 -39 -17 47 9 -2 27 -13 -5
7472eK4rk6K1k2k1oN1mn4N4mok6J3J3M0k8j3lJ4M4q0O5l7L9n0N0j8p7K0QL5l1
$$ -5 19 10 -16 5 -17 -38 -44 7 3 -51 3 -1 -7 -33 -20 -7 33 5 -8 -11 3 47 -33 32 -5 34 -16 34 16 -61 -41 -33 2 -29
7506b9KN4j4j3K4Kln6N4r3J03m9J6pM7n3kK1j8J7l1M9Rm5J7J9oL7q4N5l5j0N7
$$ -29 -27 27 13 0 24 26 23 -33 21 -72 31 -18 -2 -9 38 -15 -17 4 -14 3 -28 21 30 -15 2 21 15 52 -32 23 -12 -22 35
7539C5l5j3J2J7K0j0l9M3L1m4n9J5j8Q7%n7j0K8J4n6J2J5Mj4LRN9n8NM2m8O0l9
$$ 35 0 -13 -1 16 36 26 -13 30 61 17 -42 -27 -45 42 42 -15 -25 3 17 -39 -27 -12 -8 -22 -19 -10 49 -9 -4 38 -10 50 11
7572A1ok4R9m5o3K4l9L7M1n4LL6l7N3m2OK8j3k8QK2Ro0mL8K2j9Nq0K9N9Mm9P4
$$ 11 5 -19 80 35 -28 -4 -43 -6 35 -19 -16 20 -17 36 -6 0 28 15 -13 -5 17 26 -34 -38 0 22 3 8 -72 -43 16 20 -29 45
7606D5k8k1j4K3K0n9ON7j7M5o5n3O0PL1q5J08p6%L4J0k9M2j9l3j3Q1o3O0p4M4
$$ 45 17 -4 -18 5 25 -34 -28 29 12 57 -8 -61 -1 6 37 -48 60 -16 -16 18 28 -1 41 22 -11 -24 57 -6 54 -20 24
7637B4J3l7p2O4NM8n9J1J0J1pLPK0j4Jk1n2O6o0N5%k8L0j6%J6j5j4nJ2N%j4O4
$$ 24 37 0 -72 -8 -3 45 -14 -3 7 18 11 14 21 41 27 28 7 -45 21 -39 16 16 -12 18 2 2 18 3 -11 -16 -4 1 1 -13 51
7672E1r9lP7m3L2l0qJ9K5K5l1l9O5p2J9O1n2K0J0j8oM4n3Q2l7l3L1n2j1Mk7M9
$$ 51 -48 -51 26 -17 15 -15 -23 -4 21 46 15 -24 41 -31 -12 49 -3 17 27 9 3 47 -6 76 39 6 37 -15 -26 -22 -49 0
7704@nJ2k9L6J5n7J2L7lj9ok6K4L9p6M8NK2k1kM8n6j6J9J7j7l9qO6Lk9k6K5k9
$$ 0 -5 7 -22 14 29 -28 -16 21 18 -1 -7 -33 -9 30 -46 2 7 29 8 6 54 -2 -18 1 18 1 -38 -46 20 23 -6 -32 -7 -36
7738c6M3l3J5k4j4P5K8r1L9rK1k5L8l9K1l1O3p2P7j17M8L5j3lm1O5o5L6K6JJ3
$$ -36 7 -26 -11 -35 -49 26 54 -37 2 -7 14 -11 27 -12 9 -22 41 -31 46 -71 -23 12 -1 -4 -45 20 -45 -9 17 18 31
7769C1j05J18p1K9j7L5mk5R1o3l2L3j2Ml4k1P8m9J2n8R7k4J4j0p1P0J8k5K5l7
$$ 31 -74 44 -27 2 -15 20 16 -9 82 19 -13 20 8 12 -22 -43 35 -14 -2 -60 37 13 27 17 -54 16 34 9 34 -3
7799cpJ1j1J4PK2q3L1j1P1l9l1M4o0N3k3M3o5Pj7O7l0jk6L5K1j2K5j6N1q1%L0
$$ -3 -10 1 -10 4 11 33 -50 -19 -30 41 2 -29 15 -45 8 -15 28 -37 -30 -47 20 -10 -11 -37 -2 19 7 32 16 67 -14 -14 16
7832A6jl0o1N8j0M0L9m7j9m9P3j0J8L0m3l7J0k5M9k1K2q6O0OmL4KM1p7J6J9l5
$$ 16 15 -15 -76 -18 -28 12 51 4 -15 -64 9 -1 17 47 4 -33 -23 -48 1 -20 2 -84 -24 -18 -22 12 14 55 -22 -6 13 -22
7864b2qM8N0p3L9j1m0O2Pk1J6o2M6j5J3n4M6k9N2k4J9k9M5l3Kjk4j3J9k1J0k8
$$ -22 -30 18 68 -5 34 23 -17 45 52 31 47 -15 31 16 29 -25 21 -8 44 20 39 10 55 22 24 23 -1 -14 5 -16 -6 -34
7896c4M2m5L0K6p1R5p0O5o5N7l7rp3Q2m6P1K3l4j9K0Qm0N1k5J6J8j8m3Q1j09O
$$ -34 8 -37 -7 19 -52 43 -27 38 -27 30 -7 -16 -89 -7 -53 18 41 7 -12 8 16 -24 27 2 18 36 18 -25 56 -53 -47
7927d7L5Ql6K8K0k4K0JK8m0M1l9l8O1k1m0R7p0JM8MM6l2k6m1Q9o7l4N3n1M9n6
$$ -47 -12 -4 -40 -12 8 -16 4 5 33 -7 34 -5 -43 18 -3 -43 54 -16 -15 33 37 83 51 25 -16 73 6 -28 25 -26 23 -33
7959c3L1Nj0j5K4J5l8K6L1m3m6M0J8K4L8m0l7k7K6L2n1M6j9J0k1kL0n8J9L5K2
$$ -33 -2 3 -7 -22 2 17 -21 5 36 -7 -53 -13 5 29 67 27 -10 -37 -11 21 -30 16 -3 7 -14 -16 14 -44 -25 10 32
7990C2l4j1k6K0M8l5L6o4K9j1M2k0rL9k3J2Kk7O8o2JK1n3Q3o4P0n9j3k6k5l4Q6
$$ 32 -2 -13 -39 -19 29 -6 30 -34 -5 -16 26 6 -3 36 13 25 27 0 68 6 7 28 -25 58 -6 64 5 -8 -34 -59 -93 -7
8022gk8N8k9k8P5k2n4N5n3j4R4j14Q8j2m9K3J3n1O3m7R6j26J05Lm5QJ0l3K5L2
$$ -7 -35 23 -6 -34 41 19 -35 20 -33 -47 47 -67 21 9 -40 -17 -4 -55 8 -39 57 -69 36 39 -6 2 12 -21 4 36
8052C6j5Pn8M7j5nPo8M5j5K0jn8K9K2L2q0O9n4J06p7K8Oqn9Q4m4L6K5o6L1J4j2
$$ 36 21 28 -30 17 2 -3 4 -64 -19 -34 -14 -15 -73 -44 -22 10 -70 -1 -55 51 -26 2 8 0 -59 25 -19 17 42 -24 7 21 9
8085IJ5m8K0k0jj1N3oL2o6lM7J6j6l7%l2M4j2k0J9N1m1j5J0N1n7O4m5k4k9M2l
$$ 9 24 -24 -4 -24 -25 -36 17 11 43 -23 -26 21 37 21 -16 -16 -48 -4 -16 -36 -17 34 -7 -22 -12 39 -18 46 1 -23 -52 -10 -13
8118a3Ojj8j5K7MK8Pl7L4k6k8P0r8R6qlk0JJ3J3n6N0K3m7j1N2j7qRm8MRJ3K1m0
$$ -13 -7 -8 -26 -41 -14 -10 18 25 -12 22 -4 -32 38 -60 36 28 25 5 6 19 32 -24 26 49 2 -9 43 26 18 27 -21 -17 -8 5 26 -14
8154a4J1K0l6M0Lqj9J6k3NJ7K7m2j0J6RLK8n1L1Kk7J4j1%rjnNmJ3qOq2O6K5J0
$$ -14 -3 17 -19 21 24 16 -3 13 -10 -5 12 39 -3 -13 3 12 15 43 -8 23 25 -2 12 1 1 -8 -9 -14 -9 -13 0 -8 -2 -84 -18 7 17
8191A7
$$ Imaginary data points
##PAGE= N=2
##DATA TABLE= (X++(I..I)), XYDATA
0@%%%%%%%%%%%%%%%%%%%%%%%kJ0j6J6j6J6j6J6k4L2l2L2l9M7m8N6o4P0p8Q7r6
$$ 0 0 0 0 0 0 0 0 0 0 0 0 0 0 0 0 0 0 0 0 0 0 0 0 -2 8 -8 8 -8 8 -8 8 -16 16 -16 16 -23 24 -24 32 -32 38 -40 47 -49
44d9J05j19J29j39J54j71J89k07K28k52K78l08L41l80M27m77N37o12P04q22R77
$$ -49 56 -63 66 -73 81 -90 99 -108 120 -132 146 -162 179 -201 226 -251 286 -326 378 -444 533
65E33j197J532k101L328j1532J2534J1433k5877P259J6486j3536j2401J7373P794
$$ 533 -664 868 -1233 2095 -9437 3097 14530 -11347 -4088 12398 -1138 -13539 3834 11628
79A1628j6696n312K0468l680k0205J1640J5274j5117p001J2507K989j2274p51
$$ 11628 -5068 -10380 10088 6408 -13797 -2157 13117 -2000 -9001 3506 6495 -5779 -6530
92f530J4903l050j6049R698J1103j3319n249J3020K750j2295k234J3836j945j3868
$$ -6530 8373 5323 -10726 -1028 10075 -3244 -8493 4527 7277 -5018 -7252 6584 4639 -9229
106i229Q983R708j3136l903J2294J266j0860m05J2101l039j2975Q785R484j1907
$$ -9229 -246 9462 -3674 -7577 4717 5983 -4877 -5282 6819 3780 -9195 -410 9074 -2833
120b833l877J0845N16r567Q52J0970l832j1939Q805Q619j1718k783J0545o03q827
$$ -2833 -6710 4135 4651 -4916 -4064 6906 3074 -8865 -60 8559 -3159 -5942 4603 4000 -4827
135d827J381R208l481r573Q086O482j1331j369J0729j176q841J616Q486l332q465
$$ -4827 -3446 5762 2281 -7292 794 7276 -4055 -5424 5305 4129 -4712 -3096 5390 2058 -6407
150f407P525N454j0328o95R322k609o924L262O676m505p312P471N397r201r48
$$ -6407 1118 6572 -3756 -4451 4871 2262 -4662 -1400 5276 771 -6541 930 6327 -2874 -3822
165c822P873k245n465K728N125l337n798O042M209q802j17Q410k538o407K625
$$ -3822 4051 1806 -3659 -931 4194 857 -4941 1101 5310 -3492 -3609 4801 2263 -4144 -1519
180a519N464k922n304N536L389q210O14P734l781n062M239L708m376l885O155
$$ -1519 3945 1023 -4281 1255 4644 -3566 -2952 4782 1001 -4061 178 3886 -490 -4375 1780
195A780K722p601O98O406l769l432M261K089l873k592N017J734o533J154O071
$$ 1780 4502 -3099 -2401 4005 236 -3196 1065 3154 -719 -3311 1706 3440 -3093 -1939 4132
210D132l809l833L871K436l064k377M183J482o144J338O153l993l777M063K017
$$ 4132 323 -3510 361 2797 -267 -2644 1539 3021 -3123 -1785 4368 375 -3402 661 2678
225B678l452j928M385J368n878J078N402l763k845M421J134l890j269M089J373
$$ 2678 -774 -2702 1683 3051 -2827 -1749 3653 -110 -2955 1466 2600 -1290 -2559 1530 2903
240B903n329Q51M865l389k803M002R01k973q06L147M18m321J577M825l826l097
$$ 2903 -2426 -1575 3290 -99 -2902 1100 2001 -972 -1778 1369 1787 -2534 -957 3868 42 -3055
256c055M122P95k746m54K626K33l734J260L887l465j820M005j02l049M7K812N51
$$ -3055 1067 1862 -884 -1338 1288 1521 -2213 -953 2934 -531 -2351 1654 1552 -1497 -1450 1362 1913
273A913l692O30L576k715j797L479m5k689L52K176m7l182J406L553l324k215L800
$$ 1913 -1779 -1149 2427 -288 -2085 1394 1349 -1340 -988 1188 1141 -2041 -635 2918 -406 -2621 1179
290A179L25k603L57J840l87k469J324K850l070j474L681n40k584R59J931m28k357
$$ 1179 1504 -1099 -742 1098 711 -1758 -434 2416 -654 -2128 1553 1013 -1571 -612 1319 891 -1466
307a466P81K539k315j097L093p03k345J061J500m26j952Q73K381k369j425L087
$$ -1466 -685 1854 -461 -1558 1535 832 -1513 -452 1048 622 -1330 -457 1924 -445 -1870 1217
323A217k26k127P03J153m15j601J061K167k441j489L137k55k202R95J288o04j451
$$ 1217 991 -1136 -433 720 305 -1296 -235 1932 -509 -1998 1139 884 -1318 -323 965 361 -1090
340a090O51J855j895q73K750p79k275J364J403q24j306O34J657j679r63K494m67
$$ -1090 -439 1416 -479 -1352 1398 619 -1656 -292 1111 287 -1019 -385 1272 -407 -1370 1124 657
357F57j857J161P45r34o31Q89J294j835j000K475k66j680R03O76p35n21M90J100
$$ 657 -1200 -39 706 -228 -859 30 1324 -511 -1511 964 698 -982 -79 597 -138 -659 -169 931
375I31j239q02K142o68j856J521R65r40q41M04J179r85q13J914n16j638J292O96
$$ 931 -308 -1110 1032 364 -1492 29 994 54 -787 -383 796 -189 -1002 912 396 -1242 50 746
393G46j024l20P07P80j343q15K143k09j643J032M60r86j1O25N43r84n64J583l03
$$ 746 -278 -598 109 889 -454 -1269 874 665 -978 54 514 -472 -483 142 685 -299 -863 720 417
412D17j576J251O85r37l83L45O92n02o31J204k67j354J144N79r18j06L95L59n85
$$ 417 -1159 92 777 -160 -543 -198 494 -8 -639 565 298 -1056 88 667 -251 -357 38 397 -188
431a88n94J410j45j270Q40L91r34K74M77P5o44m47J327j13j255Q20N61q93jM22
$$ -188 -782 628 483 -787 53 444 -490 -216 261 336 -308 -755 572 459 -796 24 585 -308 -309 113
451A13J70m32k09Q78l73j130J170N81j212P1M67J53l28l39Q66j02j012P62L62
$$ 113 283 -149 -358 520 147 -983 187 768 -444 -373 94 247 -81 -420 446 344 -668 94 456
470D56r16L90L90j16m40k49R11J12j134N45N25p80J61L67n6k26k82O84j06r49
$$ 456 -460 -70 320 204 -236 -485 426 538 -596 -51 474 -306 -145 222 166 -60 -342 342 236 -713
490g13Q38O11j098q4O35Nj90k96N61o6q11P54L85q99J97M56k19k58r4N75J59q93
$$ -713 125 736 -362 -446 189 194 4 -292 269 203 -608 146 531 -368 -171 285 66 -192 -286 289 448 -445
512d45K76N42o33J82L69k66j35r7M42J24p95M50N33q03M8M16p9L5k72J80R5n60
$$ -445 -169 373 -260 -78 291 25 -110 -207 235 359 -436 14 547 -256 -208 208 129 164 -108 72 167 -393
534c93N05L77p81J29M09k57m1k4K32J57o18K10M19n71K44L61m09j57J41L03Q3
$$ -393 112 489 -292 -163 246 -11 -52 -76 156 313 -305 -95 324 -247 -3 358 -51 -208 -67 236 319
555C19o45L23M84p94P5O47l23j31J04M3o2k86M13K82p72J28M35l14M2Q7K8J03
$$ 319 -326 -3 481 -313 -238 409 86 -45 59 102 40 -246 167 449 -323 -195 240 -74 -32 55 83 186
577A86l39J27L30m21J7L58k83k22K25K25N8n27J37N05m35j79N00k44j18Q7J43
$$ 186 -153 -26 304 -117 -100 258 -25 -247 -22 203 261 -266 -129 376 -59 -238 262 18 -100 -13 130
598A30kl79L01L84o49n4N38k20q3J39j11Q7j40rL22l81m1M05k85p0K13m3J18l03
$$ 130 128 -251 50 434 -215 -269 269 49 -34 105 -6 81 -59 -68 254 -127 -168 237 -48 -118 95 52 170 -133
622a33j15M56j88k14M08k89r3K63p4M3k19O1L54m37r3N41k35j70J95j13j6P0Q
$$ -133 -248 208 20 -194 214 -75 -168 95 21 64 -155 -94 260 -177 -270 271 36 -134 61 -52 -68 2 10
645A0J51k38j39L96j83j29K24r9J8q3p1L25j87q7L17k98j05K41J18j79p4K5K21
$$ 10 161 -77 -216 180 -3 -132 92 -7 11 -72 -143 182 -5 -92 225 -73 -178 63 181 2 -72 -47 174
668A74k63p1M73k94j56K48p2j58J71j4R5k39q7L37o1k55K52nj07k1r5K83n3k47
$$ 174 -89 -160 313 19 -137 111 39 -119 52 38 133 -106 -193 144 83 -172 80 75 -32 -53 -148 135 82 -165
692a65L38j69k31K75J00j80q0J9K80j67j64L31q6k99K34J0j22J2P6N0j57o6L01
$$ -165 173 4 -227 48 148 -32 -112 -93 187 20 -144 187 101 -198 36 46 -76 -64 12 62 -95 -161 140
715A40l6k32J76q5k8J34j16R4l7j60K49j57j07K16Rj35P1p9J11J12k11J00j5k28
$$ 140 104 -128 48 -37 -65 69 -47 47 10 -150 99 -58 -165 51 60 -75 -4 -83 28 140 -71 29 14 -214
739b14K83N9j74J03l4Op1r0J91M8k56J82nj67J71N1j22%p1K08k2k56K23j3j68
$$ -214 69 128 -46 57 23 29 -42 -132 59 107 -149 33 28 -139 32 83 -39 -39 -110 98 76 -180 43 30 -138
764a38J24lmO3j14J14J6k53K30J19k99Q3Q4p8K9o6J65N0k78K41k1j98J65L5j01
$$ -138 -14 -17 -21 42 -72 42 58 -195 35 154 -145 -62 22 -56 -27 -93 72 122 -156 85 64 -134 31 66 -35
789c5j0l4J71L3k16N6J16j80R2M6j20J72p8o2K8j27K08O4k48M6R7L%n8J4O2j40
$$ -35 -45 -79 92 125 -91 -35 81 -99 -7 39 -81 91 13 -49 -21 -148 60 124 -124 -78 19 22 22 -36 -22 40 -100
816a00J53R7k43J16R3j32M3o0O5Q2j65L5R6j71J20K9j09M4K0m2R8j57R1J36k33
$$ -100 53 150 -93 23 116 -16 27 -33 32 114 -51 -16 80 -91 29 58 -51 -7 13 -29 69 -88 3 139 -94
841i4Q2M2p7J15q1o0J22j09M6Q8j48L9J43j24M4kl8J04j17%J06j36J10J08k22
$$ -94 -12 30 -47 68 -13 -73 49 -60 -14 74 -74 -35 108 -16 28 26 -12 92 -25 -25 81 -55 55 163 -59
866e9O4R9r8Q4j27J5J41j44j9J93j30LQ0j78J28p8O6M0k11R1J08j10Q6L2j06R4
$$ -59 5 104 6 90 -37 -22 119 -25 -44 149 19 22 102 -76 52 -26 40 80 -131 -40 68 -42 44 76 -30 64
892F4m7r3R2n3N1J13k23N4Q5k5j4K7p9J12r2MJ66j55KJ22j45L2P0q4J20j66j1
$$ 64 17 -76 16 -37 14 127 -96 -42 43 18 4 31 -48 64 -28 -24 142 -13 -11 111 -34 -2 68 -16 104 -62 -73
919g3J94j67Q5J14k14N3P7r9J32p0l7R9j70KJ44o1K5Pj38K05n8o3J43j76JR1l7
$$ -73 121 -46 39 153 -61 -8 69 -30 102 32 -5 94 -76 -74 70 9 34 41 -97 108 50 -13 130 -46 -45 46 9
946Ij3O1n2M7m8l5J36j04M8M0j42L0J39j29R0q9o5J43o3l3J02o7rO2j44O8J03
$$ 9 -4 57 5 52 4 -31 105 1 49 89 -53 -23 116 -13 77 -12 -77 66 3 -30 72 5 -4 58 -86 -18 85
973H5r4M4q6r0K22o0k1N6j01P7L9r8R0k1j12J73k07N0J70r8l7M1j30J79o6n4J93
$$ 85 -9 35 -51 -141 81 21 0 56 -45 32 71 -27 63 42 -70 103 -104 -54 116 18 -19 22 -108 71 5 -49 144
1000A44j70m2J21j40P8N0p1O6q6l7K03m9j18R7j44J15Jj18J80o9j12J36n1q1J76
$$ 144 -26 -68 53 -87 -9 41 -30 36 -50 -87 116 67 -51 46 -98 17 18 -100 80 11 -101 35 -16 -97 79
1025G9k3l4J3j32Q1J05j17J07n7j4P2j23O8k4l1P3k7q6J65l8j16K3k3L1J28j28
$$ 79 56 22 35 -97 -16 89 -28 79 22 8 80 -43 25 1 -30 43 16 -70 95 57 -59 -36 -59 -28 100 -28
1051b8O9J0j34J18n1p3J16Rq5J04j03j7J70j44P8q3q9K49j47q2J45n5k3Q8j36
$$ -28 41 51 -83 35 -16 -89 27 36 -49 55 -48 -65 105 -39 39 -44 -133 116 -31 -113 32 -23 -46 42 -94
1076i4J49K4j40K4ok8J59m6n0j5j4J19l5j36J56Pj66P2j6jJ68j58M4q2J1J73p8
$$ -94 55 79 -61 -37 -43 -71 88 42 -8 -23 -37 82 47 -89 67 74 -92 -20 -36 -37 131 -27 17 -65 -54 119 41
1103D1j49R9mO1J8j20M8M5q3R3p1k2J07r4k6N1k8R6lj93J32O4j20J51j20kQ4r1
$$ 41 -108 -9 -13 48 66 -54 -6 39 -44 49 -22 -44 63 -31 -57 -6 -34 62 59 -134 -2 62 -58 93 -27 -29 55 -36
1131c6mN3m0J22j30p2R1M6l1Q4j30k7J64j52N5M2j15Q8Ln4R1j05J32N4k41P9O5
$$ -36 -40 13 -27 95 -35 -107 -16 30 -1 83 -47 -74 90 -62 -7 35 -80 8 11 -43 48 -57 75 129 -112 -33 32
1158C2m2R4pj29P6k7M0j7j1K7L1j43J07K7r6J45l2j89J51rJ5n3o8O2M9r9J14k8
$$ 32 -10 84 77 -52 24 -3 37 20 9 36 67 -76 31 58 -38 107 75 -114 37 28 43 -10 -78 -16 33 -66 48 20
1186B0k5J07j64J6R6j21J47o8r0J44l9K9j9j31R2J04j50J30n0o4P5m1m1J00k5
$$ 20 -5 102 -62 -46 50 -71 76 8 -82 62 23 52 33 -98 -6 98 -52 78 28 -36 39 -2 -43 57 32
1211C2q1R4j30J19Q0j51O0j8KR4r3jO3j07%R9p5J8J5k5Q0j57mJ56r3k8R9j35J12
$$ 32 -49 45 -85 34 114 -37 23 5 7 101 8 7 70 -37 -37 62 -13 5 20 -5 75 -82 -86 70 -23 -51 48 -87 25
1240B5K8j06Q9Km4P1p4JP6k9L0n8j07J99m2q6O6%n3Q2j44Q5L1n8L%m5J20n9K0
$$ 25 53 -53 36 38 -6 65 -9 -8 68 39 69 11 -96 103 61 -25 41 41 -12 70 -74 11 42 -16 -13 -13 -58 62 3 23
1270B3N8j23j1J47j06k8M2l7R2o7nJ26j71J33n5j22J51J1o8N7q3k1J88j26M6N9
$$ 23 81 -42 -53 94 -12 -40 2 -35 57 -10 -15 111 -60 73 18 -104 47 58 -10 47 -36 -57 131 5 51 110
1296A10q8Kk5m8J13q0L6N7j72P9J04j18K0j49K02Np8n3J15K3n4K0o7p3J23M18
$$ 110 22 24 -1 -49 64 -16 20 77 -95 -16 88 -30 -10 -159 43 48 -30 -83 32 55 1 21 -46 -119 4 422
1322D22j82k47K12J52l75j5Q9j15J66l82M9J03M5K09J73k16k38K68k59L74j29
$$ 422 240 -7 205 357 -18 -33 56 -59 107 -275 -226 -123 -78 131 304 88 -150 118 -141 233 104
1343A04k64J90RkJ35l64Q1j5j02K18K58n00M79q9K2j59O6j41J54m12L71k04k06
$$ 104 -160 30 39 37 172 -192 -111 -126 -228 -10 248 -252 227 138 160 1 67 -74 80 -332 39 -165 -371
1366c71L21J3K15m01L30k95J61L4J34j91j13K61j56k43K73n7n3k02J85r2N00k77
$$ -371 -50 -37 178 -223 107 -188 -27 7 141 -50 -163 98 -58 -301 -28 -85 -138 -340 -155 -247 253 -24
1388b4K34%k18N6R2J31r5P3m63L61j34p2l2J37j07J8k57K50j71Q2L98l98J3m5
$$ -24 210 210 -8 48 140 271 176 249 -214 147 13 -59 -91 46 -61 -43 -300 -50 -221 -139 259 -139 -126 -171
1412a71J22K03l44J1J2K45K2Q9j54k63K34K0Kl2RQ7n7k7P6j92J04J2m8Q4qr0J06
$$ -171 -49 154 -190 -179 -167 78 100 189 35 -228 6 26 28 -4 5 92 35 8 84 -108 -4 8 -40 44 36 -54 52
1439E2j11L3N2q7R3j2n5K9NPQ6j23k3O1j8NL8r6JJ14n7O2m5kK3k3k9P5j08O8J2
$$ 52 -59 -26 26 -61 32 20 -35 -6 -1 6 92 -31 -54 7 -11 -6 32 -64 -63 51 -6 56 11 9 32 9 -20 55 -53 15 27
1470B7n6N7J1p9N7n3J0P2o6j1O7n9O0k1j02R5k6k8O6o4K8N5o4M5J8r5J00n3n0
$$ 27 -29 28 39 -40 17 -36 -26 46 -20 -31 36 -23 37 16 -86 9 -17 -45 21 -43 -15 40 -24 21 39 -56 44 -9 -59
1499e9L4J7RL2p5O9J1k3K4j5k8J1n4K0K4j0L4j0Mkn3L5J6l2J1O2m3JNo1P4o4N3
$$ -59 -25 -8 1 33 -42 27 38 15 39 24 -4 7 -47 -27 -3 -13 21 11 15 13 -40 -5 11 -21 -10 52 9 10 15 -46 28 -36 17
1532A7O2q0p4J54m7j0k7JK3l9j8O6n4M9N1q6J5M6p7O4j7p0J16l7q0R1l1L4n1k8
$$ 17 79 -1 -75 79 32 22 -5 -4 19 -20 -38 28 -26 23 74 -12 3 49 -28 36 19 -51 65 28 -52 39 8 42 -9 -37
1562c7O1K6p8K0K6r3J11k3l3M7po0O4k2J8N4j50N7L2k4L2k8J5M2r7K9Q4n7j5P
$$ -37 24 50 -28 -8 18 -75 36 13 -20 27 20 -40 24 2 20 74 -76 -19 13 -11 21 -7 8 50 -47 -18 66 9 -6 1
1592Am2M7KK8Q4j78Q7k1k9J09n3o0M3Lj1N2j4l4ol2nj6K3O1n9K0Q5j17K7ln0J05
$$ 1 -41 6 8 36 120 -58 29 8 -21 88 35 -25 18 21 10 62 48 14 8 -24 -29 -45 -22 39 -20 0 85 -32 -5 -8 -58 47
1624D7r2M4Nj8M2L7r5K7M9n4L9L7q9%J8j7N2m1J4Q0j50Q5M3q0J01q0o5J9Q6l7
$$ 47 -45 -1 4 -14 28 65 -30 -3 46 -8 31 68 -21 -21 -3 -20 32 -9 5 85 -65 20 63 -17 84 4 -61 -42 44 7
1654GJ6n1M5m0PM2Nn8Q6j23jJ04k9kL5l4m0K0j9J09p1j5J0k1M2jl9k7L1k6N7n5
$$ 7 23 -28 17 -23 -16 26 31 -27 59 -64 -65 39 10 8 43 9 -31 -11 -30 79 8 -7 3 -18 24 23 -16 -43 -12 -38 19 -36
1686c6L2j6k8P6j5L2n8NkLn6K7JN2Qro6R1j6j8pn1k9J08q9R0pq1P5Km3O3lo4J25
$$ -36 -4 -20 -48 28 13 45 -13 -8 -10 -7 -63 -36 -35 17 25 16 -50 41 25 7 0 -51 -80 28 -61 29 22 -59 16 18 -25 38 35 -29 96
1721I6q6l2Q2m4N9q5NkL1n9M0k5J4J19j10j4n8J7N9Ml4j2J2j5L3m8K7JmN2l2%
$$ 96 10 -22 60 16 75 -10 -5 -7 24 -35 5 -20 -6 113 3 -11 -69 -52 7 11 -23 -35 -23 -38 -5 -53 -26 -25 -29 23 -9 -9
1753il0N5j8j1m6P8J4l4K5j1QmJ5Lk7Ln2M3l1L0rPK2l4pM4Or3P9l1K2L2p9K5l8
$$ -9 -39 16 -2 -13 -59 19 33 -1 24 13 21 17 32 35 8 11 -41 2 -29 1 -8 -1 21 -13 -20 24 30 -63 16 -15 7 39 -40 -15 -53
1788e3M6M0k2l2KoJ6J2j6P2m3j9K4k8M1m3jM7j7Jj8M2j00Q3o5J00j03L7lO8p4
$$ -53 -7 33 11 -21 -19 -25 -9 3 -13 59 16 -3 21 -7 34 -9 -10 37 20 21 3 45 -55 28 -37 63 -40 -3 -6 62 -12
1819a2L1rj6Jk0k3J04j1m7j8kP8r1K3m2R2l6M2m8L9k8l7l2N1PP9m5Pll7K0n2N1
$$ -12 19 10 -6 -5 -25 -48 56 45 -2 -20 -22 56 -35 -12 -54 38 2 44 -4 35 7 -30 -62 -11 -4 75 30 37 34 -3 17 -35 16
1852A6kqK7j1k6k5J5L2k9N6n6j1M3l1M4p3L1J13p5o3J5N7n4M1l4J1N4o5K5m7L1
$$ 16 14 6 33 22 -4 -29 -14 18 -11 45 -11 -22 21 -10 34 -39 -8 105 30 -33 -18 39 -15 26 -8 3 57 -8 17 -30 1
1883ARj2j6P5l0J5o8N2l2J6o5R5oJ0k5kN2p5%L6k2m3L5k2O4l1o1L0M1JqmjNl8
$$ 1 10 -2 -18 57 27 42 -26 26 -6 10 -55 40 34 44 19 17 69 -6 -6 30 8 -35 0 -22 42 11 -50 -20 21 22 14 10 9 14 -24
1918b4MM3n7QJ9Nmn4N6qM7k0m4PJ7K4m1O7q2J0QL3o3Q4Omn6N4N1n0J5o8O0k3k7
$$ -24 -20 23 -34 -26 -7 -2 -6 -60 -4 -12 35 15 -29 -22 -5 19 -22 45 -37 -27 -19 14 -49 35 41 37 -19 35 86 36 51 -17 43 20 -7
1953gj2L7m5k6K3J1L1m9J2K5k6M7l2K9m2K0K5K4m9K1o6R3J6j04O4MJK0n2m0J18
$$ -7 -19 18 -27 -53 -30 -19 12 -37 -25 0 -26 21 -11 18 -24 -4 21 45 -4 17 -49 44 60 -44 20 24 25 45 -7 -47 71
1984G1q0k2J9M6J2j0k8L9p4k4J3O9l9L1K9Lj33O4j1l1M8lmL0L9n9j7LnL1mpK8
$$ 71 -9 -31 -12 34 46 36 8 47 -27 -51 -38 31 -8 23 52 55 -78 -14 -25 -56 -8 -11 -15 15 54 -5 -22 -19 -24 7 3 -4 24
2017B4%p5J06k3jk5l4K1P6o6mk5K1pK1l6M3K9k7M7l5j4j0p6J6N5k6k4MJ2K4j2
$$ 24 24 -51 55 32 31 6 -28 -7 69 3 -1 -26 -5 -12 9 -27 16 45 18 65 30 16 6 -70 -54 1 -25 -49 -45 -33 -9 -21
2049b1K7k5L0j8K7p7O1J3pJ0q0P7M4k7o3J3N4l2L1r0O2K5op0M9o3K2J3Q9l2m5
$$ -21 6 -19 11 -7 20 -57 4 17 10 20 -60 17 61 34 -29 -16 38 6 37 -53 9 34 28 -42 7 -56 -34 -21 68 36 -9
2080irKK1Nj3qm9N9J0l9K5kM5oqp4Q7n9N6No9L8O1n0KpK5n6j19J62j51J43j23
$$ -9 -18 -16 5 10 -3 -11 -60 -1 9 -30 -5 -7 38 32 24 -50 37 -22 34 39 -30 8 69 19 21 14 39 -17 -136 26 -125 18 -105
2113a05J35J25k65J14j04J03N7j44R9J30o7n5j25J43j5j44J1M2J39j90J27j04
$$ -105 30 155 -110 4 -100 3 60 -84 15 145 78 23 -102 41 26 -118 -107 -65 74 -116 11 -93
2135i3o3L47j92r3K32k03J11n0J33N4j64J18J03l66Q0K20k92o0K98k02o5m0K09
$$ -93 -156 191 -1 -94 138 -65 46 -4 129 183 19 137 240 -126 -46 174 -118 -178 120 -82 -147 -187 22
2158B2Q9K1j91J14j60K48j18P7O9l18J97m4j29K80j40j63J63j79Nk6n2J49K01
$$ 22 111 132 -59 55 -105 143 25 102 171 -147 50 6 -123 157 17 -146 17 -162 -157 -183 -235 -86 115
2181A15o1K03j46j32j8J93j72r9J07j28K39k94K14j00J25m3J62m59K59j87J07
$$ 115 54 257 111 -21 -39 154 -18 -117 -10 -138 101 -193 21 -79 46 3 165 -294 -35 -222 -115
2202a15J79J54l64K1J15j28L65o6n81L47J91k45K43k3l6n7J85L8l22r0K07K32
$$ -115 64 218 -146 -125 -10 -138 227 161 -420 -73 118 -127 116 93 57 0 185 223 -99 -189 18 250
2224B50l11k92N28l37Q0p4J04l24K92p5K83J24n40L82j90J69O1l75P0K26o0K01
$$ 250 -61 -353 175 -162 -82 -156 -52 -376 -84 -159 124 248 -292 90 -100 69 130 -245 -175 51 -9 192
2246A92m48J43L12J58j20k47oqJ85j65O3J66n82N14m54K15N9j76R7p1K67k71M80
$$ 192 -256 -113 199 357 237 -10 -16 -24 161 -4 59 225 -357 157 -297 -82 -23 -199 -102 -173 94 -177 303
2269C03l40kL3j40N2k3J40j98K13jP7k01J33l76L46KJ13l7j0O0O1k74k18L03l7
$$ 303 -37 -39 -6 -146 -94 -117 23 -175 38 37 114 -87 46 -330 16 18 131 94 84 144 205 -69 -287 16 -21
2294b1J67P4k73k13M84k18K44k42l01N08l09n1L8M7j34J91L2k11M29k56r4N2K38
$$ -21 146 220 -53 -266 218 0 244 2 -299 209 -100 -151 -113 -66 -200 -9 23 -188 241 -15 -109 -57 181
2317A81k01m6J53J7j87J44j70Q4Q9K5Q6j13k3J31j31n1n0J52j75J24qk3q4R4k
$$ 181 -20 -66 87 104 -83 61 -109 -25 64 89 175 62 39 170 39 -12 -62 90 -85 39 31 8 -76 18 16
2342A6K4n6N3j3POn1j6Q5p7j2K4K5l9J6Rl6L7j0N1j4n6K4K0p4L4K5J0k6m5O1Q
$$ 16 40 -16 37 24 31 37 -14 -30 55 -22 -34 -10 15 -24 -8 1 -35 2 -8 43 29 -27 -3 17 -57 -23 2 12 -14 -59 2 10
2374A0kJ3kk6O2o6L3l4l8K9M1k4m1O7J6n2k2RL7m4R3r3lN8K2k8J5J7l1L2l2o1
$$ 10 8 21 19 -7 55 -11 22 -12 -50 -21 20 -4 -45 22 38 -14 -36 -27 10 -34 59 -34 -37 21 43 15 30 47 16 48 16 -45
2406d5P7k4R3n9n9j3M1M2l8k7k1Q9r5Q0rm1j8M2n1%Q3o4j0l7Q1L6q9j4M8jj2K4
$$ -45 32 8 101 42 -17 -30 11 53 15 -12 -33 56 -39 41 32 -9 -27 15 -36 -36 47 -17 -27 -64 17 53 -36 -50 -2 -3 -15 9
2438IQjl7k3M8L5m2M3n6O8m8qL6K4j9Nml7n2J00j3n6M7Km4oJ3rLM9j10N3N0L5
$$ 9 17 16 -21 -44 4 39 -3 40 -16 52 4 -4 32 56 37 42 38 1 -51 49 36 -20 27 29 -15 -21 -8 -17 -14 35 -75 -22 28 63
2472F3m9n4L1k9J00j04N3mL7o7K7k9K8j4J6kQJ8o5J6O6l4L1k1n4R6k7l1Qk3K8
$$ 63 14 -40 -9 -38 62 -42 11 7 44 -23 4 -25 3 -11 5 3 11 29 -36 -20 46 12 43 22 -32 64 37 6 14 -9 19
2503A9Nl0k5K4J1P2r1K4J9p5N2l9J4k3K0k9Q1k5p2O5l6L7J8M3o1k2M3n0M8r5N9
$$ 19 24 -6 -31 -7 4 76 -15 9 28 -47 5 -34 -20 -43 -23 -52 29 4 -68 -3 -39 -2 16 59 -2 -24 19 -31 17 -78 -19
2534a9O2k7j4l3M9K6m9j4KM5j7Oj7N2n8K4L5n1rl3R7n9k0JK2k8J2N3l6OJj8l5
$$ -19 43 16 2 -31 18 44 -5 -19 -17 28 11 17 0 52 -6 18 53 2 -7 -40 57 -2 -22 -21 1 -27 -15 38 2 8 9 -9 -44
2567d4pK8N0j6K2l5N5o3N0Mj1qrl7J7O6K6o3m2K7M6K1q3J8k2K4J7k3o7M8K3m6
$$ -44 -51 -23 27 11 33 -2 53 -10 40 44 33 25 16 -21 -4 62 88 25 -17 10 56 77 -6 12 -10 14 31 8 -59 -11 12 -34
2599c4M8L8r0MN7j2On1jJ4J4N1p8O8o5M1PM5n8N1j8j5J0J2m7RK3rk7KrL6K5l3
$$ -34 14 52 -38 -34 23 11 17 -34 -35 -21 -7 44 -34 34 -31 10 17 62 4 55 37 22 32 44 -3 6 29 20 -7 -5 -14 22 47 14
2633A4M7r1J6LK4k7J3N7l7l7J5N2l7j7L2m6J4K0L0m5JL9k0oM3o5O3l0MJ8m6L6
$$ 14 61 -30 -14 -11 13 -14 -1 56 19 -18 -3 49 12 -5 27 -19 -5 15 45 0 1 40 20 14 57 -8 55 25 29 47 1 37
2665C7r4O4LNPk8J8J2K7p6J0J1K2m5J4j4L3k1j4M1l7qLL0KkN3q7J6M4K2m0J9L
$$ 37 -57 7 10 15 22 -6 12 24 51 -25 -15 -4 18 -27 -13 -27 6 -15 -29 12 -25 -33 -30 0 2 0 53 -34 -18 26 48 8 27 30
2699C0k0j0pLn8Q5j1RL7q0oQ4l0p2K9MK1oJ3k2K4Jmj8j1l1L8L8j7n7M8l6jN0k8
$$ 30 10 0 -7 -4 -62 23 12 21 58 -22 -28 56 26 -46 -17 -13 8 2 15 -7 17 18 14 -4 -15 -46 -8 30 13 -44 4 -32 -33 17 -11
2734a1M1k8N0r1M6kNN6p2L5j1O7l3m0L5l5qkLj0K5m2K1N0m2M9o0K2J0k1Pl1M2
$$ -11 30 2 52 -39 7 5 10 66 -6 29 18 85 52 12 47 12 4 2 5 -5 20 -22 -1 49 7 56 -4 18 28 7 14 -17 25
2767B5m1j4J5j8j0L5J6o%Jl5O7k9j7q1P2K4K%Pmo7Q6l7L0m4Ok1Qk2M3L9l0NM2
$$ 25 -16 -30 -15 -33 -43 -8 8 2 2 3 -32 35 6 -11 -92 -20 4 6 6 13 9 -58 28 -9 21 -23 -17 -38 -30 -52 -9 30 0 5 47
2802D7l5qj7LL6pnl8l3O0%LK2k0Pk8k3J5j9P6k5k4j1R0m5n7M4L3k0L4m2J1m5M5
$$ 47 12 4 -13 -10 26 19 14 -24 -57 3 3 6 28 8 15 -13 -36 -21 -40 36 11 -13 -24 66 21 -36 8 41 21 55 13 24 -21 24
2836B4J4Ol6l6M2j6Mk9k8L8o1J33j02M8K1k0m0L9K1o3L3pN5k6PNK4m1k7j6N2l8
$$ 24 38 44 8 -28 14 -2 2 -27 -55 -17 -78 55 -47 1 22 2 -38 1 22 -41 -8 -15 40 14 21 26 50 9 -18 -34 18 -20
2868b0M6L6l8j3l4R8j46j02K87j46J40M8l99J39J56k62k1L52j73j48P0K75j52
$$ -20 26 62 24 11 -23 75 -71 -173 114 -32 108 156 -243 -104 52 -210 -231 121 -52 -200 -130 145 -7
2891gJ37p2j16L19k37k03J96j5j40L9K69j32j28J66k00Q6J31j57J73j11n2N5O0
$$ -7 130 58 -58 261 24 -179 17 2 -138 -99 170 38 -90 76 -124 -38 93 -64 109 -2 -54 1 61
2914F1J42jj09J87l91J89j36j82J63J67j48J75p5Q0j19k6p6Q8m0n2P4M9j43k1
$$ 61 203 202 93 280 -111 78 -58 -240 -77 90 -58 117 42 122 3 -23 -99 -11 -51 -103 -29 20 -123 -144
2938a44N7rK14j73P6l6p2Q8m0o7J15j34J85L5j4j31j01K19j12r8K34K2l1j62L
$$ -144 -87 -96 118 -55 21 -15 -87 1 -39 -106 9 -125 60 95 81 -50 -151 68 -44 -142 92 114 83 -79 -76
2963g6R2j3J39k52N4o9P7k66m6K96r2J72O0j70K01j79K71p8j4r7m1O4k40J43L7
$$ -76 16 3 142 -110 -56 -125 -48 -314 -360 -64 -156 16 76 -94 107 -72 199 121 107 10 -31 33 -207 -64 -27
2988b7m4K0J37r1N0j32J13l4L9l7N6l3J2k7j2l9Q5l3J8nL4n0L4r5J02j7Ol3J0
$$ -27 -71 -51 86 -5 45 -87 26 -8 31 -6 50 17 29 2 -10 -49 36 3 21 16 50 0 34 -61 41 24 30 -3 7
3017Gk2N3k3l8j7N0j3N9p7K8J5l2N7j4m6J2p9O3j3M0RJ1k3k1Lj0N0l4m6K6M0O
$$ 7 -15 38 15 -23 -40 10 -3 56 -21 7 22 -10 47 33 -13 -1 -80 -17 -30 10 19 30 7 -14 -11 -21 29 -5 -51 -25 15 21
3049B1J3l7j5J2l6K5mN4k9Q0j0k2q7MM5Ol1K1j3K4n0N9m7Pl5L8k3K2N4p7P5j8
$$ 21 34 -3 -18 -6 -42 -17 -21 33 4 84 74 52 -35 -31 14 20 -11 10 -3 21 -29 30 -17 -10 -45 -7 -30 -8 46 -31 44 26
3081B6l9Q4m5n1N0n8QJ8pK7K5p6J1K2M3l6K7l2m2P8j4m5k7N6K0j5n7M3J7n9O2
$$ 26 -13 71 26 -25 25 -33 -25 -7 -14 13 38 -38 -27 -5 38 2 29 -3 -45 33 19 -26 -53 3 23 8 -49 -6 11 -48 14
3112A4k8qJ9n7L7k8J6L4K6J4j4N8p2n0M4rm0L0M6oj9Qk4J8J3kl2K9k3O5n9rPL3
$$ 14 -14 -22 -3 -60 -23 -51 -35 -1 25 39 25 83 11 -39 5 -4 -44 -14 32 26 7 15 -9 9 22 20 -12 17 -6 59 0 -9 -2 31
3146C1k7J5m7K6j3O3k9o3L0O1l3Nj8o8N6K3Lp1M9O%J2m5M1k1L6j6k8OO1k4M3l6
$$ 31 4 19 -28 -2 -15 48 19 -44 -14 47 14 19 1 -67 -11 12 15 -56 -7 -1 -1 11 -34 7 -14 22 6 -22 -16 45 21 64 28
3179B8l2L4jm4PKL6r2M1K9m4P9j6l8m4PJ09j9j3j3j02O7J2Ol8M0J4po4Q6p3K3
$$ 28 -4 30 29 -15 -8 -6 30 -62 -21 8 -36 43 27 -11 -55 -48 61 42 29 16 -86 -19 -7 -1 -39 1 15 8 -56 30 -43 -20
3211b0oL5L9m9K9r0N0K5M8o7M7Mk1L3p5M4On5K7k0RK3o0N5k6J3mOqLRl3M7l2L7
$$ -20 -26 9 48 -1 28 -62 -12 13 61 -6 41 45 24 57 -18 26 32 -23 4 -16 -7 16 -44 11 -15 -2 -6 0 -8 -5 4 -29 18 -14 23
3246B3k7n6J0P2Ll5M9l2oj2J6M8q3Q1j1j02R7om0J0j3N3n8%M5l5p1Q3q3N8P1p8
$$ 23 -4 -60 -50 22 25 -10 39 7 1 -11 5 53 -30 51 40 -62 35 29 -11 -1 -14 39 -19 -19 26 -9 -80 3 -80 -22 49 -29
3278b9M7j4l9J2k1M2k7L5q5J19j06P6j1j4RmO3l3k8j8J7K6Pn9N9q4M4P4m8Jj1
$$ -29 18 4 -35 -23 -44 -2 -29 6 -79 40 -66 10 -1 -15 -6 -10 53 20 -8 -26 -9 17 24 -35 24 -60 -16 58 10 11 0
3309@k1PRK9kj7N0n4j6K2L7n8K6n3N0l6M7l9KM5n9L6K1K1q9L0K8l3K1M3l8L4n6
$$ 0 -21 -14 -5 24 22 5 55 1 -15 7 44 -14 12 -41 9 -27 20 -19 -17 28 -31 5 26 47 -42 -12 16 -17 4 47 9 43 -13
3342a3M2lk5K0R8j02j2Prl2K6Pl2ML2L8n4K3M4o1k1K3l6P9m9L7j7j4mJ9J1k5r
$$ -13 29 26 1 21 119 17 5 12 3 -29 -3 4 -28 -24 8 46 -8 15 59 -2 -23 0 -36 43 -6 31 14 0 -4 15 26 1 -8
3375hm8L0J6Qm4N9ro3M3N7o6oJ6J0l8M8K9k6M5m3mj4n1P4n1J03p5J6k0N4p0rQ4
$$ -8 -56 -26 -10 -2 -46 13 4 -59 -16 41 -25 -31 -15 -5 -43 5 34 8 53 10 6 -8 -59 15 -36 67 -8 8 -12 42 -28 -37 47
3408D7l1K8q%k0rn0M0qk1k8O7k7M7K0l5m3R5m4nk3M8o0qJ7L4o0M2L2J1kj3M1m9
$$ 47 16 44 36 36 16 7 -43 -3 -11 -32 -60 7 -20 27 47 12 -31 64 20 15 -8 40 -20 -28 -11 23 -37 5 37 48 46 33 74 25
3442B5o0J0L1j7LOM5o7L0J7k0PK9k7j8Rk7L1N7p9jO8m7lN1q5K2l2O8MJ8l6J1M2
$$ 25 -35 -25 6 -11 -8 -2 43 -24 6 23 3 10 39 12 -6 3 -24 7 64 -15 -16 52 5 2 53 -32 -10 -42 26 30 48 12 23 65
3476F5l7K1qp6L8L0jJ9p9Q8k2j5qk8M5l7N5k6j3K6o5pO3k6l9NQ4p2N3p5L3J5P
$$ 65 28 49 41 -35 3 33 32 51 -28 60 38 23 15 -13 32 -5 50 24 11 37 -28 -35 28 2 -37 -32 52 -20 33 -42 -9 6 13
3509A3L4L2r3nkL2J6k8k5L2L0k7j8K6m7Q7o2k8R4m1K1j1Np1L1M7j5p6M5m7L5L9
$$ 13 47 79 -14 -19 -21 11 27 -1 -26 6 36 9 -9 17 -30 57 -5 -33 61 20 41 30 35 -36 -5 42 27 -49 -4 -51 -16 23
3541B3k6N4k9n3L0m1J34m7j4j8K3k9l0K7R%Pj7L6k4J0l7M6n2K5p8K9N5J7K1o2
$$ 23 -3 51 22 -31 -1 -42 92 45 31 13 36 7 -23 4 13 13 20 3 39 15 25 -12 34 -18 7 -71 -42 13 30 51 -11
3572a1Pk8J8Kp5J17K6n9L9Jj4p9O5n0M5l1M3M4q1Lk3l9Q5%m9L5N0j1m7M2o0N7
$$ -11 -4 -32 -14 -12 -87 30 56 -3 36 37 23 -56 9 -41 4 -27 16 60 -21 -18 -41 -80 5 5 -44 -9 41 30 -17 25 -35 22
3604B2l2J6j6%M5k3j0J4rk8K6Rp3M8m4K1J9K2L8p3k8J01o4L6LK8q6O1n4NO0q8
$$ 22 -10 6 -10 -10 35 12 2 16 7 -21 5 14 -59 -11 -55 -34 -15 7 45 -28 -56 45 -19 17 20 48 -38 23 -31 -26 34 -54
3636e4R9m7N2m4l4K9l6Q3q8L7O2m0L5j1Qn7L0Mp0L4m3k2O0M1L1n1k0jMK1l4J3
$$ -54 45 -2 50 6 -28 1 -35 48 -40 -3 59 19 54 43 51 -6 24 28 -42 -8 -51 -73 -13 28 59 8 -12 -13 -9 12 -22 -9
3668iM9m4Pl3P9Ko0L9n3Q7o3km3Q4r7J15j30O5j42LmK66L0l18J75j7J25j14m7
$$ -9 40 -4 3 -30 49 51 -9 30 -23 64 1 -1 -44 40 -57 58 -72 -7 -149 -146 -150 116 146 -172 3 -14 111 -3 -50
3697e0O9jJ6k5M8ln0Mk2LKK0j9K2p1N3L2n1k1K8l8P5j5l0M1q2Q7onrnK8l8M0n3
$$ -50 19 18 34 9 57 54 4 8 -14 -11 -9 11 -8 14 -57 -4 28 -23 -44 -16 -54 21 6 -24 17 -65 22 16 11 2 -3 25 -13 27 -26
3732b6O2QjJ2q0K4L8q5K6L0J7j0Nm4K0k2mL6nj7j%M2K7j12J8k8Q3Pk9K9l8M2J9
$$ -26 36 44 43 55 -25 -1 37 -48 -22 8 25 15 20 -24 -4 -26 -30 6 1 -16 -17 -17 25 52 -60 -42 -70 13 20 -9 20 -18 24 43
3766D3qqj7j8K3M4q1M2j2L5l9K5k6qk1M5m7N3LNn8mN6o4L1j8N0j1k4l7j6J9J7
$$ 43 35 27 10 -8 15 59 -22 20 8 43 4 29 3 -5 -26 19 -28 25 28 33 -25 -29 27 -37 -6 -24 26 15 -9 -46 -62 -43 -26
3799b6%R0o9K2k3K0j2K9ko7P4J2j01Q9o1J0k1M8K4j8MNk8K8l3N4m0O6m4m7NQ2
$$ -26 -26 64 -5 17 -6 14 2 31 29 -38 36 48 -53 36 -25 -15 -36 12 36 18 22 27 -1 27 -6 48 8 74 30 -17 -12 70
3831G0m5l0M8l1J1k5mLk8J15p1k0j3M2l6J5L7q0L2l4RM2Jm0K6K5k9%K3O5q5L0
$$ 70 25 -5 43 12 23 -2 -6 -3 -31 84 13 -7 -20 22 -14 1 38 -42 -10 -44 -35 7 8 -32 -6 19 -10 -10 13 78 -7 23
3863B3J1p9K7j1j6L7k2j2K9j3M8m5M6m2M6l7M0ml4nLL5k3J8n8N6MNk0k2RN8m7
$$ 23 34 -45 -18 -29 -45 -8 -30 -42 -13 -26 22 -23 23 -19 27 -10 30 26 -8 -13 -10 25 2 20 -38 18 22 27 7 -15 -6 52 5
3896Ek3O5l0ml0M1N1r3M0n6N9l3j1QM6Km0J6n6L4P4m0k0K7m2J9Qm2O5l8qj0K0
$$ 5 -18 47 17 13 -17 24 75 -18 22 -34 25 -8 -19 -11 35 37 -3 13 -43 -9 65 25 5 32 -10 9 17 -25 40 2 -6 -16 4
3929Dl1MJ4k2L3Krl4Q6l1p2M5J3M3j5l2kj1K7j3K3l0O2o4JL1l0j7Q7k2J1n5LM4
$$ 4 -27 -23 -9 -31 2 4 -5 -39 47 16 -56 -11 2 45 30 -2 -4 -15 12 -1 22 -8 54 -10 -9 22 -8 -25 62 40 51 -4 -1 43
3963D3l5j4nj3L3l3m0N5k9O2l3nJ7M3j07K5M7l0L3nl3Q4l5j8j4j2N5J4r5P7Kl3
$$ 43 8 -6 -11 -24 9 -24 -64 -9 -38 24 -9 -14 3 46 -61 -36 11 -19 14 9 -24 60 25 7 -7 -19 36 50 -45 32 34 1
3995AqNl4N9L1rn8l7J8M8n7k0RJ2J7L8p7pO9Rn9k3P8j7P3n5k1O8j13N9M6m7L6
$$ 1 -7 -2 -36 23 54 45 -13 -50 -32 16 -41 -61 -52 -40 -23 15 -62 -69 0 9 -50 -73 5 -12 61 6 -15 53 -60 -1 45 -2 34
4028C4k3p4O6OP1m3k5L8l2Pn8Q9n1k6L5n2O2o6K2%J0K5m9Oj1M2L7k8J5j6Ro7Q5
$$ 34 11 -63 3 9 80 37 12 50 18 25 -33 56 5 -21 14 -38 24 -42 -20 -20 -10 15 -34 -28 -39 3 40 12 27 11 20 -47 38
4061C8m6NLk3L1k7qM4n9RM3K5j6n7L8k0j0O8J0l3M1p0J6lM5j3r3K8J2L4j2op6
$$ 38 -8 -3 0 -23 8 -19 -27 17 -42 -33 10 35 19 -38 0 -20 -30 38 48 15 56 -14 2 -1 44 31 -62 -34 -22 12 0 -6 -82
4094h2R5m2L8m6Q9m5Jj6l3PK3L2m1l0P7m7NK0j2O1p2L4L2rm3k2J5J8K1p0K7K1
$$ -82 13 -29 9 -37 52 7 8 -8 -41 -34 -11 21 -20 -50 27 -20 -15 5 -7 54 -18 16 48 39 -4 -26 -11 7 28 -42 -15 6
4126Fjl2Q1m1k7m4O9K7o5L1K8n3KL2qJ2o8R9r4K0oK3K2K3l2J7%J9J1rQm6Q6j21
$$ 6 5 -27 54 13 -14 -58 11 38 -27 4 32 -21 -19 13 5 17 -51 48 -46 -26 -32 -9 13 36 4 21 21 40 51 42 50 4 90 -31
4160c1JO2J4o2k0K0K6Pk3j1J2Pn3L1K6k2J1j9j4oL4j7J3k0J07j05M4Npm5mN6k8
$$ -31 -30 32 46 -16 -36 -16 10 17 -6 -17 -5 2 -51 -20 6 -16 -5 -24 -38 -44 -10 -27 -14 -34 73 -32 12 17 10 -35 -39 17 -11
4193a1k9M4m0M8m0L7j4Q6j5K3q3j6k8L2M8%o7L5k5J2j1M4m4M7j6M5k1p9J8k4P3
$$ -11 -40 4 -36 12 -28 9 -5 81 66 89 6 -10 -38 -6 42 42 -25 10 -15 -3 -14 30 -14 33 17 62 41 -38 -20 -44 29
4224B9k1OK3m1RNn3O9o2R9l9lK2l5rK1jK5k7M0l1n5N6k4lk0MO8m4M1p6k2M3O5
$$ 29 8 14 37 -4 5 10 -43 26 -36 63 24 21 43 8 -1 20 19 44 17 57 26 -29 27 3 0 -20 -16 52 8 49 -27 -49 -6 59
4258E9p4P7r9O7Nl1o2L8K4n1L5lJ1J7l3L6j7K2m2oKn1Q0Nj1J5mk0K4pm1L8k1M1
$$ 59 -15 62 -37 30 35 4 -58 -20 4 -47 -12 -15 -4 13 -20 16 -1 21 -21 -27 -25 -76 4 9 -2 13 9 -11 13 6 -35 3 -18 23
4292B3k0j2k5L6MM3p2P0k3j8J0J5m8mK2j1L2%o5M4J6n0%M2k5J4k6MJ9r0J39m6
$$ 23 3 -9 -34 2 6 49 -23 47 24 6 16 31 -17 -21 1 -10 22 22 -43 1 17 -33 -33 9 -16 -2 -28 -24 -5 -95 44 -2
4324bo9O3L1j4l6R9m9Nj0j9K6k5Qk1j3L7l0j5L3N5l7n5J5jK9L8r1O3k0K6k7K0
$$ -2 -71 -8 23 9 -27 72 23 28 18 -1 25 0 8 -13 -26 11 -19 -34 -1 54 17 -38 -23 -24 5 43 -48 15 -5 21 -6 14
4356A4L0o2K9J7j4m8M8J6k5LL2n6lM0j7n5L3M0j5k2l7R6J4n3n4L8klL7m7K7km3
$$ 14 44 -18 11 28 14 -34 14 30 5 8 40 -16 -19 21 4 -51 -18 22 7 -15 -52 44 58 5 -49 -11 -13 -16 21 -26 1 -1 -44
4389d4K9oJ0oj1L5m8J5K7j9M5mk7Rk5L3j1J4K2n1Pl3P8J3Kp5J4K1J8Rm0M4m2m1
$$ -44 -15 -21 -11 -17 -28 7 -41 -26 1 -18 27 23 -4 5 -20 13 2 16 38 -13 -6 -39 39 52 54 -21 -7 14 32 41 1 45 3 -38
4423c8kN6pJ4o1Q2Nn8k2N3p1NJ0QJ8k7L6o0J8KJ7J7k9O0j4LK1J2l1l4K0n1M2j7
$$ -38 -40 16 9 23 -38 44 49 -9 -31 22 -49 -44 -34 -26 -8 -35 1 -59 -41 -39 -22 -5 -34 26 12 15 36 48 17 -17 3 -48 -6 -23
4457b3N4k1Lm5K6L5l2PNn6P6k5NJ2k8j5N6K6p6k7L7pjJ4m7M0k0K4l3J3K5k3L4
$$ -23 31 10 13 -32 -6 29 -3 4 9 -47 29 4 9 21 -7 -22 34 60 -16 -43 -6 -13 -14 0 -47 -7 -27 -3 -36 -23 2 -21 13
4490A3Nk3M0l2L1m3k2kL2Pn8J7J8N8n2j6Q7q7L1m8P2k5L7l1J9J5r6M3L2Rl5j9
$$ 13 18 -5 35 3 34 -9 -31 -33 -1 6 -52 -35 -17 41 -11 -27 60 -27 4 -44 28 3 40 9 28 43 -53 -10 22 31 -4 -23
4522b3PL1l7l0K1L5M3m8J0l2K0oK8j9O6m0nJ8k8k3P8p4N2l5pL1n8Kk3J21o4p8
$$ -23 -16 15 -22 -52 -31 4 47 -1 9 -23 -3 -9 19 0 66 26 21 39 11 -12 66 -8 44 9 2 33 -25 -23 -46 75 11 -67
4554f7J15Pq8L0k4M6k1m5L4rn0Q0n0k1NM7j1N9n9M7j8mk8%K4QK9m6j2N9O%o0N7
$$ -67 48 55 -33 -3 -27 19 -2 -47 -13 -22 -72 8 -42 -63 -58 -11 -22 37 -22 25 7 3 -25 -25 -1 7 36 -10 -22 37 43 43 -17 40
4588D0Rl1jJ5ll1N3m3J1k3Pm0L6K2K4k0l9K7p0M8J8l5M7J9o4MJ4MMJ4Mk4K0J7
$$ 40 49 18 17 32 29 -2 51 8 19 -4 3 -37 -1 21 45 25 -14 13 -57 -9 9 -26 21 40 -24 -20 -6 -2 2 16 20 -4 16 33
4622C3k8pJ5jl5j1L2M2p2RM8j3j2K1m4PoN3J7n7rj0J4L1p0J09l7o9K8j1J0PnK4
$$ 33 5 -2 13 12 -23 -34 -2 40 -32 -23 25 12 0 21 -23 -16 -22 31 48 -9 -18 -28 -14 17 -53 56 19 -50 -22 -33 -23 -16 -21 3
4656CNo8J2R1k4l1O8o5N1q0P4J7l6j7J7j8L0J7j04Q9Nm5L2m9K1Qm7RN1l7j3O1
$$ 3 8 -60 -48 43 19 -12 56 -9 42 -38 36 53 17 0 17 -1 29 46 -58 31 36 -9 23 -26 -5 3 -44 -35 16 -21 -34 27
4688B7l4J7rnPK0l0lJ0k5j0j8N1n7L5O7l5Rl3L5j9l1M6oJ4n8L7MK3Pk0o0M7J2
$$ 27 -7 10 1 -4 3 23 -7 -10 0 -25 -35 -53 -2 -59 -24 43 8 17 -16 19 0 -31 15 9 23 -35 2 6 29 36 16 -44 3 15
4722A5K8l6m0L5L3K3m0l1j6M0qLL2o0Pj9O7K2m5n9N8j7m3N2j8k7MK9oN2q1N2k0
$$ 15 43 7 -33 2 35 58 18 -13 -29 11 3 6 38 -22 -15 -34 33 55 10 -49 9 -8 -51 1 -17 -44 -40 -11 -17 35 -46 6 -14
4755a4M0Rmm7M5k1k0J3M4k7J3n2NM7n3M5J0j3Pm6j7K0k0M0Nq8J17k8n2RL7j6j0
$$ -14 26 35 31 -16 29 8 -12 1 45 18 31 -21 -16 31 -22 23 33 20 27 -19 -36 -16 -36 4 9 -79 38 10 -42 -33 4 -12 -22
4788b2K6j1k5L1J9lK4n1L7Jj5K6j3m5M8Nm1N1j3m9P1o4J9Jj6mQl9J6N0j1L0k3
$$ -22 4 -7 -32 -1 18 15 39 -12 25 26 11 37 24 -21 27 32 -9 42 29 -20 51 -13 6 7 -9 -13 -5 -44 -28 22 11 41 18
4821A8l3k0L6J9J8p0P6k7n8LJ8j2M2k0j1J9L7J7m4J0k7P5q3k2J32n4n4M2l0Kl7
$$ 18 -15 -35 1 20 38 -32 44 17 -41 -38 -20 -32 10 -10 -21 -2 35 52 8 18 -9 66 -17 -39 93 39 -15 27 -3 -1 -38
4852c8O2o3O8o4N9J0m4L5l3N7l3mj3j1M1m4n5P2M9n9P0j1k6RJ5n8L2L8m8M0Ll8
$$ -38 24 -39 29 -35 24 34 -10 25 -8 49 16 12 -1 -12 29 -15 -70 2 51 -8 62 51 25 34 49 -9 23 61 13 53 56 18
4884A8l1M4k4K3nl5lJ8k3L8k3K0k6l7N7k1O1o9K1nPmM5l8J0k7pO6o5j5Q2Qn3N4
$$ 18 -13 31 7 30 25 -10 -13 5 -18 20 -3 17 -9 -46 11 -10 51 -18 3 -2 5 1 46 8 18 -9 -16 50 -15 -30 52 60 7 61
4918F1n3Nm5J3K4Rm5nQ1ponPm9J6j7K6j0J2l0L3Jm0P1n2J0j8n0J24j13OR8q7J3
$$ 61 8 13 -32 -19 5 14 -31 -36 45 38 32 27 34 -15 1 -16 10 0 12 -18 15 16 -24 47 -5 5 -13 -63 61 -52 -46 52 -35 -22
4952b2J4K4m4J1j6pM0l7J0Q5n7R%m4J7N6m1j4j3l2J05j5o9N4MRn8J0k0j6R6k5
$$ -22 -8 16 -28 -17 -33 -40 0 -37 -27 58 1 10 10 -34 -17 39 -2 -16 -29 -61 44 29 -40 14 18 27 -31 -21 -41 -57 39 14
4984A4j6K3rk7J3Qj6RJ4j9j0m2K7L9j9N4p4JM8J6l8P7mr3L1j4L3n5M7l0N3%m5
$$ 14 -2 21 12 -15 -2 6 -10 -1 13 -6 -16 -58 -31 8 -11 43 -31 -30 18 34 -4 73 69 -24 7 -7 26 -29 18 -12 41 41 -4
5017dL5k1K0k7k6L7k7k1J1L6o2O1K8Jk9r4R2n6PK4J9j4j3K8mn4Q6o5J3Pl2R1j7
$$ -4 31 10 30 3 -23 14 -13 -34 -23 13 -49 12 40 41 12 -82 10 -46 -39 -15 4 -10 -23 5 1 -53 33 -32 -19 -12 -44 47 30
5050C0j7l8K5K0l0j5K8j3Nj6P3p5M3n1N4p5J02p3k4N7MpL5k2J4l7L5l5l7J2N1
$$ 30 13 -25 0 20 -10 -25 3 -10 -5 -21 52 -23 20 -31 23 -52 50 -23 -47 10 14 7 42 20 34 -3 32 -3 -40 -28 23
5081B3k5M9l5q6K1Q2k1o9P0l9O3j3k7k7J7M3k3L3n8M8J6m7N1k1M4jo5oO2o9O0
$$ 23 -2 47 12 -74 -53 29 8 -61 9 -30 33 20 -7 -34 -17 26 3 36 -22 26 42 -5 46 25 69 68 3 -3 59 -10 50
5112E0l5l7Q8p8j5K5m0Q3k1o4M2J4MJ7j4m8K8j8L7k1L5oqK0m6lN0M0p8J7jL6l5
$$ 50 15 -22 66 -12 -27 -2 -42 41 20 -44 -2 12 16 33 19 -29 -1 -19 18 -3 32 26 18 38 -8 -11 39 79 1 18 17 53 18
5145A8mk3j7jN0l4N0m2pNm7L0K9k5J3l9Q1j9n3O0k7K0o6J1J1L5jl1k8kK3O9Qp8
$$ 18 14 -9 -26 -27 23 -11 39 -3 -10 -5 -52 -22 7 -18 -5 -44 37 18 -35 25 -2 18 -48 -37 -26 9 8 -23 -51 -53 -30 39 47 -31
5179c1K5rO1q5P1rl3N7qJ7m7oRKLPo9M9O9m7K3r1J7N8j3m1N6%q4O5k8K2m0j7M8
$$ -31 -6 -15 46 -39 32 23 -10 47 39 56 9 3 12 14 17 24 -45 4 73 26 49 -42 -25 33 20 -21 35 35 -49 16 -12 10 -30 -47 1
5214AK3m3J4L7k6Pr4P6m1R8o5J2K4m5P0k3j2k6L6Kk4K5j1l3L5Jl8NL3j0j7j4L2
$$ 1 24 -19 -5 32 6 13 -81 -5 -46 52 -13 -1 23 -22 48 25 13 -13 23 25 1 26 15 -18 17 18 -20 -15 18 8 -9 -23 9
5247Im1J7J3J7j4k4m9N2n5M2L9O0j02k8M1J4j1J2N7k6j9k6O8l4l5O8K8n3OpOl
$$ 9 -32 -15 -2 15 1 -23 -72 -20 -75 -33 6 66 -36 -64 -23 -9 -20 -8 49 23 4 -22 46 12 -23 45 73 20 26 19 25 22
5279B2k0J6m2N5o3M3J4q5P0rl6K3L7l8L1nl6P2o3O3k2m1P9o6J5n9L9N8p2N3rk5
$$ 22 2 18 -24 31 -32 11 25 -60 10 1 -35 -12 25 -13 18 13 -23 49 -14 49 27 -14 65 -1 14 -45 -6 52 -20 33 24 -1
5311aj0M4k7M4k5l0RL4m6L0j2k0M9j17P2%m7O9l6K4k3k5N2N3p9J5L9o3J14q6K1
$$ -1 -11 33 6 50 25 -5 4 38 -8 22 10 -10 39 -78 -6 -6 -53 16 -20 4 -19 -44 8 61 -18 -3 36 -27 87 1 22
5342B2nn1j9M2Rl0qR2l2Mk0Ml8M9Mk2L1nnk1L9jj2l6lL6qJ4m7K6j0J4KkL9m0k2
$$ 22 17 -34 -53 -11 -2 -32 -40 52 20 24 4 8 -30 19 23 1 32 27 22 1 40 39 27 -9 -12 24 16 30 -17 9 -1 13 15 13 52 12 -10
5379a0KM9k8m9N0j9lJ5K3J1o8N3kL9q3O1J4n7m8O4j0j8M9o9O7k8%n0L8J8KQm7
$$ -10 -8 41 13 -36 14 -5 -8 7 30 41 -27 26 24 63 -20 41 55 -2 -50 14 4 -14 35 -34 33 5 5 -45 -7 11 13 21 -26
5412b6O1m4j0L3%P0l5m9m6J6M4k9k9P0k4N7q4MN6n0Q2p0K0l8K9NlL7q2N1L8j7
$$ -26 35 -9 -19 14 14 84 49 0 -46 -30 14 -15 -44 26 2 59 -25 -21 35 -15 67 -3 17 -21 8 13 10 47 -35 16 54 37
5444C7o9K4m2P4m9MJ1L9j4l4M1j08M5J18o6k0J14j08K7n9j03P8J35n6r1j13J80
$$ 37 -32 -8 -50 24 -25 -21 -10 29 15 -19 22 -86 -41 77 11 -9 105 -3 24 -35 -138 -60 75 19 -72 -185 -5
5471ej93J6K24N1j23j32J34k14K93J56m76J26K04l25K20qK52l24K22j8J25q9p5
$$ -5 -198 -182 42 93 -30 -162 -28 -242 51 207 -269 -143 61 -264 -44 -52 200 -124 98 80 205 116 41
5494D1P5j73J00p0n1J20o5L2p7L2JJ9l4j4L8k01K44j5m4k3mQ9%P9j5j22N3p3J11
$$ 41 116 -57 43 -27 -78 42 -23 9 -68 -36 -35 -16 -50 -64 -26 -227 17 2 -42 -65 -69 20 20 99 84 -38 15 -58 53
5523E3l6J88k00k30K17J06j58P6L03m01K39L2p6PN1J02m78K71l2j93L69m53J97
$$ 53 17 205 5 -225 -8 98 -60 16 319 -82 157 189 113 120 171 273 -205 66 34 -159 210 -243 -46
5546d6M8q2R4j83L60m82L58L2j87K6J23j36J57j99K15l5q3J11k50L04j73L5m2
$$ -46 2 -80 14 -169 191 -291 67 99 -88 -62 61 -75 82 -117 98 63 -20 91 -159 145 -28 7 -35
5569c5m3M3J84j42j61J51R8q6N2L4o8Mj06j42N55j86j69j41N8j16J54J77j49p
$$ -35 -78 -35 149 7 -154 -3 95 9 61 95 27 31 -75 -217 338 152 -17 -158 -100 -216 -62 115 -34 -41
5593d1k6M2J56k81K45j13j7j84L35q4j48J44r5L5J13j22J58k59Q3O7K53l66J3
$$ -41 -67 -25 131 -150 95 -18 -35 -219 116 32 -116 28 -67 -32 81 -41 117 -142 -59 8 261 -105 -92
5616i2J35Pj96J19Mk28M70l48KQ5j50Q3J56j35J6K1K9l27Q3K25k12L41J8l9j28
$$ -92 43 50 -146 -27 -23 -251 219 -129 -127 -42 -192 -109 47 -88 -72 -51 -22 -349 -266 -41 -253 88 106 67 -61
5641f1N5J43l10n8Q7L69l1ql8r7J66O3m52j62J96l4m2J66L51m04k8k84N20k09
$$ -61 -6 137 -173 -231 -144 225 194 186 148 51 217 280 -172 -334 -138 -172 -214 -48 303 -101 -129 -413 107 -102
5665a02K43N3k74J92k88%J55m2K93q3l04M6O6j25J29J02q7j2J40j9m6n7l4J9l4
$$ -102 141 194 -80 112 -176 -176 -21 -63 230 147 -157 -111 -45 -170 -41 61 -26 -38 102 83 37 -20 -54 -35 -69
5690f9J76j08K3l5N5J7n1J4l7rON2J5pj3l7Nl5N3qj2j8P2n7J7l4kJ1M7m4mJ7j9
$$ -69 107 -1 22 -13 42 59 8 22 -15 -24 -18 34 49 42 29 -8 -3 -38 15 7 -5 -23 49 -8 9 -25 -27 -16 31 -13 -17 0 -19
5723a9N0l5PJ3n7N5Kk2J4KJ4l1l6R4j8o1M5Nm6N5l9L5m7L1j1jL0Jm6N1On4L3k
$$ -19 31 -4 3 16 -41 14 16 -6 8 10 24 -7 -43 51 33 -28 17 22 -24 31 -8 27 -20 11 0 -1 29 30 -16 35 41 -13 20 18
5757A8qk8M3p7N8j4qNJ1L4l6J1n6P8p2M2OjJ2PJ8o2l0J8L2%N2p3Kj5L1M5po4J29
$$ 18 10 -18 25 -52 6 -8 -16 -11 0 34 -2 9 -47 31 -41 1 7 6 18 25 43 -19 -49 -31 1 1 53 -20 -18 -33 -2 43 36 -28 101
5792A01m3m9J7l0L2p2KR0l1j8m8J1RL9j1p0J08m4j6p0J02%jL7l8l3P1kn1JO2o6
$$ 101 58 9 26 -4 28 -44 -42 48 17 -1 -49 -38 -29 10 -1 -71 37 -7 -23 -93 9 9 8 45 7 -26 45 43 -8 -7 55 -11
5824a1LL6j8M5l4k0K6k4m1M9pJ1j0%Jk6K0OJ2kl1l3Q7k3q1K8RN6J2l9K5m1QM5
$$ -11 -8 28 10 55 21 1 27 3 -38 11 4 15 5 5 6 -20 0 6 18 16 -15 -48 39 16 -65 -37 -28 28 40 1 26 -15 -7 38
5858C8k1n5K0j3M0n8R3l9RK0m0M9p0QK6Jn0J04l0pk8M6n6l8N2n5M4JK2M2j2k1
$$ 38 17 -38 -18 -31 9 -49 44 5 14 34 -6 43 -27 -19 7 8 -42 62 32 25 -3 43 -13 -51 1 -54 -10 -9 13 55 43 22
5890B2lK1Lr7M4JJ0M6j04M6j0K9qK8j1Pm3k7O2o2J0R1j3K1k9j0j3mj2N4m8Kj5
$$ 22 19 40 43 -54 -10 -9 1 47 -57 -11 -21 8 0 28 17 24 -19 -46 16 -46 -36 55 42 63 34 24 11 7 -5 49 1 3 -12
5923a2L3L1m4k7L8njj5lN1n1mL0Rn7O2m6K0JL8n1m4P2M4j19O4J8J3o5M5l2J9J
$$ -12 21 52 8 -19 19 14 13 -2 -5 46 -5 -9 21 30 -27 35 -11 9 10 48 -3 -47 25 69 -50 14 32 45 -20 25 -7 12 13
5956A3L4j6kl9j4M0j9M0m9N7k4m3Q9n1Mk7j4K0j2j2mj3O9p1j5J11r1O5k1kj0L7
$$ 13 47 31 29 -10 -24 16 -3 37 -12 45 21 -22 67 16 20 -7 -21 -1 -13 -25 -29 -42 27 -44 -59 52 -39 26 5 3 -7 30
5988C0Mp1R2j00N5L4q8N9j5J7k2j0K1M0l4M4l4k2M2k6k5M3m0J0k4K0j4k7K7l5
$$ 30 34 -37 55 -45 10 44 -44 15 0 17 -5 -15 6 46 12 56 22 0 42 16 -9 34 -6 4 -20 0 -14 -41 -14 -49
6018d9M3L9nm0%lj3R5j39M0oM5l1lOP4n2L3K6l0l1kJ5M2J7m2n2N8L3n1on9P8n5
$$ -49 -6 33 28 -12 -12 -15 -28 67 -72 -32 -38 7 -24 -27 -21 53 1 34 60 30 -1 -3 12 54 71 29 -23 35 68 17 11 -48 30 -25
6052b5K3J3J2qm9P2j2l5J1l3J1Nj0K9k6M5j6L3m7J1l5J4M6k1Km2RO3j4Nk9M6m3
$$ -25 -2 11 23 15 -34 38 26 -9 2 -31 -20 -15 -25 4 -22 23 7 40 -7 4 -31 -17 29 8 10 -32 -23 40 26 31 2 48 5
6085ENm9M0Ll7O4j1m1N8l8j1L2qn0Q6Rr0L2Nq4N6J8RJ8J9j5l1OK9Lj8m1j6N0o
$$ 5 10 -39 1 4 -33 31 20 -21 37 -1 -12 20 12 -38 48 57 -33 -1 4 -80 -24 -6 3 21 40 25 -6 0 29 32 14 -27 -43 7 1
6120AOMo2P8q6M7J6O0K0j33R7k8o6M2l0R2o2j4N4l0n0N1qk2J5JK9l3oOJ5j6MJ0
$$ 1 7 11 -51 27 -59 -12 4 64 84 -49 48 20 -46 -4 -34 58 -4 -18 36 6 -44 7 -1 -23 -8 -7 22 -11 -17 -11 4 -12 -8 2
6154BJL0m7J7lk7M6k7n1L7j4R6p8J8N0q6L5k8L8LK8k8N8r8M5J6j6M4q2M9l2j1
$$ 2 3 33 -14 3 0 -27 19 -8 -59 -22 -36 60 -18 0 50 -36 -1 -29 9 12 40 12 70 -28 17 33 17 61 -21 28 -4 -15
6186a5k7O5r4J9j9L1LJ1j0K1J6oN3m7k1rO2k5%j3P7r0L3M2p6m3mM0M1n2P7m7K6
$$ -15 -42 23 -71 -52 -71 -40 -37 -26 -36 -15 1 -5 48 1 -20 -29 33 8 8 -5 72 -18 15 57 -19 -62 -66 -26 15 -37 40 -7 19
6219A9K3m6Ljj6K1K0k6k6O3l6p1M5oK3J1l0k2N8OLL0k4o9%M7K7q3jM2j8J0O3n2
$$ 19 42 -4 -1 -2 -18 3 23 -3 -29 34 -2 -73 -28 -34 -11 0 -30 -52 6 12 15 45 21 -48 -48 -1 26 -57 -58 -16 -34 -24 39 -13
6253a3K2l2K5lK9K9p9O5l6Q9l1m4k0j0qM3j5j1l1J2qJ2KoJ0k1J7M3j3jJm3k2P5
$$ -13 9 -23 2 -1 28 57 -22 43 7 96 65 21 1 -9 -17 26 11 0 -31 -19 -27 -15 -13 -19 -9 -30 -13 30 17 16 17 -26 -48 27
6287B7k2J5j0m1P9j5o8J8L8m2J8o1N3M5Jl5M7n7k6r9K12k30K2L78k94NJ5o7j99
$$ 27 5 20 10 -31 48 33 -35 -17 21 -21 -3 -64 -11 34 35 0 47 -10 -36 -135 77 -153 -131 247 -47 -42 -27 -94 -293
6316b93J60J21k6l3K29r2K7pj51o4L43j78M08m73mK60m78N10q6j75N2l51O73j99
$$ -293 -133 -12 -38 -71 158 66 93 86 -65 -129 214 36 444 -29 -33 227 -251 259 173 -2 50 -301 372 173
6340A73j97K4j01J47J68j92l11K1O9L61k48K01n00L44k06K57q0l38Q00n41K14
$$ 173 -24 0 -101 46 214 22 -289 -268 -199 162 -86 115 -385 -41 -247 10 -70 -408 392 -149 65
6361F5k75P0n0M7L2o7K88j30n8M0R0o7L2k1j0K0J7m4l8N5Pk%K1L0l3J4jm9l3N8
$$ 65 -210 -140 -190 -143 -111 -178 110 -20 -78 -38 52 -15 17 -4 -14 6 23 -21 -59 -4 3 1 1 22 52 19 33 32 -17 -50 8
6392HK5j5k8j0J4JJRJ6m4R0q5L9m8nOLO0m4k5J7N5k6PQl0K2nM0m9%%N6j3o5N5
$$ 8 33 18 -10 -20 -6 -5 -4 5 21 -23 67 -18 21 -27 -32 -26 -23 37 -7 -32 -15 40 14 21 29 -1 21 16 56 7 7 7 63 50 -15 40
6428D0l4j0k3L6L4j9nl0N9k6K0l0J9K7m5j1M2j26R2l5N1r1P6J2o1R8q6NL6n6M7
$$ 40 6 -4 -27 9 43 24 19 -11 48 22 42 12 31 58 13 2 44 -82 10 -25 26 -65 11 23 -38 60 -26 -21 15 -41 6
6459FL8n3Ok8O4o6k0R3p0L0pL2j0Qj2oK2j9p1R8m7P2m8l8O0l7KRJ8o9K1k7N1J2
$$ 6 44 -9 -3 -31 33 -33 -53 40 -30 0 -7 25 15 23 11 5 27 8 -63 35 -12 60 12 -26 34 -3 -1 8 26 -43 -22 -49 2 14
6493A4Ql3K9%j6o1O2K9On9Nk3N9KL2p6K5j0lQ1p3k9P4No3O0k8nkk9M4m4J7K2j
$$ 14 22 -11 18 18 2 -59 3 32 38 -21 -16 -39 20 22 54 -22 3 -7 -10 71 -2 -31 43 48 -15 45 17 12 10 -19 25 -19 -2 20 19
6528A9o2NO5LM8j06j1K4jLLPj6M7m2O9n8J3M6J9k8n4KJ9K0n2R5l1pp2M8K7jk7
$$ 19 -43 -38 27 30 78 -28 -39 -15 -16 -13 -10 -3 -19 28 -14 55 -3 10 56 75 47 -7 -5 14 34 -18 77 46 39 -33 15 42 41 14
6562A4qK3J0l0n4O4j00N3N4L%J3l2j9J5k1L1o2j6jN7l1qN1Pq8R4J7n6K5k4qK7
$$ 14 6 29 39 9 -45 19 -81 -28 26 29 29 42 10 -9 6 -15 16 -46 -62 -63 -6 -37 -45 6 13 -75 19 36 -20 5 -19 -27 0
6595@j1M6o4L0L0n6M3%Ok8j8PK4Oj3m8M4j6K0j2N1p3N7n1lK7L4o7l1JP6m3j2K3
$$ 0 -11 35 -29 1 31 -25 18 18 24 -4 -22 -15 9 15 2 -46 -2 -18 2 -10 41 -32 25 -26 -29 -2 32 -35 -66 -65 11 -32 -44 -21
6629b1l1L0L5j6PJ5j4qL3k3m1L1M7k4L0j4n0K9l9J5j2O0l3k6L8n5K4l9O1j0L5
$$ -21 -52 -22 13 -3 4 19 5 -3 30 7 -34 -3 44 20 50 36 -14 15 -24 -9 -21 39 6 -20 18 -37 -13 -52 9 -1 34
6660C4k8o2O3%O8q9Pj6K2j4nN0l3J2j3k5L7j5M4nl8L3j0j2j3qM0J7l4m7K2K7O2
$$ 34 6 -56 7 7 75 -14 -7 -23 -1 -15 -20 30 -3 9 -4 -29 8 -7 37 32 -6 27 17 5 -8 -16 24 41 7 -40 -18 9 71
6693G1q3j9O2nK0k8Mk1L3l8l7lK4J0k7N3j1K6n3M4K4n1J8o2J0qM5k8K5j8O2Jn7
$$ 71 -12 -31 31 26 46 18 22 1 34 -4 -41 -44 -20 -10 -37 16 5 31 -22 22 46 -5 13 -49 -39 -47 -2 -30 -5 -23 39 40 -17
6726a7P6l7jl6lM6Rrp6M2LJ0l3L2j7ML9n4m6O4l2N5l6j4L1PJ6Lp4O1j7k5J9Pj8
$$ -17 59 22 21 -15 -18 28 37 28 -48 -6 -3 7 -26 6 -11 -7 32 -22 -68 -4 -36 19 -17 -31 0 7 23 26 -48 13 -4 -29 -10 -3 -21
6761b1jN9mNm3K8j0%J5n8K3K2%L2n1PL7o1M4NJ4n3J8qk5J0QK4m7M6kNl1jK8j8
$$ -21 -22 37 33 38 -5 23 13 13 28 -30 -7 15 15 47 -4 3 40 -21 23 28 42 -11 7 -1 -26 -16 -8 16 -31 15 13 18 -13 -14 14 -4
6797dNJo3N3J8k0N0r7O1j1l9P3J0m1K9mJ2j6j5ko0N6l6j2P0j8J7qk5P8o8J1J2
$$ -4 1 2 -61 -8 10 -10 40 -57 4 -7 -46 27 37 -4 25 21 33 17 2 0 -60 -4 -40 -52 18 0 17 9 -16 62 -6 5 17
6830A7n3PL1mN7k6m4O3j02lN9l2MK3j1M9j4n8K1rJ2L2%mpJ1l8JK7M0l8M6l3k2
$$ 17 -36 -29 2 -2 55 29 -15 48 -54 -57 2 -30 -26 -3 -14 35 21 -37 -16 -25 -13 19 19 15 8 19 -19 -18 9 49 11 57 24 2
6864BL5n1J8rM2k5j3k4M3L4k5k9rLO4j10P4Kj7m5O1J0k0l0QqP6p0K6l5K9l5j5
$$ 2 37 -14 4 -5 37 12 -1 -25 18 52 27 -2 -11 -8 56 -54 20 22 5 -40 21 31 11 -19 -11 -19 57 -13 13 -22 7 -28 -43
6897d3M1l0LK6K4l0K2L7l8L2l0m0RKj8j8P0k5m3K9k6K9L9Jm7M1m5J6K5o4L3L1
$$ -43 -2 -32 -29 -3 21 -9 13 50 12 44 14 -26 -17 -15 -33 -51 19 -6 -49 -20 -46 -17 22 23 -24 17 -28 -12 13 -51 -18 13
6929A3k4l1J2K9No6O5J9nm1M1l7KK6M1k5J6l5n5M9M2l6Qqkn0PP1q0J3M7P6r2n
$$ 13 -11 -42 -30 -1 4 -62 3 22 17 -24 17 -20 -18 8 49 24 40 5 -50 -1 41 5 13 5 3 -47 -40 31 -49 -36 11 87 -5 -10
6963a0j4O2n6n4O3L9k1jn0pK6%M4J4q6L7O7m4L3m5J3m8N4nJ1l0K8L4m7jk2k7O4
$$ -10 -24 38 -18 -72 -9 30 9 8 -42 -49 -23 -23 21 35 -51 -14 53 9 42 -3 10 -38 16 11 22 -8 20 54 7 6 -16 -43 21
6996B1lN0j20O3k5J1K8o0M8J3j8k0K0j9L6l5JOnL5Lk6l7M3k2%J3j9J3K4J2n0R1
$$ 21 18 68 -52 11 -14 -3 25 -35 13 26 8 -12 8 -11 25 -10 -9 -3 -8 27 30 4 -33 10 -12 -12 1 -18 -5 19 31 -19 72
7029G2q4J9K9m8L5k0j0K7j8Ll3O8j7m1nM6pj9J2J0Nn7L0l7l8L7J2M3m4L7K6n7
$$ 72 -12 7 36 -12 23 3 -7 20 2 5 -28 40 23 -18 -23 23 16 -3 9 19 24 -33 -3 -40 -78 -41 -29 14 -30 7 33 -24
7061b4R1q4l3N1K6j3J2j8j8O4j0l7K2j7kK5JJ6l3j4K7n6O1k8J5J4o7k0P3j4Ko
$$ -24 67 -17 -50 1 27 14 26 8 -10 54 44 7 29 12 10 35 36 52 19 5 32 -24 37 9 24 38 -29 -49 24 10 12 6
7093FrL6m4J6l5K2J2j9Rom1R8o0L9m6L2K2k3M5n0L3K6m9Lm8Q8q2rk8N1J5rJ8J
$$ 6 -3 33 -11 5 -30 -8 4 -15 -6 -12 -53 45 -15 24 -22 10 32 9 54 4 37 63 14 17 -31 57 -25 -34 -62 -11 4 -5 13 14
7127A4l5QRp2J06n4Ojk9Q8r2O4J0n6L7k7O8n2J9k5kNpJj6K9L0J3j5o5O7p3O1M1
$$ 14 -21 -13 -4 -76 30 -24 -18 -19 -48 40 -52 12 22 -34 3 -24 44 -8 11 -14 -16 -11 -18 -17 -33 -4 26 39 24 -41 26 -47 14 55
7161E5j03R1n3J6K0n8L6Kk8M4mpL7l7K0j01L3Q5o0K8J8k5m6K1J1J8l3K1L1j7m7
$$ 55 -48 43 -10 6 26 -32 4 6 -22 22 18 11 48 11 31 -70 -37 48 -12 16 34 9 -37 -16 -5 13 -20 1 32 15 -32
7192c2rP3%mJl4NoPoRJ3L3o3OL3j1o3N4j2k4k5J4L2P%J0Lk1Lnj5M4L6Pm0J0mo0
$$ -32 -41 32 32 28 29 -5 0 -6 1 -5 4 17 50 -13 -7 26 15 -48 6 -6 -30 -55 -41 -9 -2 -2 8 11 -10 -7 -12 -27 17 53 60 20 30 26 -34
7231c4k1P7k3Jm5M3QK9k9p%m5N6J%O0j14OPR4q4M9k0m6O4o7L0l7K5o5P6JN2k5
$$ -34 -55 22 -1 0 -45 -2 6 35 6 -1 -1 -46 10 11 11 71 -43 -37 -30 64 -20 29 9 -37 27 -40 -10 -47 -22 -87 -11 -10 42 17
7265A7l7lJ1K8m0j3K3J6K1l0M0n6L1j1kN8o8MJMNk8L8K4m8L9j3K1k9J5l9L4m9
$$ 17 -20 -23 -12 16 -24 -37 -14 2 23 -7 33 -23 8 -3 -5 53 -15 -11 -10 -6 -1 -29 9 33 -15 24 11 32 3 18 -21 13 -36
7298c6O5j2o1Q4n6L2j9Ok7J1k1M0n2O4n5J7K2Oj4Ql3JP9m1L6m8M1l6k5j1Q9m1
$$ -36 29 17 -44 40 -16 16 -3 3 -24 -13 -34 6 -46 18 -37 -20 2 8 -6 2 -31 -30 49 8 44 -4 37 1 -24 -35 54 13
7330A3m1K6J9j8j6K4K5m3L2n1l1R7k0o1P6p7K0K9n2N5ol3K7j7n1J15j9n8K2J5
$$ 13 -28 -2 17 -1 -17 7 32 -11 21 -30 -61 36 16 -45 31 -46 -26 3 -49 6 0 -33 -6 -23 -74 41 22 -36 -14 1
7360ARk7N4Jj3J5m8NO3k3Jk2k6O1o0M5o2rN2%k2J7Nn6K9J1J8j0J1Lj7k3l4Q3l0
$$ 1 10 -17 37 38 25 40 -8 -3 60 37 38 16 -10 51 -9 36 -26 -35 17 17 -5 12 17 -39 -10 1 19 9 20 23 6 -17 -51 32 2
7395Bl3QpJ2nNK6l1k1L4K4N8p5M3J0m7mJ2k5L5jl7M3jl4o9N9ONN3q2M2k4kJ5K7
$$ 2 -31 -23 -30 -18 -23 -18 8 -23 -44 -10 14 72 -3 40 50 3 -1 11 -14 21 20 -17 26 25 -9 -78 -19 -13 -8 45 -37 5 -19 -21 -6 21
7431B1m0k0L2oM6l9m1M5mj4L6K0m9jJjn1Q2k2NJ0lrN8m0kKk9J0L6RJp6R7p2M5
$$ 21 -19 -39 -7 -13 33 -6 -47 -2 -6 -20 16 36 -13 -14 -13 -14 -65 17 -5 0 10 7 -2 56 16 14 16 -13 -3 33 42 43 -33 64 -8 37
7467C7m4o1Q7n4N5rK2k7l1l7N9q0L0pJ19n8k%rN9l3k2j4j4K3k2N6l4N4o3M0J3
$$ 37 -7 -68 19 -35 20 11 33 6 -25 -62 -3 -83 -53 -60 59 1 -1 -1 -10 49 16 -6 -20 -34 -11 -33 23 -11 43 -20 20 33
7499C3l1j3K1M3m3JJ3l4K2j1mJ9o1J2oM1J7n6K4L6l6M4l1n1j0N4J4l4MP6o9N7
$$ 33 2 -11 10 53 10 11 24 -10 12 1 -3 16 -45 -33 -39 2 19 -37 -13 23 -13 31 0 -51 -61 -7 7 -27 -23 53 -16 41
7531D1qk6L9l7Om8L8l3O4l8Rl4K0l6J8J12o8p0Q6J4m5PM4p0M2o9mJ5P9j07N9j3
$$ 41 33 7 46 9 15 -33 5 -28 36 -2 7 -27 -7 -43 -25 87 19 -51 35 49 4 11 55 -15 27 -42 -46 -31 48 -59 0 -13
7563a3kONqj6K6k4P9J3q4J9LL0j16P2L1l4K5k2M6K5n3l4qLn%O5m6J2m8N3jk9L
$$ -13 -15 -9 -4 -12 -28 -2 -26 53 66 -18 1 4 34 -82 -10 21 -13 12 -10 36 61 8 -26 -34 -31 -36 -36 29 -17 -5 -53 0 -1 -30 -27
7598b7L3lj7Jk2Q1n1l8M0j0J8j0k3mK1J8o0RN3nQj9j5J6M1pQk5j3k4L6l2qN0M4
$$ -27 6 3 -14 -13 -35 46 -5 -43 -3 -13 5 -5 -28 -32 -11 7 -53 -44 9 4 12 -7 -22 -6 35 28 36 11 -2 -26 10 -22 -30 20 64
7633F4m2qL3j06N5L5k5l4rK3KK2J4OM9n0l8QJ1k7O9n9J4Kk9O8p3J7mJ2kL0l5N0
$$ 64 22 14 47 -59 -4 31 6 -28 -37 -14 -12 10 24 30 79 29 -9 -1 10 -17 52 -7 7 9 -20 48 -25 -8 -12 0 -2 28 -7 43
7667D3n7K6mmN2o7J9PJ0J3j08N0k8K5L0p2J0L5J6K2k5K0n7L3l1%P1l1L3o7K9J1
$$ 43 -14 12 8 4 56 -11 8 15 25 38 -70 -20 -48 -23 7 -65 -55 -20 -4 18 -7 13 -44 -11 -42 -42 29 -2 31 -36 -7 4
7699DL1l6M2n2L0m6L6pk5K8k5rK7K0m2K4M9m4J7m2K3K9j2oj5M0ok9J5m0L3mLk6
$$ 4 35 -1 41 -11 19 -27 9 2 -23 5 -20 -29 -2 18 -24 0 49 5 22 -20 3 32 20 14 -1 39 33 4 19 -21 12 8 11 -15
7733a5j7j1R2r4L2n0O6jQJ7rkj7kk4NL6k8K8pOM4j2o7L8k4O1l7L8p8L6k0Nk1P1
$$ -15 -32 -43 49 -45 -13 -63 3 2 10 27 18 16 -1 -3 -27 -22 14 -14 14 7 13 57 45 -22 16 -8 53 16 54 -24 12 -8 -3 -24 47
7768D7o2k4J3O7o6O0m1J3RJ1Op2rO0Kq9O3l9K6M1l5L5J7p9J03n7m2kN5Kj4j6l3
$$ 47 -15 -39 -26 41 -25 35 -6 7 16 27 33 -39 -48 12 14 -75 -12 -51 -25 16 -19 16 33 -46 57 0 -42 -44 11 13 -1 -17 -50
7801e0M2L1Qn5L8N5n3j0J9l3J5J9m6M6l2K8n7M3oJ7n1K7K3q9N6J9J6kLJ9m1N3
$$ -50 -8 23 31 -24 14 69 16 6 25 -8 7 26 -20 26 -6 22 -35 8 2 19 -32 -5 18 -71 -15 4 20 18 21 40 -1 52
7833E2n0M0p2K5M5k0Nl9M1k8M5j01O8L9n7PJ3l0L9po9J4N2kl0%J0Kkjm4J00o2
$$ 52 2 42 -30 -5 40 20 25 -14 27 -1 44 -57 11 50 -7 0 13 -17 22 15 -54 -40 12 10 -20 -20 -10 -8 -10 -11 -55 45 -17
7866a7M8L3j15L5J5K6l1KP5p4l7j8K2O6%n0J3POj7J8J0m6k2P3n1N0M3m1K0l4k9
$$ -17 31 64 -51 -16 -1 25 -6 -4 71 -3 -40 -58 -36 30 30 -20 -7 0 6 -11 7 17 -29 -51 22 -29 21 64 23 43 9 -20
7898b0J6Lk8N2Mm0L0J6k3J0j5l3O7n1QK8k0nJ1rm6O8Ll9N4p9R0n2J1J0k2N2k2
$$ -20 -4 -1 -29 23 27 -13 17 33 10 20 5 -28 39 -12 -4 24 4 -1 10 1 -45 23 26 -13 41 -38 52 0 11 21 -1 51 29
$$ [...]
8191D0
##END NTUPLES=NMR FID
##END=
