##TITLE=1H_DE-80H_X3
 200.13MHz, d2o
 8 sc
 
 19ns.26.2.2025
##JCAMPDX= 6.0         $$ Bruker NMR JCAMP-DX V2.0
##DATA TYPE= NMR FID
##DATA CLASS= NTUPLES
##ORIGIN= UXNMR, Bruker Analytische Messtechnik GmbH
##OWNER= pz
$$ XWIN-NMR		Version 3.5
$$ Wed Jun 24 11:15:32 2026 Russian Standard Time (UT+4h)  Yarkov@DPX200
##.OBSERVE FREQUENCY= 200.1313
##.OBSERVE NUCLEUS= ^1H
##.DELAY= (6, 6)
##.ACQUISITION MODE= SIMULTANEOUS
##.ACQUISITION SCHEME= undefined
##.AVERAGES= 8
##.DIGITISER RES= 18
##SPECTROMETER/DATA SYSTEM= spect
##.PULSE SEQUENCE= zg30
##.SOLVENT NAME= DMSO
##.SHIFT REFERENCE= (INTERNAL, DMSO, 0, 14.3821)
##AUDIT TRAIL= $$ (NUMBER, WHEN, WHO, WHERE, WHAT)
$$ ##TITLE= Audit trail, XWIN-NMR		Version 3.5
$$ ##JCAMPDX= 5.01
$$ ##ORIGIN= Bruker BioSpin GmbH
$$ ##OWNER= Yarkov
$$ C:/Bruker/XWIN-NMR/data/yarkov2/nmr/H-C/1/audita.txt
$$ ##AUDIT TRAIL=  $$ (NUMBER, WHEN, WHO, WHERE, WHAT)
(   1,<2026-06-24 11:14:41.07 +0400>,<Yarkov>,<DPX200>,
      <created by zg, POWCHK disabled, PULCHK disabled
       configuration hash MD5:
       00 E9 B6 7A A2 85 ED C7 34 08 36 98 17 FE 4E 26
       data hash MD5: 16K
       E6 C7 E8 1A 28 0E 70 B9 DD D8 26 2E 07 AE E2 89>)
$$ ##END=
$$ 
$$ hash MD5
$$ 91 A9 7B 07 3B 08 9E D8 FB A1 56 D9 8D 18 09 2E
##$RELAX= 
##$RELAX= 
##$RELAX= 
##$RELAX= 
##$RELAX= 
##$RELAX= 
$$ Bruker specific parameters
$$ --------------------------
##$DU= <C:/Bruker/XWIN-NMR>
##$EXPNO= 1
##$NAME= <H-C>
##$PROCNO= 1
##$TYPE= <nmr>
##$USER= <yarkov2>
##$AMP= (0..31)
100 100 100 100 100 100 100 100 100 100 100 100 100 100 100 100 100 100 
100 100 100 100 100 100 100 100 100 100 100 100 100 100 
##$AQSEQ= 0
##$AQ_mod= 1
##$AUNM= <au_zg>
##$AUTOPOS= <>
##$BF1= 200.13
##$BF2= 200.13
##$BF3= 200.13
##$BF4= 200.13
##$BF5= 200.13
##$BF6= 200.13
##$BF7= 200.13
##$BF8= 200.13
##$BYTORDA= 1
##$CFDGTYP= 0
##$CFRGTYP= 5
##$CHEMSTR= <none>
##$CNST= (0..31)
1 1 145 1 1 1 1 1 1 1 1 1 1 1 1 1 1 1 1 1 1 1 1 1 1 1 1 1 1 1 1 1 
##$CPDPRG= <>
##$CPDPRG1= <>
##$CPDPRG2= <>
##$CPDPRG3= <>
##$CPDPRG4= <mlev>
##$CPDPRG5= <mlev>
##$CPDPRG6= <mlev>
##$CPDPRG7= <mlev>
##$CPDPRG8= <mlev>
##$CPDPRGB= <>
##$CPDPRGT= <>
##$D= (0..31)
0 0.7 0 0 0 0 0 0 0 0 0 0.03 0 0 0 0 0 0 0 0 0 0 0 0 0 0 0 0 0 0 0 0 
##$DATE= 1782285280
##$DBL= (0..7)
120 120 120 120 120 120 120 120 
##$DBP= (0..7)
150 150 150 150 150 150 150 150 
##$DBP07= 0
##$DBPNAM0= <>
##$DBPNAM1= <>
##$DBPNAM2= <>
##$DBPNAM3= <>
##$DBPNAM4= <>
##$DBPNAM5= <>
##$DBPNAM6= <>
##$DBPNAM7= <>
##$DBPOAL= (0..7)
0.5 0.5 0.5 0.5 0.5 0.5 0.5 0.5 
##$DBPOFFS= (0..7)
0 0 0 0 0 0 0 0 
##$DE= 6
##$DECBNUC= <off>
##$DECIM= 32
##$DECNUC= <off>
##$DECSTAT= 4
##$DIGMOD= 1
##$DIGTYP= 9
##$DL= (0..7)
0 120 120 120 120 120 120 120 
##$DP= (0..7)
150 150 150 150 150 150 150 150 
##$DP07= 0
##$DPNAME0= <>
##$DPNAME1= <>
##$DPNAME2= <>
##$DPNAME3= <>
##$DPNAME4= <>
##$DPNAME5= <>
##$DPNAME6= <>
##$DPNAME7= <>
##$DPOAL= (0..7)
0.5 0.5 0.5 0.5 0.5 0.5 0.5 0.5 
##$DPOFFS= (0..7)
0 0 0 0 0 0 0 0 
##$DQDMODE= 0
##$DR= 18
##$DS= 0
$$ [...]
##$SUBNAM2= <"">
##$SUBNAM3= <"">
##$SUBNAM4= <"">
##$SUBNAM5= <"">
##$SUBNAM6= <"">
##$SUBNAM7= <"">
##$SUBNAM8= <"">
##$SUBNAM9= <"">
##$SW= 18.0517328524113
##$SWIBOX= (0..15)
0 0 2 0 0 0 0 0 0 0 0 0 0 0 0 0 
##$SW_h= 3612.71676300578
##$TD= 16384
##$TD0= 1
##$TE= 0
##$TE2= 300
##$TE3= 300
##$TEG= 300
##$TL= (0..7)
0 120 120 120 120 120 120 120 
##$TP= (0..7)
150 150 150 150 150 150 150 150 
##$TP07= 0
##$TPNAME0= <>
##$TPNAME1= <>
##$TPNAME2= <>
##$TPNAME3= <>
##$TPNAME4= <>
##$TPNAME5= <>
##$TPNAME6= <>
##$TPNAME7= <>
##$TPOAL= (0..7)
0.5 0.5 0.5 0.5 0.5 0.5 0.5 0.5 
##$TPOFFS= (0..7)
0 0 0 0 0 0 0 0 
##$TUNHIN= 0
##$TUNHOUT= 0
##$TUNXOUT= 0
##$USERA1= <user>
##$USERA2= <user>
##$USERA3= <user>
##$USERA4= <user>
##$USERA5= <user>
##$V9= 5
##$VALIST= <valist>
##$VCLIST= <CCCCCCCCCCCCCCC>
##$VD= 0
##$VDLIST= <DDDDDDDDDDDDDDD>
##$VPLIST= <PPPPPPPPPPPPPPP>
##$VTLIST= <TTTTTTTTTTTTTTT>
##$WBST= 1024
##$WBSW= 4
##$XGAIN= (0..3)
0 0 0 0 
##$XL= 0
##$YL= 0
##$YMAX_a= 52517
##$YMIN_a= -48115
##$ZGOPTNS= <>
##$ZL1= 120
##$ZL2= 120
##$ZL3= 120
##$ZL4= 120
##$ABSF1= 10
##$ABSF2= 0
##$ABSG= 5
##$ABSL= 3
##$ALPHA= 0
##$AQORDER= 0
##$ASSFAC= 0
##$ASSFACI= 0
##$ASSFACX= 0
##$ASSWID= 0
##$AUNMP= <proc_1d>
##$AZFE= 0.1
##$AZFW= 0.1
##$BCFW= 1
##$BC_mod= 2
##$BYTORDP= 1
##$COROFFS= 0
##$CY= 83.5205535888672
##$DATMOD= 1
##$DC= 2
##$DFILT= <>
##$DTYPP= 0
##$F1P= 10.8118882576601
##$F2P= -7.23987719738617
##$FCOR= 0.5
##$FTSIZE= 0
##$FT_mod= 4
##$GAMMA= 1
##$GB= 0.15
##$INTBC= 1
##$INTSCL= 1
##$ISEN= 128
##$LB= 0.25
##$LEV0= 0
##$LPBIN= 0
##$MAXI= 10000
##$MC2= 0
##$MEAN= 0
##$ME_mod= 0
##$MI= 1.114404
##$NCOEF= 0
##$NC_proc= 0
##$NLEV= 6
##$NOISF1= 3.799351
##$NOISF2= 2.8
##$NSP= 1
##$NTH_PI= 0
##$NZP= 0
##$OFFSET= 14.38212
##$PC= 1
##$PHC0= -6900.419
##$PHC1= 13.42196
##$PH_mod= 1
##$PKNL= yes
##$PPARMOD= 0
##$PSCAL= 0
##$PSIGN= 0
##$REVERSE= no
##$SF= 200.129724274929
##$SI= 16384
##$SIGF1= 3
##$SIGF2= 2
##$SINO= 400
##$SIOLD= 16384
##$SREGLST= <1H.CDCl3>
##$SSB= 0
##$STSI= 0
##$STSR= 0
##$SW_p= 3205.1282051282
##$SYMM= 0
##$S_DEV= 0
##$TDeff= 0
##$TDoff= 0
##$TI= <>
##$TILT= no
##$TM1= 0
##$TM2= 0
##$TOPLEV= 0
##$USERP1= <user>
##$USERP2= <user>
##$USERP3= <user>
##$USERP4= <user>
##$USERP5= <user>
##$WDW= 1
##$XDIM= 8192
##$YMAX_p= 0
##$YMIN_p= 0
$$ End of Bruker specific parameters
$$ ---------------------------------
##NTUPLES= NMR FID
##VAR_NAME=  TIME,          FID/REAL,        FID/IMAG
##SYMBOL=    X,             R,               I
##VAR_TYPE=  INDEPENDENT,   DEPENDENT,       DEPENDENT
##VAR_FORM=  AFFN,          ASDF,            ASDF
##VAR_DIM=   8192,          8192,            8192
##UNITS=     SECONDS,       ARBITRARY UNITS, ARBITRARY UNITS
##FACTOR=    0.0002768,     1,               1
##FIRST=     0,             0,               0
##LAST=      2.2672688,     0,               0
##MIN=       0,             -48115,          0
##MAX=       2.2672688,     52517,           0
$$ Real data points
##PAGE= N=1
##DATA TABLE= (X++(R..R)), XYDATA
0 0 0 0 0 0 0 0 0 0 0 0 0 0 0 0 0 0 0 0 -2 8 -8 8 -8 8 -8 16 -16 16 -24 24 -24 32 -33 40 -48 49 -56 64 -72 80
40 80 -88 100 -110 122 -136 148 -164 180 -200 220 -244 269 -294 325 -358 398 -441 490 -548 613
60 613 -695 792 -913 1069 -1278 1575 -2033 2841 -4702 18990 -2180 5927 52517 4306 -11772
75 -11772 15811 889 -25466 831 5112 -17886 -6816 11253 -12600 -13473 7495 -7890 -19155
88 -19155 3844 2079 -7012 6794 10655 4984 12548 12037 4004 3661 3711 -3440 -6292 -2661 -4260 -7801
104 -7801 -3954 -5949 -7451 1510 -1511 -8988 1756 4374 -3935 3265 9101 2820 4634 9224 4248
119 4248 808 4544 2876 -5019 -3193 534 -7836 -8136 1057 -2877 -7059 -364 1279 -467 1491
134 1491 2482 2617 3105 3929 3001 -276 2356 5363 -722 -3480 462 -460 -3700 -3760 -2099 -1515 -3339
151 -3339 -2248 237 -1378 86 2603 0 1078 4024 1682 1511 3821 2153 -586 -712 906 -352
167 -352 -3547 -1710 -37 -2570 -1801 -504 -1281 776 1458 -357 419 1409 1393 967 -203 1321 2037 -466
185 -466 -61 1390 262 -492 -1203 -1603 -1228 -1806 -1299 -885 -1325 666 755 -1001 1627 2777 -94 73
203 73 1373 286 -758 -752 198 -106 -814 132 -389 -1010 927 58 -1808 -67 168 -1202 -291 832 798
222 798 303 352 1648 993 -154 706 194 -740 -33 -962 -1275 379 242 -583 -467 238 1015 -129 -730
241 -730 840 351 -597 226 112 113 837 109 -19 274 115 117 -416 -432 279 -850 -1061 456 127 -416 135
262 135 189 252 -45 -150 489 220 63 287 -633 -222 920 -292 -785 342 208 -409 -384 49 303 -376
282 -376 -174 212 -425 144 589 -443 -16 581 -279 -74 671 384 -143 -195 207 325 -671 -124 249 -232
302 -232 -5 -67 -214 489 596 -298 -128 91 293 -110 -554 73 569 -439 -142 288 230 325 450 -6 78
323 78 -426 -216 32 -615 380 149 -261 304 722 -95 54 139 -91 -45 -343 90 -190 -34 294 36 200
344 200 489 163 -250 16 -104 -420 -167 -32 218 157 6 187 235 -27 130 84 -187 114 -173 -523 283
365 283 -91 -65 -314 135 343 -63 -282 325 248 -215 -47 -72 -24 228 19 69 127 185 137 -152 -21 315 -205
388 -205 -356 209 -132 -207 101 -9 89 21 -71 171 9 33 101 -123 47 253 -109 -112 129 -42 -69 -129 -29 61
412 61 -72 -84 41 -128 38 70 -158 59 213 -99 -80 52 155 90 -102 37 152 -219 -100 108 -81 -29
434 -29 -13 -83 66 135 -19 2 -27 137 4 -241 30 223 -122 53 74 -37 82 55 -56 14 -111 -71 -125 -122 114
459 114 -97 -74 133 132 -113 105 153 53 12 -141 0 49 -34 -2 -41 -41 144 -24 -43 77 44 -129 -126 -140 -75 -13
485 -13 -60 75 104 -17 135 -9 -4 89 -105 -62 -36 -138 -5 5 -31 140 -40 -105 61 29 -61 -19 -17 16 -60 -10 36
512 36 75 43 118 -66 53 114 -27 -40 20 1 -60 28 66 29 -43 4 7 -95 10 117 -135 38 86 -63 -34 105
538 105 7 11 -6 -17 25 -27 -11 17 -40 22 -17 -62 100 20 -66 20 -27 -16 5 -23 37 26 -9 -41 36 18 18 27 0 33 -50
569 -50 -77 -50 -44 -9 -45 -142 -2 29 15 8 56 37 63 4 -20 17 -5 -70 16 -51 43 -42 -100 32 18 2 6 -5 53 1 -86
600 -86 43 -7 23 16 22 57 37 1 -73 73 61 7 -59 -44 -5 -18 -38 9 -7 -20 27 -25 -30 19 -35 -64 2 -35 -22 47 26
631 26 54 -39 15 28 -37 -83 -2 -63 7 -27 -53 1 -65 47 3 1 -15 -54 21 40 -23 29 6 27 -26 58 -110 -8 66 -16
661 -16 63 -64 -23 24 -3 -57 30 -52 -32 12 1 -19 54 -56 2 -25 -30 -25 -46 -34 19 -21 37 -21 -5 38 -40 7 27 9 -15
692 -15 19 19 9 -1 -7 -31 -17 24 -31 67 26 8 -21 -28 -22 -22 -45 48 5 40 11 -39 -48 19 32 -18 -29 -36 79 -58 31 39 7 -5
726 -5 17 17 -1 5 -62 17 19 29 50 33 5 -45 -12 13 -45 -18 -42 -60 28 23 -4 -54 -3 27 -45 15 -18 28 -12 7 16 0 27 48
760 48 12 -10 -15 43 29 -20 -14 20 -30 25 3 -46 13 10 -12 -2 -5 20 16 -30 -45 23 -31 5 -13 -83 -132 -310 0 -6 -27 -30 -14
793 -14 -19 -79 55 -7 -22 -47 -31 -41 9 31 42 -10 -22 17 13 -64 -6 10 53 -2 -7 -13 -48 7 9 -2 -16 -9 -7 7 -10 36 -6 -24
827 -24 19 -1 -54 -43 -1 7 -31 21 -54 0 40 -54 -22 5 26 -62 0 -12 -33 14 11 -21 -18 -40 38 13 -13 -168 -93 31 -26
858 -26 12 1 11 -12 43 26 56 43 -69 -16 -39 -4 49 -36 24 -23 65 -31 30 -34 -31 62 -10 -7 -17 -23 -17 44 14 1 -11 16
890 16 42 26 -23 -31 -16 31 9 -15 23 -24 37 -17 -35 15 20 -13 10 33 8 -17 -29 25 17 -14 49 -40 -35 -29 -1 31 41 3 -41
923 -41 19 -1 -17 40 -16 10 7 -13 20 36 -14 36 -41 61 -1 -35 4 -38 -45 0 79 16 24 -26 21 54 24 40 -49 -14 15 -28
955 -28 36 28 78 -35 -19 9 -31 -57 -35 -25 2 -5 -14 58 -22 41 4 15 -11 -33 18 -81 53 13 24 -23 20 40 1 -8 36 -29
987 -29 49 -19 14 19 20 -20 13 46 10 20 13 35 36 -60 -5 -9 11 0 5 34 23 -12 -31 0 6 -10 36 3 -37 -20 -38 10 38 -5
1021 -5 5 27 -24 -22 -27 -29 -15 -62 44 34 -82 8 -25 -33 26 -2 12 -8 3 1 -28 43 -3 -19 13 -27 -53 -44 5 -48 -5 1 -24
1054 -24 -9 -8 12 0 -34 50 -6 4 55 75 14 8 15 21 -34 -11 23 -17 32 -8 24 -3 5 -10 7 2 -32 -29 -42 36 11 74 48 -29
1088 -29 14 35 -60 -21 14 -5 28 -45 7 49 -26 39 -11 0 12 -55 14 -2 -12 -24 -4 14 12 -31 26 2 -47 -7 -74 48
1118 48 31 -11 25 -44 -7 -75 0 -26 9 23 -3 -19 -13 54 66 7 -47 -41 -13 -7 -15 15 16 -12 -6 -15 -8 -63 8 -2 -33 -38 27 8 -16
1153 -16 22 21 -35 10 -6 30 14 -15 27 -49 -34 -43 20 -4 16 -2 32 9 25 40 -13 -24 -17 -53 -43 67 11 -12 -4 -51 -24 32
1185 32 -2 -21 23 27 18 -70 18 -48 47 -6 -25 -39 9 14 37 11 -2 60 13 33 9 17 32 6 37 -22 -32 -2 -38 -37 -60 5 -18
1218 -18 -11 -25 3 -33 -22 45 -51 24 -17 2 -42 8 64 25 -35 -4 38 6 -12 -6 30 23 -69 8 -4 16 15 -12 61 -20 25 29 -3
1251 -3 -30 37 6 3 -46 45 38 -52 -11 43 8 27 48 -63 8 -21 46 9 5 43 -6 -24 -51 -38 1 20 -13 12 -38 -24 36 -29
1283 -29 16 55 -43 13 78 57 -6 21 6 -50 -50 -26 -19 21 -34 -37 -7 37 -20 -11 -2 -96 -30 26 -7 -33 8 35 42 5 13 20 29 2 -9
1318 -9 0 -32 16 -11 49 -59 10 14 -46 20 13 -1 -8 9 -13 -9 -13 35 23 30 46 -27 2 -5 -2 9 -15 -22 -2 -31 27 36 27 -34 -33 -58 -9
1355 -9 -7 37 -17 -38 49 -10 38 10 -2 10 -34 21 43 21 27 12 12 7 -53 29 15 55 -23 -10 -15 -5 15 -44 39 58 -20 -6 -16
1388 -16 -8 34 7 -4 -31 -10 27 -3 -18 -37 -27 -8 -4 -37 -11 15 -85 26 35 -21 3 25 24 51 -56 -40 44 2 2 47 0
1419 0 4 -15 -43 3 23 -29 0 -17 -13 -14 9 9 10 -5 9 -31 -4 -4 -6 1 9 22 44 -36 37 9 -48 -35 18 -10 -6 22 46 -35 -8 -20
1455 -20 4 -47 39 4 -42 1 -20 43 -26 10 7 43 24 -18 -7 -2 29 -97 -46 -30 69 -22 -5 7 -11 31 -3 -2 19 -21 16
1486 16 19 -17 43 -11 48 8 -9 6 -27 75 0 -27 -33 -23 -27 19 2 21 -28 25 5 -9 3 -14 -7 52 -23 8 14 -43 -1 11
1518 11 -18 17 39 -1 -17 -39 24 -25 -23 6 -11 -27 -41 -39 21 -5 28 -38 -15 25 -49 -54 -43 7 -26 -10 -24 -8 -12 11 -39 57
1550 57 33 2 6 36 5 -16 30 8 29 -43 -28 -50 -15 -1 8 -18 -10 14 -8 -50 -14 -15 -32 -25 12 -3 -31 20 13 -2 -36 -40 53 14
1584 14 34 52 8 54 16 -34 -13 20 31 30 47 -56 -18 13 -44 -5 -32 -49 18 14 9 -2 11 -1 17 -8 -28 -41 -25 -13 51
1615 51 -20 -9 -55 -52 31 -18 23 -44 -30 12 -23 -7 -29 -22 20 35 44 0 -22 -10 -29 -55 -6 -3 15 48 -1 12 -6 -24 1 40
1647 40 5 0 -10 -16 -11 -33 23 61 -73 -24 -38 40 18 15 46 23 7 -15 -48 32 -55 -65 -4 -25 -14 52 19 -5 67 3 -8 24
1679 24 37 -53 58 -6 36 10 1 -52 40 -31 19 -58 0 12 -56 -25 -17 80 -8 54 -18 25 36 56 -8 -14 36 -4 47 14 -99
1710 -99 21 -22 0 23 0 16 17 38 -21 8 1 38 -16 -21 -9 34 -7 46 28 -30 -53 -34 77 1 -17 23 6 -22 34 20 35
1741 35 24 -26 -29 -15 24 -10 -14 -13 -39 36 -32 -68 11 -11 -32 15 5 28 8 8 -16 39 -13 2 -22 0 -13 15 -19 -11 18 -59 74
1774 74 -21 21 61 -19 1 14 0 -26 9 -41 24 7 -26 -7 19 46 -1 -22 37 -19 -54 48 -9 16 17 -26 -12 -31 -11 64
1804 64 -38 25 13 -33 -23 53 -38 -42 -23 -5 7 18 -21 20 -12 21 -35 -124 -141 -239 0 -53 2 -60 -20 -42 -70 -13 14 59
1834 59 10 32 -5 6 -12 -30 17 -22 -35 -50 67 -46 -3 10 6 34 -25 -21 42 40 37 -32 -44 33 -21 -10 -60 4 82 -24 16
1865 16 8 25 19 -27 -60 -12 -54 17 -6 -28 -53 -6 5 47 15 18 48 -13 48 -35 45 31 15 37 56 20 46 37 14 17 24 4 -22
1898 -22 14 -2 7 21 -1 -3 -15 -16 48 8 -41 31 14 54 -48 -22 25 20 -24 -40 -7 -2 46 -19 1 -5 7 -19 31 -39 -2 19 11
1931 11 30 -18 50 9 9 -29 13 -4 3 9 10 48 -1 -87 35 10 12 17 10 -37 31 -14 -13 -5 -23 -6 3 54 60 -9 8 31 -70 10 -27
1966 -27 26 44 5 -27 30 12 -38 -28 -2 2 17 34 84 18 -39 -7 39 -12 40 55 -13 11 -22 8 21 -26 21 -40 38 -41 -20
1997 -20 -30 -10 4 -11 -50 -57 16 -1 7 -3 -24 0 -6 13 77 32 6 16 -19 8 0 -29 4 16 -6 -26 52 10 -14 -40 54 48 -28
2030 -28 -27 -1 -34 25 -2 20 -28 51 25 37 49 -10 69 -42 -9 -45 10 -23 -8 4 -53 86 -44 15 -9 8 68 -10 46
2059 46 14 25 -35 25 31 39 -1 -17 14 9 9 30 16 -27 21 56 -34 6 23 10 -65 -3 -9 -14 30 -18 -10 -1 31 19 -21 -14 27 17 -8
2094 -8 2 -37 -27 -6 43 28 9 38 28 31 18 -21 -53 20 1 -1 3 26 11 44 -20 -20 -25 -43 24 -26 -27 -25 1 -103 10 -6 19
2127 19 -14 -6 13 -6 -18 30 85 -26 -11 10 -2 45 11 -31 29 -5 -15 -2 47 -16 5 -43 -6 32 -17 26 11 -19 -5 -6 -1
2158 -1 26 -17 15 -9 -5 -42 -2 11 -43 -21 23 -36 4 19 14 28 -29 0 25 50 7 -16 -9 21 -46 10 23 -29 -27 10 -40 6 14
2191 14 -17 57 4 20 -14 27 33 -12 13 16 -2 -30 11 -4 -13 -24 59 -1 -34 42 26 23 32 -47 -26 26 -2 -19 -24 9 -18 6 4 10
2225 10 7 12 -12 31 -41 -27 55 -14 50 4 -25 1 24 89 51 29 -20 -24 18 27 32 32 38 3 -91 17 25 -30 20 -11 -34 19 16 4
2259 4 8 -10 -38 -57 26 7 -14 -6 69 20 -13 4 62 -45 -24 3 24 30 -25 -32 13 32 -30 -19 -58 56 4 50 8 27 -27 2
2291 2 -26 -5 48 -21 9 -31 17 9 -50 -35 0 63 -31 -48 13 7 14 -35 -65 -11 50 -7 -10 -6 48 25 -22 -34 4 44 52 38 46 37 -38
2326 -38 17 19 -2 -39 56 -5 -8 -31 12 -64 -15 -60 5 40 1 20 -9 -1 5 -38 -83 18 -29 -11 -51 -11 11 25 -17 24 -42 -6
2358 -6 18 45 -12 -43 -26 8 9 -24 24 -14 -3 -4 2 15 -29 32 -32 -39 35 14 20 3 28 -37 -17 -14 47 25 9 -8 13 30 -19 -1
2392 -1 45 6 -2 -24 -18 -3 41 26 3 37 -2 3 32 -22 13 -20 31 0 24 12 13 -2 9 -4 85 -36 12 -60 12 -3 -8 53 -8
2425 -8 -2 -24 -24 -26 1 -19 4 -1 14 -7 6 6 -36 -15 21 51 8 18 -4 -83 33 -1 9 1 -7 39 -10 7 -18 5 -65 3 -41 -4
2459 -4 14 28 20 -17 -2 18 -21 29 47 20 -47 -38 26 5 9 44 -28 105 1 8 -21 47 3 25 -30 29 -14 -30 48 15 9 27
2491 27 14 45 57 -22 -23 16 -19 -10 8 -46 -12 -1 -4 25 7 -30 -89 -27 -42 2 -23 4 -2 -13 6 -70 -19 7 32 25 -5 -11 -8 -24
2525 -24 19 13 9 -12 64 -7 -20 12 30 32 11 -19 -14 8 32 -23 -14 -24 -57 -41 47 -6 -34 -24 -28 -16 -26 36 35 -8 46 33 -11 17
2559 17 11 12 -21 29 -42 15 13 3 -6 23 -19 47 30 -11 -1 -69 51 -28 -30 22 57 -12 -6 -30 -30 34 -48 26 -1 -21 -75 1 -40
2592 -40 -36 -61 -43 14 -81 -43 -9 -23 -17 38 10 -17 44 18 38 -1 -21 27 41 60 35 2 -23 23 47 -10 35 2 71 -7 -53
2623 -53 39 33 -31 -21 -13 -26 -27 -11 58 -3 -54 -1 -1 3 51 4 57 -19 -25 -16 3 -24 -29 -8 -20 14 -4 75 41 38 -18 35 57 -3 31
2658 31 -1 -25 34 5 29 -38 31 29 -66 -1 -26 -54 24 35 8 41 -2 23 15 2 6 -24 53 -28 19 -31 19 8 -17 -29 -23 54
2690 54 -6 -9 44 22 -7 44 33 15 11 -46 -31 -2 -15 -10 -50 -32 -6 1 -73 -21 14 42 8 -7 26 21 1 -5 4 19 40 -31 -51 -11
2724 -11 19 6 38 -20 -45 9 33 7 -27 8 2 -51 48 38 -14 42 28 25 2 16 8 -21 9 47 -9 -1 56 31 16 -5 7 35
2756 35 -4 -18 -6 56 57 -21 -1 -23 76 -46 -2 -37 52 26 -37 -52 21 -2 22 -45 12 -34 -24 24 -36 2 6 28 33 10 -11
2787 -11 29 -6 -19 42 2 -18 3 14 15 28 -24 17 4 60 -41 14 -2 17 -53 1 25 -45 28 -45 26 -22 -5 24 79 22
2817 22 -3 -39 -29 8 37 2 16 29 60 19 0 -38 51 -21 10 -12 -70 10 19 15 -33 10 -12 31 -15 31 19 -18 -57 -9 -7 7
2849 7 79 19 20 20 -7 -9 32 14 -48 29 -1 13 -51 37 25 57 -50 -47 12 14 25 -26 7 -36 17 -10 -39 0 -1 -34 -23 22 8
2882 8 9 -4 15 2 16 -21 -35 -9 -15 21 6 -38 -10 18 6 -4 51 15 32 22 5 -20 15 25 -18 31 1 -13 3 -20 28 51
2914 51 -24 -13 -53 26 2 -38 -20 1 17 82 -1 -9 43 -20 -22 -22 -9 71 43 -25 21 37 -43 0 14 32 28 7 -19 14 2 -73
2946 -73 10 5 4 -20 0 52 -41 -22 9 5 23 14 38 10 3 5 -1 33 62 -17 43 -21 9 -31 16 13 8 -16 -7 -48 22 -31 -23 36 -3 -12
2982 -12 -13 -59 -5 31 -6 -4 5 24 1 62 -11 13 52 -17 30 28 32 -3 -25 41 10 -31 -1 6 19 -62 -27 -21 24 -40 -39 22 -29 -25 -41
3017 -41 49 32 -18 4 19 13 25 -17 4 -17 5 17 -42 8 17 -25 27 -6 5 37 -50 -7 14 -74 -10 -13 -5 36 29 28 -21 -43 36
3050 36 -12 3 -6 -62 -19 -21 26 -5 17 6 11 25 -43 -14 -41 -29 17 -32 -47 -5 -23 55 -25 -76 34 -6 51 -35 1 17 -19
3081 -19 33 10 25 165 65 36 -16 13 -10 -5 -3 22 8 -15 12 -35 56 -5 -3 -21 -27 28 22 34 16 -10 10 -4 58 34 -36 -13
3113 -13 -20 -51 -27 18 -19 22 12 3 48 14 44 16 8 30 20 20 41 35 15 -39 40 27 -19 53 43 33 -8 -29 -1 -42 61 13
3145 13 -21 -2 54 14 9 18 8 -23 -17 13 -26 -53 -47 -7 33 -3 -2 78 -24 15 -30 -3 54 15 2 -31 -32 32 7 54 -26 -8 52
3178 52 -39 -44 -10 3 6 -5 6 25 -11 38 47 22 5 26 16 -63 -38 34 13 18 -24 -1 38 -45 -14 54 -31 -55 -30 23 41 -13
3210 -13 35 34 18 -14 4 4 44 -3 32 -20 4 46 9 -13 -48 -64 -25 -2 -56 30 2 -39 35 72 -5 -7 -21 7 25 28 -17 1
3242 1 -15 23 15 -1 3 -30 51 -46 -14 40 14 1 -20 -53 19 18 13 55 -2 16 -9 1 9 -44 -14 20 46 -4 10 -22 57 -28 -9
3275 -9 -46 -12 30 -32 2 49 11 61 -43 29 4 -24 14 -38 45 -4 -9 -64 2 -6 29 -3 8 30 19 33 45 -13 -57 -22 1
3306 1 -26 -10 -20 -19 16 -27 -76 30 53 20 -13 -49 -45 13 -32 -6 32 16 -25 -11 -6 -19 -2 -30 18 -11 21 -11 0 25 -8 8
3338 8 29 -45 16 19 -33 46 -17 -8 35 59 -2 5 40 -18 27 -34 41 -2 10 27 17 13 -24 31 -19 -15 27 16 25 -2 -5 20 1 -49
3372 -49 -7 40 39 -21 35 -1 0 18 -3 -11 31 -25 36 14 5 -52 -6 39 -7 40 11 -44 40 11 11 -20 -11 -29 -18 -42 29 27 12 7
3406 7 11 14 7 -22 -26 -19 -11 -45 25 3 5 -44 -10 -36 -21 -9 -18 -2 -59 1 -4 15 18 45 -10 39 18 18 -19 11 -11 -4 -11 0 -17 37 13
3443 13 34 43 -13 -37 -47 -39 -40 43 -33 -16 -67 -5 -20 -2 -51 -11 59 12 -6 31 22 -22 -9 24 70 -6 -41 -4 -24 29 -18 -29
3475 -29 42 -33 -20 17 -12 15 25 89 -82 7 -13 40 37 16 8 37 -67 -30 -21 38 18 -8 -26 58 -7 -21 32 -4 -62 -36 26
3506 26 31 40 -2 -7 4 62 16 -16 9 39 12 13 36 -15 53 22 36 13 56 -8 35 27 -8 42 -19 -2 27 90 23 65 -19 1 -66
3539 -66 12 -33 31 -4 -16 -44 14 -28 -2 18 -11 35 -9 -9 22 14 43 -43 9 26 43 -12 15 27 -25 40 11 6 28 -20 44 -21
3571 -21 9 -16 -35 6 -36 6 -34 -27 -79 31 -23 19 -53 11 6 -56 25 -36 15 -10 -24 31 57 12 36 -73 -37 35 0 -28
3601 -28 8 -19 9 -49 15 -7 -44 11 42 33 0 -15 7 -15 43 -19 -31 -19 12 28 19 18 20 9 49 14 3 80 17 52 -32 -36 -26
3634 -26 -34 -76 46 28 37 18 3 74 -1 15 -4 5 -25 2 32 -30 -44 -6 -2 -23 -30 -32 19 -33 -12 9 -10 -59 9 -3 -76 -27 21
3667 21 18 -2 -1 9 -30 -45 11 33 -53 28 -14 -21 24 34 -38 -15 26 -1 -34 -22 -40 28 41 -12 8 49 42 -22 -29 70 -14 -5 -41
3700 -41 -42 -9 -25 38 -28 19 -13 8 16 16 1 -35 -74 -31 34 -49 4 -33 -7 18 -14 -1 61 -2 15 19 4 14 -16 14 7 -1 2 32
3734 32 3 17 -41 34 12 -10 -23 10 -14 14 14 45 53 5 20 -20 26 10 46 34 -1 17 -10 -14 -29 -31 -3 1 10 -9 49 46 -7 2
3768 2 -9 15 11 11 54 13 -14 23 30 16 28 17 61 18 -33 32 40 2 26 -15 -44 9 14 -28 -2 -39 -36 -21 14 2 2 14 7 9 -13
3803 -13 23 41 4 -63 56 -30 -38 -16 -35 -24 -23 0 -44 -4 34 3 -14 -69 -16 7 22 35 11 61 -20 7 6 -84 -8 27 49
3834 49 157 -75 -234 -16 -32 -37 -29 26 -74 -3 8 18 8 34 55 -6 -10 74 27 -37 28 36 -24 21 -71 66 -6 -10 15 20
3864 20 62 82 78 30 -20 -11 49 -67 44 -14 8 -10 -94 22 121 -72 49 -68 28 -56 14 2 -78 -82 59 24 48 14
3892 14 15 -22 14 -73 68 8 50 -3 62 -43 171 76 -204 -21 36 -215 -159 18 87 254 279 610 -57 196 346
3917 346 -391 -268 126 -434 215 105 233 -99 -178 -161 320 99 169 94 -182 197 -222 -13 90 58 294 415
3939 415 177 -53 214 -275 235 -11 -72 -401 188 -194 156 107 -142 -287 3 99 -33 -6 57 -233 -113 -324
3961 -324 -32 -132 6 27 75 152 47 -456 -119 141 -132 -295 -203 31 -90 -167 13 -145 -209 119 -69 104
3983 104 151 142 -86 1 -2 128 18 78 4 -102 16 170 29 0 -106 96 -17 -64 -122 -11 -67 -57 89 -81
4007 -81 5 -15 -7 -50 -19 -2 39 0 53 -39 -30 -75 -24 18 2 -5 17 14 2 -11 0 2 -23 2 -25 -78 -20 -17 2 78 -16 47 -8
4040 -8 -12 18 -40 -59 25 -4 -2 -9 -36 -15 8 8 -20 25 25 -28 39 -23 -7 21 -50 3 10 -8 -8 1 -45 11 -3 -37 -25 -50 66 37
4074 37 51 46 -32 11 -2 -19 14 -17 -11 -7 -36 47 -32 1 36 -14 11 20 -10 -18 -18 -56 -19 -29 33 -18 -17 -11 -24 -17 -25 -15 -9 22 -8 19
4110 19 -26 -4 67 -32 1 70 14 -17 -20 4 26 -14 51 51 -5 -24 26 -15 25 -11 -9 -22 6 -20 -28 9 19 15 52 -1 6 25 -25
4143 -25 -15 -8 58 -6 34 17 -38 72 -20 -9 30 4 24 15 16 -9 30 12 -12 63 -23 -19 -5 2 33 -35 37 -18 18 14 22 53 -9
4176 -9 28 19 -5 35 -55 -27 -32 76 9 -35 -14 45 -24 -23 -7 34 -11 16 14 42 23 9 -1 65 -19 42 -12 -28 -6 15 53 5
4208 5 -10 -33 -14 17 0 14 -9 -22 7 14 30 -35 2 42 -20 2 -62 -53 16 18 27 10 -36 12 28 17 -18 -54 34 -6 80 5 11
4241 11 -29 -37 5 -32 39 -13 20 -4 -21 8 43 -9 3 -38 -25 27 9 2 62 -21 -30 5 18 -63 38 70 -62 -26 -35 39 -2
4272 -2 57 30 13 -22 -1 3 -12 -19 23 -36 -2 -3 -19 -12 103 7 17 4 16 64 6 18 25 12 -33 -25 31 -10 -37 71 30 -27 18
4305 18 27 26 -36 -19 -6 1 19 34 11 67 -8 -8 27 -15 67 62 20 77 37 7 5 -14 13 11 -15 65 -3 45 65 0 56 17 0 43
4339 43 52 3 4 65 11 -13 41 2 7 -14 -42 -21 -18 -17 -26 -37 -7 24 -8 50 -23 -31 -1 0 -28 3 7 40 32 21 40 -44 20 27 -14 54
4375 54 -42 23 25 51 1 -22 -8 30 24 9 -39 1 -9 -29 -79 130 17 91 10 14 4 37 15 -134 54 -34 27 25 -11 -5 62
4406 62 63 25 -46 20 21 17 -11 -15 -19 -4 0 -43 -57 -1 14 35 -14 -10 -26 37 -27 32 37 -38 21 -24 3 -30 -45 19 -4 -27 10 -11
4440 -11 -54 -25 -21 0 26 -53 14 -15 35 -18 19 37 -4 -1 -57 37 38 -59 -42 33 27 -13 24 -10 -9 16 -29 56 28 26 -22 9 -13
4473 -13 38 -43 -47 26 -68 22 -22 6 -28 -29 -23 43 -26 25 -32 -46 11 2 -48 -3 27 40 4 10 11 13 16 -36 11 -11 61 -3 20 -5
4507 -5 36 65 6 77 26 -17 -27 44 35 -22 12 -7 -4 26 -11 46 -48 36 -208 -33 48 -24 -10 -82 5 -15 -5 32 33 65 16
4538 16 -5 53 -27 32 -28 -27 -22 34 -27 12 43 2 76 13 24 -4 15 80 -1 0 40 36 46 23 -1 -24 -44 47 1 32 17 -21
4570 -21 -8 -10 20 -42 -5 50 29 6 0 -5 8 46 11 -44 16 -6 -36 -11 -19 -50 16 -2 -12 1 17 -16 26 26 -45 14 -21 -2 19
4603 19 -38 -36 58 -61 0 -9 16 -5 -3 14 -2 28 -23 6 35 -28 -8 -20 -6 -21 -46 3 19 1 -20 -7 -31 70 39 2 -61
4634 -61 -20 -3 31 8 -20 48 -48 2 46 -41 21 1 -23 18 -23 8 3 -17 36 -21 5 17 -38 17 -21 -39 22 -4 -6 20 6
4665 6 -2 5 -22 -15 -9 -2 -5 -21 16 -32 25 32 -13 10 -37 7 28 -27 52 11 26 27 9 15 12 -5 8 -7 -2 -6 -15 6 4 49 -11 28 -14 -17
4703 -17 -4 -6 5 -17 12 -16 31 40 7 31 -28 30 40 62 -26 16 34 -8 -9 -15 53 -63 -43 27 -12 -52 26 27 34 -24 18 -53 28
4736 28 -36 108 55 -54 38 -27 72 -8 -88 -123 44 -146 40 -166 140 -51 -131 92 -93 114 98 -275 -177 16
4760 16 -246 -116 -4 7 -53 -53 13 -17 -70 3 -18 -20 -35 2 22 50 -11 -12 -13 5 -24 80 31 21 54 -27 -8 -39 -43 33 3
4791 3 22 5 -56 4 56 -18 -36 27 -14 73 30 73 -40 26 0 22 25 -25 -16 -15 -8 -31 -2 23 5 29 26 11 2 21 21 -4 0 -6 33
4826 33 39 -1 -19 -12 1 -4 21 -12 28 -25 -5 -13 16 -60 40 -3 -11 77 7 -18 1 -14 -2 -10 53 30 29 37 36 -1 -22 39 12 74
4860 74 79 50 -12 23 53 12 13 -45 -27 17 24 -8 46 -16 24 -50 -32 19 -11 -15 -18 19 -37 13 28 51 24 -16 -68 -30 15 -15 29
4893 29 -37 45 54 32 0 11 14 -41 34 -52 8 6 46 -38 2 -8 58 31 -13 5 -30 -32 3 -26 -47 43 0 12 -13 -6 -5 -29 -25 -4
4927 -4 -27 20 29 -10 -11 126 29 11 20 23 15 -5 15 15 11 -38 4 79 4 4 -57 31 -30 -28 -33 -7 6 -15 26 -62 10 -28 -38 25 20 -19
4963 -19 -6 11 23 29 31 29 3 -30 -3 28 -5 4 0 32 16 28 28 35 -1 -26 53 15 20 -5 23 30 45 -36 9 -28 -29 -32 -23 30 33 14 -57
5000 -57 7 53 -4 -1 -3 27 -12 7 13 11 12 9 16 -18 38 37 40 -43 2 -57 37 59 -12 75 -23 -17 -27 -33 -6 16 36 -39 -29 17 -37 -25
5036 -25 -27 26 0 -28 -21 -28 -8 8 -6 14 4 13 25 -9 3 20 36 -1 18 26 1 27 51 -60 17 10 11 33 41 21 -69 11 -9 22
5070 22 -17 -2 -13 -21 8 55 22 15 4 -17 -28 -46 -16 -87 36 8 -34 -68 8 15 35 -26 12 13 -4 44 -4 9 -16 3 -16 1
5102 1 34 -45 29 50 -16 -14 11 -5 -59 -10 -17 42 12 -9 37 6 28 11 -26 22 -5 -21 0 20 -39 42 27 5 3 -17 -29 -49
5134 -49 -34 8 27 -5 -31 27 -3 13 8 -35 -9 -269 149 321 164 3 40 15 -25 49 -4 -14 -27 -31 28 2 -20 22 -11
5163 -11 -61 19 -54 97 111 235 -9 46 -37 10 -33 28 -6 46 9 20 18 11 -10 -33 29 -35 -16 -8 20 -15 43 47 17 -21 11
5194 11 41 46 -22 -49 -40 6 16 -5 -27 -55 3 -28 25 8 14 17 -8 2 11 8 11 -12 -6 -5 40 -6 -36 -25 -36 -6 40 -67 19 -19
5228 -19 17 -55 42 30 15 1 6 11 -1 -37 12 60 -44 -9 -23 10 -72 -50 63 -48 -1 -26 14 49 -49 46 -66 18 14 4
5258 4 -18 8 42 0 -20 -3 -9 -22 -31 -5 25 42 -14 -7 -38 -25 6 26 45 -11 27 -5 21 -23 -8 27 -23 21 -4 -12 20 -34 17
5291 17 0 -50 63 -7 -21 -26 -27 -14 23 -19 16 -32 -1 -16 60 49 -17 76 13 41 7 9 -42 -19 -13 26 40 6 -50 31 -18 7
5323 7 -18 5 34 8 21 27 0 -70 -27 -41 -20 60 25 -12 -44 -50 2 -22 23 -30 -7 9 57 -5 -7 -2 6 -25 47 13 25 -49 -5
5356 -5 2 45 1 1 -42 -28 19 13 -29 4 -4 8 -36 67 -50 -90 62 -12 -10 -24 30 -11 -7 6 44 -21 21 -17 26 -40 5 46
5388 46 16 5 2 38 -10 -19 0 -2 31 1 46 -16 30 25 -15 -35 -13 -51 24 20 5 -14 -5 60 -12 -30 7 -57 36 -18 -28 -78 34
5421 34 23 55 20 -24 -2 5 -9 14 1 -38 -22 -20 -10 7 0 -10 22 14 1 14 12 14 -44 -49 1 -2 52 62 -39 24 -2 62 -24 -24
5455 -24 -28 -21 17 13 40 -2 -53 -17 -46 -5 -28 -43 2 7 -63 -32 5 -57 30 -10 -34 27 32 7 -45 35 -30 29 17 -24 -41 12 -17
5488 -17 22 -10 0 48 37 -4 -47 -10 32 44 56 6 44 -42 9 -6 -53 30 -27 -10 0 -4 13 -42 0 63 6 -28 -4 -17 4
5519 4 -29 -26 1 -24 -22 -19 7 -32 21 -31 -11 91 34 -43 13 -13 13 -7 -19 -19 19 10 -28 -45 -29 50 20 15 4 52 15 8 -52 5
5553 5 22 9 -8 -17 25 -39 7 -44 66 19 60 -24 18 13 -3 -41 -1 -21 14 9 -33 -29 4 15 6 11 23 18 13 1 -11 -23 -52 27
5587 27 7 17 -8 -6 -52 13 -5 12 -33 -3 -4 13 -13 -39 18 -49 75 -18 42 -3 -13 -21 39 -40 21 -25 18 -14 29 36 15 33
5619 33 -53 -14 54 2 -39 -51 1 -16 -18 -13 -33 34 -7 -23 48 -37 -10 -18 58 -6 7 52 -3 1 -19 -14 -40 -4 50 -38 20 -67 -5
5652 -5 36 -6 -25 -43 -15 14 1 -3 11 11 69 24 44 30 25 -16 16 16 3 44 22 10 35 -43 -1 -64 78 40 5 19 -7 -44
5684 -44 -10 13 18 -2 -31 2 3 62 -25 51 50 -42 26 -41 39 -2 -123 -118 -184 19 103 -149 -50 33 2 167 -283 222 36
5713 36 -16 31 210 45 226 19 -44 -138 95 1 19 17 -72 126 -161 183 -144 141 -433 -71 303 -263 84
5736 84 -71 1 -85 47 -37 58 174 152 -122 -273 -29 -111 124 -22 6 124 66 -215 -98 -191 -203 -31 -116 51
5760 51 -174 -211 -135 22 131 -160 -14 12 -172 -92 -142 42 -107 128 0 -19 64 47 -19 -44 -35 13 12 -227 66
5785 66 12 -68 22 21 -46 -38 16 5 60 -39 -15 53 57 41 47 -15 -43 -50 -36 14 -12 -78 32 6 -16 -52 -4 -65 7 -45 -2 -29
5817 -29 -51 82 29 -119 -75 174 78 84 20 60 -159 59 -47 -66 272 281 131 -4 221 38 -83 22 26 -36 -102
5842 -102 -57 18 43 62 -31 -41 44 40 -2 -14 -25 -17 11 -64 -6 26 31 0 40 -57 -3 -30 -3 -20 26 -40 -19 -26 29 -7 -10 -34
5874 -34 7 30 -67 43 17 2 -34 28 41 15 -17 17 -66 -12 3 31 47 32 8 -85 -29 -2 -30 -49 -27 -17 37 29 -3 36
5904 36 -20 8 -25 -31 -15 59 12 -32 8 7 27 -27 3 -10 32 -5 -31 14 -24 53 -44 4 11 10 -16 25 16 -6 35 31 1 -24 -43
5937 -43 -30 13 54 -9 -39 -23 -22 -13 10 -11 -21 -22 -19 -28 -46 -19 -50 42 13 5 -22 -29 -12 -4 -8 -17 5 0 -13 -36 49 -22 24 -4 36 95
5973 95 -30 -32 -37 52 -16 31 -13 -7 -20 -24 -31 69 28 -19 -10 -44 -16 -18 8 -9 38 11 -10 0 -57 50 10 12 -16 59 23 -26 -30
6006 -30 -51 33 -11 -5 1 -13 -11 -39 40 48 -14 14 24 -6 -56 8 37 42 7 -9 -52 -11 4 -25 21 55 -10 44 26 -26 22 -24 23
6039 23 -39 4 -3 -1 25 9 11 0 7 9 -37 18 49 20 23 -25 -30 2 28 -12 -28 9 21 12 4 34 -11 -21 -34 -1 17 9 -56 -12 18
6074 18 -38 -10 -9 21 -24 32 19 15 -26 4 -32 17 -8 -11 23 -47 -12 37 -51 16 33 -30 -22 -50 19 -52 -12 -30 -12 -28 14 -7
6106 -7 4 -19 20 16 -9 -51 -8 -14 -34 9 -33 -58 -16 -12 -31 41 38 -35 -14 -6 32 26 20 15 -36 2 -10 18 8 28 2 -34 -33 29 29 23
6142 23 -37 -12 -25 5 58 -19 -39 -19 -11 -31 43 28 35 -12 -31 33 -17 14 -9 32 -12 -19 -40 -10 -15 -16 -12 4 -19 29 18 -21 38
6175 38 -45 47 -24 37 22 39 27 3 79 1 -9 -5 -58 29 23 -36 -8 7 48 -23 23 19 -59 -15 -15 -15 74 38 -35 -16 24 -25 -59
6208 -59 7 -56 -1 -20 52 34 3 -7 34 -39 51 18 -6 33 8 -19 -8 16 15 -2 30 0 -41 32 24 -5 25 -31 11 -25 -52
6239 -52 27 2 17 -76 -16 -34 16 -21 -12 -38 18 7 -19 -34 -23 -15 40 -11 -20 -71 0 42 14 45 -29 34 -39 -8 -9 -45 -13 -12 0
6272 0 35 44 -14 1 5 -13 -37 -21 -26 17 -62 -35 -41 13 40 -61 6 -3 36 -13 -19 11 46 53 -22 -23 -19 11 -8 49 15 -1 -2 51 -1
6307 -1 15 28 -35 23 18 -24 -34 23 22 10 -11 -25 27 28 39 -17 -20 -27 -23 -68 -33 -29 29 41 -26 -20 -16 -31 29 11 -3 45 -51 14 -24
6342 -24 -1 -5 -19 -25 25 14 -39 9 13 33 -21 -9 -9 -6 -8 -45 13 17 -2 29 26 25 -34 33 2 -15 -7 -2 -17 17 -1 -66 -54 -5 32 17
6378 17 -63 -37 9 -2 -13 31 14 29 7 43 26 -19 6 0 -50 -5 -56 -11 0 11 23 -50 37 9 -12 -8 -9 -17 -43 3 -26 44
6410 44 37 -53 59 13 8 -11 46 37 -1 9 -4 -45 -39 8 -24 19 3 -19 0 -24 -42 3 19 4 2 -9 19 29 10 -70 34 11
6442 11 3 -19 9 62 -88 40 15 -31 16 -6 11 62 -12 -39 3 7 -3 3 9 24 -13 -26 43 20 -5 14 -33 -5 21 11 47
6473 47 -3 32 6 22 -22 42 8 48 -4 -30 53 -35 6 -50 -8 -25 -4 -3 -39 -12 60 -24 29 -12 45 12 -45 -55 16 -57 12
6504 12 -6 -38 44 4 3 35 -5 -11 9 32 48 -1 35 2 14 6 -16 2 3 -27 58 31 21 -1 24 14 -10 -6 3 -19 11 -12 -24
6537 -24 -13 3 -83 24 -54 -41 -32 -12 -1 -51 -25 -2 6 -8 -13 -12 -15 6 -20 52 5 13 -116 109 -78 -287 367 103 187 171
6567 171 -275 339 415 -115 167 157 -33 -100 206 -193 63 -161 -24 113 36 -43 62 33 -108 32 56 41 -54
6590 -54 38 0 -62 22 -35 61 16 27 5 7 24 17 -42 -18 18 18 -24 8 53 13 26 38 -40 23 44 -1 3 -25 18 0 9 -6 80
6623 80 -19 -13 -61 14 31 37 19 20 -10 30 -44 40 1 -1 -3 46 -38 -21 -3 -14 -26 22 5 29 3 18 2 -39 77 33 -31 -21
6655 -21 68 -130 -92 74 32 -10 -92 -116 -5 30 2 23 -41 -8 -196 -21 -5 -82 -1 -87 -211 50 -134 -35 -225 -213
6681 -213 181 209 -61 19 36 146 101 75 53 -87 74 191 -160 -220 275 -135 172 -208 -206 252 -114 250 400
6704 400 216 74 -67 -435 -290 -192 31 -254 -344 54 232 -198 -56 248 -55 365 166 163 -264 -26 -136
6725 -136 -244 45 -104 58 -160 -143 6 263 -182 -76 304 -171 63 -64 -144 88 59 -166 -82 81 -79
6746 -79 48 106 -38 -26 86 62 -149 158 7 -30 -2 5 -69 36 -39 40 -53 48 -62 34 37 -12 2 -41 -45 -43 -10 -25
6774 -25 -19 44 -27 -52 -47 24 18 27 11 58 -58 -20 -47 -37 -49 8 -54 43 -41 -7 -6 9 0 -36 61 -84 -9 -11 18 -12 5 26 46
6807 46 10 -28 66 24 20 51 15 43 -37 -8 -7 -2 -14 1 -11 36 -32 -14 30 3 21 37 -25 52 29 21 -16 -72 22 24 58 31 -21
6840 -21 8 19 -54 13 -32 -45 -51 -5 48 32 20 1 34 -16 -18 -45 4 25 -8 9 -3 16 44 15 -8 -7 21 -19 -45 -55 -19 6
6872 6 15 -23 1 31 -55 18 8 33 40 3 -47 19 24 -19 42 -7 -3 -47 26 8 30 0 -2 -18 58 10 -19 31 8 16 -39 -45 -8 -57
6906 -57 -8 -33 52 19 3 -18 -14 41 2 -33 4 68 36 -31 -25 -24 -38 7 -11 20 18 -16 22 19 13 26 50 39 78 11 27 13 -23
6939 -23 44 4 -59 -21 65 -26 43 2 -10 17 61 -6 -40 42 -32 -71 8 6 4 15 -18 19 23 8 -11 -32 -18 47 -37 -50 3 90
6971 90 -17 -3 -1 -46 -47 -32 37 12 -18 -23 -3 26 -11 22 -50 -2 -6 -34 23 -23 20 -32 -4 41 23 -45 42 -20 24 49 0 4
7003 4 23 50 -31 9 -14 -30 -19 -33 -7 3 -2 -41 -28 -20 -13 -18 30 -44 37 44 -13 4 -3 34 0 35 -24 22 -12 8 -57 25 36 -16
7037 -16 5 -32 -6 -18 8 4 -46 -47 -49 3 -23 -1 -7 54 -22 4 -9 -15 2 -15 0 -17 -16 -53 37 16 34 17 18 -47 3 17 -39 15
7071 15 45 50 82 28 32 48 -78 -4 127 -28 48 14 17 -28 1 -24 -21 42 -15 31 -48 -3 -5 -6 7 23 -47 -27 -5 48 -2 -37
7103 -37 -32 13 11 85 28 -41 -32 -34 -3 -11 17 5 10 -43 10 42 11 -1 3 27 16 -32 -51 -49 10 -2 -25 -47 -35 27 -41 -35 45 -15 13
7138 13 -37 -13 -9 -12 -45 -3 -35 33 -38 -74 139 -1 -5 20 38 2 20 3 30 64 45 28 1 22 0 -5 8 -5 -16 -20 -36 18
7170 18 -23 24 -40 1 35 32 -21 -25 -11 1 28 6 0 37 -14 36 -27 50 11 -19 -20 -1 13 23 46 -1 57 -13 -17 3 36 19 -22
7203 -22 32 23 25 -49 -2 -18 -23 -11 45 -62 -32 67 10 0 -54 -17 -30 -40 -6 4 14 -60 -9 52 -54 -8 6 -4 -36 9 2
7234 2 17 17 -38 -19 -36 25 -15 22 -3 45 45 -48 -17 22 -14 -8 32 49 -1 6 -3 23 -38 30 -36 -46 -31 -33 38 -72 -29 53 -27
7267 -27 19 3 -71 26 -9 -23 -2 -35 55 -30 48 7 15 10 -29 -41 -62 -22 32 -44 23 -2 13 -35 40 -40 28 -35 20 -62 80
7298 80 159 149 -150 -160 -88 -131 -152 -218 199 -45 -130 34 -11 -6 -28 47 38 -12 -21 -49 28 -21 -21 -63 -27 36 -5 -26 -12 -23
7328 -23 39 41 14 -14 25 56 30 -16 8 -8 6 -24 -29 -1 -46 34 19 77 -18 0 -12 10 27 -19 59 -41 -39 -19 44 -1 -3 -16
7360 -16 11 10 -8 -33 0 15 19 -24 -7 34 0 15 -20 -17 -24 42 -36 41 -10 33 45 -43 42 30 -23 22 -34 15 -11 51 19 -24
7392 -24 -11 -34 11 -8 -27 37 34 -14 -23 36 3 2 -84 21 -11 -22 -44 33 45 47 -19 5 -2 -43 -21 35 66 7 43 -35 10 17 -11
7425 -11 10 -5 -10 -6 71 4 -18 49 -31 53 -27 8 -146 -40 15 21 2 11 21 37 8 -27 42 17 -47 -33 -34 -61 -32 -16 -52 -59
7457 -59 11 56 -8 -14 32 43 28 -27 -20 24 -16 -38 -40 -73 -29 34 -23 -49 -11 -18 -54 18 -1 -26 6 7 34 -9 -50 -1 40 11 -5
7490 -5 49 -11 -1 -16 -14 -4 -10 90 31 -12 34 26 8 -37 25 -20 15 -33 -17 25 -13 -11 0 7 57 48 -22 16 -4 -10 -14 -23 1 -5 19
7525 19 4 -8 44 -30 7 22 -26 -19 -2 47 -27 23 -55 25 29 -22 -9 -20 -29 -2 -2 -1 -7 53 17 -53 30 -38 -13 4 63 5 -57
7558 -57 36 -5 37 -8 -30 27 -34 33 20 35 18 -35 -7 -4 -14 -38 -35 17 -6 -14 -12 -26 -26 -38 -4 20 -16 -12 9 53 26 -35 55
7591 55 41 28 -5 -29 39 -48 33 -3 -14 -33 -4 -17 29 21 3 -46 -18 16 -41 -5 -13 54 -15 -8 -39 0 10 34 60 38 15 -10
7623 -10 -46 26 33 -54 46 55 99 8 -18 -25 -28 -31 24 30 12 36 10 30 -46 5 17 26 -10 30 4 26 -14 0 44 -4 -16 30 15
7656 15 -19 43 4 -21 -10 -53 66 28 31 40 -13 -31 -3 60 -65 0 -20 37 7 23 -12 25 -77 2 -50 1 2 -40 -48 54
7686 54 20 -27 -8 -10 -28 52 -14 27 8 -42 -20 -35 -45 -275 -44 -5 161 -132 119 136 -217 -214 -110 196 70 -65
7712 -65 -46 -26 -228 32 -200 10 295 52 -129 181 203 48 196 256 263 -196 73 90 37 202 -149 64 116
7735 116 16 -196 89 322 242 87 -263 66 54 22 3 -20 8 -51 295 -50 -5 -231 -97 -108 43 2 10 -129
7759 -129 -14 11 42 -34 30 62 17 20 23 15 -8 -9 1 -31 28 -12 26 74 17 -9 -45 -28 0 -35 -2 -10 -24 31 -40 -52 -17 21
7791 21 -13 0 -3 -23 -37 -33 -11 -3 1 -36 14 -23 -13 -28 32 8 -30 -3 -40 26 -7 -56 21 19 9 -30 -24 -37 40 27 22 -42 -27 -7
7825 -7 -46 -27 -20 47 22 30 -19 -26 17 13 -12 -12 7 5 -11 14 9 2 -22 7 -46 34 85 -21 -46 30 -7 -60 17 13 -8 -6 34 -12 -33
7860 -33 5 13 -3 28 25 39 26 -35 -26 -1 -12 16 27 -31 -25 -68 1 -11 8 23 28 -3 -15 48 59 -7 59 2 -34 2 -12 27 -15
7893 -15 1 -9 -29 7 -39 18 -10 -46 15 16 -36 -16 -31 1 13 12 -1 55 15 9 -10 2 21 16 20 10 47 -86 2 39 -2 29
7925 29 -37 -40 -27 -6 -5 -1 21 15 19 9 40 15 14 20 -52 -9 39 -18 -11 0 -55 -12 23 -42 -12 7 32 -66 6 -41 -12 -7 -24 -13 -60
7960 -60 23 -21 -7 -56 2 -15 13 18 -29 -32 -21 -12 -4 -73 21 -23 3 -16 66 44 11 13 14 64 -41 -4 21 22 -14 12 -22 -63 33
7993 33 11 -28 -63 -35 28 -25 34 17 9 -47 -19 -15 -17 -23 30 -19 22 -36 -47 -12 -17 16 28 -1 44 -10 -9 16 -22 -4 14 -4 -32
8026 -32 55 -26 32 69 29 18 -21 -28 -24 58 -14 -47 -38 -2 28 -16 31 -41 72 39 -69 21 26 -2 18 15 30 -13 35 -29 -12 -40
8058 -40 55 11 6 -29 21 6 51 -51 -33 -21 16 -31 17 -21 25 -60 10 -57 71 17 -74 208 -218 -100 215 -223 -9
8085 -9 -51 -61 47 -165 378 -308 -208 345 -65 -44 79 -166 -1 -1 -2 -67 59 8 -3 1 115 23 86 62 -2 37
8111 37 -27 12 0 10 -46 81 18 5 -48 12 -32 -58 13 -53 -29 74 -15 -45 6 57 7 34 53 25 49 -41 2 6 -14 17
8141 17 -26 50 -1 3 -30 13 8 11 24 19 18 16 101 -1 -23 -10 -3 -12 -36 2 2 -7 -35 30 -12 -58 14 42 -39 -35 19 27 1 24 8 28
8177 28 48 -11 -18 32 -8 -14 2 -41 18 22 -33 -12 4 -52
8191e2
$$ Imaginary data points
##PAGE= N=2
##DATA TABLE= (X++(I..I)), XYDATA
0 0 0 0 0 0 0 0 0 0 0 0 0 0 0 0 0 0 0 -1 8 -8 8 -8 8 -8 16 -16 16 -24 24 -25 32 -37 40 -48 54 -56 64 -72 80
39 80 -92 104 -112 128 -139 152 -169 188 -208 229 -251 277 -305 337 -372 411 -454 507 -564 632
59 632 -713 809 -929 1081 -1281 1558 -1968 2627 -3882 7086 -33351 -48115 30107 3148
73 3148 -14510 27745 32212 -1255 16293 22873 -6123 -6965 12686 -9388 -18370 6596 401 -18595
87 -18595 1340 4403 -12436 -4110 1725 -9050 -3039 2733 -2418 52 6821 5964 6737 11619 10523
102 10523 4389 5658 4193 -2689 -330 -2405 -12376 -5651 -984 -11054 -6457 3373 -2602 -3086 4393
117 4393 3066 930 5750 6421 755 2496 8105 989 -3152 5127 2208 -6491 -2526 -949 -5350
132 -5350 -4450 -3414 -4242 -3243 -1368 -346 -1446 1012 5779 2535 -419 4416 4640 796 937 1990
148 1990 842 -2032 -2370 -456 -2622 -3852 -1144 -2468 -2588 1043 -367 -837 2807 2229 -365 743
164 743 3298 2948 -70 652 2926 254 -665 541 -1265 -1042 -139 -2564 -2627 -1086 -888 -556 -770 422
182 422 2145 738 877 2843 1478 245 317 -98 -50 -632 -787 -7 -884 -447 46 -1882 -289 1324
200 1324 -1788 -1977 754 325 -695 44 1421 1679 609 953 894 -248 872 288 -2347 -994 240
217 240 -1389 -948 328 49 -188 -145 683 488 -591 448 627 -623 192 407 -221 1121 917 -500
235 -500 -219 234 334 -728 -1531 76 218 -1228 -253 414 173 753 158 -89 609 463 181 -68 -219
254 -219 569 -93 -836 613 518 -543 -96 -70 -225 -221 -390 155 106 -295 292 -125 -194 937 150 -697 541
275 541 532 -420 -197 198 282 -338 -499 193 -276 -359 348 -434 -437 593 -217 -400 695 353 -311 -258 184 266
297 266 -287 -339 356 31 -217 138 -148 231 384 -477 -448 -65 -59 -126 -424 85 633 -179 -162 572 187 -139
319 -139 298 -357 -111 346 9 422 -100 376 186 -331 80 344 -361 -451 359 -52 -229 -292 243 252 65 73
341 73 339 -201 401 -89 -902 306 38 -429 -251 429 143 358 129 -3 62 -243 -137 8 -398 -10 37
362 37 -274 146 233 18 -55 89 213 -122 -427 85 124 -359 -138 77 112 362 27 -46 152 181 122 -47 -143
385 -143 276 -62 -296 220 112 -124 138 170 -65 -122 -79 13 6 -152 -42 -201 -108 226 -63 -101 288 67 -80
408 -80 40 73 178 54 -83 9 -29 -43 81 -139 -42 199 -50 -74 120 26 72 -55 -26 129 -166 -64 166 70
432 70 -51 78 -78 88 103 -149 -68 -145 -16 -26 -272 -11 285 -106 -108 101 25 52 -7 -56 30 -36 -85 5 -60 60
458 60 96 -87 49 164 -195 -77 78 -100 -129 -108 67 193 30 32 116 50 167 65 -122 64 -8 -113 -82 -21
482 -21 22 67 3 38 77 -33 15 -13 -67 -2 -33 -114 92 26 33 45 -14 28 25 -128 44 -3 -87 -72 11 19 33 -43 24 16 1
513 1 60 -53 -79 140 -4 -98 70 28 -40 33 58 28 -97 -10 62 -51 -16 58 -91 -43 160 -64 -55 125 25 40
539 40 -54 -13 43 0 6 25 -41 68 -16 -35 48 66 -3 -13 77 -67 1 -19 -26 30 -41 13 32 -8 -20 35 9 34 21 -25 9
570 9 -88 -24 -4 -86 -42 98 -77 -22 46 -47 52 -5 -69 12 28 1 -21 18 14 33 -49 24 72 -42 -25 13 7 -37 -81 34
600 34 -2 35 52 25 32 54 56 14 10 18 23 -54 -35 -23 47 19 14 -34 -31 29 -5 -22 -9 -36 -26 -1 41 21 -16 56 9 9 -66 29 66
635 66 46 21 -23 18 32 -12 42 66 14 -1 10 -29 47 13 -32 31 -1 9 41 47 38 -62 -31 42 -56 -77 27 -51 -7 76 -7
666 -7 -16 -45 23 11 15 6 13 -39 6 -6 -13 61 21 -12 39 23 39 46 34 4 30 9 24 -15 -60 14 -11 -7 3 41 -47 0 -2 -10 -8 5
702 5 21 -14 -10 -9 -28 -11 -63 17 -15 44 -19 62 88 -10 30 54 -2 28 10 -49 -28 4 0 81 20 28 68 32 26 16 49 -3 -44 6
736 6 -4 -67 49 61 17 38 -29 -33 30 -36 -2 16 -45 -93 -4 -7 -38 -15 -82 18 -45 4 -25 -49 -2 -36 23 -18 28 10 8 -1
768 -1 -28 53 41 7 8 -34 57 -11 -14 1 19 -9 -29 31 -50 -43 14 -76 -25 -6 25 -16 -56 -57 -27 -22 52 -1 16 -9 5 1 59 -45
802 -45 29 3 7 36 41 28 3 -28 -23 29 46 -14 -38 -9 -6 -17 -10 -5 91 -10 -15 43 9 20 33 -52 -15 -27 -22 18 -8 5 -14 10
836 10 -44 -65 29 24 -15 41 -39 22 15 -5 12 8 36 27 9 -16 16 30 -5 12 5 -11 46 31 9 27 23 77 -5 77 15 4 -17 36
870 36 -14 -10 9 22 39 -47 -38 -2 -15 -11 -17 22 34 0 31 -43 29 55 66 65 0 5 37 72 -5 -22 66 1 -51 25 -28 15 45 -12
904 -12 -6 13 -31 -9 31 37 -38 40 -45 50 -49 -21 -18 -23 16 -59 -8 -10 -18 33 3 2 -2 -13 -50 -58 46 25 10 16 -46 -14 11 16 -42 14
940 14 50 43 -20 32 -6 21 2 4 68 -71 -28 -5 -1 12 11 -24 -9 -4 -14 -39 -53 40 -4 -50 18 -18 -2 -27 -28 -37 -56 -7 37 -26
974 -26 -28 -13 80 33 41 13 42 27 2 63 25 31 34 -52 43 4 27 29 7 -46 62 -23 -31 7 2 -20 -10 -11 -52 -19 5 5 20 -25 -18
1009 -18 11 -1 -11 -14 -35 15 -33 25 18 20 15 -5 50 3 32 27 -17 -15 44 -13 62 64 19 13 23 -33 -18 -22 9 16 58 2 -24 -10 -16 -9
1045 -9 -16 9 -1 44 -50 1 -14 48 -11 -21 33 12 17 28 -3 61 -27 18 -28 18 41 -11 28 10 6 7 32 28 -13 -20 50 -12 -60 -7
1079 -7 -15 33 21 5 12 -4 -5 29 -9 19 -4 -26 -29 -57 -29 66 68 -31 -11 -5 28 -9 21 -1 77 30 39 51 34 -18 -40 -20 54 64
1113 64 27 28 48 75 -45 25 4 -20 -10 -56 15 -2 -51 -40 -5 -16 49 19 -29 6 -7 2 22 -1 -9 -5 16 -1 31 53 -68
1144 -68 14 -16 9 70 50 22 -3 -28 6 -18 -11 21 51 76 50 47 21 -17 19 12 -33 -39 -19 -3 -18 82 5 -43 -13 -64 39
1175 39 -7 -3 4 -45 -41 -6 31 14 4 36 31 0 59 30 -12 -15 -27 33 -1 -27 -6 -10 -1 27 19 63 -6 -11 22 -16 -7 67 9 9 24 0
1211 0 18 -39 -45 -7 8 6 0 0 26 -51 -36 -39 27 21 29 14 -19 -1 18 -12 -10 7 33 86 -25 22 -14 18 -2 19 9 -4 40 28
1245 28 32 -29 60 -20 20 9 -26 -58 -8 -15 -43 -14 -17 -32 -26 -28 -1 11 -16 13 19 -2 -9 2 -35 -32 -11 7 14 5 49 78 25 72 -48
1280 -48 30 63 -39 32 -22 25 41 -24 -20 -4 41 34 -40 -29 52 -4 -4 -15 -2 -29 2 -39 -3 15 -17 -52 -6 -25 69 75 6 17
1312 17 -22 -17 9 17 -22 12 18 30 1 48 50 22 54 8 -50 -25 -14 -3 39 -46 14 5 42 29 63 1 -20 20 -26 20 -29 -17 59
1345 59 20 -1 34 -33 38 -8 -17 25 21 -45 5 17 -20 -5 44 -5 -2 29 -13 -2 -37 9 -12 1 59 12 46 34 3 -11 -21 49
1377 49 26 20 47 -40 -29 -21 -33 -30 -51 18 -1 25 26 -3 -24 -2 30 -7 -73 4 -3 -6 -17 -6 -25 -23 -31 -20 0 2 27 22 18 13 31 -76
1413 -76 -22 7 6 48 -9 26 -14 28 -12 -1 -13 -9 -21 -15 -19 -5 -14 -36 -24 -35 20 21 -60 21 -17 -54 7 -36 20 2 -16 -35 74
1446 74 -28 26 30 29 -6 -17 -19 -11 19 17 -26 68 22 43 -4 26 -52 -2 10 -45 60 22 -32 -33 38 -13 -6 -2 -24 28 20 -3 -16 1
1480 1 36 36 2 9 18 29 -36 -42 26 -5 27 14 29 -46 7 37 17 44 27 -3 2 29 -16 40 -5 -11 6 53 -15 21 -16 0 -11 -28
1514 -28 15 -24 44 -30 -5 -27 -23 4 -6 -7 -6 -2 0 18 15 -32 -7 30 11 9 43 18 42 -1 27 -4 -6 59 -19 26 30 3 15 -52 -12
1549 -12 -8 -6 -21 -2 25 -24 -31 28 -10 -1 -12 22 -40 -31 11 -22 -46 -2 -86 24 41 12 13 17 13 7 -4 -25 4 -21 -10 78 21 13 -15
1584 -15 31 40 89 10 44 22 -20 28 -8 45 11 -26 0 4 15 -15 -19 -55 -41 -72 -15 43 -64 20 16 -25 19 13 -12 -26 -21 17 30
1617 30 -1 5 -11 27 9 4 23 1 59 3 -25 -44 36 5 2 16 7 -18 -18 -46 15 3 -29 -7 -16 -15 -5 1 -10 -39 -33 -5 -47 24 -2
1652 -2 -42 -9 -9 11 28 -3 22 -13 30 52 -30 36 57 6 89 11 16 14 17 23 -24 26 -9 9 -27 -44 8 6 6 9 62 -11 27 -38 2
1687 2 50 -61 -20 -57 -4 47 -20 7 -5 -21 2 -13 20 -27 -36 18 -14 57 -2 -3 -48 9 -21 19 11 -32 60 -48 22 -13 5
1718 5 0 -23 -17 -27 -18 6 -118 205 95 -4 34 -32 0 -20 7 -50 12 1 14 -65 -18 33 28 -35 -37 36 16 -50 57 41 -5
1749 -5 32 8 55 30 22 37 38 -7 -31 102 -9 5 21 22 17 4 70 -41 -27 45 -55 -22 -63 -28 -8 -18 2 -10 17 6 -8
1780 -8 -58 -7 -9 -20 -38 -10 15 2 -31 9 11 6 31 12 35 30 24 -40 -2 -42 9 -18 16 12 -3 21 -19 -9 -50 -16 -15 1 -41 20
1814 20 -5 10 -41 36 -21 7 8 196 -127 -65 43 -14 34 -21 -11 43 29 -33 57 23 26 14 20 22 16 -33 32 -17 -28 18 -11
1845 -11 -26 -26 -12 53 33 -12 -10 33 -13 40 4 42 23 -17 32 -50 2 9 -37 -10 -8 -5 -24 -27 51 18 5 -7 -45 28 2 5 21 13
1879 13 -12 33 45 37 46 -29 1 33 -3 -32 28 6 -25 21 2 -18 58 0 -18 32 -21 -44 14 -16 -17 -9 -21 -1 -8 -44 24 -13 -14
1912 -14 22 28 -60 -5 12 0 59 -31 21 46 17 -21 19 2 -17 45 62 38 18 21 -7 11 94 57 23 -6 -13 -32 -39 24 -31 1
1944 1 52 1 -33 27 -26 -8 -25 22 -21 50 6 -15 39 16 58 -95 -39 34 10 -1 14 11 26 20 56 -10 52 0 55 93 33
1975 33 -6 9 3 -38 43 -29 -15 -42 -19 -1 11 -50 -64 -48 -42 19 -69 -25 -12 -25 10 -16 -37 64 65 4 -7 8 -22 -4 22
2006 22 61 19 23 23 33 28 -45 -20 7 -5 18 67 31 -23 8 -3 -8 35 9 -8 21 -53 0 -40 -114 -56 -61 -16 -5 -32 25 8 18
2039 18 -20 -21 -10 -8 14 60 46 -3 -50 -6 -32 17 2 16 -8 0 18 42 7 -5 35 13 -23 -30 -16 51 -10 -12 -12 -54 23 -2 39
2072 39 7 -18 25 -17 16 -7 -35 -19 18 -41 -8 -35 -13 -3 5 -43 -10 23 -9 -1 -4 50 -21 -14 27 11 59 93 30 65 5 27
2104 27 24 -3 -12 -49 0 0 9 -1 15 -16 17 -39 -5 32 -2 -47 -12 14 15 -12 34 6 7 -3 1 45 12 -15 -4 -10 20 -19 -38 -7
2138 -7 29 -28 -10 6 28 21 53 17 65 5 25 -2 54 31 -32 13 -4 36 -68 -8 7 44 12 -30 -22 22 -48 -62 -2 0 7 -25
2170 -25 -27 27 -16 -15 20 2 1 -45 4 23 22 -11 35 2 47 6 59 19 48 29 -18 37 55 -77 63 14 16 -14 -4 21 -49 21
2202 21 -67 37 -9 -69 -7 -76 20 -11 16 3 -32 -2 11 -42 29 -12 21 26 8 33 -35 -10 70 29 -20 -22 39 36 40 -3 -16 29
2234 29 -18 -6 -7 -22 -23 26 -3 42 15 23 -13 51 -30 -22 -53 -9 49 38 6 -34 38 -27 -2 -8 -6 16 1 63 -5 55 -1 56 5
2267 5 34 48 -14 -18 -32 45 -25 15 -61 16 -30 1 -16 -25 70 -37 50 -10 -13 -48 -1 -70 -44 -20 -14 -61 -27 -20 -59 22 36 -3 -82
2300 -82 4 -4 23 -82 3 -2 21 26 36 -21 51 68 22 70 24 18 -16 23 -44 -12 64 -1 18 8 -29 44 -27 -22 15 -60 -49 -33
2332 -33 -4 20 49 -40 -17 -18 23 -34 44 -2 5 4 -11 14 -18 -14 -34 29 32 20 39 8 74 31 22 58 42 61 57 36 -17 -16 34 -22
2366 -22 -77 -27 48 -17 13 -7 -41 8 -17 -11 -34 -38 5 -45 -39 -13 23 12 -57 49 44 45 -18 -4 28 26 49 2 57 34 57 20 23
2399 23 -3 0 41 13 6 28 -1 -3 32 65 41 24 2 68 -57 -22 -18 -23 -3 -70 14 -23 -34 -11 38 25 -40 -27 -24 -18 -9 10 9 -11
2433 -11 29 -20 15 15 15 38 43 50 25 -3 -7 24 4 -14 12 -19 20 62 17 26 6 34 11 -40 -42 7 0 -1 81 3 -16 4 -29 5 -28
2468 -28 -7 3 -32 6 -27 5 -26 32 75 -3 74 50 16 48 35 49 44 -24 12 3 -32 -17 12 51 -1 -54 -19 18 -20 -23 -23 -55
2500 -55 -12 -31 31 11 1 -48 92 -42 18 -70 -56 12 29 42 -61 23 16 25 -14 10 21 42 3 29 19 8 -8 -1 16 19 12
2531 12 2 5 58 18 0 -31 9 -38 -21 -20 -25 5 -23 -44 10 15 -1 28 25 -5 -19 -55 0 30 -42 -18 -3 -13 -37 23 35 -8 42
2564 42 35 23 32 2 -1 12 22 38 -27 -37 22 26 -6 16 -13 -2 -27 -18 13 22 -55 27 -35 75 -66 12 -1 -22 -9 -48 -5 1 -6
2597 -6 38 4 -30 -7 42 4 -64 -24 55 47 16 43 -39 -29 0 38 -22 13 28 9 12 21 47 -12 3 6 -26 -27 37 -26 49 60 22
2630 22 21 -67 -14 -37 -57 -68 -5 -57 -18 -26 -16 -32 -20 -3 -10 -9 -34 12 -12 55 -26 18 20 9 -10 45 19 -66 39 3 44 -13
2662 -13 -41 -7 -43 29 -46 35 -29 6 58 23 -5 -7 -8 12 0 -38 36 -54 -16 -34 -34 -30 -35 -63 -27 -24 56 48 35 16 -4 18 1 45
2696 45 1 30 -22 -45 24 -10 26 -8 -28 -5 -41 7 -29 2 -45 -26 23 -14 -41 -26 -30 6 17 -70 17 -28 -22 -30 -49 9 -19 -78
2728 -78 -43 -8 -19 53 -19 -32 4 11 26 43 -23 11 -6 2 29 -20 36 -28 33 54 16 4 33 -70 41 -31 18 9 -11 -12 16
2759 16 26 -39 -23 -24 21 -34 11 52 18 -17 11 -9 20 20 -41 -12 13 0 24 30 101 45 3 -9 69 14 5 21 14 -13 -7 -8 6 18
2793 18 -26 22 4 52 -36 -22 47 -9 24 -30 -6 -36 -7 11 9 -9 -41 -41 25 -12 -41 64 28 6 16 0 1 -13 18 12 35 21
2825 21 16 -15 34 38 -61 -39 46 35 16 -56 -8 26 -4 34 42 -29 -10 30 0 -12 13 -35 6 -6 -33 -13 28 -2 16 -16 -24 9
2857 9 17 -20 27 52 28 -37 19 -29 -25 18 30 53 23 98 -15 90 -4 -4 14 -7 3 84 6 -1 -24 50 -60 18 21 -12 16 -21
2889 -21 -26 -20 -33 -3 -21 19 -7 -11 -10 24 29 1 3 0 99 -26 46 53 5 4 36 17 -12 54 30 52 16 0 -2 8 24 29 60 -46 -9
2924 -9 19 48 -33 23 -8 -59 35 -21 -29 -21 -30 -27 -16 -18 -51 44 12 -2 -12 -6 37 -14 58 -32 -8 -13 32 -33 55 2 -5 41 57 48 44 -12
2960 -12 -10 30 -52 41 25 35 -16 0 -42 40 24 4 -36 -2 36 14 -10 32 -29 -6 -24 -9 -40 33 -8 43 49 22 -30 -23 -27 8
2992 8 10 60 13 -1 27 19 9 19 17 17 14 -29 70 53 -37 -33 79 46 27 -28 16 -66 19 0 6 -50 12 -18 20 3 -45 4 5 2 18
3027 18 -16 21 13 -34 -6 24 44 -32 -2 62 20 -20 -17 45 46 -15 6 -5 -29 43 13 38 -22 -18 -13 -28 11 15 33 -14 -21 23 3 54
3061 54 17 -12 66 11 -53 -10 -54 -42 27 -2 58 17 17 -6 -18 -17 28 10 28 -14 29 29 233 -48 43 37 24 -19 -54 74 30
3092 30 37 -38 4 -32 13 64 4 3 -31 -51 -24 -2 -22 10 9 -2 36 -13 4 5 -27 -22 -33 2 64 3 -35 10 94 58 -7 34 35
3125 35 10 9 45 -13 52 -6 50 -2 2 30 10 12 21 -49 1 -18 -6 -41 18 17 26 22 -10 -48 -23 -22 36 -17 16 -56 -13 39 7 -21
3159 -21 -16 -1 12 11 -12 -3 -30 -38 19 4 34 25 38 23 -4 40 2 -2 -97 40 -28 -45 -18 -31 52 20 15 45 -15 -26 4 4 -65 -39
3193 -39 -12 -7 -57 -35 3 10 -26 10 23 32 20 3 36 1 -11 -13 54 65 -28 44 -17 -12 23 7 13 -2 27 36 -39 -21 47 33 -47 1
3227 1 34 -68 -45 -6 -6 -26 -50 11 -73 -44 9 10 -25 0 -7 -59 -74 -34 -20 11 -18 -1 29 22 70 -7 -9 53 17 29 17 -5 -41
3260 -41 -26 36 49 22 -21 5 -18 -14 -62 -39 -22 -29 51 1 -23 -19 -9 -45 15 15 -69 57 -16 -16 22 32 -17 3 -17 -17 -1 -30 -30
3293 -30 7 37 -41 79 5 23 -29 34 64 24 2 8 -30 19 7 -12 3 32 -53 -7 -17 20 -20 -28 -11 1 -23 28 -18 -54 0
3324 0 -33 -17 -75 -14 -19 14 -8 6 -5 19 -27 31 8 25 43 41 32 61 15 27 -2 6 -3 0 10 30 9 -23 5 -10 -37 -61 4 20
3358 20 -40 -4 4 -22 11 -6 10 -20 27 52 -10 -23 -12 -36 -9 16 40 -1 -79 37 -12 -3 20 43 14 17 24 -6 24 13 -20 38
3390 38 15 20 6 -16 22 -20 28 -39 -46 -10 -1 -107 -4 -17 1 -60 25 -22 -47 10 -7 -64 -14 -17 67 -51 32 -7 -61 69
3420 69 -15 4 -23 11 5 29 73 -5 -1 -3 82 43 87 -16 -26 -11 -7 -9 5 -40 -25 -46 -6 -41 -24 -26 -17 -46 -18 54 -8 -3 -18 36
3454 36 9 25 13 14 1 -68 -2 -42 -6 -10 8 -13 27 106 55 -10 27 42 45 6 -43 43 19 33 -59 -18 -5 23 2 30 5 -26
3486 -26 51 -14 3 12 -5 -14 -23 -38 19 -43 -5 6 8 19 6 43 -25 0 5 -19 58 1 -49 -12 -19 34 12 -5 21 9 24 -23 50
3519 50 -12 32 59 -4 -7 -2 -6 -24 9 -51 15 0 3 4 -18 14 -20 -42 -47 -36 -42 -30 10 86 -2 -3 4 17 23 -22 -20 -18 47 8 23 67
3555 67 11 5 -28 -7 -22 25 -12 -29 25 12 -14 33 36 31 -37 -2 -25 -4 24 -10 4 -38 -3 32 7 -34 7 25 -43 4 25 -42
3587 -42 20 -35 -28 -28 -38 -24 6 14 1 -1 21 16 23 12 -32 -20 3 48 -3 11 33 -10 -10 47 47 34 13 24 -16 -47 -3 -40 -34 -40 15
3622 15 -45 -13 38 7 -15 -29 -31 -3 -6 5 32 -34 5 30 21 8 5 -21 2 28 -62 106 64 7 36 -27 -21 0 39 -19 61 24
3654 24 1 7 6 0 -8 -6 -1 -24 -14 -44 -12 -3 -51 -16 30 30 -59 -11 10 -48 -20 -5 61 29 -4 35 55 11 -34 -49 -5 38 30 -7 6
3689 6 25 55 -4 17 38 33 25 -17 17 -12 15 -21 25 -22 -48 -10 -23 -79 7 -18 37 22 30 -2 -11 13 33 -13 -15 35 55 21 9
3722 9 3 11 -11 3 62 -11 -18 28 10 78 54 39 -6 24 35 -7 15 -51 50 -6 -34 4 -40 11 -6 41 -28 -42 -23 6 -51 -39
3754 -39 -16 16 20 -18 -63 37 -30 16 -10 14 44 -16 15 -12 4 19 28 33 78 38 0 73 -5 11 29 -34 13 36 -13 -5 -27 -70
3786 -70 -7 -26 -50 -17 -30 -65 4 -27 -24 -25 -57 -28 -15 -16 -38 10 -2 24 -1 -6 18 35 40 43 -25 -21 0 42 -34 28 15 -9 53 57
3820 57 33 7 14 -46 1 -40 -6 22 1 6 25 36 7 -72 73 9 21 -131 -51 -153 -61 -4 -40 -39 45 -10 -10 19 25 57 -27
3851 -27 63 -32 46 14 7 26 -40 8 13 0 4 -12 -9 10 -81 11 5 45 -29 -99 -35 6 -26 22 -96 0 61 27 30 -68 54 -14
3883 -14 -27 -25 29 -44 34 23 -11 27 -48 0 38 76 47 3 -12 8 -120 -2 205 81 55 54 -184 -82 28 307 300 -119
3911 -119 227 -75 -77 135 -201 -231 -76 -95 198 310 -37 -82 70 -51 -77 132 23 -367 -384 90 291 45
3933 45 -294 48 168 47 418 -204 -68 254 -445 -275 -20 100 98 -704 186 -8 -346 -149 -432 190 153
3954 153 264 15 348 99 282 -139 -26 202 -250 -101 9 -336 -26 0 24 96 -13 73 -87 38 -5 29
3976 29 -69 34 134 -40 17 27 -39 -29 112 -37 43 -113 -120 71 -229 24 38 76 194 -13 274 154 17 48
4000 48 -123 29 -29 -29 9 7 -159 -45 43 6 13 31 -66 -17 -42 -34 34 -54 -22 16 17 27 10 49 38 -20 13 -40 46 30 7
4031 7 29 -33 11 -18 5 -27 43 1 -36 -7 8 1 -40 -38 -12 52 -32 -19 -25 52 -11 -9 -22 -38 -46 -19 -47 78 -27 -7 21 19 4
4064 4 4 44 9 53 17 38 -40 -61 40 25 -10 24 -33 22 19 -6 14 64 30 -11 18 -9 -22 -54 -11 17 1 -20 58 -25 -32 -28
4096 -28 -18 45 -12 34 20 -2 40 5 -74 27 10 37 13 -17 55 62 11 -15 30 -1 83 -9 -31 -8 -17 68 52 23 11 45 5
4127 5 12 -12 -35 5 -4 2 13 4 -48 -1 35 46 3 73 -33 -6 -38 -10 0 41 13 -17 12 -46 -38 -5 -34 32 18 63 -9 5 0
4160 0 -39 68 37 12 19 7 8 42 -29 -36 20 9 -70 -6 3 -41 -7 -42 51 11 -53 -6 28 15 -11 -24 -27 -52 14 30 4 34 -22
4193 -22 9 -24 65 -13 34 43 18 -59 -3 39 14 13 7 25 18 48 -32 65 4 -8 26 -5 -26 -39 -34 4 -12 -51 -24 3 22 8 29
4226 29 13 -49 6 -9 7 -6 -11 6 5 62 28 59 -2 2 1 24 76 32 -2 -12 28 -8 -13 22 63 -13 1 -75 31 37 -10 6 14
4259 14 -5 -12 -8 -31 -11 -11 -11 47 6 49 -24 14 36 -24 -20 22 78 -8 -33 51 -28 -2 5 -19 -38 69 3 -19 41 21 62 -10 27
4292 27 52 25 40 -23 -14 33 31 12 -39 13 8 20 18 46 20 -14 -36 -18 22 -6 -51 -5 -62 7 0 -14 -12 8 10 34 34 105 12 -8
4326 -8 69 -19 1 25 45 26 54 51 6 46 25 4 -72 -79 11 -38 24 7 -67 -10 -1 -43 17 21 -41 -16 14 -15 14 17 -21 -11 38
4359 38 57 -16 -13 -1 -20 -10 8 -3 26 48 25 24 3 -30 24 31 4 6 -37 -59 -15 2 -14 13 -29 0 -28 -24 45 23 -29 59 -23
4392 -23 -34 -74 116 18 -115 168 5 0 50 -46 -92 -29 18 -6 28 8 -36 6 39 -27 -2 3 29 13 46 88 -39 -25 -3
4421 -3 -37 -43 70 21 12 4 -16 -21 6 -50 -21 16 -15 -11 4 -26 5 -22 -6 7 36 34 -55 12 -22 34 21 -52 17 24 34 2 -42 -1
4455 -1 45 3 -40 5 72 5 8 40 63 -11 26 56 -16 55 -43 -21 31 -10 -42 0 -28 9 -21 -57 -8 -40 -8 -31 -52 22 -30
4486 -30 45 -15 0 57 37 14 -34 19 26 49 14 0 14 14 78 -13 8 3 26 -7 74 -37 44 -37 -7 -2 -24 -3 13 4 -57 -31
4518 -31 -33 -59 -14 -34 -10 -99 117 -149 -159 49 -38 32 -8 36 5 18 28 21 -47 25 -43 25 -16 -36 -12 46 42 5 45 33
4548 33 -48 44 -22 -16 -2 9 -66 0 -1 1 46 49 -16 -54 4 -37 11 0 -22 -54 9 -6 -8 -47 1 14 27 -2 17 15 -17 -24 5 5
4582 5 82 16 -5 -16 25 -22 -50 -3 7 -19 46 12 16 -3 24 -4 -1 28 34 -17 -20 -30 -30 -91 -38 -35 -22 2 -78 21 70 -22 -13 -1
4616 -1 49 -26 55 -4 -5 54 48 -21 24 -55 28 -7 49 10 50 46 14 21 -58 39 -39 -7 -37 15 9 -9 -42 -31 -22 4 -34 11 -24 33
4650 33 -55 -47 2 -36 -58 -4 26 1 4 16 13 -20 15 -8 15 78 28 -32 29 0 -30 36 -1 9 22 4 -7 -48 72 43 -7
4681 -7 -9 -52 12 46 -18 39 -43 22 4 90 -9 -12 0 -9 -34 -1 -28 -13 41 18 17 -23 -42 -14 37 -12 -19 43 38 31 35 -9 -9 56 50 2
4717 2 11 5 -3 3 42 5 55 18 21 -6 51 6 102 4 -93 21 -56 14 -24 40 -79 -49 -1 -65 41 41 77 -95 -59 111 -136
4748 -136 -73 30 136 55 61 -14 107 -86 -262 289 -361 0 137 5 -18 104 -30 21 -22 -26 -31 -12 5 -42 -2
4773 -2 32 -45 -3 11 -18 -53 36 -68 17 -15 -1 -1 -9 6 12 -7 27 -44 -12 -8 22 29 -34 15 5 18 35 16 -2 14 5 -15 65
4806 65 41 47 8 11 -54 -38 -36 -8 -1 -15 9 18 -31 -32 6 9 13 53 33 -4 -28 21 36 19 -9 8 -82 12 -7 -106 -27 6 -19 0
4840 0 11 66 20 -67 51 34 50 51 34 -23 54 39 19 -6 -8 8 -9 -20 -18 2 -75 -13 -46 -43 -4 -24 -28 -27 4 17 -42 -9 57
4873 57 12 -1 8 39 42 -4 -70 5 1 16 -57 -19 64 42 58 12 -16 26 21 -30 -24 -16 56 30 -37 37 24 -5 11 37 -41 19 -32
4906 -32 -23 9 -38 -44 -26 34 12 -16 27 33 -33 -30 31 -11 30 23 -62 33 68 -23 28 14 26 -1 23 115 49 23 28 -9 13 18 34 26
4940 26 44 -49 -14 2 -36 13 -56 18 19 -32 2 16 -15 21 -36 -53 -17 3 -66 39 -15 23 18 33 12 -18 -60 -35 -16 59 27
4971 27 71 39 -17 2 2 -7 -30 1 41 24 17 12 47 57 65 -40 -35 -33 17 -47 -43 17 16 7 31 19 9 -23 -3 -18 32 -6 15 4 22
5006 22 11 9 0 -10 7 -10 26 -1 19 -2 25 16 13 36 36 66 -26 1 -18 -8 0 37 28 7 12 -46 -6 9 9 -23 -8 -38 -31 -50 44
5041 44 -51 -4 37 -22 -30 -27 8 -6 -40 39 61 26 52 47 14 10 58 -5 47 10 57 -26 -49 -16 23 -18 -29 21 -41 -22 -12 4
5073 4 -4 -46 14 -36 -61 -5 -39 30 26 -50 15 7 -55 -15 43 26 -14 -22 -35 -6 36 58 12 -11 -3 36 -15 66 23 -27 34 38 26 6
5107 6 0 21 27 44 17 -10 3 11 34 -81 3 -54 4 -18 -38 24 -13 -3 6 -70 -41 4 -12 25 -3 6 28 -6 19 0 15 -34 64
5140 64 -24 -42 105 -15 64 39 108 -222 -108 14 18 -28 -3 -48 -59 38 -23 39 58 -23 -28 30 38 34 -11 46 5 -5 -101 13
5170 13 6 8 17 -3 -8 28 -19 18 -20 -1 -4 38 25 -44 -7 18 16 -18 61 -10 19 26 -4 7 31 60 -25 -37 25 25 5 -23 -53 43
5204 43 -21 -41 27 -1 -25 1 11 -5 -32 -64 0 5 -14 -19 -63 -27 -16 -2 38 33 21 24 25 38 21 34 8 -29 24 15 -1 38 25
5237 25 0 5 -1 20 1 -19 30 -31 -28 -39 4 -9 -2 -48 19 -3 -33 76 -7 59 -10 4 -8 13 15 75 30 -15 -8 -1 -9 38 12 43
5271 43 31 21 21 14 29 46 39 21 54 33 -29 -32 -32 65 7 -21 -41 -49 27 -25 27 -11 12 -9 -26 -21 14 5 -58 -7 -15 -52 -37 10 -33
5306 -33 42 21 -4 48 65 27 -28 52 67 56 48 1 -12 63 37 -35 14 14 5 -12 6 22 46 -25 20 -3 -18 -23 -44 -53 -26 -24 -31 -21
5340 -21 56 -5 8 -33 -55 -20 -1 57 -47 2 16 29 68 7 21 -27 -21 17 -16 18 -16 37 54 57 10 80 -28 32 -20 41
5370 41 129 156 -54 -29 -27 6 -52 24 -36 16 5 -2 -8 -24 6 -30 6 -56 17 -7 -27 -6 -10 9 -4 24 -5 34 64 82 52 24
5402 24 61 17 28 49 6 26 -38 -24 -4 -28 6 32 16 -73 35 14 39 0 -31 15 18 -26 -51 -5 -11 -4 -38 -17 -36 11 30
5433 30 -14 20 -9 -112 -12 15 21 48 23 16 -1 -10 -24 36 28 30 2 1 -52 11 7 34 -13 -28 -61 10 -31 -27 -15 -50 -16 54 6
5466 6 -36 -31 -4 -54 5 10 25 75 -7 -14 -10 14 -39 8 45 8 84 85 28 15 -18 17 9 23 36 -31 -14 5 -14 -18 -31 13 58 33
5500 33 -9 6 -19 -14 -4 -58 -32 -10 -27 -20 73 -30 16 9 -13 1 -8 -13 7 19 20 9 -2 49 -44 8 -27 39 -12 26 21 16 5 -56
5534 -56 45 58 36 6 0 2 38 2 14 9 12 4 -49 -30 25 -107 -4 -63 7 -16 28 -58 -7 -62 -18 44 -40 3 38 -4 66
5565 66 -31 44 -8 -4 30 14 8 25 28 -1 45 3 7 -10 33 -22 -29 -14 -46 -31 10 -10 24 -6 -41 30 -16 37 -46 -5 -29 23 36
5598 36 -11 -33 32 16 32 -6 -27 59 11 29 -20 33 11 34 -12 36 19 -12 29 21 -1 46 -14 26 22 26 -16 28 -26 13 37 7
5630 7 22 15 1 52 -21 -18 -33 -9 -35 34 45 -18 -9 14 -44 -20 15 -19 25 -5 -39 29 62 26 -14 45 -17 57 24 -19 3 3 12
5663 12 10 27 10 -2 44 47 43 -28 14 -54 -5 -61 -55 -74 -6 -5 -26 4 -51 -37 6 -4 -12 16 -16 -6 25 -20 -69 22 -13 -21 -7 -22
5697 -22 12 4 42 -6 -18 162 163 -41 -82 28 -15 94 144 189 186 404 250 -48 137 136 147 -3 110 -377 -31 -42
5723 -42 -159 28 142 50 -45 -258 -406 -66 515 -78 227 193 7 100 62 187 145 28 252 -70 469 50
5745 50 36 -30 -235 -128 -26 -144 -39 122 46 59 -27 -309 -42 -202 -1 -49 141 80 -16 141 179 -175 -32
5768 -32 -166 -292 -27 47 25 -100 30 -12 -60 156 49 -39 24 40 -6 10 118 6 -22 32 51 -16 -42 27 56 -20
5794 -20 55 9 -7 -69 -38 8 42 -62 6 41 -74 14 -3 39 8 -25 -18 -16 -40 3 25 17 28 10 37 -69 -31 -53 -63 -87
5824 -87 -126 311 -123 112 161 12 433 185 -113 95 171 37 54 192 -26 -183 -46 0 199 12 83 21 24
5847 24 53 -59 11 8 11 3 -7 -32 -11 20 -10 -24 9 21 47 -12 32 -17 0 -6 -5 39 5 4 -2 47 34 -3 -18 42 42 8 33 -15
5881 -15 18 -28 16 -12 -13 -31 -2 4 -17 -24 -43 -70 9 -45 4 -6 -45 -26 -101 -11 2 3 69 -41 -11 -13 24 -34 9 9 8 30 -6
5914 -6 30 -38 16 3 5 -5 16 1 26 22 10 -3 -24 -9 25 29 -73 -18 -52 -8 -29 10 7 20 30 -39 36 -50 25 -8 14 -21
5946 -21 -52 4 -56 -7 64 -8 -24 12 11 -1 -7 12 45 60 56 30 11 31 66 6 10 47 -20 -15 -29 17 -86 6 20 -22 -3 -54
5978 -54 6 16 -11 -26 -21 11 -15 -14 40 27 -14 10 -9 20 -15 -23 -3 15 0 -1 33 68 -5 28 71 17 -15 -42 61 17 9 -10
6010 -10 18 -24 -37 -15 7 -12 -17 30 -51 -3 -19 2 -22 -22 25 -88 -48 -24 20 -53 24 -2 3 -17 3 33 -20 41 -64 20 -66
6041 -66 9 17 -11 32 25 39 -28 -12 -9 7 19 3 -8 18 14 0 -48 22 -33 6 -19 39 8 -11 -34 22 -9 28 -12 -44 -41 14 27
6074 27 20 53 9 -12 27 2 61 5 -9 60 -25 -3 25 11 22 11 43 12 16 12 -10 -28 -15 22 -2 15 20 15 43 -24 -29 38 45 -37
6108 -37 34 -29 1 -29 34 2 -37 20 18 27 23 15 52 43 -22 11 -48 82 -19 14 -4 22 15 -33 56 52 69 29 -10 -51 -14 6 36
6141 36 33 -6 12 37 -5 11 30 30 -12 26 45 -6 -40 -38 10 35 -29 -25 1 33 -6 16 -38 24 3 -26 44 2 21 -12 46 31
6173 31 1 44 24 30 -2 15 -27 42 -23 61 0 19 40 11 26 11 2 -40 37 8 -20 13 -28 3 14 -27 1 -1 2 -1 -25 -33 -35 12
6207 12 -20 -17 -17 -18 19 -24 46 44 52 33 73 37 25 41 -35 51 5 20 -39 -12 -13 24 23 -35 18 30 -58 -15 -61 -11 -49 18 7 7
6241 7 -7 -58 7 -19 -21 -12 17 16 16 -5 -14 6 68 13 -66 23 1 58 34 25 40 15 24 69 -19 -2 52 62 64 22 -33 -32 3 -30 29
6276 29 0 -10 6 33 -30 -26 -15 -71 -69 13 -69 -48 14 -12 22 -14 -40 43 -19 11 22 29 41 -56 40 27 18 28 25 5 26 27 -5
6309 -5 -40 20 28 -28 -33 15 -13 -3 -45 -1 -30 -6 -12 -58 21 -27 -2 -44 -20 -9 34 -18 -18 13 -5 33 -18 -53 43 -4 32 31 -1
6342 -1 34 -12 -4 27 21 -2 29 4 34 -21 -3 -26 6 -4 4 -43 -15 -60 16 -5 20 -14 6 -1 -2 -24 23 -56 -3 -5 24 -11 27 30
6376 30 -26 68 13 35 -41 36 -23 -53 -14 -36 34 -25 54 -28 39 -15 17 30 4 -32 -7 13 28 -53 -4 -17 3 -9 -77 -66
6406 -66 -8 4 -59 -21 0 25 3 -3 -33 27 -11 28 58 10 -52 31 5 -31 -2 15 -28 -16 32 79 1 30 2 54 -20 20 28
6437 28 64 21 109 300 41 15 -26 -2 -23 -43 -27 5 -8 7 5 -35 -24 -34 -60 8 -11 -13 5 -23 -32 21 -13 11 -20 45 17
6468 17 40 26 -5 53 16 46 -24 41 42 50 43 6 17 11 31 23 -33 24 -56 -18 -12 17 -20 36 -3 21 5 -3 -38 -13 16 37 -34 -7
6502 -7 11 27 28 -21 18 41 4 10 3 39 74 -11 40 48 35 3 25 4 -23 -13 37 -15 36 -41 21 -15 -2 17 -31 -2 -20 -36 -57
6535 -57 18 0 -27 43 53 19 3 26 14 8 -15 43 2 5 10 13 58 12 3 -35 14 16 16 46 -10 -53 -171 20 102 -10 213 124
6567 124 157 238 -136 172 -130 -70 -12 63 68 104 122 -59 -89 130 27 104 -20 -52 -8 9 -13 -10 -60 -10 -55 5 -1 -19
6595 -19 -25 -37 3 -16 21 5 13 -13 52 10 51 -15 -29 21 29 17 11 33 43 -5 -20 20 -7 -80 -1 -14 -56 -29 -6 -37 3 62
6627 62 -57 33 5 -25 48 -23 19 38 -10 -34 -8 30 -15 -13 90 69 2 97 133 -38 83 -5 -31 63 89 -17 21 0
6655 0 -68 -36 -88 21 151 -50 14 142 18 1 -40 -104 -104 -54 -192 -143 -190 64 93 161 -65 85 -307 -124 -219 -130
6681 -130 -84 -40 -86 -235 176 6 11 -80 -115 -141 97 133 -66 120 -33 181 -102 -240 99 263 153 -24 -105
6704 -105 -38 -82 -97 176 218 -134 24 18 -401 162 -343 -146 -18 -29 410 -4 -20 376 -256 -184 -215 309 197
6727 197 134 234 -5 129 416 39 3 -10 15 211 31 -143 -90 -61 -55 -136 -78 -16 -80 -14 -109 81 -42 -53 -4
6752 -4 -78 -15 -25 -61 40 16 -81 -40 75 48 58 -27 34 30 68 1 19 36 26 -22 21 -35 18 8 -1 9 -24 19 6 49 -49
6783 -49 10 14 -77 4 -31 -18 -19 -44 29 4 -57 58 -1 44 -32 4 -20 -30 45 -38 6 -46 48 -58 29 -23 28 -24 -42 -31
6813 -31 -37 35 -7 28 45 -1 -12 23 51 33 1 -47 11 -23 40 -23 -4 -1 13 -50 2 -5 -12 -49 -4 12 13 -2 4 -3 -16 -6 -38 30
6847 30 15 0 24 -6 52 -19 26 21 -11 45 -39 -31 -2 27 3 31 13 38 -42 56 -8 6 -24 -13 -45 29 -44 16 38 -45 57
6878 57 -36 8 34 -40 -22 -19 -27 1 -34 16 -6 -60 -34 -24 -8 -27 -36 27 35 1 -28 9 -14 -24 -7 17 33 13 34 -13 47 22
6910 22 30 -35 -38 -41 -21 -25 -25 -27 -10 -8 -2 -17 -4 -31 -14 -9 -7 -14 54 41 24 9 -8 10 9 10 -20 16 44 3 3 -15 50 38 5 78 -3
6947 -3 7 18 28 -34 5 -9 -48 -23 17 -13 26 5 33 -21 8 -58 -17 -51 -27 -20 46 37 -28 -22 8 -13 14 -9 59 6 -5 -12 25
6980 25 -29 -15 -31 -57 -11 0 -49 -2 -16 -4 21 27 -19 63 37 -9 -52 -15 -12 15 -5 -6 -17 -53 -45 -14 -29 -20 -23 -20 -40 -19 -39 -12
7014 -12 13 -22 -37 -38 25 -7 -64 32 26 29 14 -20 13 0 19 0 7 -17 72 22 38 -39 -46 -11 1 -20 -9 14 24 43 17 13 24
7047 24 -14 -29 16 -27 5 -17 6 -31 -22 -28 -38 -7 13 -3 -20 29 36 52 43 28 18 -49 -1 21 61 -8 20 25 -12 63 -5 65 -64
7080 -64 -20 -2 46 32 40 -57 14 67 -25 -13 15 -14 -59 -16 -32 -7 -8 40 -25 -3 -15 35 32 -10 54 30 -25 -3 -20 31 -3 -48
7112 -48 -23 -12 9 -61 3 35 9 19 62 13 -33 -8 7 -16 -2 -38 51 -20 -6 -25 3 25 -12 51 -45 -35 26 43 45 28 -44
7143 -44 36 -12 -9 1 120 -104 -7 -1 30 -23 -37 79 37 14 -1 54 33 -14 28 11 -7 -28 -18 -32 -46 13 39 -14 -13 33
7173 33 -29 29 -23 -3 21 8 2 -32 -1 25 5 -59 -38 -14 -1 -65 30 1 -36 43 -2 -27 -26 19 -12 10 16 13 -10 50 24 22 -6
7206 -6 -25 -16 9 36 21 9 10 9 2 -25 -28 -27 34 -6 -11 -28 -27 47 -5 -33 13 24 -51 25 -38 9 -26 -11 39 -26 27 36 34 -13 34 -7
7242 -7 23 -27 20 -4 -8 32 18 -15 -37 29 39 7 32 -56 24 -44 -21 -15 -40 -97 -19 -47 -39 -27 9 -60 18 -11 -31 -23 -21 -11 -49
7275 -49 -18 11 9 -56 -16 30 20 -3 1 34 -13 -20 -14 34 -3 17 -13 31 30 41 28 30 -1 113 57 -85 -191 -398 -42 -20 64
7306 64 -260 -160 -126 16 9 -59 21 -9 -49 -25 -31 -7 -13 28 -13 -17 -19 0 -2 32 -4 0 18 63 -6 64 14 44 3 -32 46 -4
7338 -4 46 55 18 24 -14 -5 53 21 -17 9 -25 22 -3 20 -37 -13 -8 5 11 -54 -40 46 -52 34 -26 24 22 18 4 -38 40 8 20 -29
7372 -29 81 9 -24 47 14 7 38 64 -22 3 -18 -27 -33 -47 -39 -17 -32 -31 -25 0 -12 23 -76 -35 3 -10 -31 -11 -20 20 -39 -5 -6 26
7406 26 0 -37 63 11 -35 -12 -8 5 31 63 19 51 -11 24 45 29 24 -2 12 61 -16 21 -4 66 -28 33 13 30 -35 59 -255
7437 -255 163 243 -78 -2 -47 -13 -55 11 -70 49 -9 66 -10 57 -4 57 7 14 8 -6 -23 -7 -38 47 19 40 -3 -18 -26 -3
7467 -3 -39 -3 50 -6 8 -22 -18 -46 -13 -11 5 26 32 -52 -23 15 17 -4 -31 -28 4 -17 -14 60 3 48 0 -28 23 40 31 5 53 -36
7501 -36 18 35 18 74 6 -10 -7 -13 32 -18 26 -59 26 16 -6 9 -35 12 -29 -65 -31 30 4 7 3 -2 -1 50 -1 -57 7 37 -26
7534 -26 -15 -2 12 -27 7 7 13 -6 23 2 21 35 23 19 27 -30 19 27 51 -7 -44 -20 -14 29 11 -24 -26 1 24 1 -56 40 -71
7567 -71 -98 8 -22 -18 28 -35 -34 -57 16 20 82 -1 -22 59 9 -23 6 26 24 46 77 34 -42 56 22 -53 -7 22 45 23 -8 -38
7599 -38 56 19 2 -32 -44 47 23 -14 -36 -29 -19 42 -10 6 31 -25 -20 -8 4 23 -3 45 60 -34 15 5 -15 -60 -24 38 34 53
7631 53 -27 -5 85 -13 13 -16 -3 -18 2 25 -23 14 -36 14 -10 -27 -31 5 -3 -1 -27 -36 16 -59 1 13 -2 -9 -37 30 -6 -4 7
7664 7 57 11 18 56 -7 52 40 13 28 58 3 6 71 37 9 9 39 -37 -27 7 -24 -35 0 18 17 -1 2 -23 4 -32 4 23 -6
7697 -6 59 -59 2 -37 -382 95 -107 64 -12 -15 287 37 -124 60 -152 0 438 141 -98 216 109 -4 96
7720 96 -143 19 -387 54 -332 178 -217 53 -136 48 -165 372 156 -110 -256 -287 -59 -188 -311 51 313
7741 313 -25 -332 -50 -89 213 61 -290 441 -270 8 149 145 151 -83 -70 0 158 32 141 48 59 24 26 43
7765 43 5 -8 32 31 29 -12 -39 -2 41 45 -20 3 -71 -24 -36 -30 -4 -46 51 43 2 29 1 -1 -23 -12 82 -22 -54 88 15 -6
7797 -6 24 0 56 16 -6 -19 -50 7 43 52 15 -9 70 21 -20 32 22 14 2 -1 -26 -42 2 -37 46 -6 -5 8 -35 18 -4 -11 -13 -35
7831 -35 -14 7 -8 30 -15 6 11 46 22 78 61 11 -8 -40 37 -1 24 3 57 61 16 34 -54 -63 31 -34 5 -7 -54 -44 -11 24
7863 24 -57 7 -3 13 -7 6 -32 -43 -43 16 -13 23 -38 -8 -28 -17 -44 -21 8 -24 -12 60 -11 9 7 44 7 37 -30 7 30
7894 30 45 -15 1 -17 32 57 -31 -37 10 36 -42 -40 -24 17 -7 15 56 43 6 -36 -31 -7 11 -4 -28 -14 5 -10 28 9 5 -15
7926 -15 -15 0 22 3 10 -21 19 37 8 33 67 45 0 -38 -8 22 39 -29 37 20 -32 -34 -19 32 -11 5 -23 -47 -30 -9 1 -51
7958 -51 -10 -22 20 -13 -4 32 24 -26 27 30 19 19 14 8 15 52 88 36 17 26 13 -2 24 1 7 40 26 0 -22 14 -6 -23 -41 20 -37
7993 -37 -49 -44 -66 33 30 -30 -36 -40 -11 12 22 -12 -23 24 -4 13 33 44 4 15 0 -25 6 22 76 31 -1 78 39 31 20 50 38
8026 38 12 15 -31 -27 -30 1 54 -4 -14 -38 -50 39 -48 -51 -8 -9 -13 -16 -35 -16 -15 -27 -4 2 35 1 25 36 7 37 32 35 40 43 24 -8 58
8063 58 -18 21 -17 -19 -20 -2 -69 -14 9 14 7 17 -3 131 112 14 328 102 153 -51 98 349 -138 -83 127 -53 -7 -85
8091 -85 -2 41 116 13 226 -48 -62 -8 -35 22 32 78 17 -4 -16 38 -98 25 -68 38 -46 -12 -62 84 46 -4 21
8118 21 -46 -96 -79 -58 -49 -24 -74 -11 -44 21 -14 0 12 1 -32 13 24 -7 -21 -20 -4 24 0 48 -17 -6 12 -7 -22 45 33
8149 33 21 -43 -12 0 -1 14 30 -16 40 -52 35 28 5 -10 -33 38 7 17 -1 22 19 21 -20 10 13 -53 -36 7 16 -49 -30 28 -4
8182 -4 -54 6 27 3 -9 39 21 27 3
8191C
##END NTUPLES=NMR FID
##END=
