##TITLE=1H_DE-80H_X3
 200.13MHz, d2o
 8 sc
 
 19ns.26.2.2025
##JCAMPDX= 6.0         $$ Bruker NMR JCAMP-DX V2.0
##DATA TYPE= NMR FID
##DATA CLASS= NTUPLES
##ORIGIN= UXNMR, Bruker Analytische Messtechnik GmbH
##OWNER= pz
$$ XWIN-NMR		Version 3.5
$$ Thu Feb 12 13:47:31 2026 Russian Standard Time (UT+4h)  Yarkov@DPX200
##.OBSERVE FREQUENCY= 200.1313
##.OBSERVE NUCLEUS= ^1H
##.DELAY= (6, 6)
##.ACQUISITION MODE= SIMULTANEOUS
##.ACQUISITION SCHEME= undefined
##.AVERAGES= 8
##.DIGITISER RES= 18
##SPECTROMETER/DATA SYSTEM= spect
##.PULSE SEQUENCE= zg30
##.SOLVENT NAME= D2O
##.SHIFT REFERENCE= (INTERNAL, D2O, 0, 14.3821)
##AUDIT TRAIL= $$ (NUMBER, WHEN, WHO, WHERE, WHAT)
$$ ##TITLE= Audit trail, XWIN-NMR		Version 3.5
$$ ##JCAMPDX= 5.01
$$ ##ORIGIN= Bruker BioSpin GmbH
$$ ##OWNER= Yarkov
$$ C:/Bruker/XWIN-NMR/data/yarkov2/nmr/H-C/1/audita.txt
$$ ##AUDIT TRAIL=  $$ (NUMBER, WHEN, WHO, WHERE, WHAT)
(   1,<2026-02-12 13:46:49.64 +0400>,<Yarkov>,<DPX200>,
      <created by zg, POWCHK disabled, PULCHK disabled
       configuration hash MD5:
       00 E9 B6 7A A2 85 ED C7 34 08 36 98 17 FE 4E 26
       data hash MD5: 16K
       B5 F0 10 9E 5E B0 BB 0C 0C 18 58 37 94 BB EF C2>)
$$ ##END=
$$ 
$$ hash MD5
$$ A0 75 4C 72 4E 85 9D 99 DF C0 61 E3 BD 0C E7 2B
##$RELAX= 
##$RELAX= 
##$RELAX= 
##$RELAX= 
##$RELAX= 
##$RELAX= 
$$ Bruker specific parameters
$$ --------------------------
##$DU= <C:/Bruker/XWIN-NMR>
##$EXPNO= 1
##$NAME= <H-C>
##$PROCNO= 1
##$TYPE= <nmr>
##$USER= <yarkov2>
##$AMP= (0..31)
100 100 100 100 100 100 100 100 100 100 100 100 100 100 100 100 100 100 
100 100 100 100 100 100 100 100 100 100 100 100 100 100 
##$AQSEQ= 0
##$AQ_mod= 1
##$AUNM= <au_zg>
##$AUTOPOS= <>
##$BF1= 200.13
##$BF2= 200.13
##$BF3= 200.13
##$BF4= 200.13
##$BF5= 200.13
##$BF6= 200.13
##$BF7= 200.13
##$BF8= 200.13
##$BYTORDA= 1
##$CFDGTYP= 0
##$CFRGTYP= 5
##$CHEMSTR= <none>
##$CNST= (0..31)
1 1 145 1 1 1 1 1 1 1 1 1 1 1 1 1 1 1 1 1 1 1 1 1 1 1 1 1 1 1 1 1 
##$CPDPRG= <>
##$CPDPRG1= <>
##$CPDPRG2= <>
##$CPDPRG3= <>
##$CPDPRG4= <mlev>
##$CPDPRG5= <mlev>
##$CPDPRG6= <mlev>
##$CPDPRG7= <mlev>
##$CPDPRG8= <mlev>
##$CPDPRGB= <>
##$CPDPRGT= <>
##$D= (0..31)
0 0.7 0 0 0 0 0 0 0 0 0 0.03 0 0 0 0 0 0 0 0 0 0 0 0 0 0 0 0 0 0 0 0 
##$DATE= 1770889609
##$DBL= (0..7)
120 120 120 120 120 120 120 120 
##$DBP= (0..7)
150 150 150 150 150 150 150 150 
##$DBP07= 0
##$DBPNAM0= <>
##$DBPNAM1= <>
##$DBPNAM2= <>
##$DBPNAM3= <>
##$DBPNAM4= <>
##$DBPNAM5= <>
##$DBPNAM6= <>
##$DBPNAM7= <>
##$DBPOAL= (0..7)
0.5 0.5 0.5 0.5 0.5 0.5 0.5 0.5 
##$DBPOFFS= (0..7)
0 0 0 0 0 0 0 0 
##$DE= 6
##$DECBNUC= <off>
##$DECIM= 32
##$DECNUC= <off>
##$DECSTAT= 4
##$DIGMOD= 1
##$DIGTYP= 9
##$DL= (0..7)
0 120 120 120 120 120 120 120 
##$DP= (0..7)
150 150 150 150 150 150 150 150 
##$DP07= 0
##$DPNAME0= <>
##$DPNAME1= <>
##$DPNAME2= <>
##$DPNAME3= <>
##$DPNAME4= <>
##$DPNAME5= <>
##$DPNAME6= <>
##$DPNAME7= <>
##$DPOAL= (0..7)
0.5 0.5 0.5 0.5 0.5 0.5 0.5 0.5 
##$DPOFFS= (0..7)
0 0 0 0 0 0 0 0 
##$DQDMODE= 0
##$DR= 18
##$DS= 0
$$ [...]
##$SUBNAM2= <"">
##$SUBNAM3= <"">
##$SUBNAM4= <"">
##$SUBNAM5= <"">
##$SUBNAM6= <"">
##$SUBNAM7= <"">
##$SUBNAM8= <"">
##$SUBNAM9= <"">
##$SW= 18.0517328524113
##$SWIBOX= (0..15)
0 0 2 0 0 0 0 0 0 0 0 0 0 0 0 0 
##$SW_h= 3612.71676300578
##$TD= 16384
##$TD0= 1
##$TE= 0
##$TE2= 300
##$TE3= 300
##$TEG= 300
##$TL= (0..7)
0 120 120 120 120 120 120 120 
##$TP= (0..7)
150 150 150 150 150 150 150 150 
##$TP07= 0
##$TPNAME0= <>
##$TPNAME1= <>
##$TPNAME2= <>
##$TPNAME3= <>
##$TPNAME4= <>
##$TPNAME5= <>
##$TPNAME6= <>
##$TPNAME7= <>
##$TPOAL= (0..7)
0.5 0.5 0.5 0.5 0.5 0.5 0.5 0.5 
##$TPOFFS= (0..7)
0 0 0 0 0 0 0 0 
##$TUNHIN= 0
##$TUNHOUT= 0
##$TUNXOUT= 0
##$USERA1= <user>
##$USERA2= <user>
##$USERA3= <user>
##$USERA4= <user>
##$USERA5= <user>
##$V9= 5
##$VALIST= <valist>
##$VCLIST= <CCCCCCCCCCCCCCC>
##$VD= 0
##$VDLIST= <DDDDDDDDDDDDDDD>
##$VPLIST= <PPPPPPPPPPPPPPP>
##$VTLIST= <TTTTTTTTTTTTTTT>
##$WBST= 1024
##$WBSW= 4
##$XGAIN= (0..3)
0 0 0 0 
##$XL= 0
##$YL= 0
##$YMAX_a= 123214
##$YMIN_a= -121468
##$ZGOPTNS= <>
##$ZL1= 120
##$ZL2= 120
##$ZL3= 120
##$ZL4= 120
##$ABSF1= 10
##$ABSF2= 0
##$ABSG= 5
##$ABSL= 3
##$ALPHA= 0
##$AQORDER= 0
##$ASSFAC= 0
##$ASSFACI= 0
##$ASSFACX= 0
##$ASSWID= 0
##$AUNMP= <proc_1d>
##$AZFE= 0.1
##$AZFW= 0.1
##$BCFW= 1
##$BC_mod= 2
##$BYTORDP= 1
##$COROFFS= 0
##$CY= 83.5205535888672
##$DATMOD= 1
##$DC= 2
##$DFILT= <>
##$DTYPP= 0
##$F1P= 10.8118882576601
##$F2P= -7.23987719738617
##$FCOR= 0.5
##$FTSIZE= 0
##$FT_mod= 4
##$GAMMA= 1
##$GB= 0.15
##$INTBC= 1
##$INTSCL= 1
##$ISEN= 128
##$LB= 0.25
##$LEV0= 0
##$LPBIN= 0
##$MAXI= 10000
##$MC2= 0
##$MEAN= 0
##$ME_mod= 0
##$MI= 1.114404
##$NCOEF= 0
##$NC_proc= 0
##$NLEV= 6
##$NOISF1= 3.799351
##$NOISF2= 2.8
##$NSP= 1
##$NTH_PI= 0
##$NZP= 0
##$OFFSET= 14.38212
##$PC= 1
##$PHC0= -5303.748
##$PHC1= 6.821927
##$PH_mod= 1
##$PKNL= yes
##$PPARMOD= 0
##$PSCAL= 0
##$PSIGN= 0
##$REVERSE= no
##$SF= 200.129724274929
##$SI= 16384
##$SIGF1= 3
##$SIGF2= 2
##$SINO= 400
##$SIOLD= 16384
##$SREGLST= <1H.CDCl3>
##$SSB= 0
##$STSI= 0
##$STSR= 0
##$SW_p= 3205.1282051282
##$SYMM= 0
##$S_DEV= 0
##$TDeff= 0
##$TDoff= 0
##$TI= <>
##$TILT= no
##$TM1= 0
##$TM2= 0
##$TOPLEV= 0
##$USERP1= <user>
##$USERP2= <user>
##$USERP3= <user>
##$USERP4= <user>
##$USERP5= <user>
##$WDW= 1
##$XDIM= 8192
##$YMAX_p= 0
##$YMIN_p= 0
$$ End of Bruker specific parameters
$$ ---------------------------------
##NTUPLES= NMR FID
##VAR_NAME=  TIME,          FID/REAL,        FID/IMAG
##SYMBOL=    X,             R,               I
##VAR_TYPE=  INDEPENDENT,   DEPENDENT,       DEPENDENT
##VAR_FORM=  AFFN,          ASDF,            ASDF
##VAR_DIM=   8192,          8192,            8192
##UNITS=     SECONDS,       ARBITRARY UNITS, ARBITRARY UNITS
##FACTOR=    0.0002768,     1,               1
##FIRST=     0,             0,               0
##LAST=      2.2672688,     0,               0
##MIN=       0,             -121468,         0
##MAX=       2.2672688,     123214,          0
$$ Real data points
##PAGE= N=1
##DATA TABLE= (X++(R..R)), XYDATA
$$ [...]
2185f53K077l135o11L469l57r16L055m56m399k93R32j864J733M392k87j801J380
2202B266j431l578J172J944j918K33K766r68j094K396J23k679J62J40k456P00
2218b222L263K89mK052j341l652m3P36j548R69K950m23p92J457m27k014M14K01
2236a35k000L78K087r5L65K318n72k482k30m51k069O00K567L30k1J517m65j809
2254a67n1l75j300M26J629k31L54J797j23j560o8p33j991Q3J588L19P46J891o1
2273B173j591j79r34j376J91J194M5R07J521k42p35k03r60j639oP27J26Q97J824
2292A740K52q29j38j101j435j90N00L24J064J213K95m03k35j030j486j34N3K30
2310a310Q95J636N71k79k20p00j462p29J76K5J029J300N36J03j27r49j445o41
$$ y = [-653, 1424, -1711, -2322, 1147, 790, -126, 2929, 2473, -1926, -2219, -1287, -3151, -1418, 2974, 2687, 886, 2266, 835, -2743, -1571, 373, -1545, -1312, 1454, 486, -608, 1788, 1911, -768, -606, -466, -2922, -2222, 1041, 1330, 1326, 3378, 2037, -1615, -1658, -922, -2470, -1501, 1449, 1026, 234, 1691, 1264, -750, -336, -135, -2135, -1757, 330, 235, 600, 2918, 2346, -136, -366, -817, -2886, -2286, 281, 611, 590, 2107, 1642, -167, -218, -593, -1893, -1467, 162, -69, 285, 2082, 1959, 399, 331, -402, -2393, -2310, -722, -403, 343, 2234, 2173, 582, 403, -531, -1907, -1716, -522, -477, 430, 1951, 1709, 974, 771, -189, -1828, -1834, -1107, -981, -84, 1740, 1992, 1163, 1025, -76, -1511, -1701, -1201, -877, 187, 1400, 1695, 1292, 1057, 27, -1459, -1593, -1540, -1310, -415, 1221, 1792, 1513, 1293, 593, -869, -1598, -1422, -1397, -368, 932, 1468, 1571, 1444, 495, -950, -1591]
2328a591j33R6Q09J604P56L4J13o96j443r31j60JN22J423Q52K26L0n69j245r24
2348a226k56k82N42J373J258R8K39l33j262j189m42j41K28J203J197K81K60N4
2366A602j380j237k89m82M9J373J361K75M35K62j199j515m44m90l04J190J481
2383F88L24O05L29j220j491j50o01n18J166J306L23O64P32j011j420k02j014j007
2401b497J248J458K63J089J002j366j547j47r17j057J349J459o2R06J342j323
2417A200j303K39j068j646J086J213j57J386J841j009j444M4j487j849J295J622
2433c7j99J250J823j501j494N63r91k025J336J009p48J031K503q62r53R05j847
2450b37k709R96J113m40J994K535j269j432N39j969k167J700J373j246J249K368
$$ y = [-1591, -1724, -1628, -819, 785, 1541, 1575, 1688, 992, -451, -1382, -1542, -1541, -1019, 404, 1256, 1482, 1512, 943, -302, -1226, -1482, -1764, -1222, 151, 1409, 1507, 1746, 1413, 151, -1038, -1480, -1621, -1393, -190, 1007, 1288, 1548, 1602, 222, -1015, -1304, -1786, -1737, -364, 997, 1272, 1707, 1969, 770, -745, -1189, -1679, -1983, -793, 688, 1012, 1617, 1946, 726, -765, -915, -1516, -2034, -868, 438, 761, 1425, 2157, 1146, -274, -476, -1490, -2497, -1249, 209, 472, 1561, 2563, 1197, -350, -497, -1414, -2471, -1122, 337, 275, 1181, 2523, 1200, -103, 136, -932, -2578, -1492, -279, -436, 950, 2791, 1782, 338, 382, -1105, -2954, -1659, -37, -236, 1014, 2837, 1336, -158, 405, -586, -2611, -1275, -266, -1014, 17, 2520, 1658, 705, 1610, -237, -2946, -1950, -837, -1277, 717, 3252, 1983, 551, 1090, -879, -3046, -1346, 27, -1219, 30, 2398]
2466B398j476p19J874j504k666P70L11j654K066L450q83o82J195k537l298J392
2482a963J286j105K244K648k043j093J820j468k322J782J94k618J298K861r67
2497E54M80K606k146l680N40j09j823L167L537j282q24J461k457k967K434O49
2513A40k151J508K037k048K60L254j218k685J234j370l426K116L665l32R94K297
2529D275l025l928J280J30j665K875K668k269n65K336j540j649K446p56l883R82
2545b288K322j278J898L981j772l285M81j863k939K988L604j108O32J991l031
2560C33k496K400j52k287J716J286k684Q01L743n10j259J354k360m250J532K339
2576d94n35K454L411k663l057Q40j275k043K682K311k290K64K441j568q43K658
$$ y = [2398, 922, 203, 2077, 573, -2093, -1323, -1012, -2666, -600, 2850, 1967, 1285, 2480, -57, -3355, -1963, -677, -1782, 462, 3110, 1067, -26, 1794, 326, -1996, -214, -20, -2638, -1340, 1521, 554, 1034, 3640, 1494, -2186, -1646, -1755, -3578, -411, 3126, 1844, 1020, 2481, 24, -2943, -509, 140, -2011, -503, 1534, -514, -254, 3000, 1782, -903, 331, -1039, -4465, -2349, 1316, 984, 1978, 4275, 1250, -2678, -1398, -1268, -2933, -58, 2610, 341, -224, 2112, 572, -1077, 1369, 613, -3270, -2288, 34, -1244, 654, 4635, 2863, -422, 59, -1804, -4743, -1755, 1849, 741, 1373, 3364, 333, -2163, 237, 85, -2202, -486, 800, -1884, -1083, 2660, 2150, 891, 2245, -115, -4365, -2833, -494, -1029, 1425, 4836, 2173, -884, -44, -1319, -3362, -680, 1631, -659, -395, 2046, 478, -365, 2293]
2592B293q83l470L04M04j777K484M444q21j663N51k667l400J858K302n83J629
2608A005K264k659j658K245m97k312J292L18k690J030L270l74K77K100k230m049
2624b668J8P16p29K867L453j455j523P71j893k355K099J289j988P18J833j263
2640a10K04L028j053k866P9p37k237J865L473J93J89J203k503l399Q98P43j053
2657b083J874K253j418n48J834j202j463J316p15k789Q49K109JJ280K534j690
2673B142k902j70j095j482K286K641m22K43J118j646j809J083o19j386Q59J298
2689A39r26R74K530q41j422K18j673k337J015K140J96J535J509j479j849J17j012
2706a166j252J430J216q16Q95J774p63q31O06j234k187M69P59k01J804K117n89
$$ y = [2293, 1410, -2060, -1756, -1352, -3129, -645, 3799, 2978, 1315, 1866, -801, -4201, -2343, -41, -624, 1005, 3269, 610, -1048, 1197, 700, -1612, -320, -2, -2692, -1662, 1608, 1234, 1511, 3611, 1381, -2668, -2650, -1934, -2663, 204, 3657, 2202, 679, 1450, -443, -2798, -699, 590, -1398, -680, 1153, -110, 94, 3122, 2069, -797, -718, -1455, -3692, -1827, 1646, 1839, 2028, 3231, 728, -2671, -1773, -1030, -2083, -209, 2044, 626, 78, 1912, 710, -753, 563, -152, -2941, -2092, 17, 18, 1298, 3832, 2142, -760, -930, -2025, -3507, -1221, 1420, 998, 1241, 2359, 713, -1096, -13, -632, -2018, -1159, 139, -787, 187, 2717, 1876, 454, 672, -1001, -3338, -2323, -183, 13, 1548, 3057, 1578, -271, -154, -1166, -2418, -988, 228, -588, 307, 2081, 1318, 487, 1093, -141, -2328, -1859, -1100, -1301, 503, 2620, 2031]
2723B031q75j74k001j604J018R42q5J537J344r25o14N08j320j606N67O4l61J580
2741B6J679j43p9K51j855j965K71K88n3J918J715n91q4m4j503j358K97k0l37J506
2761h1J378m9K41L03j368j571k40m21j80J596J570J80M62Q5j588j450p6m52j51
2780a812J384J307K27L34N18j326j286l00p21m32J341J348L86P08M01j045j471
2797d39o02n20l38J027J157N77O85M16q24j248p37o83m47P23J157O03R65N59p80
2816A251j183n04j059o01O69J162P16Q97O19l80j191q78q71n53L54R26R43R34
2834A251N86l21q03p77j199o48K12P94Q90J060Q27j20q16q39r84q07j70R20R12
2853c2Q26J021J21q76q53r14r25k55O40Q44J006R11L71p38o89q43j142m32P24
$$ y = [2031, 1156, 982, -1019, -2623, -1605, -663, -748, 789, 2133, 1208, 594, 1102, -218, -1824, -1257, -1193, -1554, 26, 1705, 1562, 1483, 1734, -121, -2086, -1815, -1527, -1580, 338, 2053, 1462, 1378, 1334, -169, -1527, -1230, -1250, -1587, -81, 1297, 1248, 1489, 1792, 424, -1147, -1387, -1808, -1988, -392, 1178, 1358, 1820, 1905, 317, -1133, -1209, -1661, -1812, -428, 879, 1106, 1440, 1958, 632, -654, -954, -1675, -2107, -766, 582, 968, 1676, 2077, 1032, -439, -1041, -1561, -1899, -872, 285, 862, 1547, 1963, 1139, -109, -846, -1529, -1976, -1253, -96, 507, 1472, 2031, 1251, 68, -436, -1495, -2096, -1427, -265, 451, 1348, 1967, 1587, 396, -482, -1353, -1906, -1552, -626, 317, 1251, 1837, 1516, 713, -64, -1263, -1911, -1699, -905, -15, 1045, 1872, 1752, 936, 97, -887, -1694, -1864, -944, -32, 794, 1815, 1936, 1060, 207, -707, -1632, -1887, -1247, -403, 603, 1514, 1885, 1147, 458, -385, -1527, -1959, -1235]
2872a235O84P11J380M87p84o23n96j428n89N67O74O63J375P29o00p28n18j341
2890a172p76L93O38O23J267Q82m04m24m40j370j226M80M32L65J551J210l58n50
2908A121m12j561j136M81M17K33J571J035l71k50q9j474j282M69N7q6J687J220
2926A630k99n9K58j840j474L17q8K10J836J226l48pLj646j322M81k05l04J648
2945A7J136l72O24N44j688j371J42o03n93J858J671j03M16L24j835j549K05k32
2963a409l54J724J065o16P67P30j520r98M22j019j140J457J532k23J233J135j897
2980H89j743K4q91p21J868J687n36O94P37j630j050P60q28j273J466O89o65J412
2998H89J686j329j104J66j794j583J601J625J07J416J128j893j410K49r06q17
$$ y = [-1235, -551, 160, 1540, 2027, 1243, 620, 24, -1404, -1993, -1426, -752, -89, 1286, 2015, 1415, 687, 169, -1172, -1948, -1555, -917, -294, 973, 1855, 1451, 1027, 587, -783, -2009, -1529, -1097, -732, 819, 2029, 1671, 1121, 709, -852, -1988, -1507, -1090, -857, 714, 1749, 1378, 1128, 1039, -435, -1717, -1248, -1191, -1277, 410, 1630, 1331, 1272, 1530, -310, -1784, -1467, -1555, -1345, 491, 1717, 1369, 1362, 1365, -281, -1603, -1122, -1327, -1631, 17, 1153, 781, 1405, 1949, 261, -1110, -968, -1571, -2164, -306, 1365, 1262, 1678, 2002, 167, -1382, -1177, -1409, -1763, -39, 1026, 410, 1177, 1907, 387, -611, -189, -1208, -2348, -891, 641, 418, 1651, 2786, 889, -854, -830, -1721, -2442, -574, 1113, 577, 1271, 2008, 378, -672, 88, -740, -2013, -547, 142, -523, 889, 2575, 1246, 142, 308, -1486, -3069, -1468, 157, 264, 1680, 2808, 915, -495, -246, -1152, -1969]
3014a969J677O17q64J172J375j314l17R11j789k064R83P77l06J987K103j172j246
3031E61j16j839j433J724J186l56J451Q84j791m06J349j580j301J159j97j343
3047b048J983K276p54j58P95k431k469J254N12j83K307J579j510r01N43j656r97
3064a858J630N3j235J241J498j039Q50J488j945k167N40q28r26K577K545r36P0
3081A558K91k486j885J433M48o76J714J143j270K18J278j338j128R24j347j587
3097b710J705J645m0J251J256k525k253M65o76m66K533J851j131K05N41j865p29
3114i43J214p99j302J190P70o92J475J787j445j299n1j669j235J985J718p6J227
3131A855Q46k267j421M91q50n40J762N93j017R77J428r87m95N74j725j767J148
$$ y = [-1969, -292, 325, -539, 633, 2008, 694, 377, 1288, -501, -2565, -1582, -805, -1111, 876, 2979, 1807, 561, 445, -1394, -2827, -1103, 83, -273, 1178, 2062, 271, -135, 1214, -366, -1667, -508, -705, -2048, -65, 2211, 1457, 1299, 2094, -337, -2806, -1552, -1040, -1223, 1084, 2663, 1153, 252, 795, -861, -1858, -228, -175, -1410, -169, 1329, 290, 1140, 2628, 683, -1484, -944, -1772, -2698, -121, 2424, 1488, 1558, 1849, -637, -2522, -1089, -641, -1317, 397, 1540, 270, 488, 1766, 428, -700, 224, -1123, -2710, -1005, 640, 600, 1851, 3107, 582, -1671, -1206, -1882, -2348, 185, 2036, 905, 1110, 1651, -214, -943, 271, -528, -1830, -640, 130, -562, 913, 2700, 1255, -44, -95, -1764, -2999, -1014, 704, 628, 1855, 2701, 434, -987, -496, -1346, -1886, -124, 469, -548, 429, 1857, 870, 375, 949, -776, -2543, -1395]
3148a395Q56M1K026J419j459j527j31j470r36J707J015l27J403O08j333m26O32
3165G03j098j118P71m9m79J873J575p42m43L1j976j476P35P57K97J837R53j155
3183I96n41K3j215q25Q30J77l69J272R63m09J84M36j715j549L10q9J42J840J377
3202A838l30k01k21j633j137N91J60lJ364P75l95J10K63j211j008L2k88l69J476
3221a87J371J2L05J07j515j278o0j27J25J238J165k19K13J5j132q32L1n02j39
3240a409R09J069K54N07M48j100j072l94p19k33J283R59N00L37K00j214q15k28
3258g18o10p3Q64Q39K46N96M65q62p57m04q94l75Q17Q35L58R84L39r73p04m03
3278d30q43l12O91Q78M00Q29L44m99p20n68r20l29L11N11O84R19N93m99n30m22
$$ y = [-1395, -539, -498, 1528, 2947, 1488, -39, -170, -1640, -2576, -869, 146, -181, 1222, 1830, 497, 71, 703, -395, -1513, -742, -791, -1270, 603, 2178, 1436, 993, 1024, -952, -2428, -1693, -936, -639, 1198, 2151, 996, 455, 478, -737, -1562, -732, -555, -924, 348, 1311, 902, 1086, 1522, -193, -1742, -1432, -1521, -1379, 461, 1838, 1508, 1307, 1086, -547, -1684, -1093, -933, -936, 428, 1203, 808, 918, 1181, -30, -1038, -1006, -1294, -1663, -187, 1184, 1196, 1501, 1608, 93, -1185, -1245, -1372, -1247, -9, 1156, 937, 1150, 1165, 33, -799, -768, -1270, -1409, -500, 569, 823, 1330, 1778, 678, -394, -788, -1507, -1740, -457, 502, 1002, 1339, 1539, 325, -490, -718, -1328, -1401, -537, 302, 548, 1144, 1609, 747, -10, -414, -1308, -1683, -866, -31, 327, 1311, 1650, 677, -27, -430, -1273, -1585, -894, -16, 384, 1213, 1557, 1058, 338, -230, -1150, -1479, -1168, -657, 27, 946, 1539, 1040, 510, 88]
3298H8j084n77M75N31N08J083M92l19n11o37p00p71K00K79O82J044N49j35l27
3317H70n86r18p41K60L34M50P74Q83j00l00n01q59p06j50O5N84R55P27J98k44
3337I95l51q00r32j22K00L27Q18R70K09k01l45r00p66l86Q4L17P54R72K41L6j65
3358I55o95r73l22%J02N82R62N57l2j57o31j015m36j0N4N62J047M05J09J81o08
3379F37j019n01k91l0N09J142M55K91m0l43j233n94j60l4L55R35P76J48K20l39
3399H84q26q13k06k78J60J067N24L93M83l64j008o41l09m10J96J112O46J91N29
3418A330k03q62p22k03m16j50Q74P40K43O45L6r77n92m31o25o8R39O63M34P88
3438A443Q2j242n61j87p37j51R52M97Q8R68K06q92m88j55r67n02Q58O68K79J152
$$ y = [88, -996, -1573, -1098, -567, -59, 1024, 1516, 1197, 686, 49, -651, -1422, -1222, -943, -261, 783, 1332, 1197, 870, 284, -634, -1375, -1115, -781, -331, 443, 1326, 1226, 926, 425, -434, -1140, -1290, -1225, -641, 314, 1041, 1239, 995, 644, -156, -1088, -1210, -1010, -683, 135, 1105, 1314, 1113, 768, -132, -898, -1284, -1200, -883, -129, 843, 1084, 1120, 955, 260, -713, -1035, -1035, -933, -351, 611, 1168, 1136, 979, 348, -667, -1103, -1113, -1059, -497, 550, 955, 1064, 1245, 637, -382, -883, -1174, -1204, -695, 447, 902, 1193, 1153, 810, -423, -1017, -1177, -1211, -856, 79, 855, 1003, 1223, 884, 58, -755, -961, -1239, -1079, -12, 512, 905, 1388, 1024, 16, -625, -934, -1344, -1148, -36, 610, 801, 1330, 1127, 265, -457, -660, -1076, -1226, -352, 388, 631, 1276, 1312, 335, -257, -688, -1313, -1381, -442, 221, 655, 1443, 1525, 283, -278, -465, -1202, -1353, -401, 96, 184, 1152, 1358, 466, -22, -177, -1144, -1646, -788, -120, 159, 1311]
3458A311L08q04o79k52j342j46J058M29Q1J155L35q79l09M5j220n07O83M06N4
3477b73J283O90q36q9m45j565o03R09L90K56J428N38j029l28M2j285n69J102p8
3496d62j76J253Q34o90J09k0j381q68L07j54L25J848Q32j009J92k07j842n26R39
3515f96Q1M5J339N26r40M27L27j437o33K84o34mJ610Q40l60O10J64k103r54M78
3535a030j82K15J686P01p53K88j6j506l15O83o88l61J263M93k66J098N18j535
3553B93j136R5p76k17J904R03k87O77j12j826o24O66o42l1J359K58o22J062N86
3572A530j270l93J45j187o74J121R40J63J192L19j714o14q2r65j15J741N01l01
3590C37O20K17j192j08M87j117p42J067J89n2J222P55q04o02k21j607l85J292
$$ y = [1311, 1619, 815, 136, -116, -1458, -1604, -546, -117, -36, 1119, 1454, 575, 266, 311, -909, -1416, -733, -327, -273, 1010, 1700, 864, 775, 330, -1235, -1838, -929, -539, -283, 1145, 1683, 654, 326, 368, -917, -1486, -384, -462, -638, 615, 1449, 759, 868, 848, -533, -1401, -1094, -1248, -923, 925, 1757, 748, 940, 733, -1109, -1635, -696, -615, -570, 769, 1295, 355, 782, 1109, -328, -961, -677, -1311, -1315, 295, 1135, 775, 1385, 1549, -554, -1508, -1030, -1212, -997, 689, 1390, 637, 925, 909, -597, -912, -229, -917, -1278, -15, 478, 212, 1310, 1828, 293, -843, -748, -1524, -1741, 163, 1066, 779, 1456, 1344, -482, -1106, -440, -1082, -1113, 246, 504, -118, 944, 1530, 260, -133, 12, -1175, -1849, -728, 212, 375, 1567, 1886, 172, -442, -524, -1489, -1604, 137, 638, 337, 957, 1174, -18, -126, 361, -756, -1498, -431, -242, -294, 928, 1683, 879, 277, 56, -1551, -1936, -644]
3608f44P14R6J242K75j502l88L43j041l18J194r7m10J069Q00p90N4K43j573p68
3627a501N46J74N22J435O05q97n11j15j394m07J066K33mJ033K48r57J25M86j021
3646c34o61L81k03r6J383Q77l68J44l68j516p79P29j9K51J381M41p74J04R6j080
3666d11n53N79j24m11J047Q66n01M17K92j308q57J29m09J34J322R13l07J4o6j140
3686c74o05M45j81j13J005M69l09M15K27q70m88j89m71k53J054P70O1O85J8j275
3706B1o74Rm43NJ101N25j09L89J25q90l54rn68k85O49N88K45P61K09p03p50k53
3728d11p67j03Q45O46J34N74K04q97m60j21n11k29O46L56J79O94L62n58l12k29
3748D2q71m21O42M41L25P40J64l34m72m32o77j99M11L25K65Q93K07l44k66k02
$$ y = [-644, 70, 166, 1408, 1683, 181, -207, 136, -905, -1223, -29, -126, -536, 533, 1333, 543, 597, 840, -733, -1501, -955, -781, -259, 1176, 1781, 884, 373, 258, -1136, -1543, -477, -244, -248, 785, 1033, 76, 201, 687, -334, -995, -614, -817, -913, 470, 1347, 979, 1123, 755, -761, -1540, -811, -830, -579, 802, 1243, 469, 573, 669, -411, -964, -385, -509, -920, 127, 993, 492, 909, 1201, -107, -964, -835, -1244, -1110, 212, 1125, 818, 832, 766, -374, -979, -534, -715, -828, 177, 646, 337, 752, 979, 109, -379, -568, -1039, -1292, -238, 532, 593, 1278, 1296, 21, -653, -644, -1087, -1082, 19, 544, 435, 824, 949, 59, -295, -304, -872, -1157, -508, 80, 325, 1086, 1295, 592, -158, -411, -1178, -1281, -436, 210, 344, 918, 1122, 225, -235, -356, -867, -1096, -450, -94, 85, 779, 1141, 583, 271, 42, -829, -1250, -608, -167, 158, 898, 1062, 728, 256, -176, -853, -1052, -641, -316, -51, 842, 1049, 705, 439, 237]
3768B37r53l27K84L18K10P18N44j70m05l36p54m29J81K40M23Q35L51k68j43k90
3788B66q08l16M7J30L17P76N39j40o5l49p13m70k1N0L15O99N36N5M1n49m96n66
3810g22j54P2K08P98M24K42p1k56o10o71j84m8M66N62N74K76k3l55n91n09k89
3831h61oJ54O90M50K85J34j98n09m95m00k04J99N48O53K91oP2m78p18l05j97O9
3853h32M18O61M05J92J0n32n53m37j58j28N92M52M94J59M5l53o39l71k26j25L89
3874e37O48M21K13J57l77n97l75l41j35K68O08M81L14K51k78o33m64l16k10K00
3894g02N51M28L20L36k33m99l59m35k34J4O04L30M45K93l1n53l98m26m40Q4N71
3915c34M04L52N57j88o03k31m22l57j1M77K91M48M62On91j76l44n78m8L90L45
$$ y = [237, -716, -1043, -759, -441, -231, 487, 1031, 861, 456, 120, -634, -1063, -882, -642, -219, 616, 967, 699, 556, 266, -542, -858, -811, -681, -364, 412, 951, 811, 746, 397, -316, -786, -807, -757, -442, 257, 793, 848, 889, 340, -156, -722, -876, -804, -596, 202, 626, 868, 797, 541, -69, -740, -924, -972, -506, 56, 630, 906, 883, 528, -63, -572, -861, -867, -713, -23, 427, 712, 846, 648, 139, -356, -756, -960, -761, -213, 440, 731, 725, 797, 319, -399, -704, -901, -832, -414, 247, 652, 844, 854, 322, -231, -668, -826, -954, -362, 90, 584, 743, 788, 435, -204, -575, -801, -926, -537, 111, 532, 745, 902, 525, -72, -447, -788, -923, -655, -47, 434, 748, 999, 721, 88, -376, -692, -902, -702, -151, 277, 597, 933, 700, 201, -158, -593, -827, -813, -209, 121, 566, 859, 828, 275, -123, -549, -989, -905, -334, 70, 422, 979, 791, 188, -43, -465, -822, -833, -356, -65, 383, 845, 851, 260, 84, -260, -838, -886, -496, -151]
3936a51L36P25M3n31j17o15n27l7M56K31L49O95l7m31j96k28o16j21L24j24N31
3957d1R07j9l85O9m92q68l5M73p9M92P25M3l13kn06n41r0K97k25K91R81j9j25
3980E38J86l32j025j93J67j03L18J112K28l02N5l00r77m1K25k35L77Q41m5o4L20
4001G50j70r09k09J09m11J18R33L90n6L81l51j043q3L3k93M54R01L2k53M43k57
4022E09q84m8K68o03%R36P5l2P12j75q46k28j39o21K72J203l0J60N46l08j166
4043c99NR2m79J11R21l2k64Q40q9o47Pj96q50K06Q65p7K39Q68q4j085r5r9q32
4066a074K62R51J10j60O62j89o97J82Op09r1O69k48J23J071R4p62N0k31j056K
4087a035Q99R5J67R06k04q85P7M8q23J86N53k75K9R04Q2n91K87k1j061j99N05
$$ y = [-151, 185, 910, 953, 422, 305, -310, -837, -874, -418, -187, 162, 857, 820, 389, 193, -35, -651, -772, -448, -572, -41, 866, 847, 462, 531, 39, -829, -864, -391, -470, 22, 747, 790, 477, 475, -31, -572, -662, -365, -590, -299, 682, 663, 538, 724, 392, -633, -826, -659, -762, -444, 668, 896, 594, 649, 349, -628, -669, -444, -679, -302, 539, 494, 430, 750, 580, -329, -538, -429, -840, -722, 211, 601, 545, 926, 575, -468, -551, -518, -811, -357, 544, 576, 323, 766, 509, -375, -423, -155, -758, -758, 178, 253, 221, 933, 758, -88, -316, -455, -1076, -804, 399, 369, 529, 1075, 767, -399, -394, -302, -781, -670, 251, 219, -45, 795, 706, 59, 66, -130, -980, -774, 91, 14, 253, 1121, 1037, -48, -143, -242, -1074, -812, 139, 249, 89, 751, 562, -135, 47, 53, -656, -747, -78, -326, -203, 868, 962, 200, 250, 19, -1037, -1035, -136, -41, 126, 1032, 828, -57, 20, 68, -755, -569, -16, -291, -262, 642, 724, 133, 420, 399, -662, -861, -356]
4108c56q0K72J121J2p60K2k40q61l8R34l57J58P68m1n41L45J41j022j8L91l86
4129e36Q0J000K07j93J59l30j108j23L76j41L16R81J63o15J35J2r14O2L29l45
4149d85J6Q06J92k69N10j72r77k13L2k65L32R21K68k10J90k57q97k1K81l30R0
4170d58P97j15l2M54K5q96L0j1m99M9P69L21l0M48k01q46k66Q8k82K46N48K24
4192C63j76L34J20q43n7J65n28n2O63J14J40N41J18p94k90j69m10k7P43K74J16
4213C45M14k13n84p7o7l80NL55K31M3M17K33m90j00k19n25j69N36L09O0L84K37
4235G45m96k18j19n16j20M38K18K07L35Q3j76l01j4n35j80L06K01J29M97J59k55
4256C88k20k65m05j99L59J20K57M99R0k27k41m3m99k20K25Q6K62M11J72j75n7
$$ y = [-356, -436, -164, 957, 969, 209, 231, -9, -870, -908, 26, -331, -173, 595, 554, 13, 358, 499, -523, -541, -150, -536, -456, 544, 751, 558, 717, 387, -721, -844, -468, -609, -293, 688, 851, 236, 371, 383, -531, -469, -140, -485, -469, 337, 529, 260, 770, 598, -379, -592, -560, -825, -493, 428, 696, 486, 676, 419, -478, -499, -218, -548, -458, 339, 224, 192, 646, 671, -225, -195, -206, -705, -656, 113, 434, 404, 852, 651, -195, -461, -373, -655, -409, 139, 363, 187, 521, 641, -202, -259, -94, -622, -674, -11, 103, 243, 784, 902, 108, -182, -351, -761, -788, -45, 229, 345, 759, 546, -38, -115, -182, -562, -557, -202, 29, 72, 489, 722, 232, 132, -87, -612, -781, -245, 64, 124, 508, 745, 249, 31, -88, -604, -724, -286, -68, 139, 474, 557, 381, 80, 66, -469, -649, -343, -142, -13, 484, 643, 388, 168, -97, -502, -701, -342, -222, 35, 534, 624, 397, 156, 113, -386, -606, -381, -295, -33, 378, 550, 375, 318]
4277C18j52m35k58Q6j9L65M33K59p3k25j09n35k09J79l0J54M33K25J5k4j53m10
4299a65l94J65l8J10M15L65n7K7k00m23k33j05J30J34M05L03M1j33j48k44l32
4320c77j22J62K8K94L45J46O1j29m92o8k74p9Q2M12L41K2Q2L4m59k65k04m0J20
4343c80L13L61OK17o5l39l65q0j14K5K39M03k1M35k41k93j52k61k86K43L21J29
4365I5K48K37o4k23l89l32q3j0K28L93J00K80M4k40l03k84p2q5K55K12J99K09
4387D15K7j73k91j99k11j33K19L37J97J36L27l42k91r7j41l02J40K09K51K31J93
4408E02k03j49k56j98j50P1K27J34L42K09j81k13k21j64k74J47P4K51L84L47l31
4429C48j61r4l27l14J00K33L6L76M20k55j78J4m46k50N8J47J22L39L78j60k57
$$ y = [318, 166, -269, -527, -441, -460, -95, 338, 597, 524, 299, 190, -345, -554, -375, -405, -251, 182, 407, 422, 398, 245, -165, -559, -394, -432, -322, 93, 458, 401, 428, 228, -195, -428, -533, -403, -269, 136, 439, 480, 347, 199, -45, -377, -499, -337, -309, -15, 330, 476, 537, 408, -84, -152, -426, -505, -423, -11, 330, 352, 434, 468, 9, -256, -460, -500, -380, -67, 294, 300, 517, 452, 113, -252, -332, -446, -421, -182, 221, 200, 635, 394, 101, -51, -312, -598, -355, -34, 95, 343, 580, 516, 293, -96, -428, -511, -521, -293, 100, 200, 480, 524, 284, -19, -303, -375, -460, -205, 7, 206, 415, 442, 269, -22, -221, -432, -565, -346, -9, 188, 324, 651, 309, 18, -79, -220, -522, -382, -173, 78, 309, 502, 299, 150, -106, -304, -454, -383, -156, -22, 320, 529, 348, 135, -86, -250, -524, -377, -303, -52, 332, 679, 348, 187, 93, -234, -548, -448, -215, -179, 197, 617, 362, 184, 198, -248, -498, -440, -293, -171, 168, 546, 386, 129]
4450A29P1l97j51j06J93Q4K91K84j03P7k15j90l03j19K49p4L56N34k78P9r4l70
4472e3m79J78Q8jL30L19q2J2ol14j81k7j98m9L70M95o9p9L12m43n19P0k9j83N21
4497a7M49o4r5K02l27m57O9L6k99L23M82k53L09K00l97l25jj68l35N75M50j68
4519A89R3K31l17n27P3J5l24M05L46j99L29J48k40m83J13j08l92M33K27N4K30
4540B96L31l04l99j48j30k60K89M55J8J38K77l20l96J87k06k92K73J68j29L20
4560A68M20j10l95n9k60l64K59M00j16M14L19l42m77R1j77l56M66R3j82J98L81
4581C71k35M7J4l72l23R8J33L1L81N42k46l52J9k59m04K27L47j7J11M91k65k79
4603F0Q0j94m79K21J93k66L26N59j97m5J01n03m77K41J67l4L82M28k74j94J54
$$ y = [129, 200, -197, -348, -454, -261, -177, 114, 398, 295, 372, 157, -33, -336, -455, -206, -280, 76, 610, 332, 411, 317, -53, -532, -354, -266, -267, 63, 382, 300, 312, 306, -8, -189, -216, -414, -463, -93, 402, 333, 254, 566, 123, -396, -326, -355, -538, -17, 432, 368, 273, 475, 148, -309, -240, -204, -503, -180, 302, 49, 358, 558, 161, -164, -165, -333, -668, -93, 357, 189, 282, 513, 196, -331, -258, -243, -567, -162, 184, -15, 314, 462, 222, -261, -148, -256, -648, -215, 12, 66, 296, 627, 323, -76, -224, -354, -614, -325, 130, 148, 286, 563, 243, -153, 34, -172, -464, -191, -23, -152, 168, 588, 478, 83, 24, -236, -600, -341, 59, -57, 357, 676, 334, -143, -52, -229, -585, -119, -26, -208, -10, 371, 136, 183, 197, -175, -498, -400, -267, -236, 145, 687, 441, 89, 108, -151, -555, -328, 19, 2, 113, 604, 339, 60, 140, -54, -533, -312, -119, -385, -59, 500, 303, 258, 359, -144, -621, -380, -213, -247, 135, 563, 289, 95, 249]
4624B49l47k11J4K96l35K66L99j16L2J90k12p14J61K6j89M26M57n9p9J23k95m63
4646c81J02J06k02L32L71j11j13K57p7o64K99q6l71K92M69J16j32K33k84n55J39
4667b60l5j95L12M22Jn8J46k52l37J18q1j38P8L25j2P9L83k99l39p6q5k92K33
4690c62N15P0J1K36k42m25J30j04k62K56K40R1l2K79j28l39O7k14k91L7N10M6
4712H9P7L16j52l34j63p1j62J28J69M3K73K37r1l86L3p2l91J76K14O3R2K66M4
4735C98l01j21j43j36p0L13j2J85K83J0k48r2k17l84K70J71R6nM63j97j10k8k58
4758a33k40J0K30j28L48L03Kl05J0n7m24K8P8Q8J87L03Q1j28r7j23l72l2K03L
4782a65J21K10J57n1m9k21l54l3J05J24k3M55P1j38Lk12k12k0o7R5J09K37K44
$$ y = [249, -98, -309, -295, 1, -334, -68, 331, 215, 247, 437, 225, -489, -328, -302, -491, -65, 392, 333, 254, 377, 82, -381, -279, -173, -375, -43, 328, 217, 104, 361, 284, -380, -81, -167, -538, -246, 223, 339, 207, 440, 156, -399, -260, -295, -490, -178, 244, 245, 187, 333, 81, -256, -138, -219, -357, -279, 46, 34, 113, 496, 197, -142, -218, -303, -595, -362, 153, 223, 234, 470, 228, -197, -67, -171, -433, -177, 63, 154, 122, 401, 273, -66, 1, -213, -504, -467, 43, 89, 166, 482, 330, -4, -167, -238, -400, -272, -103, -60, 213, 450, 359, -27, 6, -66, -457, -281, -67, -4, 88, 354, 398, 97, -24, -167, -303, -373, -60, -72, 113, 396, 406, 158, 66, -151, -535, -265, -94, 2, -3, 460, 263, 153, 125, -133, -373, -363, -133, -261, 87, 390, 392, 87, 97, 40, -384, -356, -278, -190, -3, 300, 381, 253, 156, 33, -339, -371, -168, -165, -44, 166, 323, 272, 223, 2, -352, -385, -280, -156, -179, 276, 347, 209, 212, 0, -212, -232, -299, -204, -95, 142, 386]
4805C86L4j61k00l27L9j13J07J13J99J47Q4k1j27l22n8j00L0J54J26L02q5J34
4827C41j70k99j35N0k42K82K50J41m6L4j17j88r1j91J40nK51J64J04J35k02k44
4849c8k13j38l2R8K47K99J23j1m9j39k40j70n5O1L01R6J77MJk53j51j95L8o5K43
4874f1J36L9K03r5J0k93k14k8O5P0K19J43J16q3m4j90k12r2pR5K70J56J61K8l73
4899A9K9k94n3J7O7J99J71J02J1Jk67j06k49J1R2J13J64K55R1k69j9j64j49k2
4923b50JJ13K15P4J75k02L0k00l15R3J10O6J71R9J81j79n9q3j86j57k4J22J39
4946f6K96Q0p5o5j70j79o5l0R4J69R8K79j21k2k28j98j12J19m6J18K41J92q1N4
4970B82r9l08j24q0J18J13J66K04q8O3j44k26j18J03p3N6K72J99Rk4j24k86l8
$$ y = [386, 420, 259, 59, -268, -229, -342, -235, -122, 77, 224, 308, 287, 160, -162, -220, -320, -290, -136, -10, 292, 207, 341, 171, -128, -263, -213, -455, -173, 77, 218, 172, 206, 89, -99, -190, -381, -241, -246, 5, 169, 273, 408, 206, -38, -251, -389, -421, -323, -76, 223, 346, 335, 286, 147, -93, -263, -318, -257, 44, 140, 317, 321, 322, 69, -82, -277, -239, -304, -61, 75, 114, 317, 222, 232, -61, -275, -303, -238, -168, 51, 194, 310, 227, 183, -7, -219, -311, -318, -223, 47, 203, 364, 392, 19, 48, -246, -299, -282, -215, -16, 155, 257, 268, 269, 2, -104, -353, -342, -250, -137, 27, 282, 373, 104, 85, -79, -228, -250, -249, -136, 79, 153, 328, 126, 156, -44, -359, -266, -156, -90, 81, 180, 361, 182, 123, 40, -146, -303, -327, -205, -66, 230, 310, 235, 170, 0, -179, -244, -274, -180, -11, 87, 366, 245, 223, -5, -203, -315, -196, -242, -124, 117, 309, 228, 282, 183, -125, -249, -329, -211, -98, 68, 272, 184, 247, 103, -123, -241, -138, -211, -155, 117, 316, 325, 301, 177, -109, -147]
4993a47j17K6m7L65J41r5J06Q2l39k00L4j11N2K56J04O8J21n4k16k55P9j09j04
5016c60L14J09J77M1o3k62j2j04k31K8L19J13Q6K12p3k33j89J5q7j9J11J71r0
5039b7K75R1j99k56L3k16k3J94K53p1K90n6k64r1l6j70n6J89J59J8K40J63k77
5062A63k42R0k50j45K52K4m5L30J64j13k83J7j59k21K57J92j21L15J07j98J1n8
5084H7l21l8J28J15j56M25j2p8L3j35k09j66J16L6Q4J85J56j23R8r7k82j62J60
5107a56P9L2J85J31k83Q9Q5k84j57J09j21J61J48K48m7j08J27l15k68R3J48j23
5129b27L96Q9j54Q3O3k91l01K12m2j7J88J88J8pM0j68m71K37n0r2M28K93k02J9
5153B32o9j70k31M1MrK48J31M2j19J27j05l09J6O6k20K72K98j58R2J35k56j69
$$ y = [-147, -264, -238, -285, 80, 221, 126, 232, 314, -25, -225, -191, -302, -250, 6, 110, 178, 299, 245, 29, -226, -147, -256, -360, -46, 63, 240, 281, 218, -44, -56, -160, -391, -363, -44, 69, 155, 367, 294, 61, -128, -113, -200, -219, -108, 63, -27, 248, 339, 140, -116, -83, -299, -322, -128, 125, 54, 344, 288, 24, -67, -103, -273, -329, -140, 19, 37, 277, 440, 163, -79, 11, -239, -384, -132, -108, -153, 177, 341, 228, -55, -38, -197, -418, -161, 31, -90, 225, 332, 134, 145, 87, -234, -272, -144, -29, -185, 240, 228, 150, 183, 48, -161, -327, -211, -175, -91, 94, 250, 127, 225, 128, -154, -316, -156, -77, -45, 140, 271, -12, 77, 162, -122, -279, -170, -291, -130, 18, 266, 219, 111, 238, -77, -345, -252, -104, -227, 169, 258, 104, 187, 250, -41, -342, -130, -172, -189, -1, 187, 205, 198, 238, 70, -401, -164, -214, -306, 122, 415, 213, 232, 163, -7, -238, -197, -193, -202, 46, 177, 219, 100, 227, 122, -187, -171, -105, -325, -53, 245, 87, 179, 314, 58, -111]
5176a11L9r6j04K17K29n0P3J71k42j93L6j09j16J84R4l7K98o9j35j24L1j90o2
5199b66J62K33k0J29J31k93q8L4j26j36K8L00n2J41J28j43k43k9o9j23P4M5J53
5222c0K39N9o2k25r8n3q0O0J29R2M8J05M1l6j00k18j39Q5O6J01J29J14J08k53
5246H2m7k08j97J21K86j7R8K7K7l0o3j02l18J18J55j07J83J97N2j17Q7k81j59
5269b13J4Q3j0K80R2k1no2j69j85Mj5J47J59M9O9Q7k14j83m1r6J16q2J90J12J0
5295A16l7N0j58n8j45J43J15q2J67R9q1%Kk02Lr4M8k3K65o7Q3N8j05q6q9n9oL0
5323a13K02m2lJ53K1j93k04J8J6L5J26MJ21L8o2j82j61Mn3J17K56r6J09J03K4
5348B38k77r1n0m8J13R0J21J68j08L2j25j65j29N1J26pJ86K1j29P5p5p4O2j78
$$ y = [-111, -72, -168, -272, -55, 174, 124, 197, 368, 126, -67, -31, -140, -256, -72, 22, -15, 283, 214, 79, -45, -14, -204, -266, -104, 129, 109, 238, 369, 76, -12, 22, -104, -240, -212, 88, 36, 177, 305, 162, -81, -110, -179, -302, -228, -183, -30, 209, 268, 206, -19, -117, -170, -250, -190, -61, 31, 79, 184, 225, 189, 89, -129, -268, -183, -117, -16, 113, 227, 335, 82, 35, -173, -370, -249, 37, 20, 118, 145, 172, 142, 79, -23, -341, -223, -68, -175, 8, 205, 257, 140, 227, -54, -213, -199, -116, -126, 154, 246, 225, 220, 158, -11, -196, -192, -207, -60, 99, 148, 217, 304, 90, -93, -134, -230, -114, -196, -6, 106, 116, 79, 129, -29, -87, -232, -89, 26, -56, 111, 210, 129, 129, 131, -71, -68, -162, -114, -137, 128, 61, 144, 202, 97, 11, -78, -137, -143, -113, 89, 47, 44, 197, 218, 25, -179, -161, -145, -110, 16, 20, 141, 179, 117, -65, -226, -222, -275, -158, 98, 2, 111, 214, 238, -39, -130, -180, -228, -115, -25, 96, 264, 156, 188, 63, -102, -231, -180, -54, -61, 125, 146, 17, 92, 17, -57, 5, -173]
5372a73J4J48R0J32j2p2j4j59%j50J19k6J16J35Nk6r4j01K4j32O9Jl7K26J03M4
5398B30j09p0r5o1J7j24K05k5K25K1j08n3j21k0N2j47K59j19J54J4J06j72j44
5421h5j6j59P7J56j4J09J22j11M1j37j19m8M4Q2o8K77k3k4O9j54l3m6m7Q1N6Q2
5447A12R2j12m0j40M8L7j65J13L0O5O7j4J40j42j43j48K36k54J13J56R5j69J45
5470A22p1o7j79J45O9j60J88rJ26N2j91p2l5j6L5p7J73Q8J7j16L0j08p0O4q6%
5496a48J39j7J85Oj4j12j26R3k03jJ73Q2J38r6Q0j66j17K54k48P4m4J05K4K8J2
5521A01j04p7Q3r9k6M9K8J05L0Q3p7q6j23O5n9j4R6L7K04j00n5j01O9l0j60J15
5547d6lQ0J32K3q1j66J18k32k4J33J40l9K00j29j59R4j13L5p2J46n6OJ41K6q6
$$ y = [-173, -159, -11, 79, 211, 199, 127, 113, -46, -46, -196, -77, -103, 13, 148, 153, 127, 33, -68, -44, -176, -107, -106, -143, 83, 186, 230, 121, 51, -44, -105, -88, -212, -7, -32, 193, 214, 106, 53, -68, -88, -36, -183, 76, -43, 111, 125, 231, 59, -85, -101, -260, -183, -27, -41, 68, 190, 79, 120, -17, -136, -184, -140, -58, -126, 151, 128, 104, 173, 19, -14, -60, -107, -26, 30, 112, 204, 92, 52, -88, -40, -3, -168, -55, -25, 40, 107, 93, 233, 91, -52, -200, 36, -218, -105, 51, 146, -23, 122, 51, -16, -195, -50, 19, -141, 47, 38, 164, 216, 25, -47, -82, -98, -63, -140, 33, 121, 138, 22, 52, -56, -126, -62, -148, -148, -9, -26, 159, 165, 151, 39, -87, 6, -197, -198, -25, 57, 195, 99, 179, 13, -104, 150, -98, -24, -68, 37, 61, 89, 101, -3, -80, 3, -96, -122, -73, -45, 60, 90, 173, 96, 10, -113, -48, -107, -121, -25, 12, 216, 116, 61, -40, 29, -1, -161, -46, -49, 31, 163, 186, 105, -61, 57, -175, -199, -66, 74, 35, 235, 106, -53, 41, -72, -37, -109, 37, -19, -13, 128, 154, 68]
5572F8j54J45j52K4L2p8Q2K1J31j05J53k42l4O9N0j4N5O4J8q3Q1p5j0j81o2K29
5598C2j65P1J97j02P0K3j81q8J23m7qJ20O0OPk0j74l6J47qj00J40%J2o7J04k59
5625a43J9J17n2q6J75Q9J1j18J27m9r1J0Mp6J72j10nJ03r4PK0j38J29j73Q0J55
5651H3N1o4P9j14j68O1K4j04L2J12J17j4l9N7n9Q1j51n6J4J29k03K43J0j35J2
5676bok17P1J26o2O9R5m2j4l3L1n5N2p2j8J9J30P3j44r3J1J85k15L6J56j35k2
5703g6J37n4Q8j58R4r4K4R4j02L7R6n9l3Q1o6j41J36n0q8J39N5j5Q2p2j14L2q1
5730a08J31l6KL8K8l0l4O8o8n5j3N6N2Q6rj20Q6j08o2JP4k6n0J8P4N3j30J35n3
5759@n7n0J12r2nJ36q1J10L1r0j37K00k16MJ45O9K1q5J16q7oJ2j72J02K7Q5L4
$$ y = [68, -86, 59, -93, -69, -37, -115, -33, -12, 119, 14, 167, -75, -109, -40, 10, -4, 51, 115, 133, 50, 131, 56, 46, -135, -197, 32, -133, -62, 135, 33, 103, 126, -55, -143, -20, -67, -75, 45, 105, 111, 118, 98, -76, -112, 35, 27, -73, 67, 67, 79, 12, 116, -143, -124, -7, -59, -145, 30, 119, 130, 12, 139, 90, -1, 9, 13, -63, 109, -1, -6, 97, 3, 10, 30, -108, 21, -152, -72, 83, 134, 70, 149, 35, -133, -72, -48, -152, -120, -8, 109, 95, 56, 113, 54, 135, -16, -72, -58, 71, -132, 111, 121, -14, -2, -8, -225, -154, -28, -90, -21, 74, 32, 18, -15, 16, -39, 13, -59, -77, -58, 72, 145, 1, -92, -81, 104, -111, -75, 81, -54, -76, 61, 7, 95, -63, 31, -63, -39, 55, -47, -10, 86, 27, -6, 75, 9, -132, 4, -46, -134, 5, 60, 45, 127, 55, -59, -27, -108, 23, -13, -11, 27, 55, 25, -9, 59, -9, -64, -77, -21, 31, 117, 108, -12, 74, -34, -96, -95, -21, -47, -97, -79, -5, 48, -82, 53, 0, -57, -107, 5, -87, -92, 44, -37, 73, 104, 14, -123, 77, -139, -135, 10, 79, 100, 15, 131, 44, 38, 50, -122, -20, 7, 92, 126]
5786A26p8j6k6l3m3k9N4J8K8L1J67j62m8L4L1j2j3r3N3nOJ13j32K07j58L7K4j32
5814e1L8q4Q9J47J6j23j22J76j20M1k4K9j10J14N0l8L0k7j76M3O0rP1J1J29j14
5840D6p7R2j51j9P6K5N3m0L6O2j78Q8j09K1L6LQ3Q0j25R9n2r4J08j24L1k0N4o0
5868e6J47k3m8l9l1Q1p9K1M6j08J14o6J08j31k1N7j3q3L6J66k35J85m2J05K0j60
5894d9q9k1K13M7r2PJq9n3J76j21J12p7n1o6J54K8k2P7j23Mo3J5Q5l2J0O8M0r1
5923bk1R0j85k6J05L7RJ17p8k1m4J09j22pl6J19N5n4j8P7j22N7rj16M0p9J56p
5951B4N4o3M0pj10j47J61m0Q9P2m8N3J6N9j29j11rM4N1Q5j3j7O8j73P3L0j69m
5979a21J7P9J15o9Q1j42M0j0l3j8N8J09j81R2J85j87K8j34M6Pn4M7L7M0O0J1j55
$$ y = [126, 48, 32, 6, -27, -70, -99, -45, -27, 1, 32, 199, 37, -11, 23, 54, 42, 29, -64, -11, -16, -10, 103, -29, 178, 20, 57, 81, -51, -13, -97, -8, 139, 155, 32, -90, 86, -34, 7, -17, 12, -98, 16, 66, 28, 58, 31, -145, -102, -42, -51, 20, 31, 160, 46, -31, 61, -90, -109, -33, -8, 45, 5, 41, 103, -75, 13, -96, -75, -39, -36, 47, 127, 2, 101, 49, -45, 63, -61, -30, -50, 4, -56, 91, 68, 20, -19, -50, 31, -48, -27, 19, -89, 25, -41, 67, -64, -85, -28, -41, -124, -88, 78, -157, 28, -14, 91, 111, -49, -138, -159, 54, 101, 9, 16, 17, -72, -125, 51, -70, 42, -35, -86, -152, 2, 30, 8, 85, -38, -34, -97, -82, 3, -29, -19, 49, 89, -2, -23, 67, -118, -144, -39, -2, 7, 124, 46, 25, -19, 90, -32, -39, -75, 44, 99, 45, 27, 104, -18, 39, 30, -86, -46, -125, 31, 24, 78, 15, 55, 48, -62, -209, -48, -88, 1, 73, 25, 78, 94, 153, 24, -87, -96, -52, -1, 84, 71, 54, 122, -51, 22, 52, -117, -121, -104, -25, 90, 21, 102, -40, 0, -10, -43, -61, -3, 106, -75, 17, 202, 15, 43, -91, -45, -38, -92, -45, -8, 32, 92, 103, -52]
6006e2jp6RM8N6qJ0M1L8n3Po6j08J36Q2qK8N8j32j4J07j13q1R2l0k7J30L4j24
6035a7RL5j23pJ5J52j92R9J78J1j06J7j31Nm3Mk6K35L5j39j14L9m8N8P9n6j10
6062a41P2K17j35j5P7j08j35J03ln1j1L44r5J3j12p7o1Q6J4j00j0K39k4j04Q1
6087F4l5lk4o7J5L9R0k9N4o7M8k23M8J0q9M1Q9N7l9J4Q4q1j6n9MJ10mp9O3J45
6117A60r3m2J5j45j04J9K41k1J33l2j2n2l1m7p5Q9J05j26l5R1m8J2L4j44O6j32
6143a74K14j78K03O1Kk18Q1n5q2RJ41R6k5L1J7j02M7Jj71k5J16O8RnQ1j07L5p4
6171dj11j18J80J27o2J25Oj8j56R9j42Rn7J44m1J77N7j39o2l0k7l7N4r1P3N7K74
6198B87k22kj27o9k6k2J53N7j9J06qq8n4j09K1N3r4M7K85o5K3q5q6r9J3L1J57
$$ y = [-52, -53, -129, -120, -72, -16, -24, -14, 27, 65, 12, 19, -47, -155, -19, 63, 55, 83, 141, 9, -5, 102, -11, -92, 0, -30, -57, 73, 107, -17, -8, 27, -96, -103, -88, 64, -128, -29, 149, 160, 54, 71, -60, -55, -98, -94, -120, 115, 150, 11, -103, -64, -112, -54, 25, -31, -141, -69, 148, 13, -2, 75, -33, -168, -65, -68, -119, -130, 214, 119, 132, 20, -57, -118, -32, -18, -118, -128, 111, 87, -17, 64, 29, 26, 2, -65, -50, -11, 79, 50, 104, 37, 85, -138, -90, -80, -169, -128, -39, 18, -21, -7, 77, -4, -20, -79, -75, 35, 31, -48, 15, 160, 67, 25, 40, -105, -209, -190, 51, 30, 163, 131, 119, 67, 36, -11, -86, 3, 108, -18, -53, 38, -10, 2, 36, -108, -42, -174, 40, -138, 65, 126, 128, -90, -9, -64, -146, -137, 4, 100, 75, 106, 123, 21, 68, 69, -102, -127, -11, 57, 66, 61, 142, 35, 70, -4, -115, -233, -53, 74, 12, 137, 143, 125, -31, 68, -74, -65, -122, 22, -19, 158, 215, 76, 14, -16, -43, -80, -26, -117, -44, 13, 287, 65, 63, -64, -133, -159, -181, -28, 29, 10, 116, 108, 20, -34, -143, -122, -69, -163, -116, 169, 104, 127, 42, -44, -143, -130, -99, 58]
6225E8r1K9N2R7N1j58n6o4J10l9o0J61r0J01r7J49k29q4N9k2L0L5J89M7pq4r6
6252ir3K6o5O3J01J13N5p2R8j49j63mp0K2J58O1M0M1m3o4j32k4QN2l8Q0J04J38
6280B34q1j50j11rl3jP1J70L9P6j8j37k4n2j45N6R8J14j09J68Oj73L3n8j56Q9
6306a03j47L11k2J05o0o7O2r0pq5K5Q5JJ87j20N4n4n6r9j62J43O4J25Q8j01N7
6332A34j22m0m4q2J0PK07Q3J5m8m8j26q9j08L0J83OJ71kO6p6l5j42j74K65k5r5
6359g9R7J66l2m6j00r8r9O0J15mN4J14J08j10r4m0j00m2l9R1J74M3o1J9j2r4q7
6386i6r9j9J79J5M1J93j04j1l8j51p8oN3Q8J20J8P1k0k09p6Lj4J20k5J09R2M7
6413B03k1r5k03p5J15r9J13P7M4R8r8J1j8j36j29N4P5J67LJ10K5l3k71J4j01L4
$$ y = [58, -33, -4, 48, 145, 196, 38, -18, -82, 28, -11, -71, 90, 0, 101, 4, 153, -76, -160, -101, -123, -93, -58, 131, 178, 171, 87, -9, -102, -76, -141, -78, 23, 136, 191, 119, 217, 68, -95, -99, -169, -147, 11, 72, 112, 153, 110, 46, -86, -110, -102, -50, -88, -8, 96, 234, 153, 3, -108, -117, -150, -151, -80, 90, 129, 205, 187, 50, 26, -26, -171, -115, -17, 97, -12, 156, 162, -11, 22, -36, -192, -103, -250, 61, 39, 144, 84, 17, 79, -11, -18, -103, -78, 7, 8, 195, 75, 129, 75, 19, -80, -242, -99, -35, 90, 178, 77, 134, 12, -28, -72, -154, -144, -137, 70, 153, 168, 120, 72, -54, -143, -251, -221, -38, -32, 139, 137, 203, 127, 92, -50, -224, 41, 16, -79, 18, 184, 152, 106, 6, -92, -191, -131, -16, -20, 34, 148, 256, 146, 52, 12, -88, -130, -169, -78, 96, 139, 78, 97, 85, -9, -96, -195, -214, -35, -20, 21, 214, 110, 99, 61, -90, -168, -174, -121, -33, 87, 105, 176, 156, -53, -129, -126, -140, -20, -45, 64, 156, 203, 182, 87, -116, -191, -76, -175, -62, 15, 59, 157, 59, 70, 52, -84, -213, -159, -84, 83, 86, 196, 221, 188, -83, -69, -170, -136]
6439a36N6P7J30P9q5po9r7r5Q7J1M8l8J30K47j20k37J1j51R0n7J05J09j9J69n8
6465A80p9r1j09q3k9J18J60P8O9j64l4m1l6j63J56r6J62J60M0Lj48J37k44j74
6489b28m2J59Q2R1M8J40r6j10j95j0Q6n3N3J39J22l4Kj90j1j47M9Q8O5j06K80
6514A82j00mr0k2j26J21j40J03J19N1J8Q4r1r5k30J31j17J54J09L9P6J03o7k00
6538Hj12q6j2J39L8J39J38m0j83n4o4J4j8l7lJ77PJ25J1m7j20m5j47J6J38nP6
6565E3J28k5j07p0n6j11Q7qJ88m1K21o5m4j25k5k24O6K3J91J24k7J10j26j28q1
6590g2j4l6J13NJ84k3M4m3m9j63j70QK15N6k9J07J15n5k14k05pQ0L6J31m8J03
6616F9J97o4j37j2j88j06j7K41K0J32O6K7o0k37o3j9l8J18J12K6J66o1q9j07j20
$$ y = [-136, -80, -3, 127, 206, 121, 114, 45, -52, -147, -60, -49, -1, -39, 91, 338, 218, -19, -8, -159, -69, -126, -21, 88, 69, 238, 180, 101, 10, -99, -182, -211, -93, 67, 145, 214, 50, 16, -25, -61, -224, -68, -164, -2, 158, 198, 201, 53, 190, -54, -228, -270, -111, -29, 62, 110, 250, 154, 44, -151, -161, -75, -128, -75, 64, 186, 152, 154, -36, -47, -194, -145, -57, 8, -98, 182, 82, 78, -12, -34, -160, -39, -179, -76, 43, 94, 112, 196, 105, 10, -220, -89, -206, -52, 57, 96, 172, 275, 208, 8, -104, -190, -202, -63, -25, 114, 252, 212, 29, -25, -89, -75, -93, -130, -133, 44, 51, 176, 187, 140, 20, -25, -172, -156, -18, -23, 53, 181, 156, 49, -21, -77, -188, -101, -109, 79, 38, 259, 194, 150, 25, 0, -224, -158, -135, 56, 180, 153, 263, 137, 9, -72, -86, -122, -9, -4, 180, 157, 201, 158, 109, -54, -224, -216, -1, 55, 26, 133, 248, 193, -21, -226, -233, -153, -117, 14, -34, 69, 266, 202, 65, 53, -135, -241, -258, -17, 3, 135, 201, 228, 168, -69, -132, -151, -189, -71, 41, 67, 233, 172, 83, -24, -144]
6641a44r8R3l3R9J20J80K5j61K4k44m4j03J71K4J39J15j0j43J56j98p1q4O4K6
6665i7J55J59j12J9q4Kj71p1P0NJ13J47K0j2j13J9j54j3j35J79rK04O3m9K0j26
6691B9j57j18J44r8J09K36n2M2j3n3j23m6lK1j9J92J38j85J45N8k81q1M3k8LK06
6717A09O6l3J14j32j37j04N6r1J1J08J02R8J44k00j19l8j04n5L1K66L9o7K40j38
6741A66p1j21j34r0J23n8J66J10lK71l22q8l8q4J07rJ42O6R9R8j76j55j42N0m2
6766a35Q9R4M4J92M8j61n2k31j04J24o1J38P7K05r4%q5k61ro1J23N8J15R7J61
6791C11j24j75K3j24j31L8P8J15l9J79L4j30r2q7n5m5J81L1J09J12M1j14p8j80
6815a22O5m2k7Q8O6K14j7j43j34k5j43R1l1J14J92o2J62m1j15j29r9J1P0q3K27
$$ y = [-144, -242, -149, -182, -83, 37, 217, 242, 81, 105, -139, -183, -286, -115, -91, 48, 163, 153, 10, 166, -32, -103, -187, -123, -97, 58, 217, 105, 124, 40, 42, -129, -200, -130, -125, -12, 135, 155, 143, 30, 49, -105, -118, -253, -74, -83, 121, 184, 135, 155, 29, -128, -246, -102, -200, -91, 145, 93, 135, 122, 69, -54, -100, -103, -82, -101, 91, 229, 44, 189, 247, -34, -115, -72, -100, -97, 109, 175, 142, 256, 124, -13, -117, -61, -152, -141, -33, 69, 167, 311, 111, -8, -46, -150, -205, -174, 92, 131, 64, 304, 166, 95, -26, -160, -250, -127, -185, -19, 91, 88, 359, 37, -51, -89, -173, -66, -75, 67, 133, 232, 330, 154, -1, -143, -93, -135, -46, 48, 92, 284, 332, 171, 119, -112, -216, -92, -153, -15, 62, 267, 173, 173, 88, -173, -182, -243, -120, -62, 53, 150, 311, 187, 12, 35, -89, -220, -182, -104, 11, -28, 151, 185, 55, -37, -124, -179, -224, -43, -12, 97, 209, 250, 136, 58, -122, -57, -99, -126, -38, 28, 242, 225, 82, -52, -77, -220, -129, -160, -46, 146, 84, 246, 205, 90, -39, -138, -127, -57, -140, 87]
6840H7K6l1O0J0k25l8j5q7J66k7J52J04P3n7j80j35J07k34J17K26O6N2j6o7p0
6865F4r0j47mo7K44M4L4P5o2Qk4k71r1N6K57L3J48j9L2r6j61p5j70N9J94J44l4
6892H1J11K9j26j71k2j35jJ84R4J32J9J1j14j19j89KO4J25Q2J1M5K9k9q2r7j19
6918a85K8J7J55m1K92r4Oj17k9j95KK0J06Q9J08K8o8j0k06j54m7J33M9O0J91j0
6944A28J36j87j32j52J46j00P9K1J70J54mOk44j5q9j72KJ87K24R3q6O2k57j77
6968b07N6r8Q7J25R7J03Jj7R9l52p7J04j37K02M4J15J00k3r6j46j63o5J18j1J06
6993c5K64j44J65Qk89n8p5lJ4K60p7J22P9L5l41j8m3o0jJ89J60m2P6p2p4j05j97
7020b62kL6L7L06R2J25j29q1j23j61j05Q5N2J74K08j36P9p9j02k12K6l2J49P0
$$ y = [87, 113, 82, 142, 152, -73, -111, -126, -213, -47, -74, 78, 182, 255, 198, 18, -117, -10, -244, -127, 99, 165, 217, 201, 134, 64, -26, -173, -177, -244, 0, 44, 78, 153, 91, 99, 75, -196, -287, -231, 26, 59, 207, 188, 220, 124, -37, -112, -282, -223, -29, 115, 81, 192, 221, 95, -76, -98, -233, -234, -50, 44, 176, 195, 206, 92, -27, -216, -214, -150, -25, 57, 68, 113, 142, 113, 31, -66, -185, -157, -140, 15, -26, 266, 172, 178, 61, 32, -163, -161, -141, -35, 54, 162, 190, 122, 112, -94, -248, -295, -162, -113, -53, 138, 128, 264, 77, -55, -207, -61, -161, -82, -61, 109, 263, 259, 265, 21, 6, -83, -255, -253, -66, 158, 251, 165, 227, -30, -207, -151, -249, -162, -37, 60, 163, 164, 147, 246, -106, -183, -79, -216, -14, 30, 145, 245, 222, 126, -20, -183, -248, -130, -141, -35, 229, 85, 250, 258, -31, -89, -164, -167, -153, 107, 30, 152, 231, 266, -75, -93, -136, -196, -197, -8, 152, 110, 186, 114, 40, -65, -262, -264, -228, -191, 115, 207, 332, 203, 122, -1, -162, -267, -182, -130, 44, 252, 116, 195, 116, 14, -198, -172, -204, -55, 15]
7044A5J46n0J11l6l27O7j56k3K1K44J30J07k6o8r5r2j59p1J15O5P8O2J51q8mk3
7070I4j71j51J56R7J5P2L9Q5j55j35j41N3J00k6K2LK25j4K2j62j15o9j07J79J48
7095F4N1J57j18j88Q8j47j72J65M8O5j5K49k8q5q4j22q3r7rJ57J04K45j72N2l7
7120H8k10J6p1k9J42jK46m0O2L0k84j21k1l0Q8J75J13Q2J5k37k3j88J14j58kK27
7146a7J25N8J7j57m8Q0j54q4M7J33J76o5O3Rj45j03L3j58L6K11P4M0J7J46k25
7171A09q9k29L7n7O5K26jN2J55j21k09q4Ll6R1J06Q6N7MR7j67j52j56QR7J21J47
7198A60M1J3N0k32r7p5N5j29J82J48L9J64j28Kl00p6N9oM2K04%J27n3j18j05j41
7224a74L7p8K28j8L1J32N1j34j02p7p7K5pJ07J85M6n0Kn7j64Kq7J37K6K3L12m5
$$ y = [15, 161, 111, 222, 186, -141, -74, -230, -253, -232, 12, 142, 249, 223, 155, 60, -32, -191, -262, -147, -82, -4, 58, 209, 121, 117, 94, -77, -228, -72, 25, 40, 112, 151, 236, 81, -54, -195, -142, -42, -68, -46, -43, 182, 168, 190, 28, -87, -156, -263, -84, 64, 115, 272, 154, -34, 54, -93, -265, -100, -52, 13, -2, 247, 219, 134, 50, -72, -155, -252, -261, -104, 0, 245, 73, 125, 88, -122, -106, -177, -206, -64, -65, 181, 141, 203, 233, -51, -172, -193, -223, -135, 40, 153, 235, 250, 13, -10, -198, -84, -242, -244, -17, 108, 166, 183, 26, -22, 58, -96, -180, -133, 0, 176, 111, 174, 183, 38, -65, -32, -190, -154, 57, 131, 171, 188, 334, 109, 20, -209, -172, -229, -164, 62, 61, 113, 268, 147, -62, -146, -143, -179, -88, 18, 104, 161, 165, 262, 95, -57, -213, -205, -108, 13, 160, 201, 214, 264, 32, -65, -140, -85, -214, -32, 116, 155, 319, 191, 193, -107, -183, -124, -130, -88, 116, 116, 243, 190, 72, -33, -174, -137, -215, 13, -5, 26, 158, 209, 75, -27, -104, -181, -156, -163, -56, 129, 175, 125, 127, 70, -94, -92, -179, -42, -16, 7, 319, 274]
7251B74j59j12j07l4oK0K2K44M4r1l8l0Nj75j07J79K4Q6K22J6j65K7j93j19N6
7276a17o8O3J20K21O0j90J31j82j51l9lR5J30o1K19m8q0j53o3o0o1J65J2R8J05
7301A43K12j84j03k5j40j33J14J89j2J34m7n5j27k6j45Rk1J06J32J11O9M1j90
7324E2Lj80N1q9L6J36J05P5Rm7k84J58k57J0O2J21J45N6J82k36j75M7j87k2O0
7349a69n9K66K10km0k03j07M0r4j1J35Q1J10o3Q1k1k89L8m2Q2O3R3l6O1N6j23
7375E7p8p7o4L6k2J83K9N9J18r4o5q3o4q4L7Q6P4J97j9n4q3j26l4j46O7J66l8
7402b2J77J5Mj99Kr3r7m0K43L4J79J09j72qo6j57k8j08J48N7J37R8j8j69k7k8
7428b9j91J7J45%l8K20J9m4j74J2j48jmJ25K4K26j7m1j6j26L3j80N3P9K1M6M0
$$ y = [274, 115, 3, -104, -138, -144, -124, -102, 142, 186, 95, 57, 27, 32, -143, -250, -71, -47, 39, 261, 277, 112, 139, -54, -173, -117, -185, -122, -2, 219, 279, 89, 220, 38, -113, -152, -155, -60, 70, 9, 228, 180, 100, -53, -116, -176, -237, -72, -60, 38, 143, 355, 171, 68, 43, -97, -230, -116, 73, 61, 195, 148, 93, -34, -60, -205, -196, -217, -111, 21, 132, 201, 242, 52, 55, -125, -74, -163, -127, 9, 114, 189, 198, 151, -133, 25, -232, -222, -160, -39, 106, 162, 344, 108, -67, -20, -207, -229, -169, -228, 38, 248, 246, 206, 3, -104, -64, -158, -169, -34, 47, 157, 94, 175, 154, -135, -97, -139, -57, 6, 99, 63, 124, 180, 57, -21, -98, -162, -126, -148, 35, 64, 123, 241, 147, 82, -1, -65, -149, -112, -26, 48, 245, 226, 172, 89, -37, -71, -217, -150, 16, -22, 155, 170, 174, -25, -23, -116, -213, -253, -10, 24, 203, 312, 140, 132, 66, -91, -119, -227, -79, -22, 115, 213, 195, 26, -1, -29, -220, -203, -58, -58, -96, 124, 143, 99, -75, -63, -211, -212, -216, -91, -67, 159, 142, 101, 85, -41, -8, -188, -135, -56, -35, 11, 51]
7455E1O3j29p6k8j9N9N0J55O4J8j25K1J1j84n6j06J40Q7R0rJ51j94k0N4r1j21
7481a44r6K63j5J96j5n4j49R4k05%m6L6K14J02m8m1J4p8j58j22K98l4p8K56J9
7506B09j14j02M7j60l0O9J8M6K05m0K1q1j53j63L2J4J55K4O5J50j3j20n6m0j47
7531a64k6O5J44j6K95k41J58k28p7n0j2Q8P0Q8J19m1q0O1k05j52nJ14J6Q7J08
7556A16J52p3j60o4qj71L3Q6P9J25J18K5j24j43N3k53J0PJ08J23J74r1o1Q1l05
7581a63m5N3n4J43J17O2J08o5m0j24p2K1j10J39K7J33J02p8j52m1m0k8N0o5K17
7606I5m6J91Mk66J5j87J14p4J30K7O2J02k8k0j50R6j10k55O8K68k6J53J14j37
7630A40o7l7l4k05O5J03R1K9J06j21O8j23j17p6m5K88J2N1J8L0l5r9j74K3p2J14
$$ y = [51, 114, -15, -91, -119, -138, -79, -29, 126, 190, 208, 83, 104, 115, -69, -125, -231, -91, -4, 86, 77, 228, 34, 14, 68, -23, -144, -240, 23, 8, 204, 189, 135, -14, 80, -125, -125, -171, -135, 79, 181, 133, 92, 106, 28, -130, -252, 46, 12, -66, 190, 209, 95, -7, 40, -120, -150, -81, -63, -17, 188, 148, 169, 88, -65, -228, -196, -182, -27, -3, 62, 212, 199, 79, 23, -17, -164, -190, -125, 19, 3, 298, 57, 215, -13, -90, -140, -152, -64, 6, 94, 213, 172, 92, 153, -52, -204, -209, -95, -79, 8, 116, 268, 195, 35, -29, -37, -208, -175, -89, -10, 115, 233, 258, 134, -9, 44, -209, -199, -192, -84, 39, 213, 122, 61, 142, -163, -208, -155, -209, -66, 51, 113, 221, 156, 116, -8, -80, -59, -169, -30, -3, 130, 232, 154, 2, -39, -79, -107, -57, -122, 95, 49, 240, 244, -22, -7, -194, -80, -154, -24, 3, 65, 167, 139, 119, -31, 65, -45, -300, -232, 36, 10, 163, 277, 140, 73, 36, 2, -203, -138, -35, 56, 85, 191, 70, 138, 15, -102, -178, -223, 65, 77, 128, 146, 176, 141, 42, -132, -109, -181, -67]
7656f7R2J83Q3j09j07j96R3n7j40N9J90KP5K9k3K9k30J1k7M7K5J05l8J29m3o8
7682D7p8j14J1Q0k2J20J96r1o6q2rj39M4j05m2K23J41J26l9k86Q0jj73O8L4jJ34
7709E6K4L9r4K7q3j50J13l0N1J25J48L2p4j17j26j69O2M8J31L7N1J04j33p8n2
7734e8n9kJ44k7M8KJ19l7j6j12q8j10l2J34J38J45q3k4N8j98oQj2l1J53Q3l7J39
7762B39k14J7j86m5J4LK14N4m0J23p4k6j52m2p5L9J19N6J56J07j07n5k83R1o2
7787a29o7K62j7L0j4L5o1j7r4N6j61K08L3R2M1j24J0j23r6k8j11J15K18lL7R8
7813A90m4r4n3j79J7j6J77L9J25n7k0j10L0n2j73P6L3K36o2R6oq4o2o1j34J0K02
7840B4m7K06L4nk19n1j10ML2M0J9K15j5Nj21L0j49R5k11J51N9J01k5K3J8j83q8
$$ y = [-67, 25, 208, 291, 182, 75, -121, -28, -85, -225, -166, 24, 26, 101, 130, 107, 136, -94, -83, -110, -63, -38, 67, 29, 158, 115, 47, -31, -145, -134, -54, -76, 44, 240, 149, 83, 1, -8, -147, -103, -208, -250, -27, 114, 240, 201, -85, -5, -6, -179, -111, -77, -78, 56, 80, 119, 25, 52, -31, -181, -68, -98, -47, 78, 226, 258, 184, 67, -59, -228, -166, -118, 13, 50, 101, 205, 72, -6, -58, -117, -119, 25, -2, 46, 48, 167, 130, 114, 2, -86, -196, -228, -94, 44, 189, 106, 82, 140, -58, -64, -56, -68, -99, 54, 137, 100, 239, 25, 42, -144, -189, -175, -172, 42, 96, 56, 179, 105, 79, -73, -115, -190, -151, -32, 24, 180, 287, 180, 125, -158, -67, -129, -196, 66, 49, 79, 65, 100, 39, 22, -72, -16, -177, 31, 64, 156, 197, 73, 83, -40, -136, -164, -275, -160, 58, 55, 92, 190, 146, 52, -1, -180, -163, -179, -2, 37, 162, 105, 85, -25, 5, -47, -220, -144, -111, 125, 63, 159, 153, 69, 7, -54, -188, -178, 24, -23, 183, 217, 212, -7, -58, -168, -164, -132, -92, -73, 142, 127, 132, 11, 41, -108, -13, -224, -73, -14, 87, 62, 85, 103, -80, -168]
7867a68J02o8K4J23M8O6J06q9r8k9k15J19J5KJ82o4J91m7j56r5m2r8R3M5j3K33
7893A67J18k05N6q1j82n1J24j22J64J69K8r4Qj14j18np2J27J10Q0m0J70k96M7
7917a2o4j5M3j15K14R5o9M6p9m7j04P4q9N2l5J60L8P1n3k5j37l4L1j28K05m2J75
7944A56j6q8r0k0k07J42M6r2R7J78k3M4r3nj98J09n6J03J72m8M9K2j27l8q3m9
7970a15j6j7J55%J43L5j81M7q7n3p2n5J09K07J4Q9j13p3r0jJL7R1K0n7Q6J8m9
7998G3n1r4j4Q2m7k9P5J36j15J55j21j85j7J4P0o8K41k1K6n6rj47m0j6Q1O6J43
8025A32l2n0l1l8N0k01k0K17Pr3L37j62K8j28l8j42o8N3R3N7J51j6j8M7k18J5
8051f8p2Q2n1K0J27L4k9N8j14p2OJ5%Q1m3J20J8j8j13j5j09Q4Q4q1J45N5J0j12
$$ y = [-168, -66, -134, -110, 13, 61, 127, 233, 144, 46, 17, -198, -79, -64, -62, 120, 56, 247, 200, 44, -51, -93, -191, -98, -53, -66, 167, 285, 80, 136, 55, -127, -178, -54, -176, -12, 157, 185, 91, 99, -15, -133, -138, -210, -83, 27, 107, 67, 237, -59, -12, -76, -91, -48, -163, 51, 146, 77, 123, 44, -3, -107, -33, -122, -70, -105, 55, 93, 164, 111, 86, -51, -85, -54, -182, 23, -19, 156, 140, 52, -38, -58, -265, -123, -77, -169, -72, 106, 83, 127, 34, 29, -169, -60, -116, -13, 159, 111, 160, 182, 55, 17, -66, -115, -131, -148, 7, 7, 150, 185, 4, 51, -36, -89, -161, -216, -107, 100, 114, 203, 90, 17, -73, -74, -73, -36, 55, 75, 18, 104, 122, 73, 22, -72, -86, -4, -51, -80, -5, 131, 16, 171, 50, -135, -152, -138, -68, -136, 105, 84, 110, 54, 45, -102, -142, -158, -77, -11, 132, 100, 50, 19, -19, 31, -170, -190, 27, 34, -59, 278, 116, 144, 16, -22, -164, -232, -179, -86, -29, 122, 106, 88, 135, -83, -68, -140, -58, -109, -89, 38, 72, 43, 101, -13, -85, -79, -64, -64, 17, -26, 94, 112, 94, -19, -34, -143, -59, 25, -56, 89, 144, 154, 42]
8079D2q0J9j06J39k12L9K28L5o7N1m2m7k5j86J15J1J03j5J66q6q9q9M1k7q0J36
8105b6o0J25O7R4j49j44Qn5l0N6J09K6M1L3n8j4j60J04l5N2J1l0J38l0P6q7jJ8
8133G9j65k9K07m2j3J06kr8j03L6j54J6O5J04K8R4j51M7k6J6k14m8L33j48Q4R8
8159A20l0n4p9P0Jj73K2J21j8K2J04j21J3n8j11K14j20M2P9k8J05no0m5k38R6
8185a31Q0J15J5P8q5r8
$$ y = [42, -38, -19, -125, 14, -198, -159, 69, 104, 37, 88, 46, -1, -26, -212, -97, -86, 17, 2, 168, 82, -7, -96, -55, -82, -162, -26, -86, 39, 106, 200, 51, -93, -85, -140, -170, -114, -5, 21, 62, 95, 37, 23, -137, -33, -68, -16, -5, -35, 103, 73, 149, 62, 61, 79, -86, -115, 92, 50, 37, 143, 141, 43, -60, -24, -178, -162, -97, 7, 35, 129, -22, 25, -1, 15, -199, -247, 86, -62, 22, 120, 90, 36, -43, 27, 28, -145, -123, -2, -20, 2, 106, -15, -2, -60, -171, 43, -77, -35, 44, 16, 121, 116, 56, 11, -227, -131, -51, 64, 79, 157, 72, -26]
8191b6
$$ Imaginary data points
##PAGE= N=2
##DATA TABLE= (X++(I..I)), XYDATA
0@%%%%%%%%%%%%jRj6J6j6J8k6L2m0M8n6O5p3Q8j04J20j37J55j78K05k32K62k99
35a60L38l80M28m77N30n89O56p29Q06q93R88j089J202j324J458j608J771j952
53a024K155k379K630k918L249l630M076m609N257o067P113q520J0525j3627J9108
68A1339l1600J10669J1420j88319J04687M535j27740M0891J23381o9254l907R0262
80G6364n6698p8267R0575k597r5799M4824L9390r4058N7037J39196p2936p8873
92c1842J04348l1802j62172M2689J05561n5161K0597J07633o8330q7183Q3208
103B7546k590j08579N4860P9929q1653n824J00729l4970m8022Q7833j8002j31959
115h0702K2024O4149o0606K1769J11413l3342n5923O0509l7198j10879O5172Q3585
$$ y = [0, 0, 0, 0, 0, 0, 0, 0, 0, 0, 0, 0, 0, -1, 8, -8, 8, -8, 10, -16, 16, -24, 24, -32, 33, -40, 48, -56, 64, -73, 82, -96, 109, -123, 139, -160, 178, -202, 226, -251, 279, -310, 346, -383, 423, -470, 518, -571, 631, -693, 765, -843, 928, -1024, 1131, -1248, 1382, -1536, 1713, -1917, 2159, -2450, 2807, -3260, 3853, -4667, 5858, -7769, 11339, -20261, 90408, 101828, -86491, 18196, 22731, -105009, -64118, 59263, -9991, -13898, 76364, 19666, -58601, 31974, 29377, -66422, -21598, 17792, -76266, -19229, 119967, 47031, -31842, 72506, 40704, -121468, -78779, 26782, -28379, -7782, 99851, 31521, -55662, 27546, 24956, -83623, -28763, 51166, -30487, -36311, 64418, 29448, -18574, 69259, 51257, -80702, -58678, 5471, -55135, -33366, 78047, 44705, -11218, 49291, 12093, -98786, -33614, 49971]
127D9971p8399l181J04327l8470o9728P3793Q377r9671K0753N0663p3647n189
139f0401J03523k328l9137N2719k0449r6664K7031M8898n8235J7950J00460l1698
151D1669o5181N3997J374q3515K5119M9526o4579r891Q3187j0508l7655O2877
163D6420Q486q2491K919K9716n4654P466Q8435r165m2486M5739m599q0971J1269
176c3916M3315m5026l944O8872j2267l5782N3369J3837o3799M380K6606n2717
188c7072j0783O5708J249k4309M6215M875o8876m657K6908l7726m506O0882J374
201A9282k6254L7212J0487m9646K127K2946m1261j5762M6127J277j8800M1661
213B9396J5372m9101q412J5938l7302j3351M8358J1134j5215L2618J4223m0696
$$ y = [49971, -28428, -31609, 72718, 34248, -35480, 38313, 46690, -52981, -32228, 18435, -55212, -60401, 43122, 40794, 1657, 54376, 33927, -62737, -35706, 13192, -45043, -27093, 73367, 41669, -23512, 30485, 31859, -51656, -26537, 22989, -41590, -51481, 31706, 21198, -16457, 46420, 54906, -27585, -24666, 5050, -49604, -42138, 46297, 37132, -5354, 40385, 35786, -45185, -33916, 9399, -35627, -39571, 29301, 17034, -18748, 34621, 48458, -15341, -10961, 15645, -37072, -47855, 17853, 19102, -5207, 41008, 45883, -22993, -27650, -742, -38468, -42974, 17908, 19282, -6972, 30240, 40727, -8919, -6792, 16154, -25107, -40869, 5258, 6535, -12265, 29396, 44768, -4333, -12745, 3193, -34109, -47460, 898, 12032, -3183, 29435, 43658, 2962]
225B962p848J5184l0626j6108L3492M355j3754L1088J6886l1086n786Q830l2411
238b4822j6035L1423P740o064L3838J7576l1320q634R374l0010k1341K5778J0488
251b009j0304K1726K1879j6816j1684L404j9087j7004J1317P877M068K4843J4286
264C2496j3010k972j272k9170j8464J5102M606n468K3815K3436j1354j0151M180
277A1774j5939k2939M170J1212L239J4647J9616J269p012o729j7483j7629k606
290b4410J741N225J8642J6632J312j76k416j8539j7776L86K473P18J6989K1698
304B2499L166n566k272j2559k2512j0775L693O417R997J6250J3991K784q195j2925
318C993j2011r876n951N347J5969J5357Q355L413l096j3182j8636j3908k831N187
$$ y = [2962, -4886, 10298, -20328, -36436, -2944, 1411, -12343, 18745, 35631, 4545, -1241, 7589, -24822, -40857, -9434, -1694, -7758, 26080, 43656, 12336, 3702, 13076, -16934, -38275, -12497, -2009, -12313, 9413, 31292, 14476, 2792, 6196, -12891, -29895, -18578, -10701, -6633, 18210, 32496, 19486, 16514, 15242, -13928, -32392, -17290, -12684, -18152, 5663, 29099, 17745, 7594, 11774, -4165, -27104, -22934, -11722, -8483, 6164, 25780, 27049, 20037, 13308, -4175, -21804, -24410, -22669, -17444, 1198, 17830, 19142, 18966, 16550, -1989, -19765, -19379, -16906, -16188, 801, 22499, 25665, 20099, 17827, 5268, -17244, -28019, -24326, -17909, -7912, 8338, 22329, 25113, 16918, 3993, -8018, -17894, -23845, -18498, -2529, 12828, 21183, 24596, 21500, 8318, -10318, -24226, -27057, -21870]
332b1870R055J4651J7900P707p265j0155r795j5155j0759N473J2642J1128J3534
345A7091R435m219j0834j2811j7879j0429O203Q373R017K0456J5540o911j0332
358A2700m701j6870j7994M617J1991N569J4649J6311l335r880o794j8291j7399
371b9427M675Q276L410K0774K2550n477r846N86j7703k5089M047J2011j051J4721
385B457K3729l554j1188J363j5839k4705L586R381m302J7693K9245k925r418P673
399B3196j6824l2795K313J1981q127J4434L2422l489j4031Q391j2848l1661M388
412b2650J2958j2063J1821L4176j914j0628J5952j1154l7907P7J0500j7505J1146
425a7191M0803k72j4679J5428j0792m0076K643J7274j6210Q396L9295l602j6709
$$ y = [-21870, -12815, 1836, 19736, 27443, 20178, 10023, 228, -14927, -25686, -20213, -7571, 3557, 17091, 26526, 22307, 11473, -1338, -19217, -29646, -23443, -15070, -6053, 14403, 29943, 23032, 12700, 7999, -8871, -26865, -22248, -10257, -4688, 9961, 26272, 22937, 13057, 6263, -12028, -29427, -24752, -16476, -13066, 7708, 30258, 24781, 14935, 15521, -2182, -27271, -23224, -11213, -12264, 2457, 26186, 22632, 11444, 12807, -3032, -27737, -24151, -14770, -19072, -1379, 27866, 24941, 15523, 23196, 6372, -26423, -24110, -12129, -20256, -5822, 26600, 23111, 9080, 17471, 4623, -27038, -22650, -9692, -21755, -9934, 24242, 22328, 11700, 27652, 16498, -21409, -21332, -10832, -28337, -17191, 23612, 23340, 8661, 24089, 13297, -26779, -24136, -6862, -23072, -14676, 24619, 21017, 4308]
438D308K1552l203l9149N50J2046k6785K956M3415J120j2240K7460n289m8876
451b2135j146J7585k4626O862N0182k764k3823K6161L81m6470K595K2749k9387
464b3836p011M0877j609j4595L6508M897m6668r5J3061l9111N86N7115M38k1304
478g47L6236P24n9578O22L0808l1313r692M7598k973k6555L4436J3438m0595N512
492b079J7822m5051j2401M9333j581j6145M8829R869o0672m668K2874m0205p379
505d1454N8501p02k9954L5894R617m9669J1234L2940m3536j9366M5966r989k8568
518b9086N3361K7274n1485l862K1804m8069k1941N1461P409j6108M2296O093n5543
531a6396P725K9720m4135j0295N5153j5803m1247M8270K6927m9160R959L9163
$$ y = [4308, 25860, 22657, -16492, -15942, -3896, -30681, -27725, 15690, 16810, 4570, 32030, 26741, -22135, -23281, -5696, -30322, -23460, 26722, 23958, 135, 26296, 26677, -19793, -17198, 5551, -23836, -30847, 10030, 8421, -6174, 30334, 35231, -11437, -11532, 1529, -37582, -36996, 20119, 20557, -747, 35489, 36213, -23365, -22743, 8065, -23248, -32940, 14658, 11685, -14870, 19566, 33004, -7591, -2079, 15743, -29308, -41709, 7624, 6043, -10102, 38727, 48596, -12076, -16744, 6130, -34075, -41454, 17047, 16345, -13609, 22285, 31902, -17767, -6533, 26407, -17129, -36495, 9471, -518, -29086, 24275, 51549, 64, -3798, 18006, -30063, -52004, -543, 6866, -9242, 33054, 39147, -16396, -8671, 21049, -23086, -33381, 21772, 5969, -35278, 12992, 39919, -9241, 718, 39881]
543C9881n1567m1386M2075P286j9084M6352K4114m4250q50J5896m9703j0917N8649
556A6496o701l4994M2493J5847n2639J5109M4085m6315l1346M4329j0595l9977
568d4208M7086L9870l2840N327J9800n6214k6985M9504l116k7757N0408K4126
580D5001n3769q2L3900l7280j7551M6527j4613m3748L9993L1180l3846J4503L5360
593D5575m5278l2818L1549j6124k9112N7196L6722m4941j926K8861m1128k6393
605c7817M2391k101l1144L6018K0165m1990J1427M3013l0642k8229K6244j8910
617a1575l6365M2935L2956l0749J4129L5298m5126l8474L1939j964k5531L9380
629F853K4672l8531O382L4571l2809k4252L5272r450l9318K5961K3341k5591J9878
$$ y = [39881, -11686, -53072, -10997, -3711, -22795, 23557, 47671, 3421, 2571, 18467, -31236, -42153, 16496, 9795, -25199, 17294, 33141, -19498, -4389, 39696, -6619, -37965, 6364, -4231, -44208, 2878, 42748, 9908, 15235, 35035, -21179, -48164, 1340, -1776, -29533, 20875, 45001, -8768, -8850, 25050, -12230, -29781, 16746, 2133, -41615, -1622, 29558, -4288, 10215, 45575, 297, -32521, -972, -17096, -46208, 10988, 47710, 2769, 843, 29704, -11424, -37817, 4574, 2473, -28671, 7347, 27512, -14478, -3051, 39962, 9320, -18909, 7335, -11575, -47940, -5005, 27951, -2798, 11331, 46629, 1503, -36971, -5032, -6996, -32527, 6853, 31525, -7006, -624, 33947, 1138, -23114, 12158, 2708, -36610, -10649, 12692, -12899, 6979]
642F979M0022l4531l3379K3233j2171l2606L4952L1879k3379Q521K6486l5385
654F21k5064L1327n630l2611K4279K1051k6449J1010L5174k1889k0656K2199j5704
667b342l7515K2999K7122j5463J4082K9944k7010k5572J8188j1191k7780K6195
679h343K2765k2334P103K8825j8642j7358K1301j0197l2655J4779J8300j6035
691a2491J2565L2043j3888k0002J0747j3773k7740J7146J9711j2127J0632K5176
703B7999j5953j7052J4828q071k5455J2129J3725j5023Q375K8102p369j4265J0785
716A2755r352k7785N476J4826o877R907K4189o309j3465O916r069k1438O823J0750
730b653q947Q257K1625n207r634J0189p395k3881K075R545p935P222K3222M88
$$ y = [6979, 47001, 12470, -20909, 2324, -9847, -42453, -7501, 24378, 999, 9520, 36006, 621, -24443, 6884, 1254, -31357, -7078, 13973, -12476, -1466, 33708, 11819, -8837, 13362, -2342, -39857, -16858, 10264, -5199, 8883, 38827, 11817, -13755, 4433, -6758, -34538, -8343, 14422, -7912, -809, 28016, 9374, -7984, 13317, 3120, -29535, -14756, 3544, -12491, 74, 32117, 18229, -1773, 8974, -4799, -32539, -15393, 4318, -7809, 2823, 27999, 12046, -5006, 9822, 1751, -23704, -11575, 2150, -12873, -4498, 23604, 16235, 1970, 12755, 3403, -24382, -18906, -4080, -10957, -1050, 23139, 16830, 3365, 10281, 1212, -20226, -13403, -2653, -11600, -3343, 18282, 13075, 3441, 13630, 6235, -17646, -15571, -6026, -13961, -6739, 16483, 16971]
744A6971r329N047o982k0367q10P873m064O371J7735R53n587M549o196j7061j739
759a2636L778n229O594J7399K789l171N331o065j7838l791L640m560M270J6972
773G483N658l613K686l020j4202p018J120j718L594J2238O829J425K733m597j2490
788b892n877j521m404L701J3274O749N88L692j708j1823q837j377k263J580R744
803a374Q661L889K200k384q805p677m745l523J990R001P896M285L528q00p939
818D203q723n289k746Q39O408Q324O688L415j495n776p351p093m478Q31N861P357
834I75O847M376P1m644p814p647l978K56L186P088Q970M428r44k535n727r407
850f499n757P66K474N319R125O203j94j908n150r465n947K78Q94M378J0222O249
$$ y = [16971, 7642, 12689, 5707, -14660, -15470, -7597, -11661, -5290, 12445, 13398, 7811, 12360, 6164, -10897, -12636, -8858, -14087, -7493, 9906, 12695, 9524, 14855, 8790, -9048, -12839, -9199, -13759, -9489, 7483, 13141, 9528, 12214, 9194, -5008, -12026, -10906, -12624, -9030, 3208, 10037, 11462, 14195, 9598, -2892, -8769, -10290, -14694, -10993, 2281, 9030, 9618, 13310, 11602, -221, -9058, -10435, -12698, -11118, -1374, 7287, 11176, 13376, 10992, 2187, -5490, -10235, -13758, -11768, -2767, 5129, 9414, 12942, 12142, 4203, -4520, -9809, -12555, -11716, -5308, 3016, 9704, 13119, 11624, 5848, -1503, -8596, -13074, -12243, -6382, 975, 7822, 12198, 12269, 7625, -189, -7836, -11814, -11558, -8372, -1284, 7686, 12114, 11170, 8635, 2908, -6499, -12256, -11490, -9016, -3697, 5428, 11631, 11437, 9529, 4379, -5086, -11033, -10755, -9861, -5483, 4739, 10988]
866A0988p63k04k956j0843o942P79l60J985J0871P701m48P75j443j1103q421J078
882i306j146P28J1443Q462j618J551M02j1388q565K146k386k458J1452R445j939
897F823L241L327j1665j0224J761l590l990J2362J1259k596L012M558j2631j0783
911i136L861l217n850J1757J0569m607L803Q553j1066j1176M168n349j0213J1756
925f147J3083m015N266J0684j2498j4589M460l975j0079J2951J3492o857L425
938E201J1554j1502j2056Q126m251j4891R805J2445p370O328J7522j0302j5303
951d694N848o631j6754J2253J7129o733M548J5457j3246j5738J0224k656j6986
964a7979J1162J3597j2532L124K1106q324j3463J1603o250k4055Q181J6479q850
$$ y = [10988, 10225, 10021, 7065, -3778, -10720, -9941, -10301, -8316, 2555, 10256, 9808, 10583, 9140, -1963, -10384, -9306, -10452, -9724, 1719, 10181, 8563, 10114, 10516, -872, -9437, -7291, -9677, -12135, -683, 8762, 6823, 10064, 13391, 1726, -8498, -6737, -10327, -14317, -1955, 9304, 6708, 9720, 14278, 1647, -9136, -5275, -8492, -14342, -2585, 7984, 3377, 7180, 15733, 4667, -6509, -2341, -7690, -17903, -6147, 6936, 2921, 8187, 18871, 6373, -8216, -3756, -7731, -17810, -4859, 8633, 1776, 5201, 16755, 5253, -6803, 1323, -2928, -17819, -8014, 4431, -2939, 3389, 20911, 10609, -4694, 1154, -5477, -22231, -9978, 7151, 418, 4966, 20423, 7177, -8561, 1663, -993, -17979, -6817, 6780, -5752, -2628, 18478, 10154, -3309, 8294, 2044, -22011, -13830, 2649, -6201]
977f201P318K3369j1212j9254R020m546k0585J3412J7838j3786J078K1082j0182
990G351j4688J6779j208k5103O048J3153j5374N211K9158n593j6636J1630o890
1003C838k8204R040K0005j1330M684K4730j2824k0161J6671R13k3666R448J5693
1016H837k0765j354K7827m685j2927J9957k529l3327L110J5902j5114O151L2331
1029B3414p582k0343J4352l542k8586J1665K1403j8475k537K5363r756j5928K3882
1042A3330M277k9056L878J2202k4032j79L4397p88j4149J8688m449l5125N199
1055a5807J9994j5924K301K9704r960k0999J9407L575k5634R418J6081k5397o535
1068a9776K7890m062j0843K6759L003l3736M90J1956k1924K241L5410l619j7670
$$ y = [-6201, 1117, 24486, 13274, -5980, 3040, -1506, -22091, -8679, 9159, -4627, -3549, 17533, 7351, -7337, 9442, 8234, -16869, -10821, 2332, -13042, -7831, 21327, 15734, -902, 10728, 3838, -24366, -15326, 4679, -6651, -1967, 22763, 9939, -10222, 6449, 7362, -16304, -6856, 8837, -11928, -13282, 14545, 9860, -3067, 16890, 14361, -18966, -15856, 46, -15068, -8917, 23414, 15832, -4511, 9841, 6299, -22287, -10622, 10781, -7694, -10231, 15132, 5376, -10552, 13330, 17607, -11449, -7571, 4631, -19401, -19580, 14817, 14029, -120, 18568, 14119, -21006, -15807, 4187, -11737, -9436, 20268, 10308, -10691, 8716, 12291, -13343, -3925, 12156, -13241, -19776, 8114, 4052, -6791, 19968, 22971, -10765, -10275, 1681, -20243, -18002, 17408, 13789, -3881]
1081c881J7621j741l0294R292K0018j9838m673K4300r395j5015K6166P999k5884
1094e325M485R869k7613n492L0449K47r538K2691r3l2169K164J4458j8489jK8236
1109A3879o616j7417J8722M989k2099Q944J4123k4612r405K1864m224q854K6158
1122A5452P558k5508M2P321k2813k625K8320j078j1832J8179K050k4395N137J4453
1136A0261j8035n427J9386p679j2887K1736R699j7540M469P652k3660q599K0095
1149e29p85n713K1647M681k2482Q16Q702j7335l075J9837m286j1737J6198N962
1163A1901j5653O111J0939j8134r528J3113l702o915J9423R437j3882J224M087
1176H421j8340o266J5956r60o107J5213M036j4736L803Q745j4192n669J2222n304
$$ y = [-3881, 13740, 11999, -18295, -9003, 11015, -8823, -13496, 10804, 1409, -13606, 12560, 20559, -5325, -840, 9029, -18584, -24076, 6373, 6620, -2918, 19773, 19680, -12489, -10325, 4133, -14356, -14357, 13879, 7263, -10154, 8568, 13557, -8542, 402, 14525, -10087, -19492, 2372, -1852, -10706, 15452, 23010, -2498, -2456, 4865, -17948, -20573, 7747, 6669, -5163, 13016, 15066, -9329, -4192, 10261, -7774, -13201, 6185, -1494, -14381, 7355, 17054, -486, 3983, 11635, -12025, -20624, -529, -1314, -7027, 14620, 19301, -3181, -2365, 6337, -10998, -14073, 5764, 1478, -10259, 5939, 11901, -3752, 2359, 13298, -4836, -14364, -1251, -4953, -11868, 7555, 16992, 3110, 4334, 8421, -9919, -16185, -229, -1189, -7296, 7917, 11953, -2783, 1020, 9765, -4427, -10096, 2126, -3178]
1190c178r531J4898R663r477L283O196j5220r583Q978j491m095J4207P252r555
1204B347J143M131j1943m545R389l723o105J1752N582q152M258P451j1412q231
1218h058N759l711n847J1849Q770n316J434M826r881p555M884j287l396Q184N321
1233E976m494K679M441p863n408L348l976m818Q385N907l081M512N415q598p308
1248d883K870k307m662O624O693j607J411L468n082n476N74k253k988M302M151
1263H35K65M263L262n191m188M89m076m295M698N355k30K558L975l576n213p71
1279a840k175l051K224M343J570K883L001k140l242j125l662l594J823L657J289
1294c9K670L601j239l517j910k884k745P64K862K343L267K906n31k387j758l456
$$ y = [-3178, -12709, 2189, 11852, 2375, 5658, 11854, -3366, -12949, -3971, -5462, -9557, 4650, 11902, 2347, 3490, 7621, -4322, -8867, 522, -3201, -9306, 2446, 8028, -124, 4134, 11585, 173, -8058, -2299, -6010, -11857, -8, 8762, 3446, 4880, 9706, -175, -7730, -2846, -4133, -7529, 655, 5976, 1482, 4161, 8602, 739, -4669, -1321, -5297, -10115, -1730, 4177, 1096, 5608, 11023, 2425, -4883, -2013, -4320, -8982, -2358, 4335, 2728, 4139, 7607, 2525, -2951, -2377, -4630, -7618, -3316, 835, 1100, 5363, 8625, 3434, -754, -265, -4341, -8636, -3938, 1417, 1187, 3745, 7720, 4144, -1069, -1840, -4015, -7066, -4842, -499, 1071, 3954, 6955, 4815, 1573, 448, -3214, -6808, -4985, -1328, -39, 2631, 6232, 4993, 1476, -434, -3318, -6063, -5299, -2437, -94, 3173, 6079, 5548, 3161, 1403, -2053]
1310b053l493K54K283J741K623L433M12k178k256k651k782o55J587K499L203K769
1326D736Q19r27k072l577l031j148Q10J539K995L434R32n03j557k997k892j248
1342d687L46J866L087K927J254L12j654l333k903j551q33J106L311K985J373R40
1358D546o42l307k837j365q65O72L195K988J453J297n60l454k834j463k056m4
1374e276L431K587J302K704O12l541k639j070k576p54M031K656P73K572J038m164
1390A686l010m78k611j624L373K633M65L405K174l277k258k20l980k282L684K309
1406a1K34M373K187m784k816P54m324l015M938K786j612L842L924l787j954J882
1422B617m361m667L600J964j533N135M670m428k214J112o019m656N853K806k209
$$ y = [-2053, -5546, -5292, -3009, -1268, 1355, 4788, 5200, 3022, 766, -1885, -4667, -5322, -3735, -1236, 1967, 4736, 5555, 4628, 2556, -1021, -4052, -5200, -4390, -2851, 144, 3578, 4510, 4007, 2450, -547, -3439, -4687, -4341, -2475, 612, 3539, 4793, 5105, 3451, 118, -2785, -4336, -5169, -4063, -752, 2233, 3606, 4546, 3904, 597, -2240, -3605, -4470, -3798, -603, 2385, 3838, 5135, 4575, 1121, -1713, -3176, -5232, -5276, -1845, 742, 2044, 4748, 5360, 1819, -820, -1890, -4466, -5220, -1189, 1467, 2240, 4812, 5850, 1686, -1324, -1802, -4413, -6037, -2664, -31, 434, 3839, 6013, 2736, 478, 258, -3722, -6004, -2320, -11, 223, 4596, 6783, 1999, -817, -63, -4387, -7402, -2464, 322, -1290, 2552, 6476, 2689, 735, 2617, -1744, -6411, -2811, -847, -2380, 2755, 7425, 2997, 783, 1895, -4124, -8780, -2927, -121, -2330]
1437b330N461M564n748j987L965m992n251N351J141n338M898P009l934j647L715
1452D877o186p290M400K211k759P168O845n770k725L703o423n572P440J402p143
1467e822N397P000o569j341Q108m729q672M241L35o228P291R753m810j258N216
1482G912q468q989P408K173o178P365P238r671k261R326m338p426P028L26r952
1497h507N063R019m923J596R493q169j1361N382J11p845R114J0794q368k700P747
1512F446p054q378R869K968r457M270O737q393J014J2259n035r249N990k711j2591
1527a3315P572J2106n719P67R409r224j1365Q376K685q242P671Q532j0773k175
1541c695J0445n157o508J0221j033j4412L862Q634p226L172J4259o066j1554N724
$$ y = [-2330, 3131, 7695, 1947, -40, 3925, -1067, -6318, -967, 174, -5164, -266, 6743, 2809, 1162, 4877, -1309, -8599, -4199, -1988, -4747, 2421, 9266, 3496, 771, 4474, -1949, -7521, -81, 1321, -5822, -425, 6575, 6, -1335, 6773, 2044, -6628, -2387, -2052, -8280, -989, 8764, 3954, 2696, 7912, -556, -9545, -2137, 36, -6142, 1223, 8461, -1210, -3471, 5855, 1517, -5909, 1119, 1445, -8507, -3444, 5575, 652, 2248, 11741, 3572, -7789, -2407, -2296, -10141, -1027, 9767, 1399, -1301, 6446, -608, -8986, 883, 3851, -5606, -1336, 5401, -2992, -1978, 10281, 5246, -4003, 1987, -724, -13315, -5743, 6363, 644, 1411, 10820, 1596, -9769, -1393, 1292, -6950, 721, 9253, -1520, -3695, 6750, 1593, -4915, 5306, 4273, -10139, -6277, 2357, -4869, -1697, 12562, 6496, -5058, 666]
1555F66j543j0739R268J1852q275j633Q420p979q686J1171K141j1046M368N893
1569C878j0928O35J4610k605p159P870k985j4725M954J0468n771K202J1647q180
1583C911j1574P341Q83r067P780Q371j0943k452J0781m160m899J1519K21j3899
1597f187K102N709q594K898J4577m000r097N882k782j2175O777J0306o866k59
1611a709R270o798p633J0378K515r515L939M364j1594q76J2379j708m556Q755
1625G211k133j4060K670P412n872K323J1946n063q547O611M04q657N666O505r204
1640b788k383Q066l983l790J0530J119j0385J682L127q958J480J2621j803n074
1654e39O730k200j0736L918O559o338l16P633n080n532P994K064o618L351K720
$$ y = [666, -877, -11616, -2348, 9504, 1229, -404, 8016, 37, -8649, 2522, 4663, -6383, -2015, 3878, -7050, -6415, 8195, 5590, -1569, 6301, 3316, -11409, -6455, 4013, -1758, 444, 12091, 3911, -7663, -322, 561, -8506, -726, 7645, -3298, -5750, 5031, 871, -4028, 7491, 7712, -6187, -4085, 1624, -6970, -4072, 10505, 6505, -2592, 3290, 508, -11667, -4890, 5416, -1450, -1709, 7561, 763, -6870, 3508, 6023, -3492, 447, 4811, -6783, -7659, 4720, 3012, -1544, 7211, 5078, -8982, -6312, 1100, -4772, -2449, 9497, 4434, -4113, 2498, 2902, -5755, -89, 6416, -2788, -5171, 2895, -1088, -4878, 5652, 6771, -3614, -1932, 1195, -7763, -6283, 6338, 4535, -539, 6191, 3991, -6745, -2827, 3732, -2606, -2922, 4711, -369, -5901, 2093, 4157, -2461, 890, 3610]
1669C610q918q55Q396j623j633Q431q90r793J395L018o810J384Q798l170m746
1684c406N827J97o511L638M451o162j521M914k672j563P649J036o193J391Q37
1699A912p369k89O574j057j394N707q18o152K478K757m842J54M741k829k249N408
1715B732R57m299K720J277o632j936M103r13m84N209R84l570R82L17m298M13L840
1732A402j952q24M019j65l209K266J132m947j163K621j372j137M172K124j460
1747A507Q48k81l582m97J671j114N8L648J44k202J248J77l407n80J519j396o35
1764b874L021J723n06J081N0k449q03Kj355K72K924N62j034J194j76k633j143
1781b144P10o74k61K155J528o4Q37L10j413j097o82j185K66J629K93M03J064J3
$$ y = [3610, -5308, -6163, 2233, 610, -1023, 7408, 6518, -3275, -1880, 1138, -5672, -4288, 4510, 1340, -3406, 2421, 2618, -3893, -255, 4196, -1966, -3487, 1427, -1245, -2808, 4841, 5877, -316, 1075, 1912, -5457, -5746, 828, -229, -1623, 4084, 3266, -2886, -408, 2349, -2493, -2339, 2402, -427, -2676, 2732, 3689, -610, 2110, 3387, -3245, -5181, -1078, -1991, -2475, 2734, 3718, 148, 1130, 1447, -2851, -2438, 1402, -550, -1374, 2645, 2480, -729, 1537, 2669, -2278, -3441, -820, -2192, -3329, 843, 2967, 1507, 2355, 2074, -1508, -2005, -334, -1448, -1390, 2258, 2402, 200, 1448, 1625, -1782, -2362, -843, -2239, -2874, 147, 1870, 1364, 2445, 2495, 46, -757, -755, -2110, -1838, 1086, 1648, 614, 1808, 1632, -1001, -2144, -1434, -2108, -2369, -214, 1314, 1250, 2087, 2397, 984, -113, -795, -1980, -1714, -85, 208, 611, 1675, 1688]
1799A688j912j112j0q11r6J682J438M59Q19L86j094j147q11q31l56Q23N47P56
1817D18Q90J14j042p50m93q97k22J028J072P51J016O39p91j043q95j007n79J48
1835a643Q41P60R45K17l86m44o63j111j43P54O73N32J242Q28o82p75n43j137j180
1854a915N3P50L87J030Q76j61m90k48j040o70N27M65K66J344Q62n61l13j53j531
1873e22j197L39j82k11J657J355n85K49N40j621j390Q38K44l93J413J440p42k88
1891I44L26j478j186L36m12o44J671J006n93J189J227j781j540Q25n64j369K115
1908G2J872j282J32J184k001j866J294l06j481J673J397j108Q36K026j409j234
1924b01J234j391k324K062J715j325J391J942k822k200J730r17k277K912J986
$$ y = [1688, -224, -1336, -1346, -2157, -2253, -571, 867, 1326, 2145, 2531, 1437, 290, -521, -1352, -1708, -885, -338, 418, 1308, 1422, 380, -370, -863, -1760, -1982, -954, 118, 869, 1885, 2524, 1733, 690, -205, -1212, -1791, -1643, -802, -42, 903, 1120, 734, 290, -373, -1484, -1627, -873, -200, 332, 1574, 2402, 1720, 945, 402, -735, -1915, -1862, -1112, -725, 305, 1181, 1020, 530, 282, -758, -1428, -901, -436, -170, 1174, 2036, 1475, 1162, 1009, -522, -1719, -1380, -1562, -1773, -116, 1239, 654, 903, 1443, -178, -1568, -730, -486, -879, 534, 1974, 1232, 944, 1270, -208, -1394, -1058, -1470, -2114, -443, 563, -30, 1159, 2386, 605, -935, -110, -674, -2043, 72, 1944, 662, 794, 1978, -23, -1889, -595, -901, -2382, -709, 688, -420, 416, 2442, 1033, -201, 1033, -358, -2682, -620, 1095, -230, 1161, 3103, 281, -1919, -189, -1106, -3383, -471, 1515]
1939A515k200N32K760j775j322K341r83l117J266R44j954K058L388k269j810J634
1955A008k216l343L227K589k072J541K919l073j974L227o05l345K195Q40l792
1970b874J315M038j857p27L223k521n036K286K072k208K898M449l232k727K675
1985A774j956l367L891J762m164O84L157k999k31N197j630m712J988L29m481L027
2001a731O136j921j540L065l884n185L671K520l396K170L654m457j958M840p05
2016A279l346L796L57o333J115N219j941M56N537k984o743J791M84l853M033O066
2032D933l797k486L608k496l988N220K201n287Q55L523m522j08P236j064m717
2047h89K253j453o745K745O606j942J65M939m228o191L704J986l973L500M243
$$ y = [1515, -685, -153, 2607, 832, -490, 1851, 868, -2249, -983, -39, -1993, 65, 3453, 1184, -626, 1008, -1208, -4551, -1324, 1265, -807, 734, 3653, 580, -1394, 1833, 1228, -2117, 78, 918, -2874, -1559, 2479, 622, -105, 3118, 597, -4439, -2153, -81, -2289, 609, 5058, 1826, -901, 1774, -182, -3549, 342, 2104, -2060, -1376, 1781, -1218, -1449, 3748, 2118, -2594, -606, -277, -4758, -1731, 4405, 2484, 944, 4009, 125, -5060, -1389, 1131, -2265, -95, 3559, -898, -2856, 1984, 1279, -2067, 1729, 2086, -4247, -3132, 2087, 146, 602, 6139, 3155, -3588, -1797, -1313, -5166, -1133, 4933, 1136, -1350, 2258, -238, -4226, 994, 3195, -2092, -1237, 2286, -2236, -2344, 4892, 3828, -889, 1364, -89, -6834, -4089, 2517, 575, 740, 5679, 1451, -4740, -1036, 950, -3023, 477, 4720]
2062D720n802k101N626j252k820N013l21p814O38M007k798J888P688k439o008
2077a775K185p11n551M089O242l604j351L976l674m192N626J679n406J609K215
2092A357n740L48P671l06k763L544k207p712J922M903k197J701N502m086n362
2107c425L352K20m051L890L512n546r48M890j687j565N936k02o812L23J660l977
2123d430K173P229j533l578K341k421n496L326M447k954N26L716l446k611M870
2138B159R71m193J889P03n768J90N543l38p25M093j965o343J031K212k637K231
2154i47N322k467k910K714r09l321L125J625m339n62L431j914l00N127j48m357
2170h30L26ol949J597N180p15o87K680k160m095J826J460k802J016K842k412j184
$$ y = [4720, -1082, -3183, 2443, 1191, -1629, 3384, 3063, -4751, -4113, -106, -2904, -1016, 6672, 4233, -1775, 410, -301, -5852, -1763, 4479, 875, -476, 3500, -174, -4366, 1260, 2939, -2467, -858, 1357, -4383, -4035, 3636, 3330, 567, 4111, 1904, -5808, -3886, 1017, -1180, 521, 6023, 1937, -3425, -73, 147, -3904, -14, 3498, -2048, -2996, 1894, 207, -1358, 4578, 4376, -2436, -2113, -453, -4430, -2257, 4972, 3439, -139, 2202, -219, -5715, -2389, 2058, -896, -370, 3346, -100, -2711, 2159, 3130, -1063, 826, 1529, -4239, -4049, 1494, 1156, 431, 4524, 2559, -3784, -2753, -541, -3178, -947, 4375, 1908, -1002, 1712, 803, -2518, 607, 2232, -2107, -2669, 762, -1152, -1452, 3675, 3527, -830, -504, -510, -4459, -2862, 2318, 1603, 916, 3596, 1436, -2659, -833, 627, -2175, -1159, 1683, -729, -1913]
2187a913L654L11k265J386k7m090j38K867k12Q74L669j191l751N30l04k697J366
2204a931L291j278q89K695n37k114J617M78l009j31J499j195P24L480j10j857
2220G33O50j142l531M96K492n37N96K716n02k154O87L3k167M20J295j324K28K563
2238A552J11q47R91p83k953l09J069p20R89K787K23j210N51q42k051qQ07o22O09
2257f56J972j66l69R90p98k062l26J23r21P36K441O06k31P73p92k146n95J95n02
2276a728P91J774K84j3O45p64j541m60k46q76O49J768N83M82Q71n09j793o25m75
2295a183p74N63J385P11N91P13q02j278o66o04p72N09J285P06P17J037l27j225
2313E86r04p03r23K64J035Q68Q24Q31k09j035p97q26r11J25J035P56Q91J045O0
$$ y = [-1913, 1741, 2052, -213, 1173, 1146, -2944, -3082, -215, -427, 447, 4116, 2925, -826, -296, -600, -3297, -1931, 1360, 82, -807, 1888, 1351, -763, 854, 1332, -1677, -1808, -309, -1504, -780, 2700, 2590, 733, 1383, 241, -3290, -2794, -302, -839, -243, 2473, 1971, -183, 504, 537, -1630, -1210, 85, -1239, -1011, 1552, 1663, 816, 1807, 1024, -1929, -2238, -1169, -1889, -900, 1887, 2110, 900, 1451, 609, -1442, -1450, -643, -1265, -656, 1316, 1150, 781, 1771, 973, -1089, -1415, -1292, -2213, -1477, 964, 1570, 1339, 2112, 1320, -826, -1421, -1226, -1728, -937, 837, 1121, 1108, 1753, 989, -552, -1012, -1258, -2134, -1485, 283, 866, 1348, 2219, 1710, -83, -708, -1183, -1957, -1394, -9, 702, 1293, 2006, 1204, -74, -740, -1344, -2116, -1607, -322, 384, 1101, 2138, 1811, 586, -318, -1021, -1944, -1680, -645, 223, 1047, 1878, 1669, 634, -163, -989, -1900, -1775, -740, 16, 907, 1952, 2012]
2332B012q84r69q31j056j70P69R29O87R94L75o53r18q86j079l33P57R29P77J069
2351A519N96o84q76p53j263o49N31R11P67J160P81o86n63p56j296p63N51Q32N57
2370h4J183R45l53p08o77j196j208M43O43N44J268J166l06o50m22j463j248M67
2388a656O70L80J264J382m17m87p5j525j532L23L86j51J589J839j55n78J87j633
2406a89j828L93M53k13J687J781n32m80L88j559j645M84J49r38J634K092l62N7
2424A372R49j636k425L57k20p72J944K489o46o1P98k083k095R95pj065J552J960
2442A406r87M29J718j368k093M28p41j725J538K566k46O85J499k113k820O99k58
2459a383j478K219K350j309K97J829j769j785J350n52k622J280J784o61J290K803
$$ y = [2012, 1128, 159, -672, -1728, -1898, -1129, -200, 487, 1481, 1856, 1203, 285, -601, -1680, -2013, -1256, -327, 450, 1519, 2115, 1431, 555, -198, -1461, -2110, -1579, -668, 99, 1259, 2040, 1354, 791, 35, -1261, -2024, -1473, -641, -84, 1099, 2044, 1691, 983, 306, -890, -2098, -1655, -1012, -468, 800, 1966, 1660, 1010, 588, -875, -2123, -1656, -986, -606, 658, 2040, 1623, 1136, 1061, -464, -1996, -1673, -1287, -1438, 151, 1990, 1835, 1257, 1444, -189, -2017, -1624, -1171, -1384, 303, 2084, 1552, 1072, 1460, -99, -1744, -1260, -1111, -2049, -415, 1677, 1315, 1372, 2321, 685, -1740, -1383, -1603, -2375, -431, 2058, 1412, 1351, 2149, 66, -2029, -1034, -1041, -2106, -554, 1406, 419, 848, 2566, 1198, -895, -467, -1208, -2933, -1395, 1171, 925, 1610, 3109, 996, -1824, -1125, -1383, -2861, -642, 1708, 399, 696, 2525, 756, -1029, 321, -231, -2853, -1573, 211, -450, 840, 3643]
2475C643j631k617M37j266k594K437K837p26Q18J971k433k486J714m43k207J816
2491g30J548k078R13L177j082j448J372j926l670J310K369o60K235L106k412k781
2507g57R16j346k331K634K152k002P12K474k003j023K629j110l329R20P60k089
2523b793K409M073j037j516R64k930l595K147K487j048J791K601k704j966K290
2538A173q62k305J851M61l019J030L577p62L3K507k454m363Q63M85j289L153M039
2555D118j799j889J154k203k841K861J280k137J108K100k253M1L535q75l099M85
2571d14j046k817K384M146n35L94J680l274m061J523R56j110K555K482k447r40
2587e24K394j184j997K070k62l334N07K469n57J584L407j934l781j7q81k210K870
$$ y = [3643, 2012, -605, -168, -1434, -4028, -1591, 1246, 520, 1338, 3309, 876, -1610, 104, -339, -2546, -730, 818, -1260, -347, 2830, 1748, 300, 1672, -254, -3924, -2614, -245, -905, 1330, 4436, 2024, -757, 159, -1187, -3518, -884, 1268, -734, -22, 2452, 449, -574, 2055, 945, -2384, -1464, -704, -2793, -384, 3689, 2652, 1136, 2100, -830, -4425, -2278, 209, -839, 952, 3553, 849, -1117, 1173, 311, -1994, -143, 318, -2701, -1671, 1906, 1144, 1177, 3684, 1230, -3133, -2270, -1785, -3074, 79, 4118, 2319, 430, 1584, -619, -3460, -599, 681, -1456, -348, 1752, -501, -460, 3075, 2200, -899, -414, -1460, -4277, -1893, 2253, 1718, 2112, 3792, 518, -3543, -2020, -1064, -2174, 381, 2863, 416, -524, 1870, 686, -1311, 759, 497, -2837, -2330, 139, -418, 1166, 4573, 2639, -1142, -1159, -2040, -4250, -1380]
2604a380L804r63p1J294k601k462K276M33k276J028J495j787O95L470o89j771
2620D95P46j895l643J297L014K69J569K465k419l269P01p42j490K325K115j798
2636b60n5K187j099q60J912j118l400N50J025o32J947L446q50k030O5k053k730
2653c955J840K469m22R21J935j861j599J315n01j851J006M08j974J226L069j92
2669A834l77J013k179l270M74J068k06K235K574j308j225L58j513j845J499O92
2685a76j262J135J851q20J6J604j280k461J8j74j067J816K852n7j33M21k150k471
2703b338P30M12n88J741J767r27k1J105j178j548K71m66j441J034K073K51Q82
2720A759J077j769k061k33p18p23K016J928k52M63N87j385j561M00o18r96J179
$$ y = [-1380, 2424, 1461, 1390, 2684, 83, -2379, -103, 330, -1946, -918, 577, -1210, -515, 2955, 2266, 495, 1241, -654, -4297, -3000, 14, 283, 1852, 4317, 1898, -1371, -670, -1412, -2902, -577, 1538, -260, -315, 1872, 773, -87, 1825, 707, -2693, -2143, -1118, -1750, 197, 3643, 2793, 763, 828, -1225, -3955, -2115, 354, -68, 853, 2788, 927, -672, 643, 142, -1709, -703, -295, -2269, -1043, 2026, 1834, 1457, 2470, 291, -2979, -2505, -1437, -1643, 592, 3166, 1858, 633, 991, -522, -2367, -868, -176, -1438, -303, 1548, 728, 744, 2348, 1068, -1393, -1375, -1549, -2616, -800, 2052, 1995, 1862, 2283, 133, -2338, -1608, -1196, -1784, -43, 1724, 797, 776, 1881, 703, -845, -574, -1040, -2481, -1447, 626, 877, 1759, 2836, 1067, -994, -1227, -1945, -2668, -652, 1276, 1024, 1487, 2074, 689, -872, -472, -1090, -2086, -907]
2737i07J155n5R96J350j200j256m77j140j109J207J551M60R73R85j411j275j92
2754c45j125p47J252Q59J43J078R68r26o81l00j356j139Q12P89L76J478J108n76
2772A668j000n81j384r43P64Q05M05J401Q72n13p46k97j333j089M38N19L63J360
2790G09J182j70o26l14j507j102K62L89L85J383J189On00n36j231j243N6J67M58
2809a043J418J150M9l9l69j422j156k23J19L15J320J185L58k38l26j075j302l09
2827a588q4N05J022J287M39J58l83r66j218q15m4L14R63J269O60K1j6q82j472
2846h30n50j51k9P44J482Q95J11n9p02j309j009k25K6O80J155J097K30J12o12
2865A056j262q54m21k61O48J175R61L83K93l45j288j117l51l23N1J361J177L54
$$ y = [-907, 248, 193, 1189, 2539, 1339, 83, -394, -1534, -2643, -1436, 115, 575, 1548, 2533, 1122, -153, -345, -1470, -2217, -965, -106, 37, 1115, 2083, 1157, 476, 176, -1180, -2319, -1507, -718, -342, 1136, 2244, 1668, 668, 87, -1297, -2240, -1476, -671, -266, 1135, 2007, 1494, 748, 451, -882, -1971, -1533, -1014, -651, 709, 1891, 1721, 1095, 781, -726, -1828, -1566, -1177, -792, 591, 1780, 1786, 1286, 750, -481, -1724, -1668, -1501, -1043, 375, 1525, 1574, 1535, 1166, -256, -1412, -1635, -1516, -1201, 119, 1304, 1662, 1424, 1098, 23, -1279, -1588, -1672, -1167, -145, 1142, 1581, 1739, 1356, 390, -828, -1643, -1687, -1373, -410, 859, 1519, 1540, 1524, 642, -830, -1380, -1531, -1560, -816, 666, 1561, 1672, 1613, 911, -398, -1407, -1632, -1606, -926, 229, 1326, 1556, 1668, 1056, -206, -1060, -1481, -1742, -1094, 81, 1042, 1425, 1718, 1373, 85, -1032, -1383, -1706, -1655, -294, 883, 1237]
2883A237L90q6j267j177l79l80J10J318R96L57N63J6j329j056k87n25m65J242
2901g22J153N17O90L72j366j062m67o63l90J277J172L61O45M13j193j137j88q44
2919a432o26J024J120K40R61J021j311j045n0j422q05J158J115M25J147P45j267
2936I98j101r3j196q05J256Q51m0J089J078j112m10J24j596j399J119O71j2J712
2954A134J512j162r26j63j666j158J071Q96J12J432J041j265l94L56j497j160
2970a837R39N7l85J681J715p33j10L8k044j802Q07N44P4J954J498j005p12L60
2988A039j760j181J188J01p85J656J247o83J07J068j805j973N45l07o84K269K190
3005B232m76k6N0k263j675R72J61k24J843J019j223L42R10j462j300R30r40j464
$$ y = [1237, 1627, 1541, 274, -903, -1282, -1662, -1552, -234, 762, 1119, 1682, 1698, 369, -687, -974, -1499, -1964, -722, 431, 948, 1638, 2010, 644, -418, -885, -1548, -1938, -661, 511, 872, 1517, 1930, 737, -400, -588, -1432, -2058, -1034, 86, 326, 1287, 2308, 997, -48, -98, -1520, -2325, -1167, -52, 373, 1520, 2265, 998, -103, -196, -1392, -2197, -941, -90, -130, 959, 2037, 925, 515, 639, -957, -2356, -1237, -566, -578, 1134, 2646, 1484, 558, 395, -1271, -2429, -1358, -462, -350, 1082, 2123, 858, 464, 820, -677, -1837, -898, -841, -1226, 455, 2170, 1437, 1327, 1365, -679, -2481, -1674, -1130, -1056, 898, 2396, 1391, 679, 1039, -721, -1902, -714, -613, -1398, 258, 1505, 822, 929, 1997, 192, -1781, -1236, -1543, -2227, 42, 2232, 1756, 1730, 1780, -483, -2158, -1186, -1025, -1249, 594, 1613, 390, 732, 1642, 180, -1120, -190, -1130, -2594]
3023b594J949J791k50Q80J123k176k291K48l60p28K562J760r07K40M98k020j094
3040a369J383o47j372J606R81r51J352J960j715j536J76j520j683K114K192j42
3056H29Q78J020k417j700P02m46q23J985R00j042O72J333j268n37J035j763k156
3073b798J261J142l22K177J839j887j624Q0j743j126K402J462o59Q77J066j878
3089B69o33J128j062j438J072R3j058J841K186r39m35L42k365k122J500J188o9
3106e02K126J444k194j142N16j232r65J616K01j051J236J399q96L21J041j844
3122G4j920M88m7m43K529J936j007n56J54k238j448J415N51k24J483P95j355O8
3140B55J175j350r84M86p81r43J794J625j67N93O15k223k057N11j35n3K181J311
$$ y = [-2594, -645, 1146, 896, 1776, 2899, 723, -1568, -1320, -1680, -2408, 154, 1914, 1007, 1247, 1745, -275, -1369, 14, -633, -2005, -399, 582, -369, 983, 2943, 1228, -308, -132, -1652, -3335, -1221, 971, 829, 1707, 2727, 310, -1390, -688, -1134, -1957, 28, 928, -114, 558, 1891, 623, 86, 1121, -642, -2798, -1537, -395, -717, 1460, 3299, 1412, -212, -132, -1875, -3001, -599, 863, 204, 1081, 2147, 269, -364, 764, -298, -1736, -664, -571, -1629, 212, 2398, 1459, 1024, 1366, -999, -3121, -1621, -433, -502, 1624, 3068, 874, -268, 248, -984, -1949, -333, -132, -1183, 53, 1452, 556, 877, 1918, 74, -1846, -1358, -1405, -1848, 681, 2617, 1610, 1054, 1208, -1030, -2478, -1063, -512, -736, 747, 1542, 187, 255, 1430, 80, -904, -418, -1199, -2142, -348, 1277, 1110, 1703, 2318, 95, -1962, -1451, -1586, -1639, 542, 1853]
3158A853r37J18K34j568p27Q84n90p16J075Q61m73J119J133j631j326O1j103o37
3176b370J769J613Q5N06L99j848j243M62m79m16J397N43k18P32Q04j202o08K01
3194A27j279j002J090J091K06J301O78j139j148l58j150l59J258J133k64Q24M78
3211A487r69n28J45q85q94P35M45K48J188J036p66p05m17j218r36P70P64L91J351
3230A242N50r19n87j29j086o07P00L08J64J120J000n98j96l19j205j008K28K55
3248a087L84J378R94m25l61m09j146q29L09L76J69J162Q74k52j82m9j196q11j32
3267a233p9L31J223Q24J82P1l31j306r18m9n9M06J102J058J2j33k9j053r67j71
3287a119k13L75Q89P07M83J90r7r28r80l86k98K13Q87R80L46L02p5j018q22n52
$$ y = [1853, 916, 1034, 1268, -300, -1027, -143, -733, -1449, -374, 487, 14, 1133, 2266, 635, -691, -630, -1733, -2370, -601, 1012, 1097, 1603, 2002, 154, -1089, -627, -1106, -1522, -125, 418, 200, 932, 1736, 534, -74, 127, -1152, -2154, -1064, 27, 233, 1534, 2212, 1073, -75, -433, -1583, -1942, -684, 449, 185, 1009, 1487, 518, -10, 135, -750, -1644, -909, -464, -216, 972, 2008, 1242, 537, 120, -1098, -2034, -1264, -500, -109, 1242, 1792, 873, 286, 157, -929, -1536, -836, -528, -364, 756, 1756, 1158, 962, 643, -562, -1570, -1342, -1087, -703, 675, 1669, 1244, 883, 474, -672, -1501, -1192, -816, -647, 515, 1389, 1137, 955, 906, -290, -1101, -1233, -1312, -981, 242, 1066, 1248, 1319, 988, -318, -1236, -1285, -1344, -938, 164, 1222, 1234, 1101, 1072, 19, -948, -1119, -1332, -957, -68, 639, 1122, 1312, 1215, 287, -693, -1079, -1377, -1164, -277, 703, 1049, 1351, 1276, 258, -564, -1116]
3307a116l02L8Q63Q61O17L46L6q65r14m19n35lP43Q99O22L76K19q05q95m99o52
3328a385j99Q46Q37O47O74M5n23q66o48m76l76M82P28Q11O74R0m21q99n90n84
3348a133l82M17P73P55O12M21j64q84q44m43n12K86O32P74O15N15q9p52p42p68
3368i13n90K24P52N65Q10O49j18o64o07o58q91r5P95N37P71Q28O2p55n76o17q76
3389a367j31P85N97M92Q29J65m74m20p36q30l17M38M57O70Q27M28o37k37n83j049
3409a093m34N99L11O31J231K64o07k67m77j155m33M77J90M94R86O15l02k59m26
3428C45j226n28M24R2M96J323O14n28j9o42j318l93M32Q3J72J381N38m36N5k23
3448F42j067o94K96p5j03J457P10j74K81l75j469p14L57k67J83J579N11l06K19
$$ y = [-1116, -1418, -1380, -517, 344, 961, 1307, 1343, 478, -436, -855, -1390, -1393, -650, 249, 871, 1247, 1466, 661, -234, -733, -1385, -1584, -738, 99, 746, 1420, 1465, 942, 76, -572, -1048, -1424, -942, -214, 597, 1271, 1361, 940, 41, -549, -1133, -1515, -1098, -325, 430, 1042, 1463, 1299, 415, -429, -872, -1384, -1098, -466, 308, 923, 1438, 1349, 597, -145, -913, -1503, -1279, -527, 38, 848, 1497, 1379, 715, 108, -550, -1441, -1536, -741, -204, 567, 1395, 1457, 702, 126, -491, -1367, -1498, -713, -116, 376, 1205, 1370, 896, 476, -260, -1090, -1407, -969, -512, 158, 985, 1413, 776, 539, -44, -1093, -1527, -928, -617, 14, 1245, 1509, 902, 635, 158, -997, -1430, -953, -763, -269, 717, 1332, 1030, 771, 345, -881, -1409, -985, -893, -397, 926, 1540, 1012, 993, 351, -967, -1360, -928, -845, -673, 708, 1246, 810, 865, 642, -425, -1119, -823, -898, -1001, 456, 1166, 992, 1273, 898, -571, -1285, -928, -1195, -1012, 567, 1078, 772, 991]
3467I91M3j436m44L58n17m8J213M94J2N13K26j468o85o9o80N5J553Q08k17O88
3487A390n6j546o79M82o94n1J460L97m93P45M53j264m85N1r15n13J273P09R8J294
3507A656J61j695n97Rj005j09J652N34l84Q74K72j410k68L46r86m97J028K26r1
3526b84J550M65j069l40j57j534n48J390O13J1J293K26j497k90K66j070l59J153
3544a81l9l29J352L92o71N6M01j713q99P85J09J49J606R31j164l22l51j419l98
3563a705J327J09KJ165L14j052L79L72j334o76O43l21m66J591J040m11J32q6j783
3582g60q61O82KL78J632M29j077K6J74j205l05P37m77m93J128P36l65P10L12j431
3602b8j129K07m38q6J944J014n28K61n5j702p56P94k25k05J259M80p00N48O57
$$ y = [991, 1034, -402, -846, -488, -1005, -1053, 160, 654, 666, 1179, 1405, -63, -748, -817, -1497, -1442, 111, 919, 702, 1390, 1334, -212, -891, -409, -1103, -1154, 306, 703, 210, 955, 1408, 144, -341, -290, -1205, -1718, -445, 264, 362, 1656, 1817, 122, -475, -466, -1471, -1580, 72, 606, 222, 1096, 1368, -42, -310, 36, -950, -1447, -419, -193, -284, 1266, 1731, 662, 322, 165, -1369, -1917, -527, 86, 97, 1390, 1616, 119, -171, 95, -975, -1334, -181, -220, -549, 803, 1195, 524, 580, 981, -732, -1631, -846, -737, -588, 1018, 1949, 785, 463, 112, -1307, -1705, -378, -269, -267, 898, 1212, 160, 539, 911, -423, -1099, -456, -777, -1243, 348, 1388, 977, 1109, 1023, -760, -1621, -939, -937, -559, 1073, 1502, 425, 451, 625, -580, -885, -148, -625, -1118, 10, 746, 381, 1091, 1403, -28, -1157, -950, -1388, -1474, 470, 1484, 956, 1217, 1162, -540, -1296, -502, -727, -932, 327, 807, 107, 655, 1312]
3621A312j107p17K99q83m16J248Q71LQ80K10j742q64J78o25j0J660N73m65M24
3640H29K13j015m14K99o53n77R13N87j73J074O67j055q33k68r20l41J341Q33R
3659E16Q71m7j164o35J62n99k52R63L27k60Q43O63p38n53J4j016p25R20L30L63
3679a7J232O41j206n69k33q89m07J149L42j69P96N88p58k59L8r07n75M26K66M6
3699d65J129P83n16k00l69j193o19O66K90K43J150L80o30l08m2r36m04M25p0J39
3719e47Q20O04j25J51k83j021o70J82J06O7J335N60l47m1m00q79o18K95O7J55
3739e89J003M75j75J47r2r59n28n3j74J83Q81P12j5P1j85r70n66q0m6J63Q64N90
3761F57M4K61k18p23o09n2l62J26P37O50J47L97q8q80n14l15k65O9P22N73L08
$$ y = [1312, 205, -512, -213, -1096, -1512, -264, 607, 610, 1490, 1700, -42, -906, -728, -1353, -1363, 297, 870, 405, 829, 1042, 27, -387, -88, -741, -1318, -405, 182, 9, 1083, 1750, 695, -138, -406, -1326, -1667, -326, 507, 516, 1387, 1340, 176, -459, -297, -896, -1148, -185, 142, -118, 725, 1388, 650, 97, 111, -905, -1630, -710, -380, -17, 1215, 1856, 650, 81, -152, -1041, -1448, -299, 43, -126, 670, 1258, 500, 241, 279, -628, -1203, -777, -511, -465, 664, 1447, 931, 731, 362, -831, -1450, -784, -494, -251, 899, 1279, 649, 341, 299, -637, -1041, -616, -686, -547, 273, 877, 752, 903, 620, -401, -1071, -889, -783, -716, 619, 1179, 832, 791, 391, -488, -1106, -811, -744, -589, 414, 889, 714, 861, 769, -190, -718, -771, -945, -762, 119, 831, 816, 887, 702, -268, -834, -914, -960, -797, 67, 657, 701, 962, 744, 21, -588, -640, -1002, -876, -139, 511, 658, 1055, 967, 87, -427, -742, -1007, -938, -216, 357, 665]
3782F65L45j53n49o50j54m06j9N23N01M56K80J89n59n76m48k85p6N36N13M25M28
3803I86l3m31n66m17m11n8M96L98M10M45J82m49n39m52l68j39L69L19O80M12J35
3824I69j55o14l56n49k81L52L58M19N96J81l04k68n07n06k47J53M13M50L97M15
3844I16n4m61n57m48j84m6L92M03N18L98k7k96n55l63n54M0L75K71N82M51j8k62
3866E21l40n71l53m9K73K96N28M76J68k95l44n03o71P5J95K22N12O18O5j61k18
3887D44n32n89j29K7K29N77O60P5j82r0m02n60l95L04j1L95O91K14l4j97m54n75
3909e34k14J8kM75P76K42k8K0n00q44o1l9J11L67M93L25N3O4l46o43l32L9k53
3932h13L46P96L15J00J37m23o93m17l4l07M94P73K35RJ52j70p08k08o9k55J22
$$ y = [665, 1010, 857, 308, -342, -496, -902, -921, -398, 103, 559, 839, 1028, 469, -107, -555, -840, -916, -380, 133, 558, 986, 953, 522, -44, -461, -872, -930, -434, -36, 374, 819, 1001, 552, 13, -439, -807, -946, -577, -258, 422, 834, 969, 814, 200, -156, -705, -986, -634, -276, 143, 739, 920, 616, 348, -159, -665, -912, -759, -346, 104, 501, 916, 862, 401, -156, -604, -788, -834, -442, -39, 479, 877, 850, 554, -1, -364, -918, -878, -503, -232, 350, 801, 783, 521, 181, -390, -743, -792, -519, -223, 305, 781, 949, 654, 310, -193, -864, -789, -594, -372, 140, 758, 823, 662, 444, -88, -677, -806, -779, -550, 27, 687, 762, 580, 490, 88, -472, -867, -563, -574, -179, 512, 726, 692, 495, 41, -534, -748, -730, -732, -257, 519, 761, 733, 753, 253, -591, -652, -691, -580, -213, 280, 605, 658, 722, 376, -267, -599, -560, -813, -467, 329, 644, 744, 881, 458, -235, -652, -686, -993, -499, 274, 509, 518, 670, 500, -208, -416, -485, -740, -618]
3953f18O83K52J54M38j95p63l12j90l25K33P27K35J63M05k04p88k12j33l51J66
3973f35O75K1K55N26k28n13r0k32q06J50O66L29K32O99j04q24j20l70o29K64O51
3994h3J09K18P35l70m69k1j60q02P4N08O3J18Q08J37m57j03m55q54Q9O26J56M25
4016B92O31m8p42Qj84p07l2O84j58q8J000M0l66J98k80j008p6M03o0L58J051Q6
4038A002n40j05l43r18n2P76n0K77N77R9o68M00l9r73J4K22n30K69J043K54k44
4059D71K70l55j074k97M66k11K79J177Q9o79L38k01q94O5M49n14R7Q60L7j89O12
4080G96j7j187k07J87n78M19J159J84l55M42l55j125j3L87l39J88Q61j48j05N03
4100F97lq25K9l6o93l8J003K16j5P08k06j090j71P8p13M37J043Q3l58N22k27o29
$$ y = [-618, 65, 317, 471, 909, 714, -49, -361, -551, -876, -643, 84, 319, 482, 887, 683, -105, -317, -450, -801, -635, 40, 61, 316, 842, 614, 101, 11, -221, -1027, -877, -211, 118, 350, 1049, 945, 121, 1, -369, -998, -734, -83, 26, 244, 979, 609, 140, 119, -41, -843, -769, -261, -198, -80, 728, 865, 408, 305, -150, -1004, -915, -289, -133, 292, 923, 875, 133, 141, -43, -750, -782, -98, -256, -344, 656, 696, 330, 528, 248, -760, -836, -433, -493, -135, 916, 1002, 462, 357, 14, -904, -956, -180, -230, 47, 624, 723, 55, 455, 416, -557, -543, -321, -851, -582, 461, 715, 471, 741, 386, -688, -985, -519, -730, -451, 726, 815, 136, 474, 273, -621, -556, -107, -621, -524, 336, 373, 184, 796, 779, -408, -615, -428, -1006, -587, 572, 756, 401, 843, 488, -637, -650, -263, -602, -414, 447, 299, 194, 697, 694, -131, -102, -138, -831, -869, 134, 350, 335, 1043, 837, -253, -424, -346, -1059, -622, 421, 504, 146, 668, 441, -188]
4122a88m2J30n01j23O61O5p1R03J98r27j49l18p11J76Q05M48j16O13j72p66j89
4143b74L6m96J61P09p1j67O91R7n62M9j8q83j81O10J93K56P58M2p37k53m7p05
4165g92n2Q01l9J19N59L8n67P6J07q01k68O23j34J67P30K33m59j9j81r12o8N27
4187c12J69J52O77q8m53J28j95p00q2M46j19J02P09L20m24J06m2q43l16K21J47
4208c97J73Q11P9k99Q2l85m43k60K78lO3P42P9j66J26k18o30j18Q3r2J01O25L83
4231F14k32J95l00o27k00J34j18J89O75J27o1J26j64m95k60J1j60N7N48L29NK55
4253F48k05l56l56k07m9j0N70K87Q8J01j2n65j45q1k58J23L32L81J8J84R3n00
4275H1k24k78k36J67K74L52K55L44k0n22l17k75k61J69L39L09K49O7J39m32k58
$$ y = [-188, -230, -100, -601, -724, -63, 2, -69, 834, 1032, 105, -44, -362, -1073, -897, -92, 356, 240, 853, 681, -85, -274, -238, -734, -573, 136, 65, -102, 589, 686, 124, 173, 155, -728, -909, -299, -106, 150, 908, 950, 213, -40, -87, -792, -844, -43, -82, 37, 596, 634, 67, 143, 250, -551, -819, -196, -330, -163, 567, 800, 341, 322, 141, -771, -839, -312, -143, 9, 686, 598, 145, 273, 78, -622, -704, -258, -377, -275, 434, 754, 330, 436, 394, -449, -765, -544, -397, -224, 587, 666, 367, 449, 64, -379, -639, -361, -364, -301, 441, 520, 354, 480, 262, -368, -486, -403, -495, -394, 231, 614, 382, 577, 277, -350, -550, -416, -534, -345, 330, 457, 396, 522, 358, -137, -397, -386, -546, -489, 59, 388, 393, 648, 443, 87, -269, -476, -525, -535, 35, 322, 410, 511, 499, -66, -211, -292, -550, -427, -95, 286, 304, 488, 581, 81, -143, -421, -657, -490, -216, 136, 391, 735, 715, 193, -124, -399, -660, -491, -152, 157, 406, 473, 612, 180, -78]
4296g8n3m42K8K95L18K57J53O7j87l39k41l23j7L05J77L43L27j4l68j03l02k78
4318d75j29K77L21J94K76J41j73m02j04l72p2j0L75K45L68J84l69l3l52k58j42
4339e10J54J62K86K79J25r8j42l05k39j98rK03J70L83J45Jj12j68m79j90J00J63
4361b79J44L78L29q7j64k22k43l55K8J65J92K42K56N4j56j22k79l46J02M0J00
4382b23L48K94o5j0n9l82l78p5KK31L73K56J87k24N9l62l43j63J23J27K86L53
4404C55pm8J8l32l59K0n8r4L99L70J28k2Q2l78l29p3p6K2L24M11q8J21n9j85k65
4429a23j21qj48K90K19J65K6K61l68m66M7j98n2L16L79L0J37J33k97m31Rj95q9
4452d84K90L12k2K22L10k75l41n6m14nK70K24J68K28J71l77k90p9k98j19K61K79
$$ y = [-78, -131, -573, -545, -250, 68, 325, 478, 545, 358, 19, -222, -545, -562, -257, -80, 263, 590, 576, 208, 105, -197, -475, -604, -327, -6, 188, 464, 605, 432, 30, -74, -446, -518, -528, -153, 92, 460, 644, 275, 242, -110, -368, -510, -356, -194, 92, 371, 496, 398, 256, -49, -288, -486, -495, -292, -122, 261, 406, 407, 295, 127, -352, -542, -442, -279, -135, 243, 572, 485, 321, 99, -144, -499, -471, -306, -114, 128, 384, 438, 282, 160, -119, -465, -363, -323, -223, 125, 419, 354, 344, 285, -97, -475, -550, -548, -317, 56, 312, 499, 275, 334, -28, -371, -534, -411, -284, 2, 355, 348, 300, 318, -14, -373, -353, -411, -505, -106, 264, 392, 370, 452, 74, -255, -328, -404, -382, -58, 353, 265, 386, 327, 142, -123, -244, -252, -400, -110, 109, 274, 300, 561, 193, -273, -226, -424, -476, -160, 219, 249, 386, 519, 222, -209, -200, -395, -484, -194, 118, 96, 318, 628, 353, 12, -44, -458, -463, -193, 31, 199, 427, 598, 221, -69, -148, -446, -565, -304, -25]
4474b5J72J22K24j35m56N6k26k88K95K67r0L43K63j22l44m6k12m89L32K85n1L88
4496B63K76k00k10k2l37k72K34K33j26L79K76k54k30L21n08l08J00K10p9L05N62
4517F13k31k42L7l72m81N11J19j48M21L02k94j88J69j73m96J45Q9j86M60L72M0
4538D67k52J10l32n06K10Ok3L55M89k14j54K09m79l93K56J16k63L85L41k03N1
4559A76L08l47n08J55k07n5M78M88j14q7P9m11n26L12Km0J75M28j08j1L20l64
4581A43m66K46j19l42L34L98R5M3L37m25n10k8L9l09M83M64k39k2K73k42l39K0
4603a66m1k94J73M54j69J55M61j40n77J8j36l60K64O20j14J90K88l70m64R7j24
4624b35j77K82L05j64Q6L79j64l78J81k16n19J69L66J12J95K65j35k48m2l11l09
$$ y = [-25, 147, 269, 493, 358, -98, -42, -268, -556, -261, 6, -84, 259, 522, 400, 56, 10, -202, -691, -359, -74, -125, 263, 539, 339, 129, 107, -230, -502, -268, -35, -161, 218, 494, 240, 10, 331, -177, -485, -385, -175, -254, 51, 613, 382, 140, 177, -195, -676, -165, -46, -194, 227, 529, 235, 47, 216, 43, -453, -308, -219, -405, 55, 427, 467, 215, 325, -7, -513, -303, -297, -320, 35, 524, 310, 156, 365, -114, -507, -251, -135, -398, -13, 328, 125, 176, 484, 137, -371, -216, -423, -478, 0, 488, 374, 287, 366, -45, -571, -259, -257, -297, -122, 306, 198, 187, 507, 143, -323, -77, -196, -538, -204, 194, 289, 332, 669, 244, -266, -294, -255, -564, -81, 383, 144, 122, 395, 153, -186, -166, -207, -501, -328, 126, -43, 112, 573, 433, -144, -126, -262, -622, -358, 262, 148, 338, 626, 256, -208, -111, -235, -412, -130, 175, 11, 97, 476, 312, -66, 115, -101, -620, -451, -85, 27, 222, 487, 352, 104, 62, -249, -558]
4645e58J39N37j27M4L53r7l10J38k15l90J88K77j06J29M88q6j97j31k09m61J36
4666d58K86J31K55L28j95k76jj42l30J51L08k19K24K08rj08K34m19m34N1J92P8
4688a45R2M53p3j97R5l06l79J9M08l11L45L71j54M4J54k52l50q7J01j63L16L46
4710C27n4n3P4j71m53n3J55kK44K69m2j3J57m06k79J01N1k9R9L99j64N4R9j46
4734A64m72l3O9r1J36L78Q9nJ08p9m44j73J61j12P3L84J08k2m8%k05j73J7j17
4758b87n6L77J00J82Q3j32l01j96N6k24K02L58K3rO4j2l51P2k21j76J05K26K06
4781H9P3J72r5k37m7j60k36J28K90J17J00J73j55q7k11k2k27J07J76J89Q5K22
4803D44k76p1j29j51j70l0K98R4J56K40j16k81k9j15j96J2Q9J93K13J85o4j13
$$ y = [-558, -419, 118, -9, 35, 388, 291, -19, 119, -96, -486, -298, -21, -127, 2, 490, 404, 207, 76, -133, -594, -458, -172, -41, 214, 542, 347, 71, 70, -72, -402, -251, 57, -162, 62, 270, 261, 153, 387, -32, -466, -415, -223, -145, -53, 400, 327, 130, 225, -81, -460, -441, -33, -344, 1, 372, 218, 262, 416, 164, -186, -273, -172, -335, -19, 327, 273, 220, 294, 123, -330, -383, -228, -230, 14, 283, 241, 228, 385, -21, -300, -199, -148, -177, -78, 321, 157, 211, 310, 164, -308, -341, -272, -363, -227, 151, 240, 235, 343, 264, -180, -353, -192, -304, -231, 153, 261, 239, 191, 191, -14, -187, -170, -287, -343, 34, 134, 316, 399, 267, -34, -230, -174, -398, -196, 162, 185, 176, 240, 228, -123, -51, -272, -448, -343, -117, 89, 162, 334, 239, 2, -45, -205, -441, -313, -23, 94, 194, 367, 212, 125, -86, -108, -335, -228, -52, 137, 222, 444, 168, 97, -32, -183, -353, -383, -85, 9, 165, 405, 289, 8, -21, -136, -332, -320, -231, -38, 175, 360, 296, 183]
4825A83j16k89p3p6J79R4K90J88l1r6k89j35q1L0j21K22J78K63N8j42j95j26j33
$$ y = [183, 67, -222, -295, -371, -192, -98, 192, 380, 349, 253, -36, -171, -252, -222, -343, -121, 57, 320, 378, 236, 41, -85, -218]
$$ [...]
8191a02
##END NTUPLES=NMR FID
##END=
