##TITLE=1H_DE-80H_X3
 200.13MHz, d2o
 8 sc
 
 19ns.26.2.2025
##JCAMPDX= 6.0         $$ Bruker NMR JCAMP-DX V2.0
##DATA TYPE= NMR FID
##DATA CLASS= NTUPLES
##ORIGIN= UXNMR, Bruker Analytische Messtechnik GmbH
##OWNER= pz
$$ XWIN-NMR		Version 3.5
$$ Thu Feb 12 13:56:11 2026 Russian Standard Time (UT+4h)  Yarkov@DPX200
##.OBSERVE FREQUENCY= 200.1313
##.OBSERVE NUCLEUS= ^1H
##.DELAY= (6, 6)
##.ACQUISITION MODE= SIMULTANEOUS
##.ACQUISITION SCHEME= undefined
##.AVERAGES= 8
##.DIGITISER RES= 18
##SPECTROMETER/DATA SYSTEM= spect
##.PULSE SEQUENCE= zg30
##.SOLVENT NAME= D2O
##.SHIFT REFERENCE= (INTERNAL, D2O, 0, 14.3821)
##AUDIT TRAIL= $$ (NUMBER, WHEN, WHO, WHERE, WHAT)
$$ ##TITLE= Audit trail, XWIN-NMR		Version 3.5
$$ ##JCAMPDX= 5.01
$$ ##ORIGIN= Bruker BioSpin GmbH
$$ ##OWNER= Yarkov
$$ C:/Bruker/XWIN-NMR/data/yarkov2/nmr/H-C/1/audita.txt
$$ ##AUDIT TRAIL=  $$ (NUMBER, WHEN, WHO, WHERE, WHAT)
(   1,<2026-02-12 13:55:27.37 +0400>,<Yarkov>,<DPX200>,
      <created by zg, POWCHK disabled, PULCHK disabled
       configuration hash MD5:
       00 E9 B6 7A A2 85 ED C7 34 08 36 98 17 FE 4E 26
       data hash MD5: 16K
       85 4B 0C F8 14 EB D4 87 38 F7 BC 71 60 C3 51 D7>)
$$ ##END=
$$ 
$$ hash MD5
$$ 5F B2 2A 19 84 7C 1E 06 1B 77 A8 8A 2D 5F D0 C5
##$RELAX= 
##$RELAX= 
##$RELAX= 
##$RELAX= 
##$RELAX= 
##$RELAX= 
$$ Bruker specific parameters
$$ --------------------------
##$DU= <C:/Bruker/XWIN-NMR>
##$EXPNO= 1
##$NAME= <H-C>
##$PROCNO= 1
##$TYPE= <nmr>
##$USER= <yarkov2>
##$AMP= (0..31)
100 100 100 100 100 100 100 100 100 100 100 100 100 100 100 100 100 100 
100 100 100 100 100 100 100 100 100 100 100 100 100 100 
##$AQSEQ= 0
##$AQ_mod= 1
##$AUNM= <au_zg>
##$AUTOPOS= <>
##$BF1= 200.13
##$BF2= 200.13
##$BF3= 200.13
##$BF4= 200.13
##$BF5= 200.13
##$BF6= 200.13
##$BF7= 200.13
##$BF8= 200.13
##$BYTORDA= 1
##$CFDGTYP= 0
##$CFRGTYP= 5
##$CHEMSTR= <none>
##$CNST= (0..31)
1 1 145 1 1 1 1 1 1 1 1 1 1 1 1 1 1 1 1 1 1 1 1 1 1 1 1 1 1 1 1 1 
##$CPDPRG= <>
##$CPDPRG1= <>
##$CPDPRG2= <>
##$CPDPRG3= <>
##$CPDPRG4= <mlev>
##$CPDPRG5= <mlev>
##$CPDPRG6= <mlev>
##$CPDPRG7= <mlev>
##$CPDPRG8= <mlev>
##$CPDPRGB= <>
##$CPDPRGT= <>
##$D= (0..31)
0 0.7 0 0 0 0 0 0 0 0 0 0.03 0 0 0 0 0 0 0 0 0 0 0 0 0 0 0 0 0 0 0 0 
##$DATE= 1770890126
##$DBL= (0..7)
120 120 120 120 120 120 120 120 
##$DBP= (0..7)
150 150 150 150 150 150 150 150 
##$DBP07= 0
##$DBPNAM0= <>
##$DBPNAM1= <>
##$DBPNAM2= <>
##$DBPNAM3= <>
##$DBPNAM4= <>
##$DBPNAM5= <>
##$DBPNAM6= <>
##$DBPNAM7= <>
##$DBPOAL= (0..7)
0.5 0.5 0.5 0.5 0.5 0.5 0.5 0.5 
##$DBPOFFS= (0..7)
0 0 0 0 0 0 0 0 
##$DE= 6
##$DECBNUC= <off>
##$DECIM= 32
##$DECNUC= <off>
##$DECSTAT= 4
##$DIGMOD= 1
##$DIGTYP= 9
##$DL= (0..7)
0 120 120 120 120 120 120 120 
##$DP= (0..7)
150 150 150 150 150 150 150 150 
##$DP07= 0
##$DPNAME0= <>
##$DPNAME1= <>
##$DPNAME2= <>
##$DPNAME3= <>
##$DPNAME4= <>
##$DPNAME5= <>
##$DPNAME6= <>
##$DPNAME7= <>
##$DPOAL= (0..7)
0.5 0.5 0.5 0.5 0.5 0.5 0.5 0.5 
##$DPOFFS= (0..7)
0 0 0 0 0 0 0 0 
##$DQDMODE= 0
##$DR= 18
##$DS= 0
$$ [...]
##$SUBNAM2= <"">
##$SUBNAM3= <"">
##$SUBNAM4= <"">
##$SUBNAM5= <"">
##$SUBNAM6= <"">
##$SUBNAM7= <"">
##$SUBNAM8= <"">
##$SUBNAM9= <"">
##$SW= 18.0517328524113
##$SWIBOX= (0..15)
0 0 2 0 0 0 0 0 0 0 0 0 0 0 0 0 
##$SW_h= 3612.71676300578
##$TD= 16384
##$TD0= 1
##$TE= 0
##$TE2= 300
##$TE3= 300
##$TEG= 300
##$TL= (0..7)
0 120 120 120 120 120 120 120 
##$TP= (0..7)
150 150 150 150 150 150 150 150 
##$TP07= 0
##$TPNAME0= <>
##$TPNAME1= <>
##$TPNAME2= <>
##$TPNAME3= <>
##$TPNAME4= <>
##$TPNAME5= <>
##$TPNAME6= <>
##$TPNAME7= <>
##$TPOAL= (0..7)
0.5 0.5 0.5 0.5 0.5 0.5 0.5 0.5 
##$TPOFFS= (0..7)
0 0 0 0 0 0 0 0 
##$TUNHIN= 0
##$TUNHOUT= 0
##$TUNXOUT= 0
##$USERA1= <user>
##$USERA2= <user>
##$USERA3= <user>
##$USERA4= <user>
##$USERA5= <user>
##$V9= 5
##$VALIST= <valist>
##$VCLIST= <CCCCCCCCCCCCCCC>
##$VD= 0
##$VDLIST= <DDDDDDDDDDDDDDD>
##$VPLIST= <PPPPPPPPPPPPPPP>
##$VTLIST= <TTTTTTTTTTTTTTT>
##$WBST= 1024
##$WBSW= 4
##$XGAIN= (0..3)
0 0 0 0 
##$XL= 0
##$YL= 0
##$YMAX_a= 108907
##$YMIN_a= -108071
##$ZGOPTNS= <>
##$ZL1= 120
##$ZL2= 120
##$ZL3= 120
##$ZL4= 120
##$ABSF1= 10
##$ABSF2= 0
##$ABSG= 5
##$ABSL= 3
##$ALPHA= 0
##$AQORDER= 0
##$ASSFAC= 0
##$ASSFACI= 0
##$ASSFACX= 0
##$ASSWID= 0
##$AUNMP= <proc_1d>
##$AZFE= 0.1
##$AZFW= 0.1
##$BCFW= 1
##$BC_mod= 2
##$BYTORDP= 1
##$COROFFS= 0
##$CY= 83.5205535888672
##$DATMOD= 1
##$DC= 2
##$DFILT= <>
##$DTYPP= 0
##$F1P= 10.8118882576601
##$F2P= -7.23987719738617
##$FCOR= 0.5
##$FTSIZE= 0
##$FT_mod= 4
##$GAMMA= 1
##$GB= 0.15
##$INTBC= 1
##$INTSCL= 1
##$ISEN= 128
##$LB= 0.25
##$LEV0= 0
##$LPBIN= 0
##$MAXI= 10000
##$MC2= 0
##$MEAN= 0
##$ME_mod= 0
##$MI= 1.114404
##$NCOEF= 0
##$NC_proc= 0
##$NLEV= 6
##$NOISF1= 3.799351
##$NOISF2= 2.8
##$NSP= 1
##$NTH_PI= 0
##$NZP= 0
##$OFFSET= 14.38212
##$PC= 1
##$PHC0= -5301.748
##$PHC1= 6.821927
##$PH_mod= 1
##$PKNL= yes
##$PPARMOD= 0
##$PSCAL= 0
##$PSIGN= 0
##$REVERSE= no
##$SF= 200.129724274929
##$SI= 16384
##$SIGF1= 3
##$SIGF2= 2
##$SINO= 400
##$SIOLD= 16384
##$SREGLST= <1H.CDCl3>
##$SSB= 0
##$STSI= 0
##$STSR= 0
##$SW_p= 3205.1282051282
##$SYMM= 0
##$S_DEV= 0
##$TDeff= 0
##$TDoff= 0
##$TI= <>
##$TILT= no
##$TM1= 0
##$TM2= 0
##$TOPLEV= 0
##$USERP1= <user>
##$USERP2= <user>
##$USERP3= <user>
##$USERP4= <user>
##$USERP5= <user>
##$WDW= 1
##$XDIM= 8192
##$YMAX_p= 0
##$YMIN_p= 0
$$ End of Bruker specific parameters
$$ ---------------------------------
##NTUPLES= NMR FID
##VAR_NAME=  TIME,          FID/REAL,        FID/IMAG
##SYMBOL=    X,             R,               I
##VAR_TYPE=  INDEPENDENT,   DEPENDENT,       DEPENDENT
##VAR_FORM=  AFFN,          ASDF,            ASDF
##VAR_DIM=   8192,          8192,            8192
##UNITS=     SECONDS,       ARBITRARY UNITS, ARBITRARY UNITS
##FACTOR=    0.0002768,     1,               1
##FIRST=     0,             0,               0
##LAST=      2.2672688,     0,               0
##MIN=       0,             -108071,         0
##MAX=       2.2672688,     108907,          0
$$ Real data points
##PAGE= N=1
##DATA TABLE= (X++(R..R)), XYDATA
$$ [...]
1817C580k279k661k114r85P49J762K646K170J074m43j658k379k089j210L74J778
1833a685K388K158J219j11j577k515k536j373k62J334K207K628J779L26j118j928
1849I34k115j914q13J041K211K127J652P13o86k240k473j971p50O59J938K438
1865G51K044J243q2j505k697k483o48K81Q09J748K849J763p07j789j651j651k009
1882c734p38J669K823K169J234O46o76k166k502j948p33N55K305K427J200M51
1898B982L44j338l354k554L44J370N53J355L145K364j303k848j415j166j903j176
1914d600J688L011K028Q69L37q44k155k102j378q00R77K991K641N17j08K63j105
1931B230l844l066N73K108N56R17K962K555j151l244j786o75j177o40J618K888
$$ y = [3580, 1301, -1360, -3474, -4459, -3710, -1948, 698, 2868, 3942, 3499, 1841, -538, -2627, -3837, -3463, -1685, 703, 2861, 4080, 3969, 2392, -123, -2659, -4032, -4294, -2960, -753, 1875, 3654, 3980, 2862, 934, -1181, -3095, -3908, -2867, -656, 1471, 3123, 3836, 3150, 910, -1563, -3534, -4284, -3625, -1687, 751, 2795, 4038, 3956, 2451, -246, -2729, -3377, -3096, -2287, -539, 2310, 4073, 3366, 1577, -74, -1725, -3734, -4472, -2803, 20, 2189, 3423, 4069, 3393, 1227, -1275, -3223, -3956, -3401, -1096, 1331, 2531, 2982, 3326, 1988, -1366, -3920, -3576, -2206, -1653, -298, 2847, 5211, 3908, 1060, -355, -1521, -3424, -4600, -2912, 99, 2127, 2996, 3333, 2489, 334, -1768, -3146, -3946, -2969, 22, 2663, 3180, 3072, 3335, 2230, -1614, -4680, -4107, -1999, -1443, -526, 2436, 4991, 3840, 596, -1190, -1865, -3042, -3682, -2064, 824]
1947H24K209Q36m81j673k241j958j053q49J122L241L008M57p63J19q14l410l147
1964d573O32K625J276N03K281J939j294l346k319p80n95K41J794K679K152J098
1980D313m94k261k282j569o97o12R90L082K947P2j138o12j182k927k297O82K482
1997a503K064J182J562R18j011k737k609j203j74P39K010K031J539R93q33k468
2013E00k431j135j77J72J561L007K277L21j275j575j698k157j583L67K115K365
2029F54J557J081J17j428k220k085j237J26J679K273J643J522K74j366k622k352
2045b384j117k34J025J923K258J886L21j014j915j908j645p42Q93J903K105J682
2061C037O94p84j854k208j879j017O15J970J998J981J158l54j514k077j950j091
$$ y = [824, 3033, 3869, 3388, 1715, -526, -2484, -3537, -4386, -3264, -23, 2985, 3442, 2679, 2798, 1984, -1426, -4573, -3941, -1316, -40, 463, 2744, 4683, 3389, 43, -2276, -3056, -3651, -3410, -1616, 1063, 3215, 4313, 3819, 1558, -724, -2293, -2990, -3602, -2612, 470, 3417, 3489, 2351, 1739, 557, -2370, -4667, -3985, -1503, 561, 1743, 3305, 4223, 3212, 475, -2134, -3337, -3511, -2772, -762, 1269, 2808, 3801, 2968, 500, -1931, -3066, -3243, -3071, -1510, 1497, 3774, 4095, 2820, 1245, -453, -2610, -4193, -3826, -1711, 654, 2211, 3292, 3409, 1981, -239, -2324, -3561, -3435, -1756, 517, 2160, 3682, 3956, 2590, -32, -2384, -3501, -3735, -2710, -787, 1471, 3357, 3678, 2664, 749, -1159, -2804, -3546, -2653, -750, 1355, 3037, 3731, 2947, 1093, -1115, -2994, -4011, -3396, -1426, 572, 2553, 3711, 3357, 1843, -234, -2184, -3275]
2077c275K06J212K111J995J153k02j154k083k067j555N7J368J869K181J593J74
2093C583q96j778k246j685k69Q54J449J891J665O88o49j823j998j641n20M34J732
2110a209K172J875P61n25j482k108j781r57J34J175K208J874P23j21r34j703k035
2127a933j282J69J187J840J791J311L19r80j947k089j444l11J019J491J853J474
2143B468P43n24j930j998j104l41J16J294K269J789L96o32j382j715j638j061
2159c250J46J501J986J561R05j29r04j676j702j435pJ482J831J140R67O25q32
2176B209k054k025r46j74O37J398K008J804L41r29j358j665j429n04L09J254J861
2193G37J639M48o80j226j276j652j323L96J690J858J108Q46L11p17k054j968p93
$$ y = [-3275, -3069, -1857, 254, 2249, 3402, 3200, 2046, -37, -2104, -3659, -3602, -2234, -365, 1816, 3409, 3583, 2687, 909, -1337, -3022, -3291, -2437, -988, 903, 2568, 3256, 2607, 784, -1214, -2855, -3375, -2941, -1209, 963, 2838, 3599, 3074, 1592, -516, -2297, -3254, -3120, -1945, 263, 2137, 2860, 2739, 1805, 102, -1933, -3215, -3046, -1859, -19, 1772, 3083, 3402, 2422, 475, -1614, -3058, -3369, -2350, -859, 994, 2468, 3211, 2687, 757, -1241, -2345, -2686, -2570, -1276, 993, 2782, 3178, 2546, 1164, -551, -2189, -3250, -3104, -1603, 383, 1944, 2849, 2720, 1816, 140, -1562, -2997, -3004, -1522, 309, 1449, 2416, 3041, 2209, 155, -1870, -2816, -2990, -2353, -955, 1053, 2857, 3198, 2269, 911, -754, -2183, -2687, -2378, -1124, 737, 2376, 2824, 2144, 918, -358, -2010, -3333, -2937, -1247, 611, 1719, 2565, 2876, 2159, 105, -1863, -2656]
2210b656J96Q66J175J735J214J50j031j576j529r35l04P39J366J833J459K05q84
2227B023j252j359j477q22L95J521J831R97M05q7q85j791j629l48L34J047J379
2244B82J456R09K3j079j767j347r09J1P32J342J571J177K45r34j461j213j137
2261b099m70P13J486J609Q45M43n80j089j656j424m61N84J088J419J449P13j68
2278B402j167j679j185o44J39Q08J639J347P77j65j065j332j492p05j44P72J447
2295b47J505J092L1n63j256j429j200l05N15J296J313J172L75l92j194j423j305
2312b015m01L86R90J585J211O64l53j045j317j293p19mJ071J364J218P72R7r84
2330A227j309j385n90j7N82J221J719Q99J7p16j097j374j332j92O31J050J439
$$ y = [-2656, -2460, -1594, -419, 1316, 2530, 2680, 1649, 73, -1456, -2391, -2695, -1956, -590, 1243, 2702, 2907, 2023, 771, -588, -2065, -2887, -2492, -971, 860, 1857, 2262, 2175, 1290, -501, -2130, -2478, -2144, -1097, 282, 1738, 2647, 2670, 1591, -176, -1523, -2432, -2421, -1689, -347, 1224, 2401, 2646, 1712, 251, -962, -2099, -2569, -1856, -370, 1239, 2084, 2527, 1947, 858, -798, -2222, -2683, -2099, -1011, 408, 1857, 2570, 2402, 1235, -444, -1629, -2273, -2134, -1326, 313, 1660, 2437, 2272, 1207, -125, -1617, -2322, -2466, -1694, -247, 1258, 2350, 2381, 1818, 562, -867, -2067, -2372, -1857, -561, 752, 1924, 2299, 1907, 713, -710, -2015, -2416, -2030, -1040, 545, 1756, 2420, 2067, 1022, -295, -1588, -2307, -2311, -1240, 124, 1342, 2114, 2211, 1227, -82, -1467, -2057, -2074, -1492, -271, 1448, 2347, 2364, 1648, 551, -823, -2155, -2347, -1716, -666, 773]
2347G73J064M51m51j116j342j188m64M22J225J258R88O60Rj157j726j265j87J88
2365a858N60J176J655Q36m19q79r13j123j025l77R66J417J220P05K64o30j188
2382C87j311j144m32O91J448J310N05M95Q6j033j919j076J25L94M83J090J610
2399A709P10n23j322j048q50p70k13J040J633J208M55j32p49r65j205j049k56
2416b327R14J558J035L59K12nj144j882r89J36R69N74J013J445N73o14j489r83
2434f45r13l42J40Q03J371J216N81n91j060r04q76q33q8J017J603J152J66k58
2452A539j08j094j662r91L72Q17R65R22R50L96n44j450j222n52j12L88P79J131
2470E24J224M05m59j401j011q14l77r3J018J600J167j2l07m81j215j178p35L51
$$ y = [773, 1837, 2288, 1837, 721, -621, -1809, -2273, -1851, -626, 632, 1620, 2280, 2289, 1132, -594, -1859, -2046, -1858, -1298, -122, 1533, 2369, 1950, 1071, 158, -965, -1990, -2367, -1401, 16, 1236, 1941, 2205, 1575, 387, -924, -2068, -2500, -1809, -361, 949, 1454, 1949, 2035, 1002, -917, -1993, -1868, -1474, -991, 99, 1709, 2419, 1896, 574, -474, -1324, -2094, -2307, -1267, 366, 1574, 2029, 1897, 1148, 183, -1022, -2071, -2327, -1413, 145, 1180, 1539, 1751, 1746, 602, -1280, -2269, -2133, -1164, -590, 423, 1868, 2441, 1827, 338, -645, -1558, -1900, -1760, -957, 414, 1630, 2211, 1620, 560, -344, -1220, -2053, -2141, -1124, 479, 1631, 1797, 1539, 1431, 337, -1325, -2316, -1944, -1127, -162, 760, 1710, 2106, 1562, 112, -1110, -1662, -1774, -1386, -607, 524, 1748, 2153, 1694, 293, -718, -1532, -1909, -2002, -984, 616, 1783, 1771, 1464, 983, -232, -1410, -2145, -1794]
2488a794J075J108Q41M90J24o38j279j072q56J53P64Q85J069Q37M67p80j247j134
2506i87o57j72L72J058J227Q28J94m56j068q51q75o54M78J084J029J100J15k17
2524A548o93j089j133n76K69Q33R84J094O93k07p35j012j150n82N6O80J034J024
2542A038P92m6n78j010j152o98n6M53Q84J200P66J92n26p59j214p41k23M30P41
2561e07J030R24K59l52p13j082r31l67K38O57J125J004L97m1q07j035r11n50M1
2580a621O60J040R00N76Nl63j051r93q18j9O49P81R70P11K41l85r76j092o08j86
2600a579L15O71J089Q44K22k35q48q91o36l96mO06J082R97K88o7n47j045r34m85
2620a553oO27J121O51P27L2n08j049q98p61K05M84P91O76Q89K92n74j001q09m98
$$ y = [-1794, -719, 389, 1230, 1720, 1844, 1206, -73, -1145, -2001, -1848, -1084, -199, 870, 1707, 2174, 1394, 147, -987, -1644, -1816, -1444, -386, 841, 1669, 1863, 1407, 339, -512, -1387, -2041, -1563, -479, 550, 1650, 1765, 1548, 855, -234, -1367, -1943, -1674, -841, 143, 1237, 1930, 1723, 988, -24, -1174, -1756, -1700, -1020, 14, 1038, 1830, 1784, 1206, 196, -956, -1654, -1710, -1257, -373, 827, 1593, 1785, 1259, 500, -714, -1455, -1678, -1248, -507, 523, 1447, 1706, 1354, 641, -441, -1372, -1739, -1501, -844, 281, 1285, 1682, 1641, 834, -201, -1112, -1662, -1621, -961, 79, 979, 1555, 1560, 1197, 146, -847, -1665, -1684, -1035, -254, 716, 1427, 1668, 1283, 307, -785, -1393, -1579, -1264, -593, 496, 1340, 1562, 1327, 479, -412, -1048, -1444, -1448, -842, 240, 1237, 1525, 1458, 911, -134, -1068, -1553, -1559, -932, 189, 840, 1567, 1599, 1091, 42, -856, -1617, -1412, -928, -137, 539, 1428, 1720, 1146, 145, -664, -1162]
2640a162l50K44O84J222P51J69m68o46o39p76o08K05Q30R90P11K73k25m63q09
2659f7r07n70J70O52P55P41O06M0m58j012p68n40J20M40N08J065P83j46o21o18
2679A73o50p39k27L72O41J061O08M4l27m75q18q25l42L69O69Q49N65L51k5n03
2699G71j041p65k57K32L45O76Q23N10k3n75q30o45m64k6K60R11Q83M80%l14p50
2720B01p85o37k79M97Q26P67L88L46k02o49q70p02k08K30P06N77P12L99j49o70
2740D98p79o17l49O8M86P97Q01L27l5m98o64p00n62R5L53O91P58L78J69k88q09
2761A20o40n81r9L79O42O53N70J67k80m86q00o48k04J63N05P75O98K75r1o30o35
2782a47n74m24J65M45O32O69L52p0m30o22p36m47J46L07O96N50O43j16k51p40
$$ y = [-1162, -1512, -1268, -584, 638, 1389, 1558, 1090, 444, -195, -971, -1579, -1374, -544, 446, 1157, 1430, 1205, 742, -67, -974, -1544, -1374, -722, 33, 774, 1380, 1420, 962, -50, -818, -1358, -1238, -798, -290, 775, 1558, 1412, 791, 173, -477, -1216, -1443, -1071, -430, 631, 1239, 1283, 956, 481, -337, -1162, -1504, -1135, -466, 383, 948, 1299, 1274, 771, -270, -1035, -1292, -1060, -715, -39, 784, 1294, 1271, 696, -134, -779, -1243, -1269, -1009, -98, 785, 1265, 1265, 951, 201, -584, -1221, -1500, -1003, -177, 590, 978, 1324, 1122, 473, -397, -1099, -1307, -1077, -371, 206, 918, 1317, 1168, 498, -281, -898, -1247, -1179, -693, 104, 905, 1232, 1197, 699, 35, -665, -1227, -1132, -779, -88, 670, 1048, 1217, 929, 120, -520, -1101, -1200, -821, -179, 474, 1044, 1211, 931, 445, -355, -1003, -1207, -1044, -539, 236, 934, 1209, 1118, 488, -147, -721, -1145, -980, -535, 97, 766, 1118, 1048, 618, -4, -740, -1187, -1041, -734, -38, 512, 1155, 1039, 788, 48]
2802D8n36m87j91L35N94P79M31L7j11n34o67n62l66L56M39O40O71K06l9m74q15
2823b46m49l44J56K84N51Q78L58j01o78n76m33l31j54K67Q89N34L08K08l26n91
2843B04p31n53NM27N49M44M64K85j75p24n93m74m8P2M43O37O03L24k67o50n06
2864b64l81k01k40M10R05N46J33p6l35n56o24l16o4N38O10L32M38R9k25n43q69
2885f83k78R9K69K96N27O04L55m69p40m51j72o4j76M00Q83M59J77m13k59m29o30
2906f95l31o4O88N35M68J66R3l26m98o38l25O2M28N01L38L72K92l07q60m72l05
2927h78J2K8N47Q09M32Q0m48m31l29n73k26J52O06O57L38N6k05l85m18m76m60
2948a112K68O10L88L27L19R0k86o58o61q3J19K37L38O14L23k1l26m48l47m37o9
$$ y = [48, -488, -975, -1166, -831, -237, 542, 973, 1010, 899, 365, -302, -864, -1230, -874, -435, 205, 876, 1082, 1043, 569, -246, -695, -1039, -883, -599, -48, 830, 1188, 1087, 409, -167, -600, -931, -1085, -818, 71, 605, 913, 1121, 795, 204, -527, -1080, -1075, -648, -99, 345, 809, 1094, 919, 195, -398, -872, -920, -848, -405, 232, 835, 1159, 892, 242, -264, -645, -846, -1086, -676, 229, 775, 908, 832, 497, -59, -683, -999, -1063, -525, 85, 417, 855, 954, 729, 186, -683, -961, -862, -593, -297, 230, 834, 1189, 720, -20, -471, -643, -707, -883, -483, 400, 859, 1036, 623, 364, -65, -695, -1026, -1090, -402, 133, 601, 767, 860, 534, 36, -602, -927, -865, -437, 64, 402, 774, 1066, 759, -101, -573, -878, -866, -838, -291, 518, 950, 1030, 582, 151, -178, -751, -977, -825, -219, 438, 776, 832, 627, 242, -176, -652, -1112, -844, -234, 154, 481, 800, 890, 604, -54, -715, -798, -679, -442, -104, 510, 833, 812, 486, 38, -309, -746, -815]
2969h15J72M26P38L65m4j86m08m01n58k50J81N67N55K57K51p0n01n51l50l45K23
2990g44M65N54K30L26O4m79n53n32j42K4M26K97N73R5J86m65l53m54k94j1L44
3011d43K69O61L34M6k57n44m52l55j49K93M53M03M22O4q7m05m53l95j43O4M03
3032b71M68M73P0j0l34n65n41j01J42J80N11M39K49J8l15l66m06l02J4K62K41
3053a44N55J80J44k41m96m17k50N1qL57O43M43j99j29k24l72n48j04J83L86M60
3074B70K98P7L0m41m66m49r6J61L53M92K19J26K22k50o29l57j20N9L6L91N39J84
3096F49j14k34l62k61k41k8O9O30K02L20Q2j48m00m37j86k80K28N02K69J46J48
3117E54N5l20m97k38j0l3K07L28L17L71j50k59n13j56k13n4K50K49M74L80j85
$$ y = [-815, -643, -217, 521, 886, 842, 656, 248, -153, -711, -961, -780, -213, 342, 599, 850, 780, 279, -272, -622, -967, -744, -279, 275, 505, 831, 895, 416, -137, -669, -811, -787, -361, -64, 509, 604, 790, 325, -28, -482, -776, -787, -443, -174, 487, 821, 867, 610, 66, -386, -741, -890, -597, -144, 259, 681, 745, 658, 253, -200, -595, -738, -674, -271, 197, 670, 740, 730, 396, -169, -710, -811, -669, -489, 22, 461, 710, 728, 413, 47, -359, -661, -647, -385, -144, 411, 591, 735, 494, -2, -419, -669, -618, -626, -269, 374, 817, 618, 489, 265, -107, -655, -759, -576, -190, 270, 568, 645, 675, 234, -232, -681, -777, -616, -263, 229, 448, 574, 796, 546, -83, -440, -560, -501, -465, -74, 465, 649, 535, 301, -61, -322, -563, -591, -522, 108, 310, 630, 712, 564, 164, -273, -459, -739, -511, -9, 260, 406, 554, 609, 289, -208, -446, -456, -489, -282, 46, 363, 734, 584, 325, -188, -344, -557, -611, -361, -112, 362, 742, 557]
3138E57m43j51j83k24j59J79M50K64J98j10O5k96n36k90M6L25J46K87L32R2j42
3159D07k05l58l04M5N4J53K66L81J25k41j93k85j88j9j90J28M76M56mn0q1k39
3181A34m67j75n6L52J54L30R3J66l08j05l83k83N6J06L63J18M82k6j69k76l17
3202b11q1j67r8L55K57K70K2K0j34l15k22k31J41K52L35J77L4K1l9l35l94j42
3224d85J5J40K86J98K82M9j86k64k80j43L9Q9J74K95J38K34l45j91j67j85j30
3245d37m7K95L19J56J14l8j27j48l23o1n1J32K07K63J74n0j41j67k32j87K4LK41
3268h1K08K68M8n4k21k52j73k4m7J99L62N2J4N4j71k51l38Q8P8J20M4M70M4j57
3292B80m0j57k57j43j18J31M04N6P7J07j02j90l15l4MJ68J8K09K07Q0j00k17j65
$$ y = [557, 114, -37, -220, -444, -603, -424, 26, 290, 488, 378, 443, 147, -389, -679, -633, -308, -162, 125, 457, 549, 407, 202, -156, -460, -415, -361, -208, 58, 439, 564, 323, 130, -155, -343, -362, -552, -424, 52, 508, 504, 454, 373, 134, -333, -508, -564, -212, -58, 272, 365, 531, 223, 118, -265, -548, -492, -386, -23, 95, 577, 551, 382, 106, -211, -292, -459, -557, -202, 55, 325, 347, 367, 233, -82, -304, -535, -394, -142, 193, 370, 404, 425, 386, 51, -343, -485, -470, -330, -44, 154, 436, 485, 299, 35, -245, -388, -349, -260, -86, 209, 347, 581, 236, 45, -122, -307, -437, -484, -189, 130, 286, 400, 362, 235, 87, -236, -297, -348, -216, -9, 254, 428, 378, 237, 70, -162, -349, -325, -322, -81, 127, 395, 443, 389, 168, -84, -257, -281, -328, -129, 233, 285, 299, 353, 182, -69, -407, -319, -241, -121, -77, 393, 437, 280, 240, 83, -174, -317, -435, -304, 100, 156, 233, 340, 238, 48, -267, -301, -297, -129, -111, 98, 305, 385, 285, 68, -97]
3315i7k91J10J48l7Q1L83J34k15k28j8O7l46p7L39L20Lp0J25J07l57n20K9Q8j6
3339c38K06K20J66L9p0q1k89j61J00K80j82J24K62L19l17k86n0k31j12j26L10
3360b17M10N5%jR2l18k54j58J32K04p1L30k2O1J44l71k94j85J47K86j35J61L65
3383C61K35k54m29q8K50k64k66L83K91L3j08L8o8k08k16j18R7J81J95L65j8j50
3405B42Mk24k21k49J37J41R6N6M50N3j87n00k6j37R5O4P3L90J45O7k92q2k04j11
3429b20j61J0J27K57K61ro0p0j00l58n1J92K01J25K6J39q6q0m13l5O0q7J71M1
3453a20L41J20J18l19j73j36j39J02oK22K69J14r4q5k92o5j63j63J36K22J49L47
3475C85j21Mj96j85j81l9R8J94J64K51j47L1j99j82j30j34R4J93K74K29rj10l8
$$ y = [-97, -388, -278, -130, -167, -86, 297, 431, 216, -12, -30, 37, -309, -386, -47, 273, 276, 206, 331, 438, 81, -439, -410, -322, -338, -132, 88, 254, 293, 223, 142, -147, -308, -208, 72, -110, 14, 276, 595, 278, -8, -58, -289, -401, -527, -217, 193, 248, 248, 247, 339, 21, -233, -391, -259, -55, -126, 204, 182, 243, 387, 16, -278, -463, -316, -30, -165, -4, 361, 596, 342, -87, -175, 75, -189, -455, -72, 219, 252, 144, 182, 114, -94, -310, -428, -331, -150, 45, 410, 392, 242, 246, 22, -199, -448, -311, -170, -74, -18, 432, 485, 298, -202, -228, -365, -270, -206, -133, 257, 402, 469, 177, 95, -109, -220, -381, -371, -244, 13, 274, 265, 205, 135, 35, -323, -374, -182, 19, 144, 170, 309, 223, 143, -270, -305, -245, -332, -161, -120, 221, 341, 459, 140, -33, -169, -308, -206, -212, 10, 279, 393, 299, 214, -78, -143, -306, -469, -333, -111, 38, 385, 264, 268, 72, -113, -294, -333, -235, -41, 123, 374, 227, 258, 59, -123, -253, -387, -293, -100, 174, 403, 394, 284, 246]
3498B46j46k58p1M1k7J30K54J85j21q8j92j52j13P2R7O8K22K34K8j93r2j70p3
3521a19k03oK57K46J32k05J12J1l46j24O1R9R0%L75J4Pk84j71k39k7N1Q6J35R2
3546D4J64J55l26k65L5R1j27q5M70J96Qk15Jo4j27l18L0J15K90o4R0K02J4k42
3570G2j39r6j69K40K52j48J2L05N5l25l11P3N5J4j95L02L73o7p1j92lo2m3j70
3594b38J42J52J35J8n3r8Ol04j12n5K90K51N2j8jR0k01m03K14J52j37o8J59J92
3618A65J04k28j16nj24j4pK05R6J79r2p2r5J5l9j72p5J75K84l8k19K27M3k19k83
3643c05n3K90J8LJ19K78j12j37j52j45mJ58j60nK73L2L2r4P7o7j11p5p4J3L91
3668A90K1q6L7n9j68k74J73j13K47M4L7J00O4j42l5j50Qo4M9oJ76Q9K7j78l5k2
$$ y = [246, 100, -158, -229, -188, -215, -85, 169, 354, 233, 145, -47, -199, -312, -240, -143, -75, 147, 381, 409, 216, 124, -46, -119, -322, -328, -71, 175, 307, 102, 214, 225, -121, -245, -184, -85, 5, 5, 380, 394, 401, 117, -54, -293, -320, -269, -183, -48, 44, 208, 363, 37, -228, -193, -102, -229, -314, 156, 352, 360, 145, 146, 82, -45, -363, -333, -218, 72, 8, 98, 300, 314, 72, -67, -163, -332, -92, 160, 12, 24, 329, 384, 59, -252, -179, -124, -110, -305, -3, 370, 303, 232, 40, 37, -25, -68, -238, -96, 56, 191, 209, 156, 58, 64, -240, -352, -407, -117, 134, 186, 168, 167, 257, 56, -347, -133, 19, -118, -186, -27, 165, 269, 41, -75, -80, -204, -218, -225, -20, 76, 255, 163, 91, -4, 11, -28, -200, -275, -100, 184, 146, -73, 154, 197, -22, -305, -358, -68, -50, -47, 72, 350, 238, 101, -51, -196, -200, -42, -202, -207, 66, 98, 130, 36, 113, 46, -65, -140, -214, -201, 190, 211, 125, 162, 103, -65, -339, -166, -279, -32, 12, 49, 149, 213, 71, 36, -114, -106, -170, -121, -127, 49, 138, 165, -13, -48, -70]
3694g0j42JO0K14P9NL2j2o4l2p1Jr4L6Q1OL2m8j8j67O2L9J1J05r8J37J06l4q2
3723G5m4r8j19J05R5J3j49R9K99k00j47L8k5J8j0P7J66l7k0N7j09p2q1o8nj1O5
3750h8O8N4N9p0M6K7k25l4J25P0L4J29J7J1k61q5j9O4m1K6R9J14k7J8J1j81J6
3777d3O7k63P1J08K26J3j91%J23j56k06N9J47J94j97K3K67l8k89j8k4j42J79o8
3801a58J80M1J07j07l6j03j30J18Mr8J47L34j45o7K9r6l4k08lL60m6j13P4nP9
3826A24j13j52m6qJ01N5R8J00J24j61j77m4n0J17kj66J42K88j00j47m9N1P1k67
3850b11KQ9L79j86j6J4R5j32j96Kk5K15J0KJ71q5P2m1l18N6M7K5K3Q5K06k6k27
3877C0j41N5o2n2j95J95K95j5p2M1Q1j49j5j57j30L25Q0q9P7J12j27Lk50j95J84
$$ y = [-70, -212, -211, -151, 63, 142, 147, 179, 167, 103, 71, 0, 1, -93, -57, 24, 30, 62, 14, -4, -171, -109, -70, -59, 46, -52, 85, 191, 157, 75, 31, -67, -186, -81, 14, 27, -122, -23, 276, 76, -71, -33, -58, -40, -50, 27, 193, 156, 136, 193, 84, 12, -69, -137, -142, -153, -88, -20, 34, 93, 23, 69, 96, -129, -163, -38, 32, 66, 195, 212, 223, -38, -123, -142, -78, -119, -93, 6, 120, 93, 111, 122, -59, -43, 24, -239, -168, -60, 166, 179, -12, -12, 111, -45, -251, -192, -45, 149, -48, -25, 242, 204, -85, -103, -127, -269, -90, -158, 22, 63, 170, 63, 27, -76, -206, -88, -84, -182, -35, 299, 154, 87, 116, 20, -14, -222, -225, 135, 89, -24, 50, 45, 124, 11, -141, -187, -195, -94, -39, 59, 159, 283, 122, -55, -99, -149, -32, -34, -200, -58, 230, 130, -17, -66, -15, 56, -211, -209, -120, 259, 73, 57, 71, 166, 34, -162, -160, -185, 30, 40, 42, 213, 128, 200, 159, -159, -103, -56, -31, -8, 77, 283, 257, 30, -111, -56, -118, -170, -365, -170, 125, 110, 38, 79, 160, 11, -4, -161, -291, 34, 114, 25, 102, 214, 87, 90, -160, -355, -171]
3902a71Q7M0R9J15oj17j36j02R3Kp5J61J47p0J88j91r8j19P6p8j0J18R4J77o4
3927A60j8j39r6k23J68J23L0L3J27q0lr3r1m0Q5j12J89N3N9J5M4k00j29%k22K90
3953g0l6J45mJ22n9l4K0l08J60Q5j47J46J7J31j00j06R9k30o7M5K8Q3J57P6K4
3978A77j06j26n4kr1n2J67K34M8j11J11j94q9q1Q0K7k5L3K54l2m5p2mj74k2M8
4004a01j1OK77N7O9k35o7j13j33J29P1rK90j31J5Lj20r7n1R4J06j4j6pJ54j6k13
4031f3j2j07R8j07J93R3J8J15r4r0j01O9m5k8q1J64J30j08J01j50L6j25r5K2J76
4056IJ57q0K5R8n1n9j85j43P5J15L2l3R4P8L6k21r2j3P1p3P4K27P4rj25j6m9j26
4084a10j42J5J37J55PN9o2K8j20Rj95Q8J20P6m9J71O8j71j05k15J73n1j7J24N9
$$ y = [-171, -84, -44, 55, 170, 164, 47, -89, -191, -98, -96, -171, -10, 137, 67, 255, 64, -34, -153, -77, -155, -165, -47, 47, 224, 160, 142, 3, -93, -316, -148, -25, 5, 38, 165, 85, 82, -11, -102, -142, -57, -169, 20, 73, 132, 147, 191, -9, -138, -138, -360, -70, -106, 39, 35, 157, 98, 64, 84, -224, -64, 21, -126, 20, 37, 168, 68, -38, 61, -169, -236, -191, -163, -80, 77, 153, 177, 71, -55, -109, -111, -202, -254, -87, 147, 195, 84, 195, 1, -88, -169, -89, -62, -87, -54, 200, 168, 123, 51, 47, -127, -149, -101, -112, -106, 171, 228, 297, 62, -5, -118, -251, -122, -51, -60, 230, 99, 114, 117, -3, -100, -151, -57, 49, 35, 19, 12, 166, 150, -63, -75, -182, -84, -191, 2, 95, 113, 228, 134, 44, -57, 12, -33, -61, -142, 22, 152, 44, 145, -5, 31, -94, -189, -167, 9, 166, 86, 111, 209, 158, 99, -86, -229, -154, -39, -7, -40, 54, 132, 168, -53, -145, -158, -87, -160, -86, 141, 215, 206, 81, 65, 16, -110, -252, -237, -100, 55, 62, 121, 59, 87, -33, -24, -219, -131, -11, 65, 16, 187, 255, 84, -21, -236, -63, -114, -131, -7, 52]
4109E2J90j29q7M4j27Jn7J75j2J58o3j18j5j13N6j21j9O7J21k5RK18j24n5r4j4
4135h2m2Q1R7j27J83M0Kn3j17j40O0q1J24OJ43J4K0o1lm1j78o4J5J58J08JJ23
4162A86l3j91l7j33J77r0P0O7R5K4M2j77rj3j71L4J64oJ47j39J18r9j62J7k1Q3
4188e7m6J92k7Q3K8r5j76N4j16j03J35J44L3jn6J41j37Ro3j61R3P4k7J36K0m6
4214C1o5Qj71j0J31j7R7P0OJ46j33j21n0K2O1j20J14R1JO3m1q6nj61OJ16m9J19
4242E3J81K9j74j27M8j13l1N9Q3o2M9J22l0J5j48j11j4J10PK1J23J56j90o5Q2
4267G3j66O5q9j09L19L1k2k0n0%k9j73J2m8K52J9QR1m2j46q4K3m8k9J67M7Q6r
4295A29n8j04j00M5jJ11n8p0K30q6K2o2l7P6k16L3O9O2J46KJ4l0j22j68K7L6M1
$$ y = [52, 242, 113, 26, 70, -57, -56, -113, 62, 50, 208, 145, 27, 12, -101, -45, -166, -185, -118, 3, -22, -13, 205, 81, 26, -68, -82, -124, -43, 54, -73, 110, 150, 152, 99, -18, -158, -98, -179, -55, -49, 94, 108, 128, 67, 64, 23, -155, -219, -204, -46, 62, 63, 186, 153, -38, -75, -208, -31, -121, -51, 16, 111, 135, 177, 0, -9, -22, -193, -159, 5, -1, 146, 7, 125, 26, -136, -119, -140, -57, -103, 89, 62, 145, 173, 78, -98, -44, -160, -263, -128, 16, 49, 48, -8, 133, -4, 5, -58, -219, -126, -52, -79, 57, 77, 31, -34, -26, -197, -207, -76, -93, 4, 74, 80, 226, 93, -28, -78, -56, 5, -115, -1, 90, 91, 154, 113, 27, 22, -139, -133, -17, -66, 53, 234, 263, 89, -38, 10, -103, -134, -75, 8, -54, -5, 117, 87, 102, -46, -157, -171, -61, -54, -33, 90, 246, 56, -9, 73, -93, -28, -117, -226, 93, 124, 102, 82, 32, 32, 3, -170, -158, -206, 46, 65, 73, 164, 122, -24, -108, -85, -133, -162, 5, 52, 138, 129, 71, -33, -133, -88, -89, 22, -36, -106, 124, 38, 60, -2, -39, 37, -179, -146, -77, -15, 131, 133, 147, 117, -5, -173, -146, -110, -69]
4322f9N5K30j02K7qq2k08m3R1N0J16ON2O9l4j00q0M8l0MO9Q9J1j36JK0m8j62R1
4351g3j20K35rJ5O5m5k4Mo3j18O5Q6jP1N3O1j45k6j72K3P7k0K0J25J29p0k9j78
4379f4L9J1j77M8J45M9J2pl7P2j87N4j56J03J9J18J77p0N2j32j37n4m8n4K18n7
4405f3J27J12n4M3k71ojLM4N8L9lK27q5j88q2j09K8P8M1R6N4O2j13K5r6j03L8
4433i9n8J17J48n8Q4N7o5r8j17k02J56J52j27K16j7J23j29j01p9l4L0J59m9J8
4457B7L9J42j58k5Jk27M9P2Q3QJ31k0m3p6m7p9r5M4K51j7J03n6m7Qk13PJ70j69
4485a37J81M2J41oo3p8j25Kq0J9L9OJ57KJ4j16p7J28k18m0R9J26R3m1N6q7rn0
4513b2j66O4p1J92M2J52l0R4k85j78J04r3K91p8K1qK03j69j2j7k00M0j37J65J21
$$ y = [-69, -14, 216, 114, 141, 133, 51, -157, -200, -109, -59, 57, 63, 115, 184, 150, 50, -30, 18, -12, -8, 61, 150, 161, 25, 26, 46, -2, -164, -73, -193, 42, 33, 48, 113, 68, 44, 48, -15, -133, -68, 18, 17, 88, 141, 202, 57, 31, -141, -118, -41, -61, -41, 84, 213, 143, 114, -64, -25, -14, -191, -143, 2, 51, 63, 56, 19, 91, -96, -42, -198, -95, -76, 42, 219, 149, 201, 69, -68, -122, -170, -224, -6, -63, 64, 176, 122, 165, -106, -112, -113, -110, -66, -8, 31, 28, 255, 170, -18, -100, -209, -181, -103, -62, 34, 88, 150, 37, 62, -34, -137, -99, -157, -40, 108, 50, 134, 191, 126, 28, -89, -291, -135, 17, -110, 106, 89, 212, 83, -18, -97, -131, -101, 58, 9, 27, 66, 208, 50, 25, 26, -201, -152, -80, 3, 11, 142, 122, 79, 3, -44, -123, -218, -174, 77, 60, 163, 107, 60, 68, -145, -138, 32, -137, 44, 86, 227, 221, 158, 80, -45, -43, -123, -104, -65, -59, 98, 100, 114, -2, -79, 49, -169, -209, -110, 16, 109, 68, 124, 37, 28, -22, -188, -124, -195, -3, 39, 191, 161, 255, -30, -208, -104, -197, 94, 16, 37, 29, 232, 63, 51, 34, -166, -126, -263, -98, 23]
4538B3R2K6J9j18j09pp4k1J92K9NpO0j35l1k0j35R5J28lj2J16J53j35j39k0m9
4565g7p8O6M1O8J09n7N6j14q4J7r2rP7J32J89j37N9m4q2l7q1l8J32m5J96p2J43
4592B38j89j18n9R7q3K0J97J7N8Mj69Q3j42l8j18Q9J58K8N9J16k01n7l4p9n2m8
4618b23K01J09KL2J9j35j37PJ5J28O6k9J6M1M9j40l3n2j41J04J1J11O8l0J60j87
4644C2l2j68J07j37P0J21M0M9R7p4q6l23J44J13J6m7J57l4K0P3j58J7j38M2o6
4669a65J13P4J38q7J43k9j91j00n4k7P8J42P2l3q3J05j11j95Q9nP2P5R9M4M7m8
4695A63k11j13QRJ16mK1K42o6j62P3j02r4r5J31J3M4N7K95k21J8j37m4J7q5J48
4721B1J45j66J88J7j34o2m5N2k69J09J15Q1P4n0JO2k08j17nO3O0J58j5J19j94
$$ y = [23, 115, 141, 160, 42, -67, -74, -148, -169, 23, 52, 57, 50, 110, -25, -56, -76, -211, -116, 12, 9, -3, 113, 266, 131, -8, -28, -77, -155, -89, -48, 20, 129, 72, 128, 14, -70, -53, -145, -154, -77, 55, 244, 107, 166, 122, 40, 3, -78, -116, 16, -29, 167, 95, 238, 49, -69, -128, -31, -114, -94, 103, 120, 178, 182, 13, 96, -46, -84, -202, -113, 45, 73, 132, 248, 47, -10, -44, -123, -175, -223, -22, 87, 89, 121, 140, 5, -132, -125, -110, 18, 84, 55, 71, 112, 161, 21, -12, -64, -205, -101, -90, 21, 89, 59, 219, 32, 0, -168, -61, -198, -128, -7, 33, 82, 179, 105, 19, -304, -160, -47, -31, -78, 79, 45, 65, 138, -20, -3, -141, -99, -165, -52, 22, 160, 73, 216, 187, -4, -104, -158, -185, -107, 35, 107, 74, -9, 96, -15, -210, -121, -126, -54, 21, 120, 164, 211, 163, -48, -161, -153, -144, -28, -32, -11, 231, 165, 3, 76, -26, -120, -215, -84, -71, -27, 30, 325, 104, 122, -15, -59, -42, -127, 21, 166, 0, 188, 205, 71, 9, -36, 16, -253, -144, -29, 52, 126, 76, 77, 139, -69, -186, -191, -128, -68, 90, 75, 194, 0]
4746@Q5j30j81K51q2K3k5K16K6j0j6k04j08O3oq9O1L50M5j11q5PNk34l7J59Q8
4773F1R6o2K2j1j38L6j69r6J54J41J2J6P4p0Jj79J07j89QK57j08K51m9R8k28p8
4799d3r8l8O4J5R7J05K0N4n1j61nj32j0J44J24KJ06qj28j11Jj94J3K81j0R6p3
4826F0K7J23j75j84MO7l0N6L7R0J99j17k65Q4n2o7m2K3L65q1r9J28m3j19q8m8
4852a47k2J32L5J01J4l6l8j6o7j21M8m8L7K36O9K2k01Q6k22J27o1k6L0J28j8P7
4878A19Ko5j28p3K1KJ11O2M6K2qn9J6j57l4QQ8k2K11j53J44n5j34j19o2L7J18
4905f2L0K2J16J0N9j41j93J29j86K62j49J59J34m7k0j41lj03k2l5J14J44O6M9
4929A92j35j16Q4j26m9K7P4Q9P8P2j6j79o0p3K6j27J24J14J8J04o6J7q2n4j02
$$ y = [0, 85, -45, -226, 25, -57, -34, -59, 157, 183, 173, 157, -47, -155, -92, -98, -187, -126, 224, 269, 158, 73, 80, 85, -149, -186, -27, 61, 157, 95, 117, 106, -32, 4, -165, -261, -107, 34, 46, 62, 136, 66, 67, -112, -5, -194, -186, 71, -37, 214, 165, 263, 35, -43, -141, -179, -115, -100, -3, 102, 122, 176, 125, -36, -41, -173, -183, -39, 85, 87, 193, 185, 57, -54, -53, -247, -234, 47, 37, 133, 60, 87, 210, 35, -149, -145, -78, -108, -52, -15, 75, 274, 157, -108, -24, -76, -143, -185, -162, 203, 122, 23, 151, 108, -11, -99, -147, -169, -37, -2, 99, 113, 77, 39, 23, -44, -165, -117, -165, -128, 108, 177, 199, -2, 84, -138, -11, -72, -98, -68, 60, 42, 119, 121, 56, -72, -145, -124, -122, -11, 51, 97, 119, 111, 52, 68, -89, -123, -115, -27, -49, 162, 9, 153, 98, -36, -155, -217, -180, -62, -32, -10, 106, 116, 175, 34, -159, -30, -216, 46, -103, 56, 190, 143, 123, -18, -21, -124, -146, -181, -67, 77, 143, 192, 57, -59, 25, -101, -150, -123, -49, 40, 118, 190, 174, -5, -65, -138, -112, -239, -115, -1, 17, 121, 55, 72, -10, -64, -166]
4954a66N6oJ7O7K16r5jp8n8n3k6N9p1K62l8J24m3j47m6k1k2j45J97J40L2r5K5
4981H4P0j82m1j00L6J72k9L1J82k4k29qj13P8j07J0R3J25J32j03o3J17j70Oj13
5006a46j4K0J38J77m8O8k35J7j82O7p5K82n3P5J18p5k7m7k30q2Q2J05J27J06Q1
5031B49j47k8q1J6j80K2J02J13P2O9j89J02j7j35j03l9J49J03L1oL3p4o8j10N2
5056f4L4j94J72J03K9J7j6j04j86J26j10N3J35Q6k1J77j43L8m7n5k06M3J31l4
5080c6J32p%j06N7j01j47J06J20%R5R0J3n3j05j26M4l9q9J49J46M1j4Qk60k6M1
5107f7j1r2J08Q3K30j35m4Nj41j48L7J5R5K40k0mj7J9k34l3N4K1j26K18J37j52
5133C8N0o8qj26M4j0P6P4N1K1O8q3k34N2o3j46K08Q0J78J1q8n7j33j0k0J3k2J12
$$ y = [-166, -110, -116, -99, -32, 184, 89, 88, 10, -48, -101, -127, -68, -139, 123, 85, 209, 166, 19, -27, -48, -70, -215, -18, 122, 154, 59, 84, 154, -28, -69, -169, -133, 39, 10, 41, 223, 199, -30, -38, -151, -73, -180, -170, -77, 48, 180, 77, 14, 131, -39, -33, -146, -160, -140, -2, 175, 127, 195, -40, -23, -205, -138, -213, 69, 16, 91, 209, 134, 107, 60, -170, -252, -170, -65, 62, 168, 249, 102, 74, -7, 9, -171, -149, -47, 66, 138, 207, 18, 120, 103, -32, -135, -174, -25, 78, 109, 103, 136, 62, -6, -116, -64, -30, -224, -52, 51, 80, 97, 81, -23, -209, -83, -193, -140, -5, 81, 60, 237, 94, 132, 85, 30, -176, -133, -2, -36, 96, 89, 89, -17, 40, -61, -208, -102, 18, 18, 113, 203, 216, 163, 58, -68, -24, -63, -152, -3, 143, 184, 170, 178, -82, -108, -67, -78, -170, -62, 21, 251, 116, 72, 77, -64, -212, -175, -160, -65, 175, 155, 151, 134, 153, -81, -114, -60, -39, -165, 53, 190, 38, 88, 20, 12, -114, -70, -80, -4, 70, 121, 142, 210, 127, -107, -55, -118, -264, -56, 24, 202, 213, 125, 68, -65, -75, -95, -82, -104, 8]
5161HL6J43q9l5oj49M8j81O4K19ON6J01p9q4j40n5p4M1Q0PK31R8j67N3j69r0J24
5189cr8k8J49K3J37l2m3m7k38J07j68K04P6m9N9o0Q3q6J05j92k5l3J64J25m0R8
5215A88J17l52N8j37OmM9J24R6l3o9o3n7j73J20j7O9K31o2N6K6Jr8j25n0J5K6
5242e8K3J79k2l2N5k6k07r9l7J87kL2J79Jj25K6n2j14rRn4J38J09J08o6j21O1
5269H3k05Q8j67J86J2J8P7k9L4p3P1l66K12j38K20M4O3Q9j14n6j84M8j10j3L03
5294I3J34oj63O2k5j92l9m1Q9R0q0J62J56q0k5n1j89L1O3j10K03O0J7P0k26m6
5320d3l2M3nk3J22qJ16j12J77j79j40j1o5P5J82l2M3M4o7p1r3o5onR6P1K13m4
5348A81J4k11K1o9m1n6K5J04J60M7Jj92l1p0m0n0J77J50m0oR3k3o7k56J84j75
$$ y = [8, 44, 187, 98, 63, 57, -92, -44, -225, -161, 58, 64, 120, 221, 142, 58, -82, -137, -211, -170, -90, -83, 148, 246, 79, 132, -37, -127, -3, -101, -129, 20, 43, 180, 148, 105, 58, -180, -73, -241, -37, 39, -10, 49, -11, 72, -14, 91, -101, -126, -159, 5, 130, 90, 188, 305, -47, 11, -126, -120, -124, -75, 49, 145, 112, 43, -20, -77, -250, -130, -147, -78, 153, 91, 147, 173, 174, 76, -49, -99, -84, -58, -35, 144, 122, 90, 145, 119, -88, -187, -224, -37, -39, -7, 172, 173, 48, 74, 22, -92, -101, -92, -146, -8, 101, 209, 143, 22, 83, -122, -34, -201, -15, -3, 15, 92, 63, 97, 24, 95, -271, -59, -197, 23, 67, 130, 219, 105, 49, -135, -87, -197, -210, 93, 227, 221, 58, 120, 95, -97, -136, -177, -88, 2, -78, 84, 240, 160, 135, 84, -105, -74, -11, -121, 82, 142, 159, 229, 3, -43, -75, -32, -37, -60, 62, 54, 170, 58, 235, 56, -84, -95, -160, -85, 97, 65, 108, 152, 85, 14, -79, -144, -150, -155, -59, 12, 225, 181, 195, -16, 5, -64, -105, -161, -136, -32, 128, 175, 176, -16, -47, -117, -157, -207, -30, 120, 80, 74, 167, 144, 77, -179, 5, -170]
5374a70L8J37O5J50j53K3J0j24j59Q9NQ3l9J61M7L2j81m6o3o8M5K7J04L3P8Rr3
5401D0K1k05q4J29k5K33m9L7J1M1k43P7j31J37o2M3Q6J05L7j23m7q6j71K7M2N5
5427a05K59n5j5J42k38mj73l9Q6MJ59L5K7m1k4k04J67m6q6N8J06J10rM1l6k37
5453a18m6K3L0m2J06K11j5m4J9r3o7m8p3J2J50M0J17l5k7l8r2r3j53J46Q9O8m1
5480a4N8P3o3n9j23M9q8p1K10J66lQj13l3j21j17R4jK48RN0ml9j19n5p8l6K8P6
5509f8J31M7M0j15r0pm9j9J87o3n0K30k6p2o3j24j25M8QJ60j0K31j32J17j17p4
5535ej40J5oJ49OJ09k0mk2j37K7k9R6j09R6J66k5j06r0R5j47kj24o0K14J89M0
5562A76J4j58j17N3m9j34N3K11LP2J42j50j69Jm3j0k0M1J38J71k8o0o9j56l7q0
$$ y = [-170, -132, 5, 70, 220, 67, 90, 100, -24, -183, -94, -89, -6, -45, 116, 163, 195, 14, -32, -95, -163, -118, -91, 13, 46, 124, 133, 40, 61, -144, -228, -99, -124, 109, 60, 97, 108, 149, -94, -17, -148, -11, -73, -30, 56, 161, 198, 75, 28, -58, -229, -202, -160, -105, 154, 99, 84, 226, -12, -16, -189, -228, -142, -138, 21, 56, 83, 42, 18, -186, -19, -65, -151, -93, 13, 123, 114, 155, 119, -118, -164, -141, -111, -153, -47, 164, 149, 105, 124, 31, -36, -84, -157, -145, 5, 45, 162, 127, 100, 62, -30, -123, -276, -130, -41, 27, -14, 44, 117, 54, -5, -128, -79, -167, -238, -28, 138, 135, 143, 30, -3, -124, -241, -147, -148, 100, 109, 159, 155, 116, -3, -58, -136, -172, -144, -68, 63, 110, 150, 35, -55, -62, -111, -130, 57, -6, -56, 174, 148, 76, 13, -111, -236, -188, -180, -20, -30, 201, 69, 186, 69, -5, -145, -130, -136, 13, 19, 128, 108, 104, 82, -55, -28, -57, 39, -70, 26, 192, 167, 61, -29, 66, -81, -83, -207, -267, -53, 136, 176, 190, 32, -85, -32, -81, -215, -162, 49, 52, 124, 266, 116, -53, -52, -95, -105, -125, -84, 54, 225, 197, 137, 68, -88, -125, -205]
5588b05N6K2R6Q0J23%j17R1k13n1J0J8R6J40ok9N7r7n0j92l1J43o9K85j7npr3
5616C5o9m9p9j1J41O3K4J17J7l9k12N7k21rJ90M1J92o1l0n3l8r9j13M9Q1pQ5K33
5644B35q8J4j85n2K4j82J95p1K00l3M0m9ro7j51RL8L6J45l3J96n4j41n5j03K8
5670a13n8J36J5K4K10q1l9j20j28k9J22o2M6J95K1Qj24k0j31OK7M1J7J1J59k3
5696A10o1P1p7j90o4L4K60o2J86j55J40q4j10j62r5J09p7L05o0K36p8k25R6j68
5720a21j3n5P3J06J18M8%M3k60L2n1n0P3m4P4P5J72j66O5j19j61j05J99qK13J5
5746A53Q0j03j00j80K5J0km6K33M3R6K5j19j72q8p4R0J32j68K94J29k48J30j50
5770a0k41L2J9J46QL9J38J03j18m0k6k15j15J17P1J27J64j3j04n2k8j63rJ30N2
$$ y = [-205, -149, -127, -31, 49, 172, 172, 55, 146, -67, -118, -108, -90, 6, 146, 140, 111, 168, 71, 21, -171, -202, -59, -128, 157, 140, 135, 128, 35, -34, -83, -162, -173, -32, 31, 55, 172, 189, 150, -62, -5, -226, -235, -45, -4, 188, 127, 97, 44, 6, -93, -206, -157, -76, -83, 2, 235, 147, 161, -24, -76, -52, -234, -39, -110, 90, 57, 97, 48, 39, -28, -179, -170, -132, -96, 49, 16, 212, 158, 17, -38, -141, -113, -171, -35, -20, 4, 214, 133, 94, -26, -154, -183, -61, -123, -77, 118, 139, 147, 23, 3, -128, -122, -95, -54, -37, -26, 133, 110, 49, 120, 43, -147, -211, -177, 83, 21, 207, 52, 192, 108, -2, -164, -259, -150, -227, 78, 18, 254, 176, -49, 47, -121, -134, -189, -116, -10, 108, 156, 156, 199, -61, -29, -80, -130, -57, -101, -27, 48, 220, 54, 119, 0, -161, -266, -67, -75, 138, 153, 233, 130, 30, -150, -125, -115, -117, -163, 70, 113, 209, 234, 115, -57, -145, -219, -129, 3, -165, 129, 258, 10, 140, -10, -251, -219, -200, -54, -46, -7, 131, 234, 116, 76, 50, -165, -280, -163, -92, 35, 199, 186, 82, 30, 2, -161, -170, -40, 12]
5795A2M6P2Nl0j10l5j6r4O5K4J7L04r1l4J5k14j4J0m3m3L9J55K29r0r7q3j01J18
5823A6j93jJ01J09J33r8J18j52j82n8n1J23J62oQ2J13J5j67j59M6j67jK58mJ68
5848B05p7l6r4j2l1k00J12K0N3J43R9l3k7j0k27m7O1m8K12k7J50M4p8p0k08N0
5874g6mOJ9J36N9mKr1jj03o8o5K43l6J09J3k5K9o0j73q0o2Q0L8J81jO6M8k10j28
5904a58k2K6R8J76M1o0J07l3j84M5j41k2o4J94O2J07m7rJ2j58j02o6K7Q7P4J07
5930I7k1K9L6j01r6j01L7N2K8J15m1L5o8J2p9j10J6O8J11J04R0O5j62r8m0o8P3
5957a7j0m9J07J31J4j34l0j06j04M1l9J68L7J15R2o6m6j31j24l4Q2N6J03oM3J34
5983B27j37q0j43o1J21m3R4O3J03P7j64p2k3o7j43J36J61K1J01M0j2o8j51r7p6
$$ y = [12, 58, 130, 135, 105, -5, -40, -56, -150, -85, -61, -44, 260, 169, 135, 150, -64, -78, -68, -111, -154, -115, 40, 269, 179, 82, -1, -102, 16, -177, -178, -77, 32, 165, 67, 185, 33, -149, -207, -258, -135, 27, 21, 103, 216, 231, 64, -95, -49, -216, -217, 41, 37, 205, 128, 92, -2, -14, -45, -245, -133, -113, -60, 83, 182, 149, 122, 112, -115, -162, -101, -149, 63, 36, 186, 230, 152, 82, -126, -76, -80, -74, -55, 81, 140, 136, 138, 47, 46, -57, -125, -190, 53, 17, 126, 139, 114, 143, 83, -90, -170, -232, -152, -114, 67, 66, 132, 180, -30, -158, -180, -154, -56, 120, 161, 101, 208, 175, -9, 36, -105, -127, -191, 3, 65, 172, 125, 116, 128, -30, -132, -198, -171, -84, -10, 97, 76, 105, 141, 40, -56, -157, -120, -68, -40, 75, 34, 69, 1, 13, -66, -176, -160, -92, 19, 123, 213, 278, 116, 18, -22, -90, -17, -27, -76, 31, 162, 176, 42, 12, -94, -198, -157, -196, -28, 9, 124, 216, 150, 104, -27, -151, -185, -103, -47, 56, 50, 93, 227, 90, 10, -133, -194, -73, -116, -22, 41, 144, 221, 57, -15, -38, -105, -248, -112, 49, 70, 171, 211, 199, 131, -20, -117, -193]
6008a93J78m6J42R7O2o0Qk70k7j9M4L0k8L06n8j37K07k65k31M9J04N1J26J2R4
6033A76J0r1j09j53k0N4N0R3J44k9J07o8j33M1k21p7J15L6K22K9m5j8k07K3k9
6058a00j21N8K7J26J02Oj4rj40p2n5L5J2L07l3o7J12j89L1j15m0l7L5J17O8K00
6084B44j18l6j39o1o4N3k5J45K01j44J58p1j57K5j80LK2R4j6K33JL9k62n7K7j9
6110a04o1jK43K4J45p7J2k52r0l9J0P3J22J2K8J44j34j62P1j64Q2j2M6J39N5R9
6136B09r0p9p0o3pp7J38J32nR7n6p1k2n9j44O2oJ65J38j2r4k34R5P3k12O3l4J44
6164a9K11o3Q4nj72n9j08k1M1J25L6Q2L3L8k61J6rr1J53p9K8J81L9Lj17k28K6
6191a36j0J11lK9J00K2p0K3L6k39qN8P3O2J02N6p0j11J1r0l8pn7J79QJ02k2n6
$$ y = [-193, -15, -61, 81, 178, 240, 180, 188, -82, -109, -128, -84, -54, -82, 224, 166, 29, 236, -29, -260, -211, -107, -56, 70, 82, 176, 186, 95, -14, -167, -187, -133, -83, 10, 154, 125, 232, 164, 31, 72, -149, -226, -111, -75, 147, 176, 131, 113, -94, -71, -100, -221, -163, -136, -10, 92, 98, 84, 75, -65, -137, -192, -157, -145, 162, 129, 62, 174, -15, 16, -99, -139, -176, -141, -24, 44, 244, 126, 90, -49, -110, -174, -121, -146, -1, 200, 56, 214, 143, -14, 11, -169, -166, -144, -50, -66, 167, 168, 207, -55, -112, -85, -104, -165, -166, 77, 101, 246, 169, 181, -71, -161, -200, -190, -117, 5, 17, 45, 189, 55, -107, -36, -200, -118, -130, -84, 55, 110, 209, 119, 40, -30, -93, -100, -177, -39, 93, 88, 185, 129, 58, 36, -23, -167, -105, -111, 54, 192, 180, 86, -148, -53, 20, -192, -129, -163, -19, 192, 129, 213, 208, 36, -23, -131, -152, -111, 14, 50, 132, 165, 203, -58, -42, -51, -142, 11, -68, -40, 141, 180, 183, 66, -162, -136, -146, -35, -38, -9, 91, 113, 43, 66, 102, -137, -145, -87, -14, 48, 150, 206, 136, 25, 36, -54, -92, -99, -156, 23, 31, 133, 111, 55]
6219E5j22N6q6p8M4KK59r2J29k6m5j42j4j27k7J46qJ68K4n8n3Kk70L1J04K4J56
6246E2n6K10n3j70P0j58n3K7R5N5K8M2J39j52q0r2j58P5oJ56J07n9J43j69K9j55
6272a33K0j06M1J52pK53p5j9o9j24K9k16J74Q9n3K97j07j2j41q6O5k25J04NK14
6297G0R0kl9l0p1K8j41m3N3mJ29J03kJ8jk34Nl2qO8M2J08O2m3n0j02r3j08J5K25
6327A3k0N3J33j46O8j50l9K0j18L2J51J75m9Mk9j90J06j53n9J47J18J13J16j25
6351A71m7n0k6k40R3K4Q7L8%J46j17j67l7J65r2n2k7J41J06mj2p6J0j78P4j03
6377a73mJ37LJ36J13p2k31M4j19R2p4J48M0m0J42o4J2j37r3K5m6J65K8M4J76j42
6403A10r5qj06nm7L5J75J52j34J3M0q1j52o9N1N1PK13q1N4M3j11q6q0n8M2K46
$$ y = [55, -67, -11, -97, -175, -131, -129, 130, 38, 167, 141, 96, -46, -60, -187, -214, -68, -76, 92, 116, 58, 5, 7, -263, -232, -128, -104, 52, -4, 206, 153, -17, 53, -105, -158, -131, -36, 19, 47, 89, 228, 76, -4, -96, -254, -179, -185, -29, 78, 19, 162, -7, 22, -133, -113, -219, -178, -26, -33, 220, 145, 126, 57, -67, -38, -254, -80, 9, -44, 253, 146, 134, -7, -93, -28, -253, -149, -144, 70, 160, 158, 119, 89, 18, 46, -95, -138, -85, -89, 40, 143, 141, 159, 158, -76, -71, -103, -111, -43, -1, 107, 169, 126, 76, -26, -119, -227, -212, 13, -7, 46, 179, 33, 101, -49, -88, -68, -186, -154, -3, 172, 123, 127, 98, -92, 14, -139, -198, -51, 67, 180, 296, 171, 124, 74, 48, -192, -99, -75, 12, 50, 50, 196, 79, -88, -125, 40, -52, -104, -131, 10, 116, 112, 100, 24, 34, -144, -70, -173, -177, -40, -37, 99, 212, 140, -91, -47, -166, -74, -148, 0, 40, 0, 142, 78, 90, -47, -140, -115, -161, 4, 32, 76, 252, 110, 15, 7, -99, -104, -151, -116, 59, 211, 77, 90, 130, 49, -103, -172, -121, -70, -63, 150, 69, 123, 166, 55, -31, -111, -169, -127, 119]
6430A19j8J34j49O6j40j46j00J24N5r5K94q3M7qj23K3q4n8M9K5P3J39p2Q0j16
6455C6N8j54N6j32K7J97n7J8K0Np9j05n1J47Ml5M3J0N8qj00p7m1p9J64R9M7J55
6483B26j42j11J6k9p0M4K9j09J25J42R3j57n6k8m6o5L4J3J23l5P1J2k6Q7k52N6
6509e5j69J73K4J38M0Nj20L3j17q5n5rJ98Q5L2k2n3J4r6m2l2J6M1J05LJ05q1j2
6537F4j50l7j2K6J0J53L7L3K6L1l29k3L5K3J62j9l9J31K3r4l0j00l4J6r9J07K61
6564A72j31KO8o9n5j28N0j07J26J38M9P9j85j8npj73Q2J2J72P1O3k8k5o6k65J7
6591a61P3JM1J28p3K10q0j01l2j20j3K4P3J27M8l4j00Q1q3j65N1k0J50l2J77r7
6617G3j1o1p7j10J03j8N9rJ15Qk2M0%j10j55J40r1J17J65k14J97p1o4j71l0J21
$$ y = [119, 101, 235, 86, 152, 12, -134, -234, -110, -55, -150, 144, 61, 108, 100, -23, 0, -84, -142, -93, -68, 5, 144, 72, 152, 36, 94, -60, -4, -136, -109, 88, 31, 49, 69, 74, -5, -110, -161, -14, -10, -45, -2, 8, 66, 58, -42, -119, -160, -239, -75, 24, 71, 226, 84, -27, -11, -40, -110, -66, -37, -146, -21, 121, 214, 57, 1, -27, -73, -138, -104, -91, 32, -3, 68, 80, 54, 141, -111, -55, -224, -51, -27, 111, 151, 156, 36, 69, -48, -133, -188, -197, 1, 86, 118, 96, 43, 57, -39, -81, -113, -97, -56, 49, 52, 157, 76, 64, -86, -123, -135, -109, -99, 54, 91, 124, 150, 181, -148, -171, -136, -113, 49, 30, -9, 122, 145, 51, 21, -79, -113, -97, -196, -89, 172, 41, 43, 111, 42, -13, -141, -91, -198, -72, 66, 115, 194, 9, -9, -14, -21, -194, -112, -100, 72, 143, 206, 178, 153, 87, -178, -161, -88, -87, -46, 82, 9, 219, 139, 38, 6, -114, -127, -103, -30, 97, 145, 111, 11, 92, 9, -156, -105, -125, 25, -7, 170, 73, 62, 1, -76, -186, -83, -101, -42, -51, 64, 72, 50, 90, 90, -20, -175, -35, -126, -9, 156, -58, 139, 68, 4, -167, -197, -76]
6643g6M8K8Q1O6j2p6o7M1j53rK2l4P3J60o1O3P0k20o3j0p4J4J19J30m1J14j71
6670c8O2m2j38L3Q2l9J54M5O8j8k1k25j19J47p4K03k6J68j70%K5j72k7P5K3L5
6696A1J7K01p3l7M2j99n2o6M8J6J20o4K05r0K6j42K6q2M3j6N5N2k6Q4J5q2k9l
6724@n5j4P6qK21j61o6J82j48p6j17R8nQL5J20l2P0m8j50n0l0J23j3J74j66J21
6751H9j37N3k1K2j65R2J47J7k1M0R9j33p2j72J56j40O8K02oj36Q2n1j0j36O6j02
6777a69J49R5m7M7j18j7j0P8r4J48l8j8N7L8KLj02Lq2o5J08M6P2j26K4L1j4J3
6805A4k13J47N6J02q4rO1o1j20O4K0j5l7K3N8Q0p5J3Qj57J06k4o8N2J99k0l9R9
6833A80j92R0j42k2j10qK27NJ44j00J07k53l8nkR1N9QQK8P5j63K1o6%no2J35J9
$$ y = [-76, -28, 0, 81, 147, 135, 59, -8, 33, -120, -129, -107, -141, -68, 92, 31, 94, 164, -56, -119, -129, -203, -189, -70, 60, 19, 133, -38, 24, -18, -156, -123, -41, -80, 74, 119, 187, 169, 148, -77, -196, -49, -123, 80, 54, 222, 52, 52, 77, -95, -122, -47, -24, 11, 28, 229, 156, 119, 161, -38, -90, -156, -108, -92, 28, -36, 169, 79, 105, -37, -11, -93, -50, -66, -11, 41, 15, 99, 114, 32, 3, 0, -55, -69, 7, -1, 220, 59, -7, 175, 27, -49, -166, -68, -73, -65, -30, 90, 58, 128, 80, -70, -120, -150, -27, -40, 134, -32, 89, -48, 5, -16, 6, -159, -67, 80, 97, 76, 116, 215, 82, 10, -162, -6, -146, -78, 124, 118, -18, 64, 13, 3, -133, -67, -169, -20, 75, 28, 75, -43, -60, -70, 8, -86, 62, 24, 6, 63, 101, 103, 106, 4, 7, -75, -140, -32, 14, 86, -40, -16, 15, 1, 14, -199, -52, 4, 106, 22, 13, 74, 13, -107, -43, -23, -38, -75, -52, 6, 86, 11, 24, 32, -125, -19, -43, -111, -59, 140, 120, 81, 180, -12, 78, -64, -86, -196, -204, 23, 28, 172, 72, 179, -74, -112, -117, -119, -28, 31, 39, 47, 75, 150, -13, 8, -58, -58, -63, -125, 10, 29]
6862B9Q3Jj19n9N2o8J5Q5J39j36k2J11k03J57j31pp4J05K2R6P8j46J45j63L9k00
6888a71M9mK25Oj2k5O3j88NQ6j42J4j6O5m0M3mQ7jk1j04l4R1o4J45kL3j37R2j67
6918a28J3j40K05J34K2j3j04J3m0j28Mk2Q6J51o2J03o0k5m4O3j71O6J4k9J57M1
6944A06J4R0j03j24j1j20J02O7o9L6N3J8o2o4M8p8J1m7J51N6J9j45J94j43q9k8
6970a18L1J8O4L6M5j5n9J7j2j15N3n1j9J64N5Rj26N8M9j53O0n5L2K38k07J09j34
6997b6m0n2M5k9J02r6O9J60j98J28lj00p7m1J04K7Ql5J37oj36P2o4p0R9m2M5J82
7025A63k1Mo9j2j95J26k61J82J25K6j0N7j12l1R5k11J10j98K27M7J6L4j2m9j93
7050a62J67j16j8j6N3J99j9p8J33j61j06J07K6l1O3%K3L3j4r6M9j57M4j50jK08
$$ y = [29, 112, 113, -6, -65, -13, -81, -66, 19, 158, 22, 0, 111, -92, 65, -66, -73, -147, -42, -20, 76, 154, 8, 153, -10, 29, -171, -122, -126, 99, 105, 93, 68, 131, -57, -52, 34, -108, -94, -110, -45, -85, -42, -46, 41, 40, 19, -85, -119, -28, -92, 53, 51, 84, -53, 39, -128, -115, -255, -50, 84, 106, 93, -11, 2, -38, -166, -162, -184, -98, 53, -9, 94, 34, 9, -35, 28, -143, -77, -63, -92, 65, 106, 120, 210, 107, -17, -28, -148, -46, 21, -48, -12, 41, 59, -3, -67, -19, -97, -86, -133, 18, 74, 93, -52, 142, -1, -90, -118, -87, -69, -5, 31, 76, 61, 2, 19, 7, -108, -55, -106, -125, 39, 94, 103, -23, 35, 84, -69, -9, -64, -32, 206, -1, 108, -26, -66, -118, -73, -102, 0, -96, -27, 133, -65, 63, 60, -40, -117, -158, -54, -27, -19, -54, 83, 77, -59, 13, -51, -121, -22, -64, -19, 163, 142, 146, 77, 65, -130, -4, -265, -83, 42, 68, 58, 115, 3, -28, 67, -144, -34, -232, -5, 42, 58, 92, 80, 31, -162, 5, -111, -129, -145, -92, 107, 88, 10, 143, -18, -124, -17, 9, -22, 41, 41, 64, 97, 83, -13, 36, -121, -77, -227, -228, -20]
7076b0O8J2N4nj13m8L2j39R7J39q7N2r3N9l0J21j15j46L7J35J15J5k6j4j02q9
7102i1L1Q0m7L1O0L0j6Lq2j2Mr9J42L3m9m6M2QN2j37J3R0j06m8J15K3O4j08L3
7131A3j02K5q9K5J9J68mO7k7j32J22o8qq1P5n7L8P7K6r0J84k67Q5nn6Oj3R7P9
7160A07j49OL3r1LJ0PkJ45r2J54j08r3Qm6L3j22K10rP4N6o2nl8j28K2R5Qk9M6
7190D3j6Q4j27l1K0K0k0n0J20j31R0L2M5n9m9O5j30K8O4J21j95K0l6R9p0Pj9M2
7218c3K2R4o1P6j16J6P3j66nn8J19K7M3KJ2k3m9o3P6k6K3J26jj45qN5j34L7jK5
7248f3n0J11n9L9N7Kq3M3mm2k6J50m4M0J4Kj35M7j35J71K9j15N0N8m%no8p4nk
7279a01M0Q3m0PJ30j71L6j05N1j49J46j2J20Rr0N5m0q9P4kJ9OP8O7r2L6r4P1n
$$ y = [-20, 48, 60, 114, 109, -4, -52, -20, -159, -62, 77, -10, 42, -51, 8, -22, 99, -16, -162, -125, 10, 125, 140, 114, 100, -2, -91, -60, 20, -27, 4, 64, 94, 78, 81, -1, -13, -9, -108, 34, 67, 18, -28, 14, 22, 74, -63, -50, 40, -66, -114, 1, 24, 88, -20, 13, -89, -64, -153, -128, -109, 59, 55, 122, 95, -37, 85, 17, 9, -72, 3, -54, -16, 61, 87, -3, 181, -86, -1, -6, -62, -56, -69, 28, 107, -42, -36, -3, -94, -91, -81, -74, -76, 69, -23, 131, 23, -70, -62, -108, -75, -197, 13, 4, 78, 134, 72, 67, 29, -99, -77, 18, 26, -3, 43, 27, 111, -16, -47, -27, -7, -27, -77, 43, -88, 2, 34, 79, 20, -29, 36, -94, -66, -2, 119, -76, -56, -92, 7, -63, -56, -75, -33, -11, 83, 22, 98, -18, -2, 71, -95, -100, -158, -39, -12, 31, 33, 45, 22, -27, -90, -14, -40, -17, 109, 108, -37, -45, 10, -124, -87, -88, -63, -113, -2, -61, -22, 35, 37, -46, -3, -7, -49, -75, 75, 31, 71, 85, 87, -48, -1, -136, 35, 64, -51, -1, 57, 53, 53, 48, -20, -94, -99, -101, -61, 22, -18, -11, 119, -52, -16, -121, -70, -219, -73, -85, 35, 44, -46, 9, -31, -120, -46, -48, -29, -23, 55, 122, 30, 66, -28, 43, 38]
7308C8j1n4R3k35L04n1j22J19j10j1m3P9N5K2j0m3n2p6kJ16M6k22J87M1q8J58
7334A28j18R6j60O0j26k6J06m7J30K3m2ML2j22J06m2n6O1Q0jnJL1j56nJ4k0Q4
7362C0mO4k7o6J5J05k30M9K5k9Q9k2O7%m0o8K3r6L5Q1Q1o2l5J44j50M0p3l9O7
7391b6L5j11J00N1Rjj22JM9K7m8o6J02Nk8N3L4j19n4O2m1O4K0J12J2n5o5j1K8
7420A7r7J38r1K7J6J3M6k1k3p9L1RJj45K53L0k16J58Pj2o2mj54N2J99j28J52j46
7448b9Q6n4o3M0q2J74j30J24k0k3J4OQ0j58o4P0j0j1J03k3q5N2Pl4L8j6k1R8q3
7477a4J35p6j9qj69J31p1J06j9O8qL9j06Oq2K3Q9j80K16j09R4r7N4k1k4j1j7K6
7505d4q4J37N9j47J7N5l5L5m1J2L2O5k3%L2o2M8j17J2K4q2K17N6j24O8n1p6L8
$$ y = [38, 27, -27, 66, -169, 135, 84, -38, 81, -29, -40, -83, -4, 51, 73, 63, 20, -32, -108, -110, 6, 52, -170, 17, 58, -30, 128, 10, 106, -54, 6, -120, -146, -40, -87, 43, 66, 24, 28, 60, -62, 44, 2, -54, 7, 87, 86, 81, 82, 113, -43, -48, -34, -54, 30, 26, 90, 63, -3, 12, 117, -113, -64, -39, -68, 21, -1, 66, 66, 26, -42, -19, -115, -80, 1, 82, 20, -15, 129, -21, 19, -54, -93, -26, 9, -102, -2, 49, 58, 57, -65, -64, -15, 12, -36, -102, 0, 5, -23, 30, 64, -55, -109, -47, -88, -24, -4, 108, 120, 65, 0, -11, 17, -80, 58, -33, -6, 10, 23, 69, 48, 25, -54, -23, -14, -13, -158, 95, 125, -91, 67, 74, 62, 0, -4, -158, -106, 93, -35, 117, -29, 57, 3, -60, -20, -102, 72, -58, 66, 46, 23, 37, 43, 123, -35, -99, -29, -39, -50, 53, 30, -55, -3, 4, -30, 8, -8, -29, 69, -14, 121, 45, 26, 18, -151, -20, -91, 15, -4, 64, 56, 95, -11, -5, -87, -64, 25, -155, 61, -48, 46, -51, 3, -18, -42, -53, -70, -44, -128, 9, 68, -79, -62, -7, -42, -7, -48, -36, -4, 61, 38, 38, 70, 8, 56, -61, -49, -25, -107, 110, 166, 42, 110, 59, -17, 21]
7533B1q3Q7q1O9Q5N9j06p6Rj8j18J40MqKJ17r7j03Q2L2QL4p1k1L0J84j39j39K03
7562A06j88N9o6pn0K74j07q7J65j19K4J06j76n0J25L5j29J03o1L0l0m8L3m9J48
7587D1p5Oo2J0K08k08J30o5%N7l8L3L4L0q8L3j00R5m1P0k3j22J61P1j73m8J16
7614E2n4N9j5L9lK2L2j55Q6K7j38j7M3n6O2M6O2j4p7p2JQ4n2j20J83o3L4J09m
7643A01j22K6r9R7l0M9o9M1R2o8N6j42J01q7K9j58Q7J50J5k3j60J73n9j0p5J2
7669g3K2P8m8JJo1J55j06J01k1Om4l3M1J09j33l0m9L3J9m8J93r4R4j07k3P8j29
7697f8k0K4Q1Q0j94M3R9P5j43k7P5j32j3J76j43J66o7J8Rq8K4j1l4N9n8J29j6
7724D4l1L5n0m9k6J36p4k6J22p5L5M4k8j18R6j09J83o0K7n5qM9J9k41J10L1o8
$$ y = [21, -62, 25, -56, 13, 98, 157, 51, -25, -16, -34, -152, -12, -8, -16, -14, 103, 6, -97, -15, 17, 25, 59, -12, -33, -3, 181, 42, -97, 106, -82, -23, -89, -96, -146, 128, 21, -66, 99, -20, 4, 110, -66, -116, 9, 44, -85, 18, -43, -13, -43, -91, -58, -107, 41, -34, -28, -90, -80, 128, -80, 50, -15, -15, 42, 4, 37, 71, 101, 13, 46, -54, 41, 0, 70, 47, -75, 86, 157, -16, -64, 52, -2, 57, 42, 81, 78, 100, 132, -23, 63, 90, -48, -65, -22, -78, -16, 30, 92, 78, 1, -71, -70, 14, -38, -158, 25, -38, -4, 105, 101, -21, 5, -94, 3, -27, 22, -47, -6, 86, 18, 74, -68, 33, -54, -25, -183, -96, 54, 69, 46, -114, 59, 0, -10, -85, -73, -51, 27, -21, -20, -19, -80, 75, -31, 70, 49, 55, 11, -22, 19, 128, -5, -35, -84, -51, -32, -80, 113, 19, 113, 6, -17, 61, -68, -88, -64, 17, 97, -97, -54, 45, 120, -23, -50, 25, -107, -120, 56, -87, 79, 12, 30, 39, -49, -25, -36, -70, -11, -69, 60, 44, 13, 48, -2, -51, -77, 59, -15, -41, 81, 6, 41, 85, 57, -61, 35, -74, 109, 49, 76, 21, 13, 62, 81, -160, -50, -19, -87]
7751h7J63k6l2m1N5j07M1P0j18J04m9K7N0m0R3j20M4L0j9m7J4L5k4j1q4J29j5
7778C5j02N2L5M4J7oj30%j3M3k0L6J64k12j05J21J10q3J9k0K3n0j9L1L7J02j18
7805ikrO9k0j34J2J4R8l6M3m0L6Rm6j0l5J40j28J21n4rj1PJj5j03j4J03j01J66
7835D3j49J37m0j03L0K00j01JJ4j6q7j0O3Q2q4q7Q2P6q4K0O6o6j7R8r4r9J16Q5
7863G6p2j5J17j38J48k41Q5k4k5J18J1Op5M5m6P2j26l5L2k3Q0j06K45j13j00J8
7889h6L8k6J35r4k5Q8n0M4j20K01Kj47M3k3k3M6p4N9pP9j1q6p4k3K8Q4j5N4L3
7918E0j09P2n8Lk2%J99j84K8P9r2P6j3q0l5n9J36qQ9j24J20L2r7J22j16j72J27
7945c6JJ49o6j29Q5%o1m3Q7j24J71Jn1R7l6K4mn9j07J00J7J6k8o8J45j03lrK0
$$ y = [-87, 76, 50, 18, -23, 32, -75, -34, 36, -82, 22, -27, 0, 50, 10, 103, -17, 27, 57, 38, -9, 5, 40, 16, 5, -79, 50, 35, -67, -15, 20, 64, 81, 75, -55, -55, -68, -25, -45, -9, 155, -57, -162, -41, 69, -14, 5, -15, 8, -42, -61, -30, 7, 109, -9, -11, -20, 49, 29, -105, -93, -79, 19, -17, 26, -14, 22, 31, -15, -25, -60, 80, -48, 73, 19, 10, -1, 6, 7, -8, -111, -125, -22, -123, 43, -106, 31, -9, -112, -82, 118, 17, 18, 32, 16, -71, -81, -18, 64, -20, -107, -25, 51, -33, -13, 53, -13, -30, 68, -26, -125, -9, 76, 4, -11, 106, -32, 116, -125, -40, -64, -89, 29, 40, 46, -29, 16, -30, 42, -84, -119, -87, -110, -30, -136, 109, -4, -104, -86, -48, -74, 61, -33, -58, 30, -20, 24, -96, 105, 107, -40, 3, -20, -43, 3, -71, -12, -19, 60, 49, -37, -111, -134, -106, -22, -37, 17, 50, -59, 13, -45, -42, -64, -64, 135, -49, -21, 58, -34, 42, 29, -51, -86, -145, -9, -17, 72, -52, 68, 100, 3, 125, 9, -163, -36, -35, 114, 48, -81, 4, 4, -57, -100, -13, -137, 34, 35, -16, 81, 45, 69, 65, 6, -101, -1, 16, 32, 4, -64, 81, -22, -25, -34, -14]
7974a4J2O1Jj17K30n7j00J16j08p3P1j1p9m1L5J78j98R4o9K5n2L0Q1Pn7p2J59
8001E2j09l9J33j04J5l3QM8k0p3K07l1r9jM6j4k4Pn7J54p6P2j7k2Q6j37O1jl8
8030fJ7rL4J6m4No8O6J7o7J32q7l0J45r3p4J9l1R2j50J48R6r2l7r4Q9m2M4nkk2
8061c3ON7l1j1nqP2q1j8oL4J07m9j43J19Ql9J13j8q1K7l3J1pP0j14PO6K7n3NM1
8093D0K9q1m8N4m7J01q5L0L7k3%l4J28l1j32l5L6j5J42j0o3l2k4R8o4M8j10J72
8121H1p2k4Q0n4J23o3j9j02J02k3l2j00Q4JJ56j48k3N2o4O2n5lL3O5k7N7j68J22
8149D1j03N9L5k3j7K7oM1J3j38J00j33J62pq1J63o8j4n8q6J46j31J9R0l1n9J17
8176E8m8p2j10P3J43R6j17OK3j48J11Lq9mR5
$$ y = [-14, -2, 59, 60, -57, 173, 116, 16, 132, 24, -49, 22, 11, -68, -109, -74, 104, -94, 0, -69, -44, -96, -66, 15, 22, -35, -107, 52, -57, -96, 37, -67, -52, -85, -77, -29, -49, -122, 85, 54, -45, -46, 0, -14, -38, -31, -88, 66, -10, 62, 45, 23, 109, -28, 33, 32, -6, 11, 2, 36, 52, 8, 13, -55, 11, 28, -39, 93, 6, -24, 121, 28, -46, -27, -58, 34, -116, 32, 128, 36, -1, -95, -6, -48, -4, -9, -11, -33, -27, 30, -1, -12, -17, -25, 47, -34, -52, -58, -24, 83, 34, -109, 10, 18, -21, 92, 74, -7, 20, -13, -2, -9, 61, -53, -46, 20, 47, -6, -1, 40, 69, -12, -60, -6, -53, 48, -37, -7, 30, 7, 7, -27, 101, 70, -62, -97, -61, -76, 66, 56, -7, -39, -63, 35, -29, 19, -91, 81, 9, -15, 65, 11, 134, 71, 52, -50, 52, 29, -3, -103, -19, -18, 138, -10, -33, 19, -45, 17, -38, -41, -8, 57, 30, 87, -81, 41, -62, -3, 32, 9, -8, 19, 13, 54, 67, -71, 29, -104, 58, 51, -30, 133, 65, 51, -7, -93, 53, -78, -59, 31, 0, -59, 58, 10, -62, -172, -99, 44, 140, 23, 29, 52, -96, 15, 18, -71, -75, 20]
8191B0
$$ Imaginary data points
##PAGE= N=2
##DATA TABLE= (X++(I..I)), XYDATA
0@%%%%%%%%%%%%%%qJ6j6J6j6J8k6L2l4M2n0N8p2Q1q9J04j20J38j58J80k03K28
36A21k58K90l23L63m04M46m96N51o09O73p44Q20r04R96j097J209j332J468j622
55h52J795j991K217k477K781l144L586m140M855n818P195r339J3162k2061Q1442
70F7211M1696j31966K273K9925m0188p7022L8188Q9273L7893k0884K850N485k8535
83A6199n1434k2503o156J1483M7198O1374M288k4650J3889J0969p6879q5283K3780
96g7725P1915l160k4192N6319P4155k6451q3299k6155K3300j2995l5937K0615
108d3610O9699L7152r691j1058j1423l5420l6251j3402o065Q497M9837N3002l76
121E0891k3683N686j84n1917n2590J4909N0657J7084n309K5527L7668j5207o0708
$$ y = [0, 0, 0, 0, 0, 0, 0, 0, 0, 0, 0, 0, 0, 0, 0, -8, 8, -8, 8, -8, 10, -16, 16, -18, 24, -26, 32, -40, 41, -48, 56, -64, 74, -84, 96, -107, 121, -137, 153, -170, 193, -211, 235, -261, 290, -319, 354, -390, 430, -474, 522, -575, 634, -698, 770, -852, 943, -1048, 1169, -1308, 1473, -1671, 1915, -2225, 2630, -3188, 4007, -5332, 7830, -14231, 67211, 108907, -23059, -20786, 9139, -31049, -108071, -69883, 19390, 57283, 36399, 39249, 44734, 16199, -35235, -57738, -63894, -52411, -5213, 56161, 60449, 35799, 49688, 60657, -16222, -101505, -77725, -5810, -8970, -33162, 23157, 97312, 70861, -12438, -38593, -15293, -28288, -64225, -43610, 26089, 63241, 53550, 42492, 31069, -4351, -40602, -54004, -60069, -51572, -1735, 51267, 50891, 27208, 32894, 32710, -19207, -71797, -56888, -6231, 10853, 5544, 31071, 68739, 53532, -7176]
134g176l5653L439k492q559K2989M6389K9327M995r481k4833l1217j8509p955
147c8736l442J5543L8493L1682J423j5962j3549j5961l0295k7747N671L4405K8417
160I942J4090J7116J3061j5669l6164k8518j2839k165J0926K2854K4865J9327
172C6826N393j4040k6080k3893j5978n372R990K3463K7660K2270Q058r812k1721
185A6764k5531k3254j2129N708J8354K3555K3112J2500n625j7628k0520k1351
197b6045j3770L808J8179K2699K2603J5620j654j7078k1922k2484j9237n511J3987
210c0805K4732K1872J3862N610m219j9680k7865j6940J336Q928J2789K2143K3549
223C5312O458j1862j8890k1049k0516j0479M501J6280K2851K2387J2814l268j5215
$$ y = [-7176, -42829, -39390, -41882, -50441, -27452, 18937, 48264, 53259, 43778, 18945, -12272, -30781, -38736, -42178, -26635, 11858, 43540, 44963, 29001, 15452, -509, -30804, -58551, -52880, -18475, 9942, 24032, 41148, 54209, 38540, 2376, -26142, -38981, -41146, -30220, -7366, 17499, 36826, 42219, 28179, 2099, -21794, -37772, -43144, -33154, -9691, 17969, 40239, 48297, 38485, 16764, -8767, -32021, -44150, -38442, -20088, 3467, 26579, 39079, 33454, 15826, -4694, -26045, -39815, -36007, -17828, 4871, 27474, 43094, 41440, 24362, 2440, -20044, -39281, -44792, -30805, -6073, 15799, 29661, 35271, 31052, 11372, -16493, -33433, -32097, -23169, -10380, 11763, 35312, 41770, 29908, 11018, -10031, -30547, -41026, -36525, -20245, 2606, 24993, 37807, 34539, 19324]
236A9324j9384j7678j3506k978J3804K4942J9044O779N70o872k1207k6995j4237
249c8394K515J0750J6373K2130J9764O090r579j8462k0231j6396p620N219J6520
262a1321K0208J6350P494n355j6981k0668j6171q538K144J5790K3295J9674R300
275C5221j017j1410k0407k1473j3149k87J1214J7416J8635J3772K428j0631j8566
288A746j8437j2952l184R163J8874K1069J5164M341p259j6924k1156j7963p453
301c4971N439J5259J8896J7108R307l072j4425j9033j6386q356K349J3346J9742
314E203J8523R967j619j2847j9518j9748j3090j348J0786J8377J9738J3836L332
327C1592q305j6664j8763j3946l740P666J6510J8851J4538M757o979j6987k0212
$$ y = [19324, -60, -17738, -31244, -34222, -20418, 4524, 23568, 30347, 30917, 24045, 2838, -24157, -38394, -35879, -25129, -8756, 13374, 33138, 39228, 29649, 11187, -9044, -25440, -33060, -27841, -11321, 8887, 25237, 32731, 27376, 10395, -10273, -26444, -34982, -32838, -17048, 6247, 25921, 35221, 34204, 22794, 2387, -19086, -32235, -32522, -21308, -3892, 14743, 28515, 30943, 20312, 1746, -16691, -29643, -32827, -23664, -4790, 16279, 31443, 35784, 28525, 11601, -9555, -27518, -34971, -29532, -14273, 4623, 21731, 31038, 27966, 13541, -5492, -21878, -30234, -27885, -14539, 5203, 23726, 33693, 32074, 19227, -291, -20039, -33129, -34477, -23691, -5314, 14424, 28260, 31592, 23287, 6623, -12140, -26086, -29826, -22160, -5650, 13201, 27739, 32496, 25517, 8530, -11682]
340a1682j6259o487M533J4918K0767J8531Q382l483j2756j7363j7992j1580J914
353b8557J4151J7900J5035R976J321j1632k1132j8877r373N3R377J7494K1006
366A6742J4718K391r820j7066j8287j4250m895O263J5416J9368J5202M061q241
379B1602j4331j6198j6158r275O455J8769J9160J3503Q168l76j3419k1680j9072
392b2852p953L181J0705J5729J7950J2573n17j3037j7553j6200j0129k62R508
405a8857J7087K0047J3689j46j1042j5706j7459j5625n397Q195J7115J8538J4000
418B4439M569n728j3606j8023j5793n721O732J4773J7071J5170P256l734j4251
431A3154j9939j6534p410J681J1137J9600J8788P798j606p768j6454k0832j0625
$$ y = [-11682, -27941, -34428, -29895, -14977, 5790, 24321, 32703, 29220, 16464, -899, -18891, -30471, -28557, -14406, 3494, 18529, 28505, 29826, 18194, -2938, -21815, -31188, -31135, -21758, -4264, 16742, 31460, 33851, 24031, 6965, -11322, -25572, -30467, -24204, -8788, 10580, 25782, 29843, 21602, 7271, -8927, -25085, -34360, -27905, -9136, 10024, 23527, 31695, 31319, 17900, -3780, -22852, -30805, -27624, -16919, -1190, 16760, 29333, 28816, 15779, -1774, -17974, -28103, -28365, -18857, -1770, 18277, 31966, 31820, 20778, 5072, -12387, -28012, -33409, -25214, -8099, 10439, 24439, 29008, 23280, 9674, -8349, -24142, -29863, -23131, -8358, 8713, 23883, 31139, 27405, 13154, -6785, -23319, -30729, -29048, -17911, 1689, 20477, 28275, 26669, 18901, 2447, -18385, -29010]
444b9010M116J0479J2090J6520J5032J899j3226j8464j4693j0252n471N778J8572
457f630K0259J2237L916n154j6343j7941j0727n943o44J5171K5123J2312l420
470B2216l416l199j7527k5739q323J4050J5802P426J1357J8428M600j9877k2881
483g083r737n167m562O982J8231J6291J0339L683j1964k1548j2231j545n683l284
497b7278J8620L0900J0900j2625q423K613j2750l1292j1652K2701K2003O78M541
510H936J8728L796k2190k2670q314j497K776J0795J3817J2122J1530L437j6435
523A4831k5579j1070M488j387p050J4483L5204J3659k0764j5252O536o405k9718
536b8024j0897K4962K4535K730L29R660J789j7110k2650j1992P24Q354J2015J1955
$$ y = [-29010, -24894, -14415, -2325, 14195, 29227, 31126, 17900, -564, -15257, -25509, -30980, -25202, -6630, 13629, 25866, 29782, 24628, 8285, -9656, -20383, -26326, -26970, -11799, 13324, 25636, 22216, 18800, 15601, -1926, -27665, -35988, -21938, -6136, 1290, 12647, 31075, 35675, 15798, -7083, -16820, -21987, -26549, -19567, -1336, 14955, 25294, 28977, 17013, -4535, -16766, -18311, -23994, -27278, -8658, 22242, 33142, 20517, 12094, 14707, 1957, -29335, -40987, -18286, 3717, 4395, 8936, 27664, 31460, 9270, -13400, -21714, -23211, -20435, -9640, 4177, 16299, 27829, 31266, 14831, -10748, -21818, -17330, -18717, -25767, -11284, 23920, 37579, 16815, 1563, 8099, 1694, -28024, -38921, -13959, 10576, 13306, 13635, 23295, 25084, 7974, -14676, -26668, -25944, -17590, -5575, 6380]
550F380R164Q670M007j4102k7890j2565J0899M907p395J1244L2103J1948k1263
563A6107j8546J150l748j9562r428J8124K5598R202j987K046O94j3203j9922j1530
577b5005L12J0027J5935J1169K876M350L232j4611k6096r969J0339P446K08J0050
591B63K1693J0449j2882j9126p547k828r984o034J2672K1561J1213M23k934o772
605A0167j1647j2316r513l28J2513J7123R433K411K027k719j3736j8132r260L652
619b0325Q965P804R273J3070O548q975j5942j0723n667m006K719J1388J4494J0961
633A9584K936o243j0825j0604j0083p242K425J1514J3204R956N303j470p851j1912
647a308j2397p002K000Q943J0966J1244P861n86q083j1312j2145q308N6O915J0409
$$ y = [6380, 15544, 24214, 28221, 14119, -13771, -26336, -15437, -10530, -17925, -6681, 25422, 37370, 16107, -2439, -1289, -5037, -24599, -34027, -15903, 9695, 18897, 16910, 18956, 19650, 6447, -13475, -25005, -24693, -14666, 1269, 12438, 15314, 19664, 22896, 8285, -17811, -27780, -17441, -9995, -9787, 263, 21956, 32405, 19523, 397, -7150, -9978, -19962, -25996, -13324, 8237, 19450, 19873, 16939, 10167, -1480, -13796, -23309, -23637, -11124, 5999, 15432, 17843, 19870, 17151, 3415, -14717, -23977, -20325, -11360, -3556, 5717, 18787, 25335, 16360, 418, -10305, -15972, -19978, -17259, -5871, 8623, 19584, 22520, 16277, 5452, -5152, -15235, -22477, -20052, -8538, 4666, 14622, 19925, 18455, 10604, -1308, -13705, -20707, -18707, -9764, 1202, 12446, 20307, 19721, 11638, 326, -11819, -20127, -20071, -13156, -2747]
662b747J1731R481J736n801r707j1722j0279k591N337R658J0944R804M357l743
676A6458j0494j2689r183l070K170P423J2856J2354M096l286p207j0214j1264
689a2050o836P79P127J1569J1326N751n55n685r989j2008q159l40P040J0527J0367
704H864P420L128m047j1269j2812p100j440K410Q093J2260R726L315l841q715
718E992j0854q616m625K008Q176J1744J0079M407j513p633j0916j0471n513N59
732a7176O888J0877R703O362O91o070j0189j0295o929j228N310R738J0496P671
746A5849K131m855r541j0383q092l345L653R456J0655Q052L583k207p908j0879
760c831r419l843K466P192R421R951N844j671q044r819q771n906l78O565J0307
$$ y = [-2747, 8984, 18465, 20201, 14400, 4693, -7029, -17308, -19899, -14562, -4904, 6040, 15844, 20201, 16458, 5964, -6725, -15908, -18978, -16808, -9385, 3471, 15825, 19921, 16635, 9428, -786, -12050, -18886, -18107, -10980, 589, 11915, 17666, 17111, 11426, 1437, -10571, -18730, -19070, -12030, -1503, 8864, 16284, 19412, 15365, 4096, -8716, -15816, -17256, -14846, -6753, 5507, 15233, 18548, 14707, 5992, -4862, -13478, -18103, -16095, -7919, 3825, 13904, 18311, 16798, 9165, -1751, -12222, -17735, -17176, -10288, 589, 10292, 16654, 17345, 11275, 1086, -9209, -16138, -17366, -12056, -2318, 8178, 15849, 17980, 13125, 3584, -6799, -14891, -18236, -14583, -5127, 5528, 13580, 17163, 14956, 7048, -3831, -13250, -17093, -14627, -7435, 1986, 11937, 17781, 16110, 8066, -1753, -10524, -16430, -16808, -10243, 64]
775F4J0241N832J40n310q884j0235p073j697N221R650R589P086J359l265r179
790C539r977q087k393M733P269R152Q487L918k224q924r743p650l652O11P627
805g314J0070R032M231j479o574q751r300o030O08O314R276R150N915Q07n189
820A0766r236r827o441j147M674Q237R648P257K035l955q427r462p048k780K770
835a2936P889R964Q057K641k517o929r081q829m326K076P277Q971P795M731j98
850A4585n804j0305p918m344M74M227Q275R573O248K10n819q325q335o239j796
865a5293M004Q734R514O334J350l458p088r014p702k812L436P547Q810P179L013
880A4554j790o632r277q242l526K279O036Q013Q257N124p63o508q639p684m759
$$ y = [64, 10305, 16137, 16277, 10967, 2083, -8152, -15225, -16922, -11701, -2051, 7538, 14624, 15983, 12718, 3539, -6438, -14525, -16918, -12185, -4916, 4236, 12723, 16641, 14417, 5493, -4250, -11900, -15552, -14941, -7314, 2756, 11788, 16019, 14540, 7966, -785, -10085, -16115, -15507, -9193, 83, 9233, 15148, 15955, 10766, 1530, -8297, -14738, -15885, -11211, -2974, 6674, 13931, 15966, 12011, 3584, -5878, -12926, -15706, -12936, -5047, 4917, 12974, 15615, 13098, 6169, -2912, -11741, -16067, -13991, -6714, 2257, 10052, 14783, 14585, 8781, -1524, -9442, -13786, -13312, -9085, -810, 8763, 15011, 15221, 9402, 1077, -7258, -13497, -15293, -11289, -2555, 6959, 13293, 14643, 11185, 4097, -4917, -12619, -15431, -11995, -4448, 4362, 11541, 14554, 12764, 6132, -3145, -11387, -14913, -12634, -6598, 1415, 9672, 14796, 14033, 7525, -1114, -8798, -13557]
895a3557k38M736Q729Q777N132m2m088p773r084n890n36L800O902R187O965J295
911A4315l839p120p978o608l154K311P595Q918O459K446j508n879q561p817l721
926a4141J634O439Q517O409L731P59m649r490r101l311J545L844O048Q160P320
941A3714J096o582q716n734l846l165J489Q520J0541N678n93l866m758o290p968
956a0480n180L500R749P821L110K340J407m263j0321r737j940M560N198L792O474
971F030Q128J225q782j0190m925j215r19P93O729J1167P104k824p387m139l153
986b358p280o049L782J1463Q703J721q99M70k424r864j1040j422P523O553K912
1001A791M417O496J612p913j1631o016J493K216j57M629J1513P669l901r114n079
$$ y = [-13557, -13795, -9059, -330, 8447, 13579, 13537, 9449, 1676, -7408, -13298, -13834, -10034, -3132, 6055, 13020, 14315, 10476, 3356, -4622, -11230, -14384, -12073, -4478, 4440, 10899, 13345, 11837, 5958, -2603, -10420, -14141, -12507, -6068, 2449, 8858, 12589, 13348, 8699, -791, -9892, -13203, -11658, -7814, -1766, 6394, 13714, 14810, 8228, -488, -6222, -10068, -13233, -11744, -3224, 7317, 12995, 12402, 8536, 3778, -2512, -10480, -15660, -12160, -2411, 5410, 8520, 10860, 12267, 8004, -2317, -12054, -13994, -9434, -4236, -444, 6030, 14158, 15383, 6601, -3589, -8514, -9729, -10648, -9855, -3126, 8041, 15145, 12321, 4934, 795, -2358, -9638, -15687, -11905, -442, 8261, 9982, 9083, 9553, 7129, -2735, -13775, -15197, -7674, -1121, 1791, 6208, 12704, 14316, 6403, -5228, -11244, -9751, -7535, -7692, -3063, 8450, 16119, 12218, 3104, -1975]
1016a975k416m475m946K576J1337J0394J353l756j328j835p974r888k003O967
1030g969Q714M203J481L712K393o186j2545o816K756L860J527M267R045O498k659
1045A2281r593p331j951j801l040K465R735R391J897l305l927l629n248o918l090
1060a4064N809J0134N559O66J398L74n768j0243o492J297N163M331L650O209N095
1075A3118k407q577p179k946j380J16L725P152P335L356k783n940n194m506m696
1090a0806j000N294Q325O104K262r34k639n030p372n548N30N019N302M720M979
1105I206J787k929o269o772m650j016K756N045O169N811K146k673n314o214n230
1120h147k352J606M460O265N769K720j251m188n946n960l214P49L795N800O578
$$ y = [-1975, -4391, -8866, -13812, -11236, 101, 10495, 11848, 8092, 6764, 4929, -3045, -12933, -14936, -7969, 745, 4948, 6429, 10141, 12534, 6348, -6197, -13013, -10257, -6397, -4870, -603, 8442, 14940, 12281, 2688, -4643, -6594, -8395, -11435, -8970, 765, 10156, 12053, 8748, 4821, 1192, -4056, -10974, -14064, -8255, 1879, 7438, 8104, 9502, 9876, 4108, -6135, -12627, -11330, -6167, -1836, 1814, 8023, 13118, 10711, 2134, -5045, -7991, -9371, -9255, -5530, 1622, 8957, 12313, 9530, 3590, -1604, -6110, -10806, -11806, -6512, 1813, 7917, 10179, 9245, 6606, 1576, -5796, -11344, -10814, -5795, -493, 4227, 9206, 10993, 8064, 1795, -4977, -9627, -10643, -7887, -2842, 3327, 9138, 11284, 8611, 3297, -2917, -8147, -10499, -8893, -4433, 1832, 7601, 10321, 9070, 4882, -1064, -7024, -10238, -9489, -5694, 106, 6684]
1135F684L706m52l641n624o144m071o67L092O030O144L829N10k079n005o231m978
1151h897j156K415N152N869M442K102r21n053p135m936j534J143L804N929N927
1166G151K952j162m526n525m767l009n03L512O331N718K981k45k769n226n824
1181d911m200j139L427N612N507L725J486j876n166o048m461j197K178M258N410
1196B605M718K388j609m997n536m386k455N26M080N959N345K666o55l496n252
1211i9n407l471K32L508N085N085L463L92k922n069n251l814r19K674M803N556
1227C846M242J436k242m899n256m291k009J495M356N642M396J864j266l495n369
1242a550n095k374J151L875M890M932L129k01l618n307n092l121j70K768M985
$$ y = [6684, 10390, 9938, 6297, 673, -5471, -9542, -10209, -7117, -1087, 5057, 8886, 9396, 7317, 2312, -3919, -8897, -10053, -7638, -2486, 3383, 7825, 9927, 9006, 3953, -3182, -8118, -9652, -8509, -4705, 1224, 7151, 10103, 8941, 4415, -1110, -5877, -8886, -9389, -5877, 454, 6172, 9153, 8908, 6139, 913, -4911, -9111, -10250, -6823, -1211, 4296, 8021, 9507, 7631, 2465, -3583, -8044, -9241, -7063, -2805, 2605, 7323, 9711, 8102, 3105, -2431, -6817, -9272, -8746, -4666, 1293, 6638, 9304, 8649, 5153, -99, -5506, -8977, -8745, -5237, -152, 4933, 8396, 8788, 5866, 797, -4454, -8268, -9187, -6513, -1710, 3846, 8088, 9524, 7282, 2383, -2873, -7164, -9173, -7678, -3322, 2320, 6716, 8580, 7314, 3819, -1550, -6645, -9019, -7868, -3993, 897, 5829, 8958, 8757, 5139, -168, -5260, -8381, -8551, -5783, -798]
1257g98N213L618M39k527m856m966l665r68K095M744N417L938R96j807m002n471
1273b600m684j755J791L837N119M441K431p72l796n236m321k558M37L298N264
1288H96M736K630k19l210m943n102l027j97K777M684N151L507P85k270m569n116
1304c487l609j083K107M044M909L834J688j687m310n159l992j602Q67M023N347
1319A890M550K026q88l298m701m833l044N70L480M583M233K870K80k919m882m684
1335d767k903l06K549M564M957L615Q41k222m534n233l535j036J508L761N203
1350B462M151J338j728l772m520m111j985J373L884M823M201K052o79l329m999
1365h39m672k516J97L126M687M552K797L8k676m204m521l243l89K770M520M385
$$ y = [-798, 4415, 8033, 8472, 5945, 1089, -3877, -7542, -8510, -6415, -1671, 3746, 7684, 8680, 6873, 2871, -2600, -7284, -9039, -7248, -3411, 1708, 6149, 8580, 7808, 4012, -1224, -5545, -8103, -7666, -4368, 896, 5632, 8262, 8043, 4833, -110, -5212, -8239, -8436, -5659, -975, 4176, 7683, 8468, 6198, 1629, -3487, -7096, -8179, -6072, -2028, 2881, 6715, 8403, 6716, 2406, -2753, -6745, -8347, -7480, -3457, 1890, 6440, 8466, 7578, 4280, -421, -5254, -8298, -7728, -4248, 335, 4568, 7438, 7718, 4799, -83, -4767, -7670, -7976, -5427, -863, 4094, 7709, 8550, 6328, 1794, -3439, -6974, -8010, -6502, -2741, 2462, 6613, 7951, 6223, 2451, -2069, -6180, -8165, -6792, -2908, 1915, 6116, 8168, 7489, 4160, -839, -5511, -8027, -7830, -4704, -17, 4535, 7332, 7370, 4694, 490, -4031, -7274, -7663, -4893, -373, 4012]
1381D012K838J206j739m851n531l196m37J444L376N004M652J566k121l751m095
1396a623l649k109P09L508M738M202K143j317l729l772l606l514o21M108O128
1411A596L311J167R75n58n079o695k566J878K234J908M110N100J034l704m674
1426C7l489k868j422J752L816M483M493K096k573m885l090k072l206j782M639
1441d071P642K659j390j90N39m328p653k607M059L582J463L269M777J030m110
1456D671n047l880k264k06K143L015L582M395J990l340o120k601O1k057j938M395
1472c201Q557L096l422j505P29l729p546k662M066M526J900K443L142O54l289
1487C759m695m044j637J176L256K686K358L466K253l781p284k955J167j058j708
$$ y = [4012, 6850, 8056, 6317, 1466, -4065, -7261, -7698, -6254, -2878, 2126, 6778, 8344, 6223, 2472, -1623, -5272, -7381, -6672, -3164, 1574, 5776, 7919, 6602, 2873, -899, -4505, -8019, -8640, -4532, 1596, 4907, 6074, 7049, 6491, 1412, -5283, -7849, -5971, -3737, -1829, 2281, 7381, 8415, 4711, 37, -3452, -6320, -7742, -5990, -2174, 2309, 6802, 8898, 6325, 1440, -1650, -3722, -6928, -8710, -4071, 3571, 6230, 4840, 4650, 5189, 861, -6792, -9399, -5340, -1758, -295, 2974, 7751, 8781, 4671, -376, -4256, -6520, -6726, -4583, -1568, 2014, 6409, 8399, 5059, -1061, -3662, -3601, -5658, -7596, -3201, 5356, 8452, 5030, 3525, 4254, 525, -7021, -9683, -5617, -1091, 809, 3252, 6394, 7048, 3759, -936, -4980, -6617, -5441, -2185, 501, 2859, 6325, 8578, 4797, -2487, -5442, -4275, -5333, -7041]
1502g041L973Q300L030k999k541k19k784n560k215L296M951K828J421J312n53
1517E199k944m149l850j964K077M285K961J609K839K035l717o568l029R08K7k80
1533d561L285N905K723k249l289j992k224l436j222K698M440L391K269M73j749
1548D462k773l285l762j691K192M098K868J575J590P3l015m938k845J43J250J610
1564b448L075M105K230j374l031l078l033k179o9K024L540L500K221n18j840k742
1580C83l150k240m17K028L331L224K004M52j236l040l895k638n93J026K574L662
1596A475K828J102o78k336l463k915r93O09K205L268L056J093n97j996l414l084
1612c840j854M05J859L110L052K288P26j806l330k856j940q13J064L158L315J921
$$ y = [-7041, -3068, 5232, 8262, 5263, 2722, 2503, -281, -5841, -8056, -4760, 191, 3019, 4440, 5752, 5199, 2255, -1894, -5744, -7708, -5631, -1346, 1615, 3224, 6063, 8098, 4381, -2187, -5216, -4308, -4281, -4561, -1276, 4629, 7352, 5103, 1814, -178, -2402, -5838, -7060, -4362, 78, 3469, 5738, 6211, 4462, 1689, -1596, -5358, -7049, -4857, -759, 2109, 3684, 5274, 5347, 2332, -2606, -5451, -5308, -4058, -2448, 627, 4732, 6962, 5588, 2557, -521, -3554, -5733, -5802, -3778, -238, 3262, 5483, 4965, 3125, 383, -2767, -5007, -5424, -3396, -65, 3159, 5163, 5615, 4379, 1339, -2556, -5194, -5787, -4761, -2187, 1475, 4303, 5405, 4727, 2391, -1072, -3987, -4980, -4371, -2166, 1102, 4158, 5251, 4654, 2658, -756, -3840, -5694, -5289, -3430, -320, 2732, 5020, 5746, 3940, 610, -2246, -4186, -4999, -3935, -777, 2538, 4459]
1628D459L73j163k733l130k441q76R54K836L342K547J226m93k142l108l080j649
1644e078M99K192K718K501J817Q7k301l189k461j698l6J899K984L081K159L22
1660E496j806k642l061k442p95J141K531L061K443P71r30k453k902k440q20Q96
1676c952K294L075K727J355q80k235k853l033j808K55K144K758K823J875K08j838
1692B915k605l025j651q6J524K758K975J888L57j239l058l381k145k46P94K165
1708b060L466K920P80j027k088k752k656j409O52K482K912K323J292l56k170l177
1724h68k856j620K74K168L128K736J774M08j374l008l196j761k58J303K245L135
1740B230K187K71j541k732k592k215r77J171K891L297K285R99p86k308k962k828
$$ y = [4459, 4832, 3669, 936, -2194, -4635, -5511, -4557, -1721, 1621, 4168, 5394, 4901, 2759, -349, -3429, -5078, -4579, -2387, 331, 2832, 4649, 4736, 2435, -754, -3215, -4913, -4949, -3050, -66, 3015, 5174, 5496, 3690, 1048, -2013, -4455, -5250, -4109, -1578, 1483, 3926, 4697, 3767, 1314, -1588, -4028, -4848, -3952, -1658, 1417, 4144, 5499, 4619, 2384, -469, -3502, -5310, -5055, -2911, -153, 2670, 4545, 4753, 2915, 310, -2715, -4366, -4452, -2928, -170, 2805, 4693, 5050, 3811, 753, -2628, -4773, -5019, -4225, -2060, 1406, 4326, 5106, 4079, 1991, -761, -3417, -4826, -4174, -1692, 1220, 3543, 4835, 4479, 2309, -868, -3724, -5344, -5070, -2902, 226, 2962, 4736, 5144, 3770, 762, -2434, -4195, -4453, -3150, -905, 2230, 4417, 4688, 3147, 415, -2177, -4392, -5369, -4198, -1307, 1990, 4275, 5274, 4488, 2180, -782, -3610]
1756c610j361N76K211K821K488J318k09k054k942k870j257N03J868K767L112J919
1772E280nk104k781k905k078n67J456K734K939K221M21j126k520k880k247m96
1788d658J172K546K965K430O13r21k437l080k727j101O53K097L052K661J462l09
1804D418k060k894k572j234N9J938K926K816J391k43j640k985l067j744j72J697
1820c366K668K956K174M58j208k580k972k027m89J003K448K751K107P79j070k437
1836A195k963k525r58R28K384K926K550J511m27k178l006k466j219P8J626K800
1852B56K782J226k88j556k677k859j640R3J844K863K781J928N2j465k309k724
1868a693k447q43J698K608K083J673J324m95l020l413j293l1L35J581L330K998
$$ y = [-3610, -4971, -4395, -2184, 637, 3125, 4443, 4234, 2180, -762, -3632, -4889, -4386, -2518, 249, 3361, 5280, 5275, 3171, 390, -2515, -4593, -5160, -3704, -970, 1969, 4190, 4611, 3485, 965, -1915, -4162, -4658, -3486, -940, 2025, 4455, 5068, 4147, 1710, -1370, -4097, -5198, -4545, -2448, 604, 3265, 4727, 4418, 2358, -536, -3108, -4342, -4283, -2345, 581, 3397, 4788, 4545, 2905, -80, -3147, -4891, -5063, -3366, -698, 2258, 4432, 4890, 3682, 1102, -1870, -3897, -4386, -3383, -935, 1816, 3923, 4702, 3632, 1195, -1768, -4293, -5251, -4323, -1939, 987, 3537, 5048, 4621, 2443, -563, -3029, -4248, -4170, -2544, 256, 3038, 4264, 3976, 2420, -257, -3116, -4756, -4663, -2819, 44, 2825, 4753, 4805, 3340, 1031, -1693, -4140, -4983, -3285, -677, 1406, 3079, 4403, 3908, 888, -2525, -3818, -3849, -3514, -1933, 1397, 4395]
1884D395N35j185k010k298k719j490M27J751K646K806J512q22j760j835j779k597
1900d423m16K806L338J381P16J042m08l490m178o70O77O06J195L014L066L01j801
1917B756j836k195j887o84R40J709K412K522J119j764k540j432j435k367n03L224
1933a961L808J197m59R75R3l280l828o83J420J247J026K294K287%j991k418k185
1950b458j460J55J150J753K157K554J127k125k826j179o53j888o65L014L765Q85
1966C306r44J62k90k797l343n55J626J796J639J862J547j80j597k287k466j313
1982c834N82J448J321J526K336Q69k286k943j055j90j098M6K680L387J122p92
1998C119q46j000k056k502p62J209J877J863J358Q58l98j220j992k314q57J002
$$ y = [4395, 4930, 3745, 1735, -563, -3282, -4772, -4345, -2594, 52, 2858, 4370, 3548, 1788, -47, -1826, -4423, -4839, -2033, 1305, 2686, 3402, 4444, 4036, 546, -3632, -4302, -3625, -3019, -1824, 1190, 4256, 4557, 2756, 920, -1275, -3162, -3846, -2906, -1197, 1215, 3737, 4856, 3092, 552, -880, -2315, -4682, -5185, -1961, 1847, 3044, 2585, 3560, 3653, 373, -3455, -4138, -2718, -1471, -445, 1849, 4136, 4136, 2145, -273, -2458, -3918, -3763, -2613, -860, 1297, 3851, 4978, 2853, 27, -1152, -1805, -3693, -4358, -1344, 2421, 3306, 2362, 2524, 2234, -563, -3906, -4461, -2835, -1039, 600, 2462, 4009, 3829, 2232, -55, -2521, -3834, -3252, -1804, -483, 1043, 3379, 4248, 1962, -981, -2036, -2226, -3324, -3278, -598, 2789, 3911, 3119, 2273, 1273, -783, -3285, -4047, -2838, -961, 902, 2260, 3118, 2720, 1500, -492, -2806, -3663, -2661]
2014b661J899J298J433J621K64k136k671j512n52j78N00K277K353J381k89j096
2030A931j388j756j582m60J004J729K071J423J87r11j460k011j910m87Q72J649
2046a099J843J721P89k39j310k142j744o20J58J036J893J860Q53l33r87k024j843
2063b188q93p5R81K059J991J278J74r06j821k093j156k25O09J445J961J334M37
2080B912o88j441j918j304p24L60J651K034J612Q47l69j317k058j633j118J16
2096c038J336J874J554Q25J47q99j932j621j097q6J146J616J698J426L34j058
2112B225j651j913j479m15P55J486J760J750O49q39j392j615j273r94L96J481
2128a069J877J415P45j97j336j697j973j028K60J195J718J959R22r6o74j602k033
$$ y = [-2661, -762, 536, 1969, 3590, 3854, 1718, -953, -2465, -3017, -3195, -2695, -418, 1935, 3316, 3027, 1931, 543, -1213, -2795, -3255, -2251, -522, 1549, 2972, 3159, 2248, 788, -1223, -3133, -3620, -2748, -1099, 744, 2465, 3254, 3015, 1705, -437, -2181, -2801, -2643, -1607, 286, 2146, 2999, 2666, 1679, -345, -2188, -3081, -3156, -2175, -116, 1875, 3153, 3327, 2421, 600, -1493, -2649, -2874, -2265, -820, 1141, 2475, 2912, 2224, 783, -1135, -2439, -3163, -2803, -1152, 882, 2494, 3341, 2972, 1655, -403, -2036, -3154, -3038, -1702, 172, 1726, 2551, 2698, 1799, -133, -1754, -2851, -2937, -1791, -175, 1523, 2949, 3283, 2225, 574, -1339, -2818, -3233, -2478, -992, 768, 2518, 3167, 2328, 936, -679, -1952, -2946, -2550, -1069, 808, 2223, 2968, 2771, 1435, -262, -2235, -3263, -3003, -1808, -90, 1869, 2791, 2695, 2021, 419, -1614]
2145a614j332L83J028J127J474J725M19j343j523j747j130m92M35J544K103J521
2161B578M09n57j278j758j435o14j2J349K182J470K51l26p08j703k102r54N12
2178b696J379J425J576J088L79j007k206j613q02k08O87J462J733J386K99p99
2194B083j844j544r01n26J07J693K305J343J44n25j177j608j881r67O41J746J486
2211E75J121J007n5j299j773j611o73J45J220J493J480J162L12j370j780j712
2227a758p32k62N25J691J992J390j74q77j330j221j652n16R86J638J419J151M78
2244B748l51j394j932j597m01O09J160J672J539P78k73j306j810j301n69k6J004
2261a450J633J572J013l48j153j404j487r85k66R73J724J806R58R8o85j429j757
$$ y = [-1614, -2946, -2563, -1535, -408, 1066, 2791, 3210, 1867, 344, -1403, -2533, -3025, -2590, -1046, 1057, 2578, 2987, 2430, 1152, -606, -2041, -2655, -2667, -1318, 864, 2334, 2585, 2259, 1551, -152, -2254, -3208, -2696, -1317, 108, 1684, 2772, 3151, 2144, -62, -1675, -2477, -2685, -1998, -536, 1197, 2583, 2882, 2083, 239, -1305, -2206, -2732, -2625, -932, 1373, 2716, 2860, 2335, 1158, -450, -2331, -3298, -2657, -911, 575, 1696, 2703, 2648, 1349, -424, -2035, -2708, -2563, -1343, 150, 1630, 2792, 3104, 1734, -46, -1758, -2490, -2752, -2227, -536, 1456, 2846, 2672, 1795, 465, -756, -2408, -2924, -1938, -300, 1119, 2270, 2748, 2397, 1003, -929, -2526, -2927, -2318, -1158, 514, 2053, 2831, 2558, 1252, -558, -1859, -2428, -2454, -1450, 183, 1755, 2768, 2420, 1267, -137, -1624, -2609, -2875, -1902, -178, 1628, 2586, 2684, 1999, 570, -1187]
2278a187j234k77P98J406J478J265M39n76j399j719j260l60M30J200J623J535
2294B162O85m18j169j555j440p81O9J090J575J475O56m9r48j444j530q85O9Q39
2312a599J631J433J049L9p79j483j479j088j54N32J369J577J086K75m65j319j436
2329h11j268m32O28J276J390J160O89l13j414j580j119n99J10R49J706J333N81
2346B286k1r21j447j263q80K3P90J490J387R82j53q82r96j524j286o9J050J207
2364b27J052J036P43n69j439j571q01k12J43J023J510J275M36n50j158j441r34
2381a684o53J75R61J608J477M51m79q27q36j337j431K22J380J226P95N32P16m22
2399A874j780j630n20J48L76R59J524J089L64p36j363j103r40j83J17Q04J591
$$ y = [-1187, -2421, -2698, -1900, -494, 984, 2249, 2688, 2112, 713, -1006, -2266, -2626, -2196, -996, 627, 2162, 2847, 2429, 1260, -295, -1735, -2516, -2447, -1357, 218, 1693, 2349, 2300, 1352, -92, -1622, -2507, -2438, -1599, 32, 1465, 2514, 2553, 1774, 291, -1188, -2276, -2430, -1898, -529, 1048, 2134, 2409, 1944, 625, -811, -2079, -2511, -1883, -607, 783, 1943, 2632, 2319, 905, -675, -1794, -2393, -2283, -1334, 372, 1705, 2286, 2265, 1344, -103, -1366, -2246, -2223, -1433, 57, 1444, 2426, 2273, 1391, 395, -1129, -2415, -2484, -1434, -227, 825, 1861, 2604, 2035, 596, -975, -1776, -1988, -1845, -822, 688, 1963, 2399, 1849, 691, -750, -1684, -2337, -2162, -1201, 407, 1884, 2335, 1856, 1029, 193, -1144, -2575, -2353, -973, 253, 1048, 1580, 2296, 1874, 94, -1536, -2056, -1908, -1532, -573, 951, 2040, 2404, 1668, 305, -798, -1738, -1921, -1804, -1000, 591]
2416E91J422J63p30q88o53j178j121K02J479J518N45L90K78n78j559j472n82M26
2434a747P03R61J104R01K92p93j431j206o11K22K92Q94J173J301J93j019j053
2451A76p91o58r50K78J377J528O78Jm8n93j313j180p20M12J287Q43R24O49k4p93
2471A083j295j339l95K27P09Q68J036J191J32j204j175q74m11m10M87J069J374
2488A073P58r2n65p23r19j089l49M19J089J079Q65J92j81p73j106j240l01L35
2506a528P42R87J051N51j21q17j209r60l57P0O20R39J137N82Ro12r94j023o83
2525a616j44M54R97J217Q33o4m17r08j048q60j57L25R38J204P51K15k74q06j172
2544e32p95l90R1R68R20R63M77j21p15j087q98n39j0P23J065R32N08J50n99j138
$$ y = [591, 2013, 2176, 1446, 558, -95, -1273, -2394, -2192, -713, 805, 1350, 1740, 2018, 1440, -119, -1591, -2173, -1747, -1044, -83, 1021, 1922, 2214, 1421, -10, -1216, -1827, -1605, -1313, -419, 754, 2055, 2248, 1229, 176, -615, -1273, -2223, -1945, -568, 960, 1638, 1639, 1591, 998, -315, -1495, -2215, -1803, -516, 327, 1251, 1900, 1876, 1083, -212, -1551, -1946, -1719, -1010, -142, 894, 2085, 2217, 1013, -162, -1036, -1447, -1857, -1370, -301, 1073, 1831, 1739, 1174, 451, -468, -1557, -1906, -1487, -398, 681, 1546, 1738, 1557, 784, -322, -1562, -1863, -1528, -786, 201, 1252, 1803, 1682, 865, -344, -1304, -1661, -1591, -971, -32, 1105, 1687, 1696, 1084, 90, -933, -1616, -1760, -1306, -309, 908, 1741, 1677, 1260, 352, -696, -1556, -1713, -1388, -450, 754, 1505, 1720, 1446, 640, -532, -1327, -1717, -1626, -658, 262, 1225, 1702, 1581, 866, -221, -1119, -1658, -1668, -945, 120, 1052, 1560, 1710, 1111, -27]
2564b7r26p16J36M51R05R28O14L10m84q85r21p09l66M18Q96R22Q70J81k68p57
2584E72q71q90n47L20P93R39Q04N48j88n95j024q80n42J05P31P07R53O75j8o29
2604I63q88j038n49k8N07O80J036Q19Q5n82p11q83p00q6R7R02J021P87J22m03
2624A151n80r16q10l87J72P82R26P68K37N1o21q57j157l98K48N41P58R19O71r3
2644A405m50j039p72n17R1J73R26J168M84r6m70p52p70n19m05K25J035Q25P01
2663A243J48k86n27r60q77l43M11P50P08O83M86M2q38j012q61j18J6N20P85Q78
2683H48P25j81o73r37n06m76k64M35J003R48L66J25m59p54p83p07k85L93J016
2702a66P00M36M18j35o82j089o51j58K88O69N14Q09N15j55q79p23o40l86J21M99
$$ y = [-27, -953, -1669, -1533, -1082, -177, 751, 1365, 1675, 1191, 306, -615, -1324, -1690, -1272, -376, 546, 1416, 1597, 1329, 572, -299, -1189, -1736, -1416, -623, 316, 1120, 1668, 1480, 885, -139, -1019, -1561, -1456, -725, -18, 935, 1610, 1592, 963, 75, -963, -1512, -1540, -1033, -353, 683, 1502, 1587, 1005, 294, -589, -1289, -1375, -1278, -376, 645, 1432, 1554, 1151, 571, -345, -1155, -1542, -1370, -588, 338, 1106, 1343, 1394, 773, -84, -1241, -1639, -1391, -850, -92, 827, 1498, 1405, 955, -84, -856, -1373, -1282, -1109, -183, 985, 1469, 1373, 903, 151, -619, -1138, -1543, -1318, -283, 542, 1243, 1391, 1105, 578, -382, -1259, -1602, -1191, -441, 267, 950, 1436, 1478, 640, -372, -1233, -1351, -1335, -815, -30, 848, 1573, 1392, 719, -218, -724, -1200, -1464, -1029, -26, 922, 1288, 1413, 954, 200, -583, -1290, -1575, -1182, -166, 534, 970, 1388, 1253, 571, -518, -1169, -1327, -1039, -370, 144, 953, 1468, 1313, 434, -289, -929, -1315, -1194, -695]
2722f95Q58P35L97j38n53n32q17n43oM62P60Q08M78L7l62p50q46m82j34M27O47
2743b49Q28N98J73k57p66o28p72k49K75N28Q23P37J76k13n07o61p25l99K52L40
2763f96Q25P51K74J32n18q25p77l39P2L57N68Q90M72p6k92q30o39m39l3L23N67
2784b33Q16N26Q7k20n71q78n54j37J22O39O99N88L01j92o06o28n78l44Q4M84P30
2805A35P42K77j00m49p84m61n99J37M71O56P11L67k4l00n75q22m55j0L91N41N16
2826C65N73J21m6q77o87m03j63J87N84O99O04K67k76o03n35n77m49J60O12P53
2846C09N37N2q8l55m68o55m49j1O77M94O28L11K6k88o52p59k86R3K97K42P47O72
2868A074K5m80n97l93l70l42J55P58O51M80M6k23m01o30n41m38K90N42O66M25
$$ y = [-695, 163, 898, 1295, 1157, 604, 72, -745, -1288, -1294, -832, -72, 736, 1214, 1251, 889, 139, -707, -1189, -1323, -896, -249, 579, 1177, 1350, 1093, 327, -301, -1073, -1322, -1047, -519, 304, 1041, 1217, 1004, 497, -164, -889, -1288, -1036, -696, 129, 880, 1154, 1286, 768, -57, -834, -1173, -1101, -744, -176, 714, 1186, 1110, 818, -12, -651, -1090, -1123, -800, -233, 583, 1109, 1196, 976, 405, -473, -1027, -1164, -1042, -403, 296, 884, 1185, 993, 387, -241, -819, -1163, -1079, -595, 135, 877, 1154, 1054, 605, -179, -640, -1239, -1102, -631, 25, 736, 1103, 1079, 779, 204, -618, -1073, -1083, -692, -151, 365, 938, 1059, 1013, 136, -551, -954, -1117, -930, -346, 353, 957, 1224, 948, 345, -190, -767, -1216, -1056, -444, 309, 846, 898, 810, 455, -13, -668, -1117, -1128, -451, 43, 671, 982, 1008, 720, 68, -691, -977, -884, -587, -345, 402, 1074, 1099, 619, 22, -371, -741, -1083, -928, -170, 481, 961, 1007, 784, 383, -247, -788, -1226, -936, -394, 272, 697]
2888F97J93J2k47p26q77k3K33L39L56N91M81K7m37q61k92k19j53K20M70P69L93
2909I46j16j69m16n09n67j06J30P34O02J75Kn8l42m90o87k70M94M12L62K84M76
2930H87J56n47o75l72j88pK75M34O05L92j39m70m82k68m36j3R4O06Q10K64j78
2951G48l59j67m23o32j37M38M75L87L04J89j57l34o07m73jJ97L28M08M32L51k05
2972G62l92n26m64j81K6K79N13N94Q8j0k97l94m52k81l8L51N82L72J65O6k31m27
2994A05n26l04j05J96O24L02L25J58j19l92n78k85n4R7K28N54M67O7n2m57m98
3015b47m11n5q4M67K89N50K69r7l04m30l32k16m9L18K97M42K04P3k71m94j77k56
3037e14k65J58M25O08K78j46L8l40m31l44q8O2L79L16L88ML5k38m46l65l29J93
$$ y = [697, 890, 902, 655, -71, -948, -971, -738, -399, -43, 548, 1029, 1056, 619, -242, -534, -753, -906, -686, -216, 553, 946, 830, 661, 245, -264, -831, -937, -807, -73, 529, 704, 706, 648, 306, -184, -871, -1141, -647, -235, 127, 411, 887, 1043, 496, -179, -551, -739, -746, -471, -37, 568, 960, 821, 351, -131, -399, -835, -848, -754, -148, 662, 926, 748, 389, 222, -201, -833, -970, -532, -57, 330, 634, 823, 666, 332, -275, -748, -749, -552, -224, 184, 616, 967, 762, 370, -156, -620, -801, -775, -496, 17, 611, 699, 689, 392, -2, -454, -735, -773, -422, 160, 532, 697, 763, 532, 105, -421, -725, -830, -634, -10, 292, 617, 775, 656, 264, -314, -599, -653, -556, -328, 226, 693, 760, 708, 251, -247, -658, -713, -797, -330, -41, 509, 778, 681, 377, -53, -385, -601, -650, -332, -35, 407, 611, 684, 413, -81, -258, -514, -779, -621, -196, 412, 690, 544, 582, 242, -189, -533, -621, -559, -180, 136, 524, 528, 563, 325, -121, -486, -815, -622]
3059f22K86N31J11N11p6m38l06m21j75k01L37L51N16J52nj02l92l05k93j12J57
3080d96M57L67L17j39n0j16m40n65j25L89K67K27K21K77nk88l87l65n2L1K11K28
3102c6M97Q2M2l17m19j87j92J1l4M73M31L02j81k11Q8m83m58n0L34L01K30K06
3124D29J58k9l94m09l27NN6K54L28M15J96p1k90m54k26q3OR3L06N78P0k57j91
3147A63k01k81k89j16L21O03J71J95N2r3l62n11k50L9J91L51L39j4K49m4l88l81
3169b56k79J24O0J12L38M21K28j49m29j60l23k72p9L96L17K67J93p8j62k39m38
3190d08r5k9K41L08L22L8K42k24l77l59j98J46J2K12L36K65J74j32m04k31j59
3211c20j74J61K49L02L19qj13l25k84k02k44J36J76K61L21K95k6j89l78k97j34
$$ y = [-622, -336, 195, 306, 817, 741, 303, -3, -424, -599, -800, -463, -112, 404, 556, 551, 449, 57, -248, -541, -653, -496, -39, 328, 645, 506, 456, 340, -100, -665, -790, -401, -134, 93, 314, 591, 586, 298, -89, -454, -506, -475, -264, -36, 461, 543, 585, 268, -151, -338, -530, -519, -553, -80, 351, 653, 472, 261, 349, -134, -592, -642, -308, -7, 223, 429, 587, 558, 164, -245, -572, -567, -511, -257, 71, 486, 682, 611, 321, -133, -359, -442, -436, -343, -37, 541, 611, 354, 163, -38, -319, -608, -724, -403, 200, 371, 566, 618, 525, 163, -348, -598, -559, -368, -17, 322, 308, 557, 513, 125, -256, -535, -411, -351, -239, 99, 520, 748, 599, 170, 10, -313, -585, -664, -268, 49, 316, 509, 431, 269, 30, -408, -503, -532, -291, 17, 339, 377, 619, 395, 18, -341, -539, -393, -381, -169, 167, 432, 606, 474, 70, -161, -320, -494, -333, -84, 218, 537, 529, 416, 91, -193, -395, -639, -503, -327, -66, 255, 550, 524, 335, -43, -340, -474]
3232d74J2K46K95K68K30j52j12l52l98j37J44N3L50L29J54J06j02k81l72j60j48
3253e01J51K52K52K83j24J3j33m14j52m7p1K53M10K68LK9j64k35l59k82R4K06
3275b68L00K24J66m3j52l40l00q5O2J46L20K69J71O7j15m16k59q5k2k4J62L32
3297A10L72r0k17q1j7k88k50J78K82R8J52K09j90o3l65k15j85L3L70J82K84j16
3319A93J87p3m76k59K5K27l6J38L71K39j26k07j71j80j75j76J36M64J16R6j7L0
3341C26j50k23k41j24O0L71K88j09j20K04o5m15l00P6L03N9j31N09K77k26k74
3362I5k01J15k75q2O7K91J94L1M8k94j24j13M1j95Q0L07M28j91OQ2j56j95m55
3385d96J03L81j0j6J93K00j16j81j77j33l0j9K07J42J38J71m8k51j95j4N3j94
$$ y = [-474, -462, -216, 79, 347, 577, 425, 313, -39, -437, -574, -430, -377, -27, 302, 456, 562, 460, 179, -193, -353, -501, -350, -98, 154, 437, 313, 326, 193, -221, -373, -420, -491, -238, 172, 440, 443, 472, 308, 73, -286, -568, -474, -268, 32, 256, 422, 379, 227, -113, -413, -498, -436, -290, 30, 299, 470, 537, 422, 6, -253, -338, -360, -384, -222, 110, 482, 392, 175, 94, 77, -211, -461, -283, -1, 97, 249, 458, 268, 205, -160, -375, -560, -527, -157, 25, 309, 193, 380, 307, -169, -428, -403, -176, -212, -74, 297, 536, 410, 203, 32, -148, -323, -499, -363, 101, 217, 313, 296, 326, 176, -47, -288, -412, -352, 19, 307, 198, 78, 282, 217, -198, -498, -422, -119, -60, -191, 318, 595, 369, 95, -106, 9, -266, -348, -281, 10, 204, 235, 283, -11, -135, -248, -207, -402, -322, -15, 413, 222, 228, 310, 154, -41, -496, -393, -12, -22, -38, 155, 355, 239, 58, -119, -252, -282, -301, -94, 48, 186, 357, 309, 58, -137, -151, -98, -292]
3407b92p8L50K81K3j22m4pj83k38o1L77J57O0L8O5m3l60k06NM6p5J26K77J34R7
3432C27j78m9j01j52Pj00J74K60J64j08k47K4p6j93k20J66K53J12R0J43m2l5j38
3455H1k44j3qR6L6J06J52p6J7j27j31j44q9K71N2J41J80r9o3n4j60K8k54Q0n5
3480b77L60P5j69M5o1k7nj57J20k5J50K38J5l0o1j99j8k48J07l9K47m9M1J95p1
3505A57L4k76p6n1J50L6J19N0J51p5Q6k83k59J24n2M6n9J84J04R2j28j22J8qk58
3530b96P6L32l7N6J7j16N4k42n6o4J11M0K01P0p8J54m0k08j98J94R1j93m4L82
3554B06J73j39k36j52J9q7J5j7K96N5P9n9k9k3j51q2j05J31k8K94n7J7P5O5m33
3579a73l33L10J45j33O8K14K82n3k51l3r6j01j57J46N7K26M1j5n5j77l8J07j11
$$ y = [-292, -370, -20, 261, 284, 162, 118, 111, -72, -310, -371, 6, 163, 223, 261, 326, 283, -77, -283, -278, -232, -307, -181, 96, 230, 327, 149, 100, -1, -153, -146, -246, -72, 188, 352, 244, -3, 21, -55, -248, -468, -302, -49, 63, 153, 296, 254, 219, 81, -163, -176, -184, -88, -52, 54, 206, 130, 147, 20, -111, -255, -344, -73, -21, 120, 300, 201, 138, 84, -76, -48, -302, -222, -277, 83, 158, -11, 34, -27, -54, -59, -216, -96, -121, 29, 267, 282, 252, 191, -8, -26, -274, -167, -206, 41, -8, 33, 228, 157, 191, -85, -161, -212, -62, -26, 93, 143, 294, 219, 305, 22, -237, -113, -165, -119, -178, 6, 110, 202, 74, -48, -30, -38, -296, -220, 112, 75, 131, 148, 32, 86, -156, -212, -276, -165, -125, 76, 146, 68, 222, 182, -26, -224, -30, 61, -132, -176, 206, 379, 240, 4, -148, -129, -216, -201, -218, 78, 133, 212, 153, 124, 101, -50, -132, -237, -106, -134, 160, 103, 120, 195, 260, -173, -506, -196, -51, -184, -116, 98, 380, 327, 76, 43, -53, -154, -311, -165, -108, 118, 159, 144, 89, -88, -126, -19, -130]
3602a30k7K61J27n8j58J75n1k45k59J36J84j17P8J43J74Mj65k16j9rL5Q9K13J8
3626A83J35j89j40J6mj79p7M9K48O6J37j15lk0j84j31l1J79O7Q3N2R1r0j95j15
3651a67o0kN7l3K54N4J28Lj79o0l4j12j27J24J37K71j34n3L0p1j09j27K6J82Q7
3676H5J23K8j2j39j2k50k1L6mJ33L9J48Qj5j63j50q2q3K24L4J70J09J30j15k04
3701A7j44M8n9j22Q8J61J76J15k11n7j32L3j35k4J83K16n8K54p8j91j89K1j65
3724b53j4J49R8J16l6M8l9l7j98N4m7J21qJ58rJ08j48j05qk05J8J52Q3P9J70o3
3750A84M9l01l6K4j03J8J9K34Q1m4m4j4m0k49k54K87P8J40m8K77p7J6k29n4j31
3775b17R7N9J82k22J18K06j73j35l17L57K1j05j5M37k1j22j34K9j0k66j6K35Q8
$$ y = [-130, -157, 104, 231, 173, 15, 190, 139, -106, -365, -229, -45, -162, -84, 59, 233, 237, 72, -144, -163, -172, -137, -48, 165, 183, 318, 129, -11, 5, 1, -178, -255, -206, 42, 108, 245, 130, 127, 107, -77, -208, -239, -60, 7, 90, 142, 233, 143, -52, -167, -227, -229, -172, -205, 49, 103, 231, 234, 55, -5, -39, -151, -278, -154, -17, 254, 120, 67, 97, 26, -83, -210, -184, -2, 85, 208, 236, 224, 85, 73, -177, -198, -162, -166, -33, 6, 154, 162, 147, -16, -166, -248, -331, -107, -73, 97, 206, 336, 221, 17, -127, -79, -138, -260, -172, -11, 165, 280, 69, 12, -120, -87, -222, -246, -63, 153, 95, 349, 271, 80, -109, -88, -253, -267, -118, -20, 96, 60, 108, 69, 32, -166, -112, -159, -38, -46, 112, 103, 211, 63, -42, -50, -255, -237, -85, -2, 77, 247, 184, 233, -68, -104, -80, -183, -165, -146, 88, 169, 125, 81, 67, 27, -222, -476, -189, -111, 29, -19, 258, 181, 197, -32, -86, -217, -120, -61, 121, -101, 17, 223, 50, -85, -402, -45, -24, -129, -144, 293, 272, 150, 16, 45, 35, -231, -247, -12, 76]
3798G6q6J51Q3L6k36j04kj48J35J30R9j06R8J58j61l36P8P0kj58J24J85Q0n9q6
3823A9p8O6j20k22J58K95J56j53P6j30j25Qp0r9N8J43P8N0J4n1j8k65J7J43N5
3848Eq4J54K6J50j80k64J48l2k4j12Q4J71P2R7Rk04N3l4k79N0J56N7R9j9noO5
3875A53l49NJ32R3l8q3K44O7J7k61m6N5k8p6J18lJ21K08k82j80L1O9m4q1O0K20
3901A22n4jk7O7j96n9j4M9P9J24L2J3K7j60j7j86%J83P5p5L2J62r7J9p9lr7J9
3929f2O5j0lQ7P0o6r2M3j25J14j17Q0O1Q2Pq0M2k01q8P0q9K78j9q8J49n7Q1k72
3957a40J68k24J67j1M7L6L0Q3j77J7q8o2O0L3J1O6Q2j18J08p5q1n6Kl3K4K0K31
3984A20M8j19J8p1K4k04r1K38J12n2N3lM4j46K7q1j23J78r4J98M1N8m3l8j66j28
$$ y = [76, -10, 141, 224, 260, 24, -80, -82, -230, -95, 35, 134, 28, 126, 284, 123, -213, -135, -65, -67, -225, -101, 84, 164, 105, 19, -59, 7, -113, -335, -177, 118, 274, 121, 197, 67, -58, -50, -120, -219, -161, -18, 60, 110, 124, 73, 55, -210, -193, -50, 5, -79, 75, 101, 251, 71, -193, -45, -77, -101, -213, -129, 42, 114, 211, 220, 16, 69, 35, -244, -194, -38, 19, 118, 99, 94, 88, 153, -196, -191, -59, 34, -4, -87, 157, 224, 241, -20, -66, -11, -39, -115, 3, 0, 121, 329, 47, -133, -102, -33, -77, -158, -98, 122, 68, 67, 40, 107, -89, -148, -162, -113, -34, 90, 122, 135, 162, 2, -15, -201, -201, -18, 57, -18, 14, 176, 79, 98, 19, 16, -81, -62, 3, -7, -10, 77, 147, 81, -11, 32, -93, 21, -96, -16, 45, 127, 134, 54, 96, -105, -193, -123, -212, 66, 47, -41, 108, 51, 132, -140, 28, -196, -29, -40, 7, 43, 73, 156, -21, -4, -92, -154, -94, -61, -50, 16, 98, -20, 88, 13, -68, -124, -122, -155, -131, -111, 120, 168, 49, 67, -4, 20, -184, -275, -37, 75, 23, 76, 73, 117, -29, -2, -83, -206, -28, -122, 76, 117, 175, 132, 94, -72, -200]
4010b00Q7O0j9J12K23k4k87Q7m3j32k8k1J63J01J8o9R9p4j48k0j62K46j1K1P7
4035E6M6J07l2j46k57Q2L8N3p0J30J87qk25l1k4Q4j13m8J19K35J2p0j69J99m4
4060A11k96M0L8O5J63p8p3P5nj07j04P5K6J43n1J9J47m4j09j85L7kn9M6Q3J39
4086I4Qj5J5o9j25O4r9R6l4J88R5k11J11r2J1r7j00N6J39MM9p1J86j85j04M8p7
4113a15j4K6J01LJ04M8j34j84J62kj72O7N0K45m4l2j16N7Rq5j21J8J55J15l4j
4139A06Ol7j67Jp2J28L1l6K47k2O8j82j59j09Q8l7N9k6K85j2j40ql1Mr5m3J11
4166d2L0J33R2k00N8j48kq9L5O0J07O7O2r5N6o2p6r4l5Q6P8KJ82r6N4n6k07N1
4194d9k2j88K26j8K06p5o8P4p8q0j01O1m6K27Q3N0Jk07k0lj9r2k4K28O4J06j21
$$ y = [-200, -113, -53, -72, 40, 263, 239, -48, 39, -4, -136, -164, -185, -22, 79, 97, 28, 127, 53, -95, -115, -277, -31, -42, -21, 56, 102, 209, 177, 31, -226, -144, -106, -53, -123, 7, 194, 186, -39, -70, -94, -10, -123, -171, -52, 183, 195, 125, -44, 155, 111, -185, -145, -107, -42, 121, 43, -30, 45, 40, -67, -171, -96, -70, 73, 22, 41, 188, 144, 35, -150, -113, -115, -174, -128, -45, 94, 102, 87, 102, 33, -92, -28, -127, -31, -65, 123, 218, 7, 118, 26, 37, -60, -160, -104, 35, 39, 88, 17, 203, 18, -86, -38, -115, -129, -103, -2, 1, 105, 153, 19, -165, -3, -5, -177, -110, -60, 185, 141, 109, -7, 50, 59, -26, -147, -129, 26, 141, 107, 106, 112, 75, -92, -91, -163, -35, -4, -40, 207, 185, 253, 71, -88, -197, -109, -146, -87, -113, 172, 160, 20, 12, -19, -15, -110, -153, -42, -12, 121, 213, 13, 71, -77, -79, -168, -133, -73, 34, 101, 163, 68, 124, 62, -14, -108, -143, -57, 21, 23, 205, 109, 163, 107, -100, -49, -71, -259, -33, -51, 155, 80, 12, 86, 8, -72, -173, -112, -158, 69, 152, 202, 203, -4, -24, -27, -46, -138, -162, 66, 130, 236, 115]
4221A15Oj02l9j27j05K36J04n0J0J22p0l0j08j57O8J19lqJ43j4J11k52j41K03
4245C1j60L6n8L41p4ko1n0l3j03q4J17QJ27PN5M8P2j42j82n8ql6K12Q2n6K40k05
4273F4j22J6p5L4j4O7J25R0n5k7r2o3j1k58K21k5J60O1%J17j56l9j92K0R3O4O3
4300F6j09J03R0qo1k85R0K8Q6k2J42J05m2j0l14J34Mj03j21J37J66ko3p0J50j45
4326e4r9M4lQ6Q6O0l7M6J9k79J5K7Q9j6Q9Q3J9Pj95j63NK16k16Q7J25J73j44M
4354G4M9k15n6n3L5J52N5J0k3R6o5p4k5p5o4J61L8q0J51O6l0j23Kj45RL9M3N7
4382IJ41J9q5k7np8q5R3pJ31Q9j3j9Pk60K9j10N2N6R5p7R6Q9k6m3j29l8m8L5J34
4412B5K1O0K5j03J08k19l6l5l4K25J8L6J11m8p2n6j52p0J49J7O0J53K1q8%j03
$$ y = [115, 121, 19, -20, -147, -252, -16, 88, 38, 48, 170, 100, 70, -38, -195, -127, -8, -11, -19, 124, 110, 221, -31, -172, 31, -129, -93, -151, 190, 116, 114, 53, 3, -30, -133, -217, -100, -92, 35, 42, 97, 145, 217, 75, -107, -165, -173, -209, 3, 85, 29, 269, 64, -58, -42, -117, -83, -97, -30, 95, 185, 130, 103, 11, -52, -63, -321, -100, -125, 35, 96, 96, 213, 57, 18, -174, -154, -61, 3, 66, -43, 60, 150, 142, 81, -204, -114, -86, 0, -22, 120, 225, 183, 173, -141, -7, -3, -106, -227, -90, 76, 74, 11, -59, 91, -54, -153, -109, -112, -26, 60, 120, 83, 129, 148, -131, -116, -89, 0, -16, 73, 156, 175, 182, -13, -176, -171, 45, -171, -84, 41, 214, 70, 74, 123, -92, -148, -201, -166, -14, 41, 51, 28, 124, 59, -15, -40, -115, -179, -18, 20, -60, 91, 157, 127, 4, 6, -139, -130, -91, -48, 9, 150, 169, 84, 57, 52, -26, -111, -18, -25, 106, 195, 182, 163, 170, -90, -61, -171, -119, -63, 32, -45, 51, 140, 114, 71, -58, -96, -144, -109, 25, 46, 106, 131, 28, 136, -83, -119, -154, -188, 37, 55, 91, 202, 154, 82, 26, -126, -196, -47, -30, 30, 183, 204, 116, 116, 13]
4438A3j01P5K0j17J30RQ6J9q7L6k86N5J0j2J12J64K6n8p1N0k62nL6M0O5J77N2
4465A76m8P7k03m3p9K9j96J65K11n8Q6j9Q3ml00n5L7J39Q2Ml6J6K4n5j57l0O6
4492h8m8Q0J38O4L9j52l8o2J4n7J28l8L0Q0R5j2k23N4j05K7o1J21K7Q0P0j08N0
4519A05p1j5k39j7J02K29p3qJ23J6k06j14K4J18m4j6R5qK35k42L0n7Q8k46O4O0
4545f7R2K39j66Kk8j27k2r2k6J39J57R6Jn3ln3k69Q1j8KJ29Q6L3m3J6j18j00j5
4573a27m6M9O1J01O2L0r4k4n6q7k5j9J29Q4R8l7Lk6K9k14n1R9R0M7l8J77r0m6
4601G9r9j19j2M8J06l9K45j84J60k06k8mo5Qk8J05J75J3pm6o6j10j22k2J80p3
4627a11J84nP8o8k0j02%j63J55J30n2J73q2N7l9j64p9R9n4JJ31N5J43j56p4q7
$$ y = [13, -88, -13, 7, -110, 20, 29, 115, 134, 47, 83, -203, -148, -138, -150, -38, 126, 152, 94, 23, 73, -189, -194, -158, -118, -53, 124, 176, 128, 205, 2, -41, -120, -91, -287, -122, 89, 31, 117, 98, 181, 177, -123, -178, -141, -2, 80, 84, 48, 64, 88, 33, -124, -154, -88, -136, -56, 82, 146, 185, 33, -5, -67, -53, -110, 18, -20, 10, 90, 185, 173, -50, 4, -101, -74, -135, -14, 13, 93, 163, 55, 105, 34, 19, -220, -237, -135, 94, 21, 13, 136, 152, -54, -168, -144, -26, -70, -86, 9, 1, 236, -6, 24, -33, 55, -191, -127, -67, 25, 264, 98, 100, 72, -55, -77, -169, -195, -56, 101, 197, 198, 145, 142, 89, -180, -99, -117, -115, 14, 100, 133, 90, 106, -12, -112, -127, -173, -124, -63, 38, 100, 130, 36, 12, -44, -131, -156, -175, -46, 38, 136, 99, 102, 76, 105, -109, -160, -61, 29, 76, 38, 215, 125, 79, -20, -139, -151, -103, 3, -36, 209, 25, 185, -21, -49, -53, -118, -110, -138, -33, 142, 155, 148, 102, 36, -74, -196, -218, -38, -111, 73, 68, 146, 78, 58, -44, -44, -207, -52, 78, 26, 199, 117, 174, 135, -29, -108, -9, -63, -62, 69, 124, 267, 111, 37, -50]
4653e0k5o3o9K25M3k4j8Q9k9j53K8j16k3J27q5K48J56j49q4K6j58Jn9L9k2J20
4679b5Q3R9O7j63r0p0P5j20J18K78j95O8R0j28o7j01j15N6J2O3R3J47p9q2j56
4704a42J00k4r3Q2J19L8j3L1O8p6j51Rj05J64j3N7J54j30R5r5j14o2r8J92rJ56
4730A40J1L5j08r8l8m3l4L6m7J20J45N7J8j65jj41j0n3L2K10q4P1J59r5l4j77
4756i4o3J1J19L0J0J42k1j0m4j42o0l6K0j9N1J37J51j65RPr7Nj79J30J78J19q4
4783A05l7k7N6k56L1K1L3L9R6M4j29K11k22N7k04M8Q7N0R5k5J54j21j06j00P8
4808b2q8o3J93L0O4m5O0q1p2p2j31P0J17K06K0n5l1O6j74j19M9J8j3J66N5l1q6
4835C1J47m9k45K4o3k3J79M2J1K15j59r1p7j01P4n2l6K99k6K9l4N2k04n2kj45
$$ y = [-50, -75, -138, -207, 18, 61, 37, 19, 108, 79, -74, -46, -162, -185, -58, -143, 105, 261, 112, 28, 54, -104, -103, -162, -123, -145, -25, 58, 157, 224, 61, -29, -99, -24, -144, -26, 252, 57, 125, 215, 87, 20, -81, -196, -140, -128, -65, 28, 175, 96, 14, -142, -42, -66, -159, -77, 42, 80, 67, 98, 166, 90, -61, -52, -157, 7, -6, 51, 205, 75, 170, 75, -39, -101, -199, -7, -16, 140, 151, 186, 78, -20, -58, -101, -135, -99, -146, -26, 119, 176, 194, 29, 28, -113, -123, -176, -144, 66, -18, 53, 212, 117, 83, -94, -157, -146, -27, 3, 13, 155, 134, 124, 80, -62, -122, -158, -138, -157, -106, 31, 182, 17, 26, 33, -64, -59, -238, -108, 70, 189, 105, 68, 41, 97, -159, -128, -107, -74, -35, 61, 105, -24, 187, -35, 22, -182, -134, -47, 3, 98, 73, 227, 106, 0, -100, -22, -110, -173, 20, 50, 114, 69, 129, 48, -24, -96, -227, -157, -40, 166, 186, 131, 100, 166, -8, -127, -78, -60, -73, 93, 148, 117, 31, 178, 129, -116, -92, -155, -178, 1, 43, 54, 269, 110, 19, -58, -159, -85, -137, -173, 126, 100, 129, 95, 147, -57, -109, -111, -256]
4861b56R6J73K0j1P3pr2j59MJ04oK0O5J89q4j21J2j97R9j34J14J42mJ12J4j03
4887F3kj75NN9m0J36p7n7K64l5mk90Q8L7q8N3J22J41j28j40O8j2j68P3o8J15J1
4914d9J21M4q2J01j30r3j32K50J3N1L9J7pr3N0k51J42o3j1J22J32o4m0K7r5r6
4940i7j13L5J8J70J39p3Q7m8m4j14j06J9O3O6J3R4K09k49K7j99n6N7m6L2N7J47
4966H8N3J21j98L0j42p8n3K01o6R8Q2K6n1j08o7r9l3J47k8K04N0j2k6j48j11O
4992a14L4r9J24mJ17N2K2k08l9pj45J46R3J55o1L9j3K1j34n9J1k02K52pK41j61
5018E4N5k3m2l9j49j7P5Q5k2Q6OQ9j58o2q2k1k7J29J16l2J35n2j03q4J5j56J42
5045h2n4J94J39r6O7j27j3j18j64J67LJ9J12P7P9j03j08r9Rj73K40K3M6J44Ln3
$$ y = [-256, -160, 13, 33, 22, 95, 88, -4, -163, -159, -55, -61, -41, 24, 213, 129, 8, 20, -177, -78, -212, -98, 44, 40, 152, 166, 63, 61, -114, -109, -50, -90, 46, -31, -88, 176, 141, 137, -153, -65, -28, -116, -63, 59, 200, 72, -68, 0, -12, -180, -107, -175, -60, -49, 72, 116, 34, 135, 5, -88, -220, 30, 43, 94, 133, 150, 143, 50, 100, -151, -9, -72, -83, 39, 171, 107, 67, 94, -1, -97, -210, -175, -157, 13, 152, 79, 166, 118, 74, -40, -146, -127, -64, 2, 15, 109, 318, 69, 96, -103, -159, -102, -148, -116, -59, 88, 141, 262, 64, 94, -48, -126, -179, 22, -44, 54, 136, 162, 111, 3, -64, -163, -196, -49, -77, 127, 177, 165, 139, -9, -120, -114, -80, -179, -55, -59, 58, 110, 132, -76, -115, -122, -267, -121, -28, 127, 66, 105, 92, 113, -21, -80, -69, -271, -19, -26, 215, 54, 109, 86, 44, 5, -144, -161, -86, -1, -23, 63, 69, 158, 0, -62, -144, -165, -192, -63, 53, 21, 156, 104, 1, -83, -68, -224, -82, -136, 58, 197, 101, 168, 41, 28, -90, -254, -87, -84, -65, 47, 124, 203, 100, -8, -107, -98, -271, -31, -8, 38, 182, 185, 132]
5071A32j49L7j61k4R0J5J43jQ0j08m8j13N1j32J50M3J58LJ6K8j06r0j09j20n1
5096b66K17J4J98K9j11n1m8n3p7j04J19J72K7J09j44J07j08j27Q6j36J43j1J68
5119A53l1O3o1l9k00l8L7J5P2Q6J87J1j85J4k17K2k0k8L7J57P1L5p4O9j15k08
5145a87J34r0N3J67M9K2M7j45mj52j18K17j48R7K63k1q7j4l1j67P1j60N9L4J07
5170dP6P5p5l3j18l4J2O9O7L9P3kj00K8N0l38J1P1J10L6L4L7K1n6j22J33o6j69
5198a75M5Q0J85K9mnj07k29L6J4L0L2J59Q8L2p5o1j34j40L9oJ87Q8J07j07J41
5224B49k62n3J6p5J09l2N0P0J12j50J2j17ol8l4K7P2J33N5j25O0N2k21k30K40
5249h6O1pJ64m4J0J5j79n5j19L0J49O4J30p8J36P5j47k09j8k6J13L4M5J88K6j21
$$ y = [132, -17, 20, -141, -165, -75, -60, 83, 82, 162, 54, 6, -107, -56, -188, -38, 5, 163, 166, 182, 210, 104, 14, -95, -215, -266, -49, -35, 163, 192, 81, 30, -18, -71, -148, -252, -133, 39, 66, 175, 31, 138, 30, -97, -11, -147, -4, -15, 153, 122, 185, 124, 85, -115, -153, -116, -101, -29, 57, 244, 255, 70, 84, -133, -111, -131, -159, -122, 35, 106, 141, 67, 136, 21, -187, -53, -143, -90, 77, 126, 148, 195, 50, 46, -106, -224, -7, -155, -58, 205, 184, 97, 83, 52, -115, -44, -204, -145, -111, -4, 72, 147, 72, 39, -79, -113, -101, -32, 35, 74, 147, 145, 45, 73, 123, -215, -204, -133, -23, 13, 47, 84, 105, 49, -73, 60, -6, -175, -130, -50, 135, 164, 160, 155, 48, -181, -145, -131, -101, -69, 90, 178, 210, 135, 74, -60, -200, -161, -167, 20, 108, 215, 108, 249, -13, -66, -50, -125, -16, -48, 2, 72, 184, 34, 46, -71, -77, -115, -149, -122, -50, 83, 138, 13, 73, 125, -96, -326, -86, -25, -32, 132, 88, 98, 113, -66, -121, -240, -210, -61, 3, 133, 55, 191, 266, 119, -90, -108, -134, -21, 13, 58, 246, 272, 151]
$$ [...]
8191G6
##END NTUPLES=NMR FID
##END=
