##TITLE=1H_DE-80H_X3
 200.13MHz, d2o
 8 sc
 
 19ns.26.2.2025
##JCAMPDX= 6.0         $$ Bruker NMR JCAMP-DX V2.0
##DATA TYPE= NMR FID
##DATA CLASS= NTUPLES
##ORIGIN= UXNMR, Bruker Analytische Messtechnik GmbH
##OWNER= pz
$$ XWIN-NMR		Version 3.5
$$ Thu Feb 12 14:07:36 2026 Russian Standard Time (UT+4h)  Yarkov@DPX200
##.OBSERVE FREQUENCY= 200.1313
##.OBSERVE NUCLEUS= ^1H
##.DELAY= (6, 6)
##.ACQUISITION MODE= SIMULTANEOUS
##.ACQUISITION SCHEME= undefined
##.AVERAGES= 8
##.DIGITISER RES= 18
##SPECTROMETER/DATA SYSTEM= spect
##.PULSE SEQUENCE= zg30
##.SOLVENT NAME= D2O
##.SHIFT REFERENCE= (INTERNAL, D2O, 0, 14.3821)
##AUDIT TRAIL= $$ (NUMBER, WHEN, WHO, WHERE, WHAT)
$$ ##TITLE= Audit trail, XWIN-NMR		Version 3.5
$$ ##JCAMPDX= 5.01
$$ ##ORIGIN= Bruker BioSpin GmbH
$$ ##OWNER= Yarkov
$$ C:/Bruker/XWIN-NMR/data/yarkov2/nmr/H-C/1/audita.txt
$$ ##AUDIT TRAIL=  $$ (NUMBER, WHEN, WHO, WHERE, WHAT)
(   1,<2026-02-12 14:07:07.00 +0400>,<Yarkov>,<DPX200>,
      <created by zg, POWCHK disabled, PULCHK disabled
       configuration hash MD5:
       00 E9 B6 7A A2 85 ED C7 34 08 36 98 17 FE 4E 26
       data hash MD5: 16K
       34 A1 18 96 B3 55 0F 07 A6 4C 55 73 DE 0F 21 3B>)
$$ ##END=
$$ 
$$ hash MD5
$$ 13 E8 15 6E 43 B9 4B 18 75 5E 87 34 63 F9 97 D8
##$RELAX= 
##$RELAX= 
##$RELAX= 
##$RELAX= 
##$RELAX= 
##$RELAX= 
$$ Bruker specific parameters
$$ --------------------------
##$DU= <C:/Bruker/XWIN-NMR>
##$EXPNO= 1
##$NAME= <H-C>
##$PROCNO= 1
##$TYPE= <nmr>
##$USER= <yarkov2>
##$AMP= (0..31)
100 100 100 100 100 100 100 100 100 100 100 100 100 100 100 100 100 100 
100 100 100 100 100 100 100 100 100 100 100 100 100 100 
##$AQSEQ= 0
##$AQ_mod= 1
##$AUNM= <au_zg>
##$AUTOPOS= <>
##$BF1= 200.13
##$BF2= 200.13
##$BF3= 200.13
##$BF4= 200.13
##$BF5= 200.13
##$BF6= 200.13
##$BF7= 200.13
##$BF8= 200.13
##$BYTORDA= 1
##$CFDGTYP= 0
##$CFRGTYP= 5
##$CHEMSTR= <none>
##$CNST= (0..31)
1 1 145 1 1 1 1 1 1 1 1 1 1 1 1 1 1 1 1 1 1 1 1 1 1 1 1 1 1 1 1 1 
##$CPDPRG= <>
##$CPDPRG1= <>
##$CPDPRG2= <>
##$CPDPRG3= <>
##$CPDPRG4= <mlev>
##$CPDPRG5= <mlev>
##$CPDPRG6= <mlev>
##$CPDPRG7= <mlev>
##$CPDPRG8= <mlev>
##$CPDPRGB= <>
##$CPDPRGT= <>
##$D= (0..31)
0 0.7 0 0 0 0 0 0 0 0 0 0.03 0 0 0 0 0 0 0 0 0 0 0 0 0 0 0 0 0 0 0 0 
##$DATE= 1770890826
##$DBL= (0..7)
120 120 120 120 120 120 120 120 
##$DBP= (0..7)
150 150 150 150 150 150 150 150 
##$DBP07= 0
##$DBPNAM0= <>
##$DBPNAM1= <>
##$DBPNAM2= <>
##$DBPNAM3= <>
##$DBPNAM4= <>
##$DBPNAM5= <>
##$DBPNAM6= <>
##$DBPNAM7= <>
##$DBPOAL= (0..7)
0.5 0.5 0.5 0.5 0.5 0.5 0.5 0.5 
##$DBPOFFS= (0..7)
0 0 0 0 0 0 0 0 
##$DE= 6
##$DECBNUC= <off>
##$DECIM= 32
##$DECNUC= <off>
##$DECSTAT= 4
##$DIGMOD= 1
##$DIGTYP= 9
##$DL= (0..7)
0 120 120 120 120 120 120 120 
##$DP= (0..7)
150 150 150 150 150 150 150 150 
##$DP07= 0
##$DPNAME0= <>
##$DPNAME1= <>
##$DPNAME2= <>
##$DPNAME3= <>
##$DPNAME4= <>
##$DPNAME5= <>
##$DPNAME6= <>
##$DPNAME7= <>
##$DPOAL= (0..7)
0.5 0.5 0.5 0.5 0.5 0.5 0.5 0.5 
##$DPOFFS= (0..7)
0 0 0 0 0 0 0 0 
##$DQDMODE= 0
##$DR= 18
##$DS= 0
$$ [...]
##$SUBNAM2= <"">
##$SUBNAM3= <"">
##$SUBNAM4= <"">
##$SUBNAM5= <"">
##$SUBNAM6= <"">
##$SUBNAM7= <"">
##$SUBNAM8= <"">
##$SUBNAM9= <"">
##$SW= 18.0517328524113
##$SWIBOX= (0..15)
0 0 2 0 0 0 0 0 0 0 0 0 0 0 0 0 
##$SW_h= 3612.71676300578
##$TD= 16384
##$TD0= 1
##$TE= 0
##$TE2= 300
##$TE3= 300
##$TEG= 300
##$TL= (0..7)
0 120 120 120 120 120 120 120 
##$TP= (0..7)
150 150 150 150 150 150 150 150 
##$TP07= 0
##$TPNAME0= <>
##$TPNAME1= <>
##$TPNAME2= <>
##$TPNAME3= <>
##$TPNAME4= <>
##$TPNAME5= <>
##$TPNAME6= <>
##$TPNAME7= <>
##$TPOAL= (0..7)
0.5 0.5 0.5 0.5 0.5 0.5 0.5 0.5 
##$TPOFFS= (0..7)
0 0 0 0 0 0 0 0 
##$TUNHIN= 0
##$TUNHOUT= 0
##$TUNXOUT= 0
##$USERA1= <user>
##$USERA2= <user>
##$USERA3= <user>
##$USERA4= <user>
##$USERA5= <user>
##$V9= 5
##$VALIST= <valist>
##$VCLIST= <CCCCCCCCCCCCCCC>
##$VD= 0
##$VDLIST= <DDDDDDDDDDDDDDD>
##$VPLIST= <PPPPPPPPPPPPPPP>
##$VTLIST= <TTTTTTTTTTTTTTT>
##$WBST= 1024
##$WBSW= 4
##$XGAIN= (0..3)
0 0 0 0 
##$XL= 0
##$YL= 0
##$YMAX_a= 49140
##$YMIN_a= -50795
##$ZGOPTNS= <>
##$ZL1= 120
##$ZL2= 120
##$ZL3= 120
##$ZL4= 120
##$ABSF1= 10
##$ABSF2= 0
##$ABSG= 5
##$ABSL= 3
##$ALPHA= 0
##$AQORDER= 0
##$ASSFAC= 0
##$ASSFACI= 0
##$ASSFACX= 0
##$ASSWID= 0
##$AUNMP= <proc_1d>
##$AZFE= 0.1
##$AZFW= 0.1
##$BCFW= 1
##$BC_mod= 2
##$BYTORDP= 1
##$COROFFS= 0
##$CY= 83.5205535888672
##$DATMOD= 1
##$DC= 2
##$DFILT= <>
##$DTYPP= 0
##$F1P= 10.8118882576601
##$F2P= -7.23987719738617
##$FCOR= 0.5
##$FTSIZE= 0
##$FT_mod= 4
##$GAMMA= 1
##$GB= 0.15
##$INTBC= 1
##$INTSCL= 1
##$ISEN= 128
##$LB= 0.25
##$LEV0= 0
##$LPBIN= 0
##$MAXI= 10000
##$MC2= 0
##$MEAN= 0
##$ME_mod= 0
##$MI= 1.114404
##$NCOEF= 0
##$NC_proc= 0
##$NLEV= 6
##$NOISF1= 3.799351
##$NOISF2= 2.8
##$NSP= 1
##$NTH_PI= 0
##$NZP= 0
##$OFFSET= 14.38212
##$PC= 1
##$PHC0= -5301.748
##$PHC1= 6.821927
##$PH_mod= 1
##$PKNL= yes
##$PPARMOD= 0
##$PSCAL= 0
##$PSIGN= 0
##$REVERSE= no
##$SF= 200.129724274929
##$SI= 16384
##$SIGF1= 3
##$SIGF2= 2
##$SINO= 400
##$SIOLD= 16384
##$SREGLST= <1H.CDCl3>
##$SSB= 0
##$STSI= 0
##$STSR= 0
##$SW_p= 3205.1282051282
##$SYMM= 0
##$S_DEV= 0
##$TDeff= 0
##$TDoff= 0
##$TI= <>
##$TILT= no
##$TM1= 0
##$TM2= 0
##$TOPLEV= 0
##$USERP1= <user>
##$USERP2= <user>
##$USERP3= <user>
##$USERP4= <user>
##$USERP5= <user>
##$WDW= 1
##$XDIM= 8192
##$YMAX_p= 0
##$YMIN_p= 0
$$ End of Bruker specific parameters
$$ ---------------------------------
##NTUPLES= NMR FID
##VAR_NAME=  TIME,          FID/REAL,        FID/IMAG
##SYMBOL=    X,             R,               I
##VAR_TYPE=  INDEPENDENT,   DEPENDENT,       DEPENDENT
##VAR_FORM=  AFFN,          ASDF,            ASDF
##VAR_DIM=   8192,          8192,            8192
##UNITS=     SECONDS,       ARBITRARY UNITS, ARBITRARY UNITS
##FACTOR=    0.0002768,     1,               1
##FIRST=     0,             0,               0
##LAST=      2.2672688,     0,               0
##MIN=       0,             -50795,          0
##MAX=       2.2672688,     49140,           0
$$ Real data points
##PAGE= N=1
##DATA TABLE= (X++(R..R)), XYDATA
0 0 0 0 0 0 0 0 0 0 0 0 0 0 0 0 0 0 0 0 0 0 0 0 0 0 0 0 4 -8 8 -8 8 -8 8 -8 12 -16 16 -16 17 -23 24 -25 30 -32 36 -41
46 -41 44 -49 53 -60 64 -71 78 -86 96 -107 117 -131 145 -163 182 -208 236 -276 324 -390 486 -632
68 -632 875 -2588 30999 37914 13823 20756 29132 371 -39470 -39311 -17415 -7361 -955 21275
82 21275 37669 29058 9460 -4811 -21644 -36787 -32149 -10653 4881 15692 31699 37936 17957
95 17957 -7958 -18005 -22650 -31440 -25273 2449 25237 25796 21386 21336 8504 -20496 -37582 -28115
109 -28115 -12031 -4229 7743 28850 38079 22935 -96 -14373 -22028 -27096 -24025 -9296 11141
122 11141 27305 30438 19575 3452 -9522 -20356 -29823 -28277 -9757 13924 25592 25195 22570
135 22570 15494 -3207 -24965 -31458 -21625 -9246 2110 16803 29190 26996 10777 -6788 -18301
148 -18301 -25364 -26508 -16181 3367 20766 27441 24910 16065 1478 -15786 -27256 -27088 -16369
161 -16369 -328 14446 23490 24854 18025 3129 -14943 -26530 -25810 -15945 -3127 10590 23820
174 23820 29604 20940 2952 -12119 -20411 -24646 -22689 -8739 10731 23139 24021 18256 8043 -6616
188 -6616 -21588 -27348 -20587 -6847 7185 19094 26201 23563 10542 -5894 -18938 -25084 -22521
201 -22521 -11723 3137 16706 24562 22612 11449 -3560 -16130 -23142 -22784 -13705 1653 16743
214 16743 24571 22764 14127 1321 -13212 -24236 -24686 -14830 -1069 11271 20803 23750 16547 2014
228 2014 -12328 -20957 -22255 -16306 -4199 10969 21941 23744 17090 5325 -8553 -20103 -24053
241 -24053 -18630 -6863 7001 18472 22811 18248 7330 -5924 -17570 -22684 -18982 -7588 5970
254 5970 16937 22524 20477 10234 -4511 -16536 -21725 -20088 -11968 1678 15070 21536 19390 11306
268 11306 -581 -13424 -21242 -19976 -11431 625 12591 20887 21334 13136 424 -11680 -19801 -21485
282 -21485 -14989 -2177 10329 18292 20314 15234 3590 -9552 -18132 -19746 -14738 -4397 8533
295 8533 18282 20561 15561 5278 -6933 -17231 -21045 -16791 -6651 5265 15538 20190 16933 7352
309 7352 -4380 -14554 -19476 -17002 -7717 4051 14069 19497 17861 9086 -3140 -13547 -19145 -18431
323 -18431 -10932 1075 12326 18428 17864 11357 513 -11098 -18026 -17645 -10994 -967 10106 17993
337 17993 18675 11788 1439 -9162 -17111 -19333 -13798 -2901 8243 15850 18184 14331 4561 -7107
351 -7107 -15462 -17467 -13789 -5188 5922 15482 18407 14314 5304 -5043 -14310 -18741 -15900 -6864 4090
366 4090 13137 17643 15993 8225 -2792 -12375 -17151 -15440 -8485 1849 11724 17335 16128 8896 -1390
381 -1390 -11067 -17021 -16762 -10274 -77 10032 16523 17009 10927 1193 -8763 -15387 -16731 -11533 -1795
396 -1795 8401 15213 16251 11758 3127 -7527 -15609 -17123 -12129 -3865 5823 14162 17555 13760 4361
411 4361 -5482 -12881 -16098 -13911 -5934 4729 13262 16094 13338 6289 -3447 -12582 -16914 -14469 -6908
426 -6908 2748 11428 16137 14902 8475 -1291 -10860 -15964 -14586 -8259 410 9267 15494 15694 9002
441 9002 -934 -9444 -14170 -15359 -11069 -978 9563 15104 14705 10512 2994 -6839 -14875 -16041 -10514
456 -10514 -2246 6024 12832 15700 11922 3092 -6570 -13360 -15255 -11949 -4281 4825 12703 16206 13320
471 13320 4486 -4623 -11147 -14447 -13648 -6760 4050 12430 14319 11721 6828 -1237 -11147 -16566 -13179
486 -13179 -5440 1785 8598 14831 15408 8018 -2134 -9505 -13269 -13857 -9269 -285 9122 13931 13524
501 13524 8717 504 -8125 -13364 -13868 -9858 -1879 8117 14197 13409 9104 3338 -5112 -13884 -15822
516 -15822 -9380 -1298 4495 10286 15070 12728 2657 -6865 -10933 -12105 -11863 -6179 4642 12990 13893
531 13893 10356 5317 -2141 -10593 -14690 -12127 -5350 2503 9779 13478 11861 6289 -1363 -9317 -14201
546 -14201 -12565 -5857 1720 7629 12592 14151 8463 -1661 -8925 -11308 -11846 -9549 -1470 8503 13317
561 13317 11811 7570 1885 -5884 -12629 -13680 -8526 -1015 5914 11211 13205 9970 2476 -5573 -11342
576 -11342 -13060 -9601 -2997 4113 10092 13311 11024 3282 -4931 -9761 -11447 -10839 -5696 3517 11327
591 11327 12692 9353 4854 -1029 -8806 -13959 -11707 -4432 2324 7433 11591 12251 6712 -1832 -8279
606 -8279 -11562 -10973 -6874 340 7634 11843 11720 7274 -1 -7060 -11217 -11425 -8116 -1533 6618 11650
622 11650 11353 7350 1954 -4841 -10982 -12716 -8092 -1161 4756 9291 11853 9913 2749 -5316 -10042
637 -10042 -10778 -9069 -4402 3352 10016 11894 9041 3874 -2683 -8656 -11566 -9868 -4506 2635 8671
652 8671 11308 9832 5189 -1619 -8050 -11458 -10576 -5392 1442 7002 10405 10859 6561 -871 -7382 -10228
668 -10228 -9905 -6819 -616 6491 10863 10624 6356 791 -5310 -10057 -11214 -7477 -928 5293 9553
683 9553 10735 7999 1922 -4697 -9294 -10737 -8056 -2575 3989 8848 10665 8556 3045 -3419 -8681
698 -8681 -10515 -8622 -3704 2752 8363 10689 8866 3856 -1903 -7569 -10632 -9374 -4383 1835 7115
713 7115 9975 9395 5293 -1093 -7044 -10088 -9286 -5427 177 6256 9949 9705 5785 180 -5692 -9628
729 -9628 -9818 -6275 -670 5187 9265 9830 6596 1148 -4783 -8957 -9786 -7001 -1814 4263 8628 9844
745 9844 7324 2295 -3621 -8348 -9761 -7688 -2852 3224 8035 9625 7747 3307 -2618 -7676 -9632
760 -9632 -8123 -3748 2129 7189 9544 8452 4141 -1551 -6725 -9345 -8665 -4583 1221 6240 9088
775 9088 8711 5076 -690 -5997 -8854 -8738 -5501 43 5385 8897 8761 5695 539 -4898 -8636 -9041
791 -9041 -5987 -853 4203 8071 9149 6436 1178 -4180 -7781 -8986 -6857 -1912 3652 7666 8894
806 8894 6965 2532 -2969 -7395 -8983 -7093 -2774 2404 6775 8916 7420 3172 -2128 -6576 -8729
821 -8729 -7634 -3651 1536 6297 8580 7833 4214 -1090 -5813 -8428 -7837 -4373 489 5417 8296 7921
837 7921 4774 -103 -4966 -8103 -8077 -5093 -496 4476 7825 8089 5452 955 -4085 -7510 -8285 -5831
853 -5831 -1425 3650 7352 8050 5986 1699 -3150 -7000 -8125 -6288 -2256 2747 6612 8076 6632
868 6632 2692 -2329 -6442 -7846 -6606 -3084 1734 6032 7928 6779 3352 -1500 -5692 -7784 -7140
883 -7140 -3705 1016 5410 7655 7077 4076 -425 -4839 -7569 -7307 -4211 242 4278 7114 7548 4850
899 4850 209 -4384 -6997 -7237 -5001 -989 3832 7033 7433 5138 1108 -3212 -6620 -7549 -5583 -1499
915 -1499 3051 6348 7237 5641 1969 -2409 -6192 -7507 -5981 -2196 2103 5648 7181 6252 2759 -1867
931 -1867 -5566 -7029 -6232 -3281 1248 5252 7263 6126 3166 -685 -4478 -7169 -6819 -3585 757 4323
947 4323 6691 6666 4214 -100 -4437 -6809 -6661 -4140 -331 3674 6433 6837 4616 580 -3705 -6073
963 -6073 -6551 -4819 -1280 3118 6311 6838 4577 1346 -2337 -5707 -6964 -5241 -1477 2471 5310 6522
979 6522 5567 2351 -2164 -5420 -6428 -5413 -2579 1417 5097 6702 5586 2658 -1318 -4717 -6430
994 -6430 -5695 -3077 686 4517 6488 5866 3123 -349 -3810 -6306 -6262 -3382 423 3756 5617 6083
1010 6083 4317 83 -3874 -5855 -5743 -4070 -1033 3130 5984 6193 4003 940 -2632 -5458 -6200 -4533
1026 -4533 -1179 2541 5215 5994 4591 1512 -2081 -4886 -6166 -5041 -1766 1971 4689 5898 5164
1041 5164 2385 -1658 -4942 -5680 -4794 -2751 836 4425 6023 5004 2497 -733 -3751 -5810 -5634 -2898
1057 -2898 834 3705 5465 5424 3360 -310 -3568 -5424 -5487 -3537 -238 3156 5205 5431 3872 677
1073 677 -2997 -5094 -5333 -3740 -933 2421 5231 5760 3871 830 -2006 -4642 -5789 -4478 -1198 2006
1089 2006 4304 5280 4566 1872 -1773 -4442 -5330 -4391 -2068 1209 4191 5452 4599 2165 -898 -3904
1105 -3904 -5342 -4610 -2525 639 3631 5329 4669 2561 -362 -3246 -5107 -5021 -3017 341 3183 4685
1121 4685 4853 3351 167 -3106 -4796 -4632 -3198 -614 2550 4862 4934 3369 787 -2196 -4488 -5082
1137 -5082 -3709 -948 2068 4294 5020 3788 1135 -1794 -3989 -4931 -3892 -1494 1605 3895 4648 3941
1153 3941 1973 -1399 -3832 -4676 -4055 -1991 1001 3604 4894 4247 2128 -693 -3068 -4678 -4533 -2355
1169 -2355 499 3009 4337 4443 2750 -225 -2942 -4461 -4486 -2908 -218 2600 4341 4364 2989 481
1185 481 -2377 -4203 -4419 -3192 -707 1999 4117 4435 3272 952 -1737 -3767 -4545 -3425 -1116 1644
1201 1644 3604 4510 3568 1389 -1320 -3463 -4368 -3657 -1681 1009 3440 4375 3715 1820 -787 -3047
1217 -3047 -4223 -3860 -2043 513 2882 4134 3845 2308 -125 -2635 -4115 -3908 -2385 2 2454 3941
1233 3941 3978 2681 127 -2385 -3725 -3899 -2761 -366 2190 3595 3902 2868 708 -1906 -3635 -3930
1249 -3930 -3078 -943 1485 3329 4005 3083 1044 -1362 -3186 -3926 -3339 -1366 1080 3059 3892 3356 1437
1266 1437 -918 -2885 -3767 -3494 -1665 792 2804 3715 3373 1819 -559 -2557 -3698 -3548 -1877 357
1282 357 2362 3560 3566 2138 -48 -2353 -3457 -3468 -2289 -93 1934 3481 3618 2432 395 -1749 -3312
1299 -3312 -3653 -2492 -581 1507 3157 3556 2720 844 -1265 -3031 -3479 -2828 -946 1085 2668 3388
1315 3388 2984 1307 -1033 -2835 -3352 -2985 -1363 693 2545 3525 2996 1400 -531 -2353 -3430 -3002
1331 -3002 -1746 261 2246 3353 3144 1951 -130 -2113 -3203 -3071 -1983 -24 1936 3171 3188 2113
1347 2113 210 -1728 -2979 -3122 -2316 -462 1584 2840 3123 2297 660 -1341 -2842 -3177 -2345 -727
1363 -727 1169 2593 3175 2642 942 -1055 -2568 -3020 -2595 -1121 782 2404 3140 2692 1269 -689 -2246
1380 -2246 -3037 -2670 -1304 506 2201 2922 2771 1481 -355 -1917 -2913 -2860 -1665 191 1831 2737 2924
1397 2924 1857 110 -1719 -2683 -2845 -1897 -196 1552 2670 2860 1883 443 -1328 -2627 -2982 -2155 -605
1414 -605 1124 2420 2799 2257 638 -1020 -2393 -2879 -2173 -890 808 2210 2882 2382 895 -672 -2083
1431 -2083 -2668 -2375 -1159 401 1961 2654 2408 1356 -351 -1848 -2647 -2388 -1274 221 1795 2570 2336
1448 2336 1461 -20 -1529 -2519 -2582 -1671 -115 1517 2428 2584 1724 139 -1332 -2205 -2591 -1865 -378 1208
1466 1208 2274 2317 1827 423 -1073 -2306 -2540 -1909 -797 851 2292 2427 1945 699 -682 -1908 -2502
1483 -2502 -2053 -816 636 1875 2498 2007 963 -553 -1626 -2340 -2229 -1057 322 1537 2284 2163 1273
1500 1273 -211 -1642 -2270 -2220 -1310 -61 1260 2153 2112 1289 192 -1264 -2061 -2266 -1454 -176 976 2090
1518 2090 2235 1618 407 -1009 -1827 -2287 -1709 -507 845 1828 2192 1829 662 -694 -1893 -2140 -1672
1535 -1672 -793 499 1715 2236 1782 775 -435 -1557 -2070 -1901 -845 375 1518 2030 1805 1106 -85
1552 -85 -1314 -2137 -1964 -1135 181 1234 1992 1903 1233 19 -1134 -1954 -1847 -1196 -217 1028 1720 2007 1324
1571 1324 146 -1100 -1661 -1921 -1151 -351 944 1820 1758 1535 422 -683 -1692 -1824 -1471 -575 581 1596
1589 1596 1874 1478 610 -459 -1407 -1778 -1545 -785 391 1292 1774 1571 838 -320 -1201 -1777 -1665 -896 184
1608 184 1217 1772 1646 978 95 -1066 -1634 -1621 -1060 -52 938 1583 1847 1153 171 -809 -1536 -1677 -1279
1627 -1279 -255 859 1515 1566 1301 248 -714 -1371 -1701 -1211 -365 505 1284 1699 1439 481 -430 -1314 -1543
1646 -1543 -1351 -643 275 1238 1565 1436 746 -330 -1062 -1574 -1430 -747 203 1070 1515 1455 929 100 -920
1665 -920 -1488 -1416 -914 -160 774 1334 1451 878 151 -787 -1290 -1538 -993 -290 681 1339 1486 1046 227 -575
1685 -575 -1309 -1407 -1064 -324 494 1077 1490 1230 555 -444 -1070 -1437 -1202 -568 311 1007 1492 1320 614 -248
1705 -248 -1058 -1369 -1235 -644 220 925 1260 1319 797 47 -850 -1312 -1255 -725 4 765 1202 1262 767 -54 -670
1726 -670 -1190 -1249 -825 -149 560 1232 1198 950 177 -548 -1132 -1272 -948 -316 601 1033 1236 1046 389 -407 -1047
1747 -1047 -1231 -1093 -362 415 959 1273 1071 442 -148 -850 -1142 -1073 -637 58 882 1109 1160 540 -52 -641
1767 -641 -1221 -1119 -697 8 684 1003 1036 534 55 -709 -1066 -1071 -655 -14 582 993 1203 720 160 -472 -897
1788 -897 -1168 -866 -365 496 905 994 843 305 -369 -813 -1115 -801 -237 224 712 1056 867 377 -175 -864
1808 -864 -1181 -963 -519 116 660 998 867 488 -2 -664 -951 -884 -643 67 640 932 896 526 37 -514 -789
1829 -789 -961 -603 -206 481 887 1021 757 46 -451 -717 -880 -737 -220 472 866 933 679 253 -341 -753
1849 -753 -974 -750 -337 288 683 856 895 392 -283 -641 -803 -831 -304 60 577 873 764 421 -107 -610 -732
1870 -732 -925 -541 10 470 863 682 505 -16 -402 -661 -822 -552 -33 345 668 937 672 104 -328 -658
1890 -658 -812 -619 -339 284 783 723 562 172 -128 -529 -698 -695 -259 177 647 790 704 430 -190 -469 -607
1911 -607 -780 -358 140 504 785 796 404 -63 -454 -577 -719 -470 26 435 727 605 458 12 -365 -560
1931 -560 -697 -545 -90 275 701 746 481 209 -321 -623 -639 -455 -201 227 544 729 525 197 -269 -447 -618
1952 -618 -662 -249 20 462 580 557 272 -108 -364 -694 -602 -330 -6 355 620 536 274 83 -321 -592 -647 -341
1974 -341 59 303 520 648 474 75 -237 -514 -466 -384 -172 249 505 616 425 255 -215 -541 -572 -502 -246
1995 -246 160 530 619 458 254 -110 -429 -620 -450 -342 55 309 542 578 361 9 -280 -553 -575 -322 -81
2016 -81 337 547 586 385 115 -286 -482 -520 -286 -87 258 418 583 426 109 -201 -401 -552 -351 -93 273
2037 273 625 398 377 184 -89 -344 -514 -521 -271 11 312 608 521 140 45 -364 -486 -511 -274 26 340 354
2059 354 435 259 -13 -302 -387 -425 -343 58 226 414 389 266 132 -225 -354 -511 -203 -95 172 355 494 440
2081 440 72 -158 -375 -493 -322 -188 43 355 429 391 253 60 -266 -427 -396 -227 51 274 357 410 88 -124
2103 -124 -220 -339 -411 -316 -58 179 425 331 340 -2 -313 -386 -417 -316 -60 144 341 437 309 14 -115 -258 -514
2126 -514 -189 -92 120 209 393 369 105 -46 -318 -372 -324 -105 161 267 431 415 225 4 -317 -395 -368 -318 10
2149 10 184 282 413 322 32 -165 -374 -348 -309 -52 169 346 317 400 80 -198 -403 -287 -280 -190 53 331 302 324
2173 324 57 -45 -306 -406 -381 -187 91 253 302 257 193 20 -332 -438 -243 -254 -46 220 317 365 149 71 -96
2196 -96 -353 -317 -289 -51 176 248 329 219 4 -146 -298 -296 -280 -76 119 264 441 375 154 -141 -221 -413 -428 -166
2220 -166 68 199 260 156 212 -37 -211 -403 -424 -235 -43 131 358 320 191 -23 -114 -390 -163 -234 -53 93
2242 93 324 273 284 19 -65 -244 -299 -311 -173 63 222 412 318 139 -57 -230 -314 -345 -151 6 225 429 414
2265 414 185 16 -348 -274 -215 -218 65 219 368 354 134 -21 -93 -421 -310 -229 -126 214 230 309 266 58 -109
2288 -109 -286 -270 -200 -37 116 253 387 214 85 -142 -234 -256 -297 -83 127 235 349 384 183 -33 -205 -298
2310 -298 -331 -228 -9 115 363 224 113 -12 -134 -327 -381 -169 -21 125 231 372 157 1 -195 -289 -255
2331 -255 -152 -68 178 338 374 386 25 -184 -199 -336 -226 -139 156 278 431 358 87 -120 -299 -351 -310 -190 31
2354 31 231 457 242 131 -13 -114 -328 -306 -140 -7 186 332 370 237 25 -196 -268 -320 -67 -175 134 276
2376 276 321 344 -25 -108 -243 -327 -136 -72 63 236 253 303 93 -18 -283 -326 -354 -256 187 56 299 318 117 37
2400 37 -193 -333 -251 -160 -5 273 346 319 305 -68 -258 -255 -353 -210 16 176 339 355 211 148 -36 -358 -300 -258
2424 -258 47 64 238 349 227 90 21 -163 -393 -201 -132 101 288 327 177 104 -27 -314 -342 -212 -212 38 216
2447 216 305 352 107 -30 -163 -363 -234 -182 65 200 355 237 261 -31 -160 -413 -321 -171 19 231 363 412
2469 412 236 -10 -199 -228 -357 -313 -148 3 256 372 289 172 -82 -233 -446 -258 -125 47 106 450 309
2490 309 159 42 -217 -345 -317 -206 155 191 305 386 133 33 -180 -421 -329 -211 70 164 344 376 268 31
2512 31 -187 -378 -385 -252 -84 239 256 305 140 131 -100 -381 -325 -345 -242 110 166 343 248 150 -79 -282 -474 -307
2536 -307 1 2 234 266 264 209 64 -192 -306 -292 -118 10 313 346 311 225 -106 -210 -283 -360 -160 -44 332 372
2560 372 269 151 108 -347 -298 -241 -234 -74 56 278 335 218 89 -142 -313 -177 -195 -76 127 308 305 345 125
2583 125 -136 -214 -389 -330 -156 103 286 430 281 180 -9 -215 -211 -384 -231 148 242 272 438 215 49 -89
2605 -89 -379 -422 -193 0 113 330 278 230 6 -154 -402 -334 -239 -147 96 224 379 321 89 -111 -343 -283 -158
2628 -158 -155 64 330 352 306 190 -99 -251 -357 -286 -164 47 295 311 268 144 -67 -354 -418 -425 -162 -149 205 291
2652 291 336 237 -38 -209 -289 -277 -213 -130 114 394 349 222 113 -118 -313 -277 -270 16 188 364 344 341 21 -151
2676 -151 -446 -319 -231 -47 203 174 359 321 112 -185 -205 -301 -369 -297 -109 269 268 304 157 -158 -193 -318 -281 -191
2700 -191 -48 97 454 318 251 77 -220 -325 -275 -205 -56 212 348 432 302 90 -87 -259 -337 -255 -112 112
2722 112 276 351 212 111 -135 -296 -293 -311 -59 101 105 341 255 50 -156 -252 -349 -420 -136 9 100 304 303 206 -73
2747 -73 -226 -307 -436 -168 21 127 472 349 192 40 -130 -310 -308 -276 -108 118 261 383 217 88 -31 -290
2769 -290 -462 -154 -58 243 242 276 352 133 -89 -337 -257 -325 -125 30 215 301 226 61 -107 -206 -359 -346 -110 57
2793 57 197 393 311 160 -134 -211 -355 -202 -111 -23 221 296 370 188 -37 -70 -234 -476 -180 42 114 243 233
2816 233 301 96 -192 -224 -315 -136 -24 169 312 221 195 -22 -163 -277 -372 -243 -193 97 196 395 262 -25 -130
2839 -130 -171 -447 -411 -151 26 312 329 298 172 42 -184 -372 -296 -52 45 171 387 326 205 -114 -186 -415 -331
2862 -331 -148 -57 185 271 228 252 62 -165 -210 -250 -181 -27 180 347 290 193 -10 -273 -193 -394 -185 -46 189
2885 189 207 335 167 130 -52 -189 -230 -356 -242 45 223 307 238 17 -83 -306 -268 -341 -134 -43 304 352 346 164
2909 164 94 -266 -202 -356 -186 -60 169 231 317 161 -11 -157 -438 -274 -245 -37 192 150 307 233 30 -143
2931 -143 -316 -261 -332 30 7 307 348 306 -45 -70 -148 -358 -286 -131 100 321 271 305 316 66 -80 -307 -272 -171
2955 -171 40 314 278 215 211 -17 -103 -250 -126 -203 156 264 274 355 240 162 -167 -130 -232 -120 -6 36 191 201
2979 201 154 7 -109 -332 -357 -205 -99 25 223 309 319 118 -74 -140 -340 -191 -35 50 239 313 274 187 -25
3002 -25 -189 -348 -242 -153 55 105 363 225 250 -5 -145 -299 -197 -180 -28 257 147 329 229 -11 -206 -241
3024 -241 -278 -191 -81 130 249 253 337 72 -142 -212 -306 -128 -21 135 273 223 182 19 -130 -264 -341 -68 -53 100
3048 100 204 315 157 83 -67 -332 -366 -251 -76 42 166 248 146 174 -29 -183 -198 -248 -126 -47 85 295
3070 295 351 226 31 -219 -226 -316 -146 119 122 235 228 223 114 -25 -174 -231 -341 -111 127 115 253 88 104 -85
3094 -85 -184 -203 -202 -179 193 289 358 166 102 21 -129 -237 -329 5 68 203 382 249 19 -96 -205 -259 -345 -43 -5
3119 -5 148 217 210 238 -28 -136 -367 -235 -142 -44 115 216 207 253 -72 -78 -343 -343 -99 -21 218 149 273 223 31 -226
3145 -226 -197 -182 -217 -87 43 281 234 331 -30 -86 -236 -390 -218 -126 157 171 374 240 80 52 -86 -319 -171
3168 -171 -114 105 165 259 253 17 -66 -158 -239 -199 43 -2 173 196 184 47 -146 -144 -302 -240 -268 -30 17 287 274 111
3194 111 86 -83 -260 -315 -173 101 82 145 166 247 32 -141 -296 -233 -185 -5 84 245 257 166 148 -148 -109 -321
3218 -321 -129 -175 73 169 215 156 129 -26 -232 -278 -187 -151 -37 123 243 228 112 86 -128 -272 -180 -103 -36 170
3242 170 237 258 68 63 -154 -292 -223 -191 -145 48 187 311 183 -20 -128 -111 -201 -186 -27 99 237 215 135 37
3266 37 -42 -225 -268 -192 -115 117 192 153 146 49 121 -183 -282 -313 -299 3 221 277 372 79 -219 -196 -141 -203 -173 61 196
3293 196 183 250 85 28 -146 -194 -275 -171 -127 20 306 217 158 28 68 -150 -229 -120 -26 49 190 296 202 -21
3317 -21 -45 -201 -287 -96 -106 172 204 163 159 -74 -108 -327 -333 -243 -61 84 122 256 246 180 -40 -123 -229 -62 -105 -38
3343 -38 214 213 301 109 -154 -57 -291 -274 -101 47 105 169 251 78 48 -126 -191 -284 -233 -140 175 197 294 121 56 -124
3369 -124 -158 -281 -3 -90 91 228 173 155 -27 -152 -138 -118 -221 -113 -37 226 273 114 130 19 -131 -212 -175 -102
3393 -102 23 161 142 246 126 -57 -140 -162 -338 -39 -23 77 67 206 7 -2 -7 -244 -89 -164 -30 8 130 153
3417 153 107 69 -41 -222 -213 -210 -35 124 35 114 146 34 -151 -142 -201 -180 -126 -5 255 198 252 9 -72 -182 -146 -192
3443 -192 -137 114 206 269 114 72 43 -115 -215 -190 -157 46 64 187 278 164 -10 -208 -187 -206 -156 38 100 125 189
3468 189 184 144 -68 -143 -154 -166 -100 53 63 205 125 55 13 -194 -225 -192 -156 60 181 232 265 5 3 -176 -201 -170 -88
3495 -88 55 167 70 225 62 -105 -185 -132 -171 67 36 42 248 202 180 152 2 -137 -272 -105 9 102 205 187
3519 187 102 84 -131 -252 -114 -63 -61 61 128 178 150 23 -171 -151 -198 -145 -126 64 214 94 63 35 -28 -156 -355
3544 -355 -185 -180 67 245 167 144 124 -38 -98 -168 -197 -200 53 110 52 168 97 -13 -153 -296 -162 -24 -40 137 118
3569 118 129 23 76 -43 -156 -215 -174 28 120 178 204 122 63 -85 -286 -214 3 45 80 163 167 186 107 -85 -242 -316
3595 -316 -292 -68 107 71 156 222 68 -80 -202 -230 -144 2 83 214 114 167 85 -47 -157 -217 -166 -101 38 138
3619 138 91 188 159 -17 -199 -81 -194 -207 27 88 252 188 -4 -28 -180 -173 -168 -83 -39 120 248 268 146 42 -92
3644 -92 -82 -222 -217 -8 37 80 159 69 43 -116 -95 -225 -206 -29 21 36 163 182 48 -16 -176 -156 -125 -172 28 105
3670 105 195 332 98 -63 -52 -153 -121 -66 68 80 206 85 159 69 -155 -84 -245 -168 -78 -4 156 103 87 77 15
3695 15 -152 -186 -223 49 -32 102 61 173 60 -115 -94 -120 -93 -66 63 111 139 255 52 29 -78 -162 -103 -68 104
3720 104 207 190 147 23 -48 -68 -246 -88 -167 88 -6 176 118 108 29 -51 -176 -233 -207 -88 133 113 97 143 82
3745 82 -94 -27 -222 -178 -165 -26 120 177 200 55 -122 -71 -134 -205 -47 127 99 103 26 105 39 -99 -163 -175 62 20
3771 20 157 256 146 5 57 -180 -181 -132 -52 -50 -110 119 190 196 -30 -30 -91 -39 -138 -88 46 149 210 3 48 -123 -44
3798 -44 -192 20 -28 114 138 72 182 44 -110 -156 -129 -169 -75 27 164 220 51 83 -114 -10 -122 -208 -125 -105
3822 -105 0 -8 173 133 20 -118 -177 -140 -65 93 125 -13 98 48 -14 -27 -168 -115 -210 -5 175 82 91 79 -23
3847 -23 2 -124 -182 -198 -96 53 166 222 164 89 -8 -110 -184 -207 -117 65 65 134 24 80 38 -14 -180 -75 -109 16
3873 16 98 72 115 -54 41 -164 -55 -114 -179 -21 56 199 134 111 82 -136 -169 -77 -111 71 162 79 119 153 48 -125
3899 -125 -164 -54 -112 73 51 79 212 159 27 -47 -161 -149 -6 9 137 32 150 81 29 -136 -61 -105 -102 -78 84
3924 84 59 124 121 10 -40 -138 -53 -132 -130 16 -17 141 63 68 67 -13 -93 -31 -72 -94 23 169 142 -40 18 -91 -49 -160
3952 -160 -90 56 42 184 0 56 96 1 -91 -185 -67 5 79 51 113 68 112 -60 -73 -170 -201 -21 2 -3 10 188 125
3979 125 67 -149 -62 -90 -31 -4 -104 93 29 -12 -34 -91 -198 -78 -28 4 -4 105 217 111 113 -87 -74 -199 -107 -144
4005 -144 129 181 134 93 20 22 -135 -199 -59 34 31 205 111 52 58 -3 -46 -18 -183 -79 128 161 45 181 35 62
4031 62 -124 -2 -24 -60 43 105 107 87 63 -10 -48 -68 -65 -113 126 53 194 229 83 30 -39 -94 -248 -99 60 21 95
4058 95 -21 23 41 30 -204 -101 -4 -109 -25 82 87 -13 31 -100 -103 -45 -71 -147 3 15 196 48 42 -193 -27 -72
4084 -72 -19 -150 13 76 89 27 55 -36 16 -158 -6 2 16 161 33 44 -73 -24 -37 -134 -202 -106 74 9 76 140 78
4111 78 59 -28 -119 -113 -111 6 -168 -3 78 76 42 4 -121 -140 -148 -38 19 93 104 41 -18 -65 -86 -146 -8 19 28 147 63
4140 63 115 117 -36 -15 21 -121 -91 48 97 94 4 36 38 2 -126 -55 -144 -106 -40 149 88 21 170 -49 -106 -142 -112 77
4168 77 18 62 101 130 22 -28 -98 -115 -156 -17 140 83 103 115 28 -57 10 -55 -21 -12 11 100 223 41 86 -26 7 -32
4196 -32 -98 -121 -12 32 120 183 102 -62 -45 -196 -241 -37 -16 -15 143 121 126 -28 -161 -67 -6 -144 7 203 148 210
4222 210 94 110 -88 -158 -167 -147 -14 -95 83 76 93 27 11 -60 -245 -3 -131 -29 27 12 94 83 -12 -43 -122 -82 -163
4249 -163 32 131 63 191 46 -162 -112 -76 -129 -8 43 -20 21 138 126 71 -57 47 -126 -22 -46 148 123 55
4273 55 24 -84 -57 -163 -156 -66 -24 44 77 214 78 23 -114 -16 -73 -58 71 -107 59 18 158 89 -32 -38 -231 -38
4299 -38 -98 18 79 158 149 -21 -40 -132 -75 -1 -34 75 100 103 81 -56 84 -71 -119 -235 -77 100 190 79 134 143 -115
4326 -115 52 -169 1 61 57 158 55 58 57 15 -113 -35 -100 -45 -2 91 156 141 142 -49 -117 -132 22 -46 29 -55 15 96
4354 96 142 97 67 -88 -112 -64 1 34 61 66 19 -20 5 -24 -57 -225 5 -83 118 57 -8 -12 -24 1 -130 -17 -76 31
4382 31 38 -14 104 145 52 14 -101 -43 21 -61 73 89 161 119 57 -137 -95 38 27 -47 49 35 208 52 28 -6 -53
4409 -53 -49 -136 -125 -43 142 85 158 49 -66 -139 -154 -82 -96 74 62 114 52 -35 -94 2 -89 -111 -6 -41 144 195 31
4436 31 -72 100 -11 -105 -122 37 40 16 43 146 66 57 42 -61 -126 -204 3 -40 106 77 82 -96 -105 -23 -59 -108 34
4463 34 37 97 39 77 78 -127 -29 -43 -192 -89 -64 142 54 30 31 -50 30 -156 -14 -117 38 110 42 47 35 60 -47 -41
4491 -41 -114 -64 -36 -84 174 32 47 -6 11 -73 -153 -12 96 -36 186 131 144 -42 -227 -97 -70 23 12 0 166
4516 166 122 143 66 -29 -145 48 -148 7 -23 79 15 37 -27 49 -101 -69 -50 -3 18 42 72 13 56 -18 36 -65
4542 -65 -58 29 54 91 9 -37 24 -27 1 -38 -92 -26 21 -19 205 123 104 50 -93 -7 -28 -79 -69 -54 24 117 65 -22 -73 -110
4572 -110 -78 -62 87 41 15 68 9 72 -36 -96 -117 -46 -11 12 -85 91 92 39 13 -133 -56 -31 99 5 108 149 75
4599 75 9 51 -75 -70 -59 -115 45 117 30 156 26 -57 40 -77 17 -43 -53 32 -40 160 56 62 -81 -142 -100 2 19
4626 19 67 97 -11 2 -56 4 18 -34 23 98 -44 43 3 74 82 -83 -157 -102 -50 6 49 4 177 6 19 12 -32 -116 -69
4655 -69 -15 83 28 47 179 7 -97 -21 -118 -89 -27 53 35 51 -15 50 -39 -65 -71 -106 -65 -6 36 53 98 42 -80 38
4683 38 -85 -84 64 -36 142 10 117 -15 -33 -4 92 -74 -54 -67 -38 61 149 19 52 41 -76 -158 -92 -76 132
4708 132 148 80 44 57 -61 -80 -109 -76 -26 -45 42 -41 -11 29 72 -44 -85 -118 -104 49 87 52 120 27 -70 -87 -61 -113
4736 -113 -77 -131 73 83 76 94 -72 -75 -56 -2 -136 17 -83 70 96 -29 44 -134 41 33 -80 -82 -3 52 51 27 112
4763 112 -46 -112 -2 -101 -22 72 79 98 100 6 58 36 -102 -29 -85 -68 98 29 146 78 93 -24 -72 -52 -97 -61 -59 112
4791 112 147 -13 67 17 -161 -63 25 -45 50 -40 57 25 -76 -34 54 -77 -60 -47 71 131 9 61 -10 -58 -68 -57 -20
4818 -20 -76 66 170 64 66 86 10 -120 -62 14 -10 40 95 7 14 47 147 32 -100 -57 46 -45 129 51 93 28 -6
4845 -6 -95 -93 -27 3 7 56 162 55 -24 66 -51 -19 -111 -121 2 -31 82 106 50 25 -80 -55 -153 -67 -74 122 23 -34 41
4874 41 30 16 -185 -106 5 -2 18 56 115 108 46 -9 -56 -29 -37 6 3 35 73 92 120 -75 -65 -120 -108 -35 -1 119 17 -29
4904 -29 -12 -55 -37 13 -84 -4 -82 53 -105 -3 81 34 -112 -127 16 -77 -41 27 42 -25 149 -47 -70 27 -34 -52 15
4931 15 -9 68 21 5 46 -66 -119 -103 -43 30 65 122 38 144 -3 -3 53 -161 -28 54 157 65 104 -86 -45 78 -10
4958 -10 -54 -19 -19 33 -40 -29 74 12 0 -42 -110 -37 -12 -57 27 156 38 151 57 -93 -85 -48 -8 -135 18 11 157 76
4986 76 108 13 10 -181 -55 10 33 39 197 49 -48 35 -167 -42 -35 -27 77 50 46 -10 40 32 -22 -15 -44 21 -76 5 155 174
5016 174 109 20 -57 -26 -217 19 31 -25 25 123 -13 22 57 -121 -30 -140 -85 -80 -42 147 75 26 19 -117 -96 -103 51
5043 51 -8 110 -38 42 32 -173 -180 -112 -54 -10 140 33 31 133 -42 -59 -49 -6 -198 -53 15 30 9 92 -51 -45 35
5070 35 -15 -73 -95 -78 40 -19 150 92 -84 -2 -111 -88 -50 -11 60 -61 139 149 -23 90 -218 -15 -5 29 -4
5095 -4 94 137 46 -51 -23 -120 -182 -91 -6 -37 50 121 123 10 -15 -63 -31 -33 29 69 110 111 14 34 36 -137 -43 -45 -98 51 4 -19
5127 -19 -25 9 -35 -3 -116 -83 7 15 57 152 203 70 157 -29 -55 -118 -78 -64 19 119 59 39 37 -35 -113 -87 11 -195 151
5156 151 219 119 79 -19 -120 -58 19 -48 -71 64 94 52 108 16 17 -105 -68 -38 23 40 -13 104 2 188 -34 -138
5182 -138 65 -93 -40 -76 -33 110 28 175 54 -89 -17 -51 -55 -34 68 198 95 73 42 -86 -25 11 -91 57
5206 57 46 144 73 41 -26 -60 -108 -40 -35 -156 34 90 -15 56 3 -47 -160 -54 -64 67 13 17 93 14 7 -29 -101 -7 -120
5235 -120 -35 39 70 -53 -12 94 -37 55 -29 -43 -113 -70 10 21 28 132 13 -55 -108 -50 10 -14 -16 51 -2 93 6 -67
5263 -67 54 -103 49 37 7 82 209 138 44 -70 -80 -120 -22 29 -34 -30 0 45 -52 -46 -113 -114 -56 -16 -122 -35 -23 46 35
5292 35 -90 29 -80 -143 9 15 14 142 -5 -90 -27 22 -138 -22 -130 61 29 20 37 43 58 -63 -84 12 -77 -117 -20
5319 -20 -69 114 -47 -14 44 -46 -37 -88 54 -86 -44 11 70 32 -97 -72 -27 56 -16 82 74 38 113 28 -6 -95 -137 -135 16
5348 16 18 36 81 -32 68 -44 58 -133 -32 -129 42 -33 119 83 -47 30 156 -86 -31 -122 -18 52 93 46 -3
5373 -3 13 -10 -189 -27 -22 -98 57 17 94 4 6 -20 -1 -18 -56 74 6 12 34 53 92 -22 -5 -184 -36 -40 -103 47 39
5402 39 104 -68 110 -39 -93 -168 -143 -1 24 -2 121 79 35 -42 -59 -111 -132 19 -28 92 62 -51 69 -29 -42 -203
5428 -203 -13 -12 -47 -22 68 77 12 -65 42 114 39 35 45 -6 17 24 45 -33 -63 -67 -80 -25 22 33 47 120 -36 -12 48 -77
5458 -77 -30 -92 -52 30 100 89 -36 -30 -153 -35 -171 5 22 14 -16 40 94 -99 7 28 -47 -88 30 -19 23 62 8
5485 8 -87 -88 -226 -12 -85 22 36 -9 57 27 35 -37 -94 -20 -22 -16 50 145 41 82 42 -6 -29 -87 -2 51 -64 56 -34 116
5515 116 4 112 -40 -8 -28 -80 70 48 90 -1 113 -83 -62 -216 11 -42 -47 83 149 102 -56 -129 -40 -93 -92 -97
5541 -97 13 65 -43 46 -1 -33 -161 -52 -52 -120 26 74 34 31 87 -6 -137 -14 -107 -70 -83 2 87 53 83 -20 -85
5568 -85 -51 -102 -19 -58 -53 137 53 38 -25 5 -44 -69 -19 -64 47 -50 85 41 22 5 -50 -113 -111 -34 -1 12 21 8 52 83
5598 83 9 -31 -104 35 25 28 38 -49 83 11 -23 -85 -61 -60 -76 -2 -88 119 112 24 101 -57 -108 -95 -33 29 48 -54 -8
5627 -8 55 -68 -79 -62 -88 -183 -64 -58 75 -10 84 -42 -85 -34 -164 -132 46 -23 4 16 154 8 -111 -60 -187 1
5653 1 -17 19 136 -3 2 22 -24 1 -52 -48 58 78 8 58 23 -40 -4 -115 -15 -178 63 94 38 69 48 14 3 -91
5681 -91 -39 -5 -43 -3 52 88 162 80 13 -10 37 -15 -48 3 75 24 83 124 -3 -24 -46 -6 -49 38 64 25 -5 -3 -24 -78
5711 -78 31 -37 -11 57 -27 143 174 21 -2 -36 -81 33 -87 -38 66 126 54 -34 82 -68 -19 -60 -54 -54 0 -8 101
5738 101 52 -12 -5 -53 -83 -16 72 -76 -63 -9 43 -21 19 -13 -24 -86 -11 -51 -56 -64 -2 -2 57 -32 -97 -19 -39 -40 11 -47 182
5769 182 38 47 -24 -149 -26 -86 -173 15 -17 175 116 -60 -51 -83 -95 -40 -51 -5 -28 71 95 32 -7 -91 82 -74 -18
5796 -18 -34 82 -11 68 -1 15 -111 -89 -107 -22 -154 -35 63 39 58 -75 -62 -44 -28 31 24 -3 23 14 94 105 32 8 -63
5825 -63 -100 82 67 -5 42 3 -33 -67 23 -2 -106 -80 72 93 112 41 14 24 -173 -96 -22 -36 -7 51 100 31 -11 -73
5853 -73 -124 -9 -137 37 43 14 136 18 111 -21 -135 -179 34 29 24 65 -6 20 107 -5 -31 8 -40 14 80 27 18 77
5881 77 69 30 54 -76 -66 43 36 -115 -13 30 45 134 -118 -22 -114 -34 13 -13 5 17 75 51 8 8 -92 -114 -75 55
5909 55 -18 -5 64 -27 27 51 -139 -83 -166 -44 -37 178 65 -37 70 -92 -42 -65 -2 -13 -5 -36 104 97 -39 -67 -75 -37
5937 -37 -102 -71 62 49 15 42 13 7 -216 -58 -35 49 52 185 51 50 80 11 3 -13 -99 -52 49 50 -71 24 67 94 13
5966 13 -74 -96 -125 -24 -29 106 2 -21 27 -112 -67 -105 95 -15 -3 170 -1 -17 -113 -54 -163 -30 36 -53 40 56
5992 56 84 -28 18 5 -138 -93 -137 -50 77 -11 60 93 -34 92 -8 -45 -4 57 -9 9 22 106 92 -81 -97 -79 -104
6019 -104 -208 10 31 42 187 60 -51 -169 -148 108 19 45 47 133 26 7 -12 -114 -3 -128 126 -14 41 97
6043 97 89 12 -83 -24 -63 -81 -135 -23 -54 35 43 -28 56 -85 -30 -13 -75 34 -17 -6 91 -84 54 -4 -142 88 -45
6070 -45 -135 -82 -11 77 94 49 -8 7 -144 -37 -38 -20 35 52 25 126 103 -62 -31 -136 -60 -30 -5 118 6 3 -54 -119
6098 -119 -22 -133 -32 -43 25 20 -9 26 100 -36 -12 0 53 -17 38 100 73 2 38 -38 -36 -121 58 -40 -17 75 97 65 103
6127 103 -104 -88 31 -168 40 79 69 9 52 -60 -48 72 -56 -71 45 -56 -9 46 101 1 -26 61 -93 -69
6151 -69 -31 37 61 172 -22 140 81 -124 -66 -113 3 -66 -52 73 111 110 43 -50 -17 -91 -61 -164 -91 126 34 31 48
6178 48 -79 69 -104 -139 -12 -3 1 122 -152 -43 -20 -60 -90 11 27 13 -54 54 41 50 -85 73 67 -46 -12 33
6204 33 42 106 85 29 40 -103 -95 -67 -26 3 40 -42 183 171 13 -107 -126 -101 -4 -56 -33 -4 -45 -52 -23 -28 -79 -73 -49 -97 149
6235 149 80 17 138 36 106 29 -85 -70 -159 73 -19 70 60 47 11 -13 -75 -45 124 6 14 70 92 133 110 -9 -154
6262 -154 -22 11 -116 83 68 163 -19 60 -45 -4 -103 -73 3 30 16 100 -3 -2 65 -76 -27 -161 32 45 19 219
6288 219 111 -73 -43 -73 27 -140 -24 -13 65 163 91 -28 -16 -84 -142 18 -99 30 -21 -86 30 46 -31 23 1
6313 1 -90 -19 30 15 81 51 12 6 18 2 -87 -54 59 60 13 85 63 152 -3 -125 -91 -2 -102 -17 16 -79 -38 59 50 -180
6343 -180 -50 -117 -52 -15 -75 17 113 33 -28 12 -1 -154 -112 -36 29 143 103 23 6 37 -84 15 -74 23 -73 -65 41 50
6371 50 28 -64 -175 -90 -132 64 -71 -39 106 46 54 -115 -42 -49 -99 -46 7 89 83 72 -37 -65 -27 3 -21 -11 119 122 84
6400 84 104 -23 75 -43 -119 -88 18 36 3 -27 -18 26 -101 4 -38 -29 -93 -114 25 53 61 26 72 44 -42 -75 15 -19 2
6429 2 27 -54 -4 27 48 -55 -49 19 -19 -41 72 22 75 -27 -10 -70 -60 -25 -2 -19 108 109 2 -12 -30 -37 -31 -109 -69 -45
6459 -45 47 -5 171 124 103 -32 -39 -108 -8 35 30 -9 129 119 -41 84 19 -9 18 -55 -44 72 161 -12 -68 -5 -122
6486 -122 -92 -39 114 22 58 3 11 -12 12 -160 25 10 -32 2 46 15 27 64 -42 -35 67 -26 -59 -24 34 143 38
6513 38 113 25 31 22 58 -204 37 65 -20 76 65 -111 -3 12 -179 -48 28 -82 -11 105 35 54 -103 -82 -52 41 86
6540 86 49 -108 187 21 33 16 -120 -60 -50 -5 -31 19 -27 -62 102 27 -23 -63 -59 28 -6 63 46 -95 81 -87 -111
6567 -111 -19 -33 12 -50 71 51 38 49 31 -42 -108 -56 -33 5 17 36 -35 41 12 38 -7 18 -77 -20 0 62 7 -6 82
6596 82 -9 -164 29 6 -77 55 -1 -36 -23 -94 -55 -90 27 -40 -36 27 16 35 113 89 3 -3 -95 -45 -26 -97 7 33 -107
6625 -107 47 22 -120 -3 16 -73 31 -23 53 42 18 58 -99 -64 -43 -7 -40 -18 60 70 -79 39 -29 -60 26 -76
6651 -76 -4 33 -69 27 17 45 98 -30 -72 50 -47 60 -8 95 112 -31 -31 -18 -95 -163 -123 34 -26 68 87 23 -52
6678 -52 47 -72 -23 -7 -83 79 -8 59 -53 -14 75 -125 1 -58 69 13 10 13 -9 -48 -25 -98 23 82 -19 -48 121
6705 121 139 69 -32 -22 -63 -55 -33 -69 5 96 37 79 37 -52 -136 73 -114 -63 59 144 39 87 24 58 54 -31 79 -83
6733 -83 -54 16 3 159 44 -46 30 -49 -23 -66 -52 -60 28 26 82 -110 19 -1 42 -20 -51 21 35 32 -47 26 79 -16 -29 -38
6763 -38 -86 -68 -65 157 3 -40 -26 -50 -9 -6 -11 -78 57 -31 -72 -31 -28 20 -25 -45 -49 44 54 -11 44 69 96 88 -52 -59 46
6794 46 49 -40 -21 -67 24 118 39 -169 -37 -37 -3 62 -11 135 -78 -115 -111 -3 45 -23 -55 82 36 10 -71 17 -44 -28 -49
6823 -49 -113 104 9 36 -31 26 -7 48 -4 65 -30 27 -26 5 -1 106 -46 -121 -81 69 69 -30 -43 24 20 34 -15 -9 -59 -7
6853 -7 10 8 35 88 75 11 -12 73 87 2 -41 -64 -103 18 85 30 44 31 -38 -54 -86 -59 -179 30 78 -43 30 84 -11
6882 -11 -94 79 -82 -54 29 28 22 104 84 51 -40 -54 37 50 -93 54 9 78 -82 11 43 -106 16 -47 -83 -12 -25 -16
6910 -16 22 115 1 -86 -28 -61 -1 76 15 -115 130 -53 6 -13 43 62 64 24 -24 -38 63 -66 75 116 -98 -38 -105
6937 -105 -22 -73 0 18 136 52 14 84 -217 -41 56 -79 17 67 7 105 7 -6 -48 -69 -2 -55 3 96 163 117 16
6964 16 -114 -18 -28 -41 54 17 119 42 -26 -8 -66 73 -70 -87 83 70 -172 150 -3 -28 21 -104 -37 98 30
6989 30 95 227 97 -48 8 89 -76 -97 25 0 57 102 -4 11 -83 92 -81 6 -5 -66 3 -9 22 -61 65 -181
7015 -181 -78 -35 0 -38 -85 -15 97 -57 150 -93 28 87 -21 -81 86 45 73 4 47 24 36 -4 1 87 -24 88
7041 88 78 59 -81 -33 -67 -3 -51 73 -95 59 -26 -20 130 58 -33 41 -24 -117 -140 -130 49 -112 87 0 19 -206
7067 -206 65 -69 -52 2 47 35 -37 -4 -66 -96 -121 -144 57 27 90 38 37 48 -32 -71 37 -5 2 -57 31 36 -38 19 87
7096 87 66 -100 63 5 -154 6 134 28 -9 -8 45 39 -20 -21 -25 31 -66 142 9 22 -131 -108 5 -91 -20 38 82
7123 82 88 76 -76 -128 -110 -95 21 -25 -60 -47 82 80 -114 -100 -81 3 -62 -9 11 53 25 18 -13 -110 -43 -100 -31 -137 -30
7152 -30 -20 93 85 -30 -43 7 -73 151 -12 -35 -65 47 -24 108 20 -53 -110 -43 6 -54 22 -88 -5 -3 103 -66 20
7179 20 18 -12 44 31 74 -41 85 2 29 -41 -146 -21 10 74 51 110 56 -19 -23 -28 -94 51 104 24 -29 -22 53 -2 33 4
7209 4 60 31 -86 -143 -46 -186 93 46 5 -134 -29 -9 -89 16 38 21 -23 42 25 16 -13 -7 9 15 62 51 145 56 -30
7238 -30 -27 -39 -58 -83 -72 35 -52 -18 40 54 40 -90 -94 45 -100 95 10 85 14 -18 31 -35 68 -97 -85 7 80 72
7266 72 -26 -42 17 33 -98 35 -165 -58 49 -41 -18 99 61 47 -16 -105 -11 -38 46 -46 89 83 -67 -4 4 -10 -76
7293 -76 21 0 55 51 32 -2 -45 -134 -32 -54 0 -70 -60 10 -27 129 73 28 26 55 44 70 -20 47 97 76 23 -24 -5 -85
7323 -85 -55 59 -29 87 50 -115 96 -50 16 -27 -80 -81 -8 130 33 52 -68 67 4 -25 -65 -38 -4 -7 92 28 -5
7350 -5 -92 -48 -77 -86 9 -69 14 -111 -108 18 82 -76 -36 19 15 -9 -21 5 33 94 -41 -121 -72 48 -73 -126 49 -41 -65
7379 -65 -87 6 -32 -30 -33 -42 -14 70 23 36 43 131 25 -10 -55 -104 -142 -41 10 18 -72 -91 -58 -66 -42 76 117 2 96 -115 -28
7410 -28 11 13 24 -94 -79 35 53 -32 84 -5 54 -90 -54 -136 49 -50 -43 22 -97 -41 92 -21 62 -28 -113 -23 -26 11
7438 11 13 76 -64 148 -67 -65 26 63 -66 48 21 -7 -36 76 -75 68 -64 -58 -13 8 57 30 -25 -19 -23 -95 -26 12
7466 12 -47 -3 -33 24 79 92 84 -9 20 0 41 57 123 21 45 99 -58 -67 -60 -62 14 -82 47 96 -13 5 83 34 -7 -156
7496 -156 43 63 19 117 -88 65 75 21 -62 44 -16 -116 93 18 -2 94 107 11 -63 -4 -83 57 13 45 38 -42 102
7523 102 21 -21 -52 -74 -44 7 1 9 12 -41 -24 22 -21 -102 111 -103 -27 6 22 -21 -54 11 -123 24 29 19 49 89 -8 -26
7553 -26 31 31 -82 -28 -100 -90 7 40 48 121 88 -4 -116 -47 50 -38 -6 0 138 -6 17 47 -67 15 -67 -78 -37 14 43
7582 43 -6 43 -2 -33 -62 -23 18 26 20 6 68 53 4 -29 51 -38 -95 -65 -70 25 90 -44 -15 -158 103 -90 -73 7 -33 108
7612 108 167 -119 90 -12 -70 -116 55 -97 62 38 -60 8 -9 -97 100 29 -30 11 -46 68 59 29 -47 -98 -30 62
7638 62 7 -2 2 150 -12 100 71 15 -102 -135 -25 -18 -81 74 25 -76 21 56 -39 5 -55 23 -13 61 14 14 15 59 -156
7667 -156 -30 30 -32 -40 37 -14 -4 18 -90 114 10 6 -2 -34 -78 -46 -171 20 56 86 -32 -56 -94 -4 40 43 63 -85
7695 -85 5 100 -14 -119 -48 63 -107 32 43 -17 129 9 81 13 -25 -46 48 -77 9 -33 -35 96 -30 -135 -70
7720 -70 -15 -55 -56 37 17 118 -3 88 -82 -111 -54 -35 -48 -62 -105 11 106 4 -24 -127 -46 7 -50 121 26 -86 127
7747 127 42 162 -82 -14 61 55 16 17 -51 139 47 122 -120 29 21 -49 -46 -123 88 21 63 -8 -33 -78 -46 57 26 75
7775 75 -29 100 87 -66 -191 -58 -60 16 40 -36 51 110 126 19 1 -62 30 -45 -33 93 50 103 51 -64 -106 -17 -66
7802 -66 -7 12 134 45 103 10 -22 11 -50 -49 71 -7 20 36 15 -28 15 -10 -47 34 11 38 4 25 -8 99 -85 -86 -87 47
7832 47 42 -36 -54 -33 29 37 -95 22 -17 11 33 -54 41 62 127 142 -1 44 -25 -41 -87 60 -53 -162 -17 54 17 -44
7860 -44 27 -39 -83 -66 -71 73 47 12 -87 34 -6 -18 -12 -61 13 -61 89 -47 -92 -25 41 50 -96 -48 39 -38 -17 20 -176
7889 -176 13 -31 -108 -97 3 -2 -106 17 13 -62 58 61 -8 88 32 -36 -7 -61 -56 43 21 -60 -108 73 -91 52 44 -137
7917 -137 40 95 3 -31 -198 0 -112 -36 -15 109 -49 74 11 54 -13 6 -38 -78 63 58 -13 -57 21 -24 37 57
7943 57 39 -41 58 84 -7 53 -61 3 86 -67 -32 -52 81 -10 33 -39 -33 85 -9 -75 -88 -28 -1 -30 -66 -36 42 15 44
7972 44 -37 10 47 51 17 29 -21 25 58 30 -52 48 -52 -48 -52 13 60 125 14 63 111 -12 21 11 4 -33 71 100 57 73
8002 73 -33 -36 -106 -40 -53 86 -84 27 14 30 94 -96 7 -67 -10 -5 115 82 -111 -33 -103 -122 -74 -46 -22 -57 60
8029 60 59 -5 -64 -38 -6 0 -45 -65 -55 18 38 13 -39 110 13 -39 -104 -34 -81 -10 121 -42 65 -113 -79 -69 -54 -24 28
8058 28 80 107 37 8 -25 -86 -34 -63 46 -8 49 55 7 120 199 69 -23 -64 1 -8 -9 32 -44 13 49 -21 -33 26 31 -40 40
8089 40 -62 61 0 -9 189 -31 12 34 95 61 -46 9 -119 45 -8 -20 -33 -76 44 -119 -6 7 77 71 -43 -110
8115 -110 87 -56 46 -37 -35 49 -34 41 -33 42 69 77 -3 5 -31 13 100 -24 -22 -11 -87 -89 12 15 55 15 15 -18 -15 -54 -75
8146 -75 -17 -5 78 55 -6 25 -55 65 -71 -29 -16 -169 59 62 47 54 95 91 -31 59 74 -25 -25 -14 -2 -105 17 73 -45
8175 -45 24 23 -3 -91 -71 -123 -38 115 -28 73 -95 -14 47 -149 3 19
8191A9
$$ Imaginary data points
##PAGE= N=2
##DATA TABLE= (X++(I..I)), XYDATA
0 0 0 0 0 0 0 0 0 0 0 0 0 0 0 0 0 0 0 0 -8 8 -8 8 -8 8 -10 16 -16 17 -24 24 -28 32 -37 41 -48 53 -58 65 -73 82
40 82 -90 102 -114 126 -139 155 -171 187 -205 227 -248 273 -303 335 -370 410 -453 507 -567 640
60 640 -723 831 -963 1140 -1381 1739 -2311 3398 -6187 30034 49140 -3322 -6533 -4043 -23991
75 -23991 -50795 -28471 9883 25633 21968 29123 27463 4187 -23529 -31354 -30829 -25305 -5997 21979
89 21979 33058 29056 23949 13474 -13955 -36186 -32915 -17988 -9704 4459 28919 38955 21640
102 21640 839 -8019 -18539 -34907 -33577 -6764 18278 24063 24152 28110 19802 -6875 -29950 -32147
116 -32147 -22268 -11421 1681 18155 29923 28947 14592 -6720 -22865 -26950 -22632 -15325 -1401
129 -1401 19391 33862 29283 11941 -2548 -12662 -24740 -31868 -21073 1631 17684 22639 23674
142 23674 20092 5005 -15746 -27416 -25179 -16051 -4342 10853 25759 29725 19869 3620 -10756
155 -10756 -21561 -27126 -22618 -8319 9330 22119 25690 19746 7703 -6249 -19218 -26659 -22665
168 -22665 -8096 8833 19893 23836 22245 13358 -3993 -21124 -26876 -20814 -11000 170 14485
181 14485 26027 24628 11350 -3372 -14038 -21432 -23536 -15206 1333 16581 23357 22142 15166
194 15166 2230 -13263 -23942 -24321 -16080 -3038 10898 21002 23163 17254 4556 -10308 -20847
207 -20847 -22557 -16069 -4950 8517 20148 24538 18605 5606 -8416 -18470 -23153 -20557 -9237
220 -9237 6621 18438 21967 18777 10039 -3395 -16919 -22813 -19094 -8868 3673 15217 22529
233 22529 21219 10999 -3202 -15158 -21676 -21441 -13261 365 13355 21029 21188 13529 905 -11926
247 -11926 -19842 -20635 -14212 -1573 11746 20290 20886 14514 3237 -10043 -20349 -22546 -15739 -4295
261 -4295 7848 18208 22430 17174 5094 -7184 -16482 -20822 -17394 -6356 7043 16912 20573 17564
275 17564 7890 -5743 -16971 -21388 -18317 -9257 3277 15511 21261 18602 9800 -1745 -13499
288 -13499 -20474 -18872 -9981 1775 12826 19817 19465 11013 -1235 -12755 -19864 -20021 -12880 -574
302 -574 11520 19070 19900 13784 2253 -9956 -18047 -19399 -13785 -2825 9338 17898 19366 14268
316 14268 3707 -8635 -18120 -20219 -15059 -5082 6883 16762 20468 15998 5961 -5453 -15135 -19724
330 -19724 -16541 -6622 5336 14551 18752 16791 7866 -4694 -14856 -19147 -17080 -9242 2646 13915
344 13915 19492 17319 9720 -926 -11741 -18758 -17843 -9952 1002 10998 17540 18064 11023 -505
358 -505 -11260 -17579 -17919 -12148 -1384 10293 17718 18328 12688 2804 -8479 -16563 -18484 -13004 -3163
373 -3163 7683 15575 17818 13592 3814 -7478 -15723 -18168 -14120 -4889 6176 14996 18303 15010
387 15010 6269 -4884 -13962 -17695 -14946 -6941 3575 13200 17460 15088 6835 -3255 -12223 -17267
401 -17267 -16203 -8169 2801 12035 16647 16092 9934 -756 -11349 -16882 -15642 -9505 -483 9429
415 9429 16259 16403 9730 70 -9092 -15392 -16392 -11339 -1274 8955 15550 16512 11554 2731 -7148
430 -7148 -14590 -16759 -12546 -3173 6698 13494 15523 12598 4637 -5951 -14311 -16031 -11951 -4840 4029
445 4029 12959 17339 13754 4876 -4072 -11182 -15469 -14684 -7109 3463 11824 14662 13105 7541 -1620
460 -1620 -10953 -15727 -13971 -7330 1698 9903 14891 14524 9272 -149 -9848 -15091 -13860 -8620 -1399
475 -1399 7295 14634 15569 8914 0 -7052 -12082 -14926 -11585 -1626 8660 13161 13226 10793 4379 -5970
491 -5970 -14095 -14862 -10194 -3641 4133 11709 15145 11706 3783 -4459 -11354 -14123 -11659 -4779 3354
506 3354 10550 15036 13061 4951 -3641 -9327 -12858 -13884 -8036 2864 11146 12569 11053 8219 754
521 754 -9847 -15197 -12094 -5698 -22 6469 13702 15068 7881 -1292 -7469 -11488 -13354 -9981 -1294
536 -1294 7322 12369 13009 9298 1912 -5905 -11434 -13299 -10376 -2756 6426 11842 12209 9634 4434 -4032
552 -4032 -12434 -14235 -9206 -3259 2447 9600 14499 11904 3584 -4067 -8825 -11960 -11834 -6102 3036
567 3036 10240 12491 10943 6048 -1267 -8978 -13177 -11983 -6607 1202 8444 11990 11476 7590 594
582 594 -8222 -12986 -11585 -6467 -800 5718 12003 13673 8174 -449 -6460 -9957 -12087 -10181 -2230
597 -2230 7013 11565 11139 8523 3497 -4397 -11211 -12653 -8802 -2669 4039 9982 12341 9945 3712
612 3712 -3818 -9928 -12306 -10040 -4147 2768 8834 12401 11036 4623 -3022 -8242 -11044 -11026 -6370 2033
628 2033 9079 11432 9863 6189 -141 -7764 -12518 -11205 -5640 471 6172 10993 11995 7226 -218
643 -218 -6676 -10373 -10957 -7626 -1131 5920 10625 11407 7796 1238 -5303 -10016 -11395 -8534 -2262 5087
659 5087 10073 11040 8206 3232 -3673 -9818 -11745 -8663 -2726 3100 8292 11418 9745 3747 -3424
674 -3424 -8583 -10699 -9497 -4922 2307 8509 11068 9318 4907 -1295 -7457 -10946 -9783 -5298 1016
689 1016 7157 10506 9886 5800 -428 -6655 -10427 -10250 -6216 -171 6056 9995 10365 6875 555 -5743
705 -5743 -9554 -10028 -7237 -1522 5275 9738 10056 7080 2009 -4167 -9127 -10565 -7795 -2223 3945 8572
721 8572 10265 8327 2939 -3427 -8154 -10085 -8385 -3591 2796 7820 10086 8590 3842 -2277 -7504
736 -7504 -9965 -8836 -4363 1593 7095 9852 9053 4765 -1120 -6436 -9669 -9159 -5148 559 5914 9493
752 9493 9336 5500 -92 -5464 -9096 -9444 -6045 -416 5250 8873 9411 6402 984 -4737 -8669 -9290
768 -9290 -6710 -1651 4156 8440 9329 6832 2041 -3592 -8043 -9507 -7112 -2504 2982 7609 9467
783 9467 7510 2869 -2753 -7201 -9140 -7884 -3534 2193 7050 8901 7777 3948 -1630 -6627 -9024
798 -9024 -7976 -4185 1001 5918 8979 8392 4586 -725 -5588 -8400 -8425 -5160 191 5402 8280 8455
814 8455 5576 485 -4929 -8208 -8388 -5668 -937 4280 7888 8571 5965 1276 -3861 -7673 -8519 -6312
830 -6312 -1761 3456 7275 8552 6606 2169 -3127 -6961 -8463 -6853 -2722 2456 6729 8302 7009
845 7009 3149 -1995 -6340 -8373 -7188 -3442 1490 5783 8123 7424 3767 -1098 -5629 -7982 -7508 -4324
861 -4324 618 5195 7867 7678 4564 -45 -4789 -7839 -7831 -4973 -231 4196 7338 7826 5162 812
877 812 -3929 -7230 -7738 -5446 -1240 3553 6998 7842 5700 1726 -3224 -6601 -7859 -6089 -2083 2705
893 2705 6447 7671 6148 2562 -2037 -6164 -7825 -6294 -2634 1813 5520 7633 6747 3223 -1592
908 -1592 -5438 -7337 -6622 -3727 905 5236 7321 6813 3854 -524 -4610 -7111 -7015 -4318 121 4552
924 4552 6909 6794 4458 502 -3878 -7041 -6918 -4631 -568 3463 6435 7286 5080 876 -3326 -6028
940 -6028 -6854 -5420 -1651 3138 6208 6950 5275 2052 -2276 -5815 -7122 -5673 -2081 2127 5471 6805
956 6805 5742 2734 -1609 -5377 -7059 -5949 -2659 1150 4635 6731 6328 3212 -1318 -4689 -6280
971 -6280 -6082 -3787 502 4637 6601 5954 3709 275 -3852 -6459 -6432 -3926 -173 3474 5946 6501
987 6501 4543 506 -3388 -5841 -6425 -4540 -891 2966 5748 6547 4912 1224 -2757 -5508 -6210 -5129
1003 -5129 -1953 2385 5592 6195 4785 2004 -1405 -5165 -6684 -5176 -1919 1589 4348 6230 5674
1018 5674 2676 -1457 -4534 -6050 -5495 -3019 782 4296 6147 5655 3053 -553 -4085 -5859 -5648 -3536
1034 -3536 10 3834 5973 5614 3426 500 -3056 -5831 -6073 -3735 -215 2882 5156 6062 4344 642
1050 642 -3026 -5080 -5447 -4359 -1564 2378 5272 5732 4287 1460 -1919 -4740 -5834 -4637 -1735 1800
1066 1800 4519 5834 4696 2023 -1235 -4281 -5779 -4947 -2179 1154 3830 5335 5250 2746 -1092 -4084
1082 -4084 -5220 -4912 -3159 178 3919 5582 4830 2957 -23 -3308 -5355 -5362 -3152 -50 2887 4908
1098 4908 5236 3543 541 -2831 -4856 -5285 -3722 -597 2415 4652 5218 4012 1011 -2329 -4471 -5006
1114 -5006 -3874 -1554 1936 4506 5272 3940 1418 -1269 -3996 -5344 -4348 -1617 1306 3670 4971
1129 4971 4560 2085 -1172 -3681 -4771 -4388 -2428 688 3457 4939 4519 2512 -413 -3158 -4710 -4517
1145 -4517 -2795 76 2989 4826 4589 2817 230 -2601 -4543 -4837 -3079 -319 2333 4326 4822 3425
1161 3425 655 -2254 -4179 -4544 -3537 -1078 1996 4247 4634 3411 1142 -1640 -3894 -4764 -3739 -1423
1177 -1423 1437 3659 4607 3866 1727 -1091 -3487 -4460 -3943 -1844 996 3225 4365 4066 2085 -642
1193 -642 -3223 -4316 -3862 -2266 339 2955 4294 4149 2493 -100 -2616 -4249 -4194 -2703 -201 2344
1209 2344 4045 4277 2873 215 -2260 -3840 -4131 -3016 -697 1954 3772 4276 3047 877 -1706 -3472
1225 -3472 -4261 -3356 -1052 1466 3403 4128 3307 1378 -1141 -3217 -4143 -3501 -1523 989 3136 4097 3623
1242 3623 1670 -674 -2840 -4023 -3553 -1919 448 2703 3915 3719 2056 -332 -2508 -3880 -3781 -2290
1258 -2290 40 2289 3770 3796 2480 200 -2190 -3690 -3744 -2529 -535 1777 3523 4003 2736 658
1274 658 -1612 -3312 -3793 -2836 -879 1473 3400 3687 2929 1076 -1168 -3115 -3702 -2901 -1226 1067 2884
1291 2884 3652 3198 1389 -927 -2840 -3612 -3074 -1744 722 2680 3602 3272 1755 -465 -2544 -3606
1307 -3606 -3309 -1949 256 2287 3333 3397 2113 116 -2135 -3363 -3310 -2218 -135 1915 3132 3444
1323 3444 2381 324 -1729 -3046 -3378 -2484 -477 1500 2906 3298 2541 834 -1381 -2855 -3320 -2630
1339 -2630 -852 1112 2574 3387 2629 1031 -956 -2552 -3317 -2811 -1336 677 2383 3271 2929 1437
1355 1437 -366 -2177 -3196 -2940 -1528 357 2106 3030 2918 1704 -123 -1912 -3105 -3004 -1829 -72
1371 -72 1705 2788 2986 1894 326 -1693 -2838 -2911 -2103 -358 1401 2669 2994 2129 460 -1235 -2731
1388 -2731 -3006 -2264 -696 1086 2577 2971 2193 919 -938 -2477 -2946 -2432 -983 708 2127 2854 2615
1405 2615 1125 -624 -2057 -2916 -2550 -1381 529 2070 2765 2574 1388 -231 -1834 -2657 -2669 -1596 226
1422 226 1680 2588 2517 1562 138 -1473 -2566 -2599 -1713 -286 1291 2533 2707 1847 271 -1171 -2306
1439 -2306 -2722 -1827 -312 1256 2222 2600 1940 585 -1017 -2275 -2690 -2124 -795 897 2032 2446 2054
1456 2054 982 -740 -1955 -2556 -2159 -1023 400 1857 2490 2226 902 -286 -1704 -2434 -2350 -1298 261
1473 261 1509 2374 2237 1349 -135 -1401 -2270 -2352 -1490 -62 1394 2089 2341 1498 293 -1274 -2179 -2288
1491 -2288 -1618 -395 1207 2200 2352 1666 509 -753 -2011 -2413 -1789 -552 749 1786 2270 1804 825
1508 825 -621 -1929 -2295 -1868 -919 563 1608 2076 1991 974 -423 -1502 -2217 -1916 -1035 225 1495
1525 1495 2161 2142 1172 -75 -1372 -2007 -1972 -1302 -7 1169 1933 2108 1389 89 -1229 -1968 -2029 -1452 -254
1544 -254 947 1901 2058 1426 363 -730 -1839 -2216 -1673 -400 814 1743 2083 1609 632 -600 -1574 -2110
1562 -2110 -1751 -774 557 1577 1953 1758 910 -346 -1346 -1884 -1714 -831 343 1248 1931 1787 1032 -12
1580 -12 -1226 -1886 -1960 -1046 113 1134 1690 1898 1174 55 -1015 -1702 -1710 -1182 -238 889 1731 1937 1338
1599 1338 286 -918 -1644 -1845 -1381 -386 631 1462 1812 1363 582 -498 -1421 -1819 -1443 -559 508 1468
1617 1468 1819 1620 620 -447 -1306 -1840 -1585 -770 370 1272 1541 1496 806 -128 -1142 -1644 -1673 -942 70
1636 70 1077 1639 1588 902 89 -880 -1670 -1683 -991 -107 927 1420 1544 1100 120 -754 -1434 -1608 -1182 -230
1656 -230 756 1426 1688 1270 394 -512 -1274 -1652 -1237 -431 624 1239 1392 1225 606 -393 -1120 -1484 -1321 -707
1676 -707 344 1064 1528 1301 634 -202 -969 -1479 -1385 -687 267 969 1398 1396 734 -58 -920 -1294 -1356 -890 -46
1697 -46 874 1350 1488 881 57 -677 -1170 -1329 -934 -179 564 1202 1421 1050 269 -516 -1233 -1277 -976 -327 502
1718 502 1033 1303 1056 419 -311 -1174 -1350 -1085 -488 311 895 1351 1196 560 -211 -780 -1270 -977 -602 152
1738 152 885 1225 1111 624 -63 -760 -1374 -1183 -766 3 672 1075 1171 835 86 -577 -1158 -1169 -790 -147 444
1759 444 970 1189 754 236 -476 -1004 -1104 -811 -328 411 910 1126 951 340 -345 -860 -1094 -1001 -405 326
1779 326 781 1137 1049 500 -253 -739 -1055 -1009 -541 10 776 1052 1037 515 -90 -632 -1098 -1042 -651 -31 634
1800 634 898 1022 630 64 -580 -920 -963 -705 -109 449 869 960 821 234 -360 -892 -1022 -919 -297 465 838
1821 838 1076 846 280 -297 -686 -955 -837 -309 180 757 976 854 308 -139 -582 -943 -863 -450 106 538
1841 538 1016 789 518 103 -565 -882 -882 -514 -137 535 775 791 511 175 -390 -774 -826 -647 -163 442 832
1862 832 892 629 206 -237 -771 -848 -630 -200 272 748 897 700 321 -224 -593 -818 -846 -397 112 567 781
1883 781 666 449 -125 -594 -889 -645 -470 -39 436 711 749 444 -71 -457 -793 -737 -445 -1 367 716 829
1904 829 572 43 -322 -665 -873 -534 -159 381 709 757 541 204 -340 -633 -735 -609 -213 230 589 756
1924 756 640 305 -106 -562 -739 -630 -339 148 480 606 608 318 38 -426 -766 -645 -380 104 405 642 658
1945 658 371 7 -462 -640 -563 -308 28 392 538 554 512 95 -327 -613 -705 -383 -169 211 582 668 437 146
1967 146 -345 -419 -559 -529 -281 174 524 643 538 284 -84 -412 -612 -505 -225 -22 424 662 549 262 8
1988 8 -390 -461 -501 -385 -21 354 509 573 364 180 -378 -437 -486 -351 -58 282 531 540 287 185 -202 -466 -421
2011 -421 -315 -132 135 435 650 421 160 -121 -548 -458 -481 -204 104 445 471 468 310 -2 -488 -342 -498 -236
2033 -236 95 384 523 507 207 37 -362 -534 -551 -373 -195 237 469 345 295 201 -274 -348 -362 -476 -1 135
2055 135 428 400 312 77 -212 -421 -584 -470 -137 73 386 380 395 143 -36 -312 -403 -360 -245 57 379 388 420
2078 420 248 91 -267 -389 -363 -286 14 224 288 522 423 216 -286 -326 -310 -235 -59 136 504 342 115 82 -97
2101 -97 -380 -249 -365 -153 163 313 431 301 169 -101 -246 -518 -357 -78 90 387 474 303 276 22 -347
2122 -347 -398 -438 -289 -112 256 275 431 310 38 -203 -386 -325 -328 -86 90 237 407 168 111 -152 -407 -467 -283
2145 -283 -122 205 323 431 329 185 49 -306 -433 -338 -127 121 265 348 378 122 26 -364 -312 -346 -379 47
2167 47 136 451 262 303 -36 -273 -341 -421 -356 -59 195 289 349 243 14 -185 -289 -407 -393 -199 71 273 388
2190 388 373 127 -103 -266 -476 -340 -60 64 328 390 319 228 -77 -298 -357 -322 -267 -104 264 327 299 221 14
2213 14 -296 -470 -338 -211 3 128 341 290 224 115 -139 -377 -317 -305 -130 176 266 396 266 174 -74 -298
2235 -298 -377 -217 -101 120 364 336 306 173 -68 -226 -378 -405 -176 -25 242 376 326 176 47 -143 -285 -300
2257 -300 -78 -128 180 275 372 199 144 -217 -306 -238 -270 -174 191 310 254 294 18 -76 -259 -408 -308 -61 133 274
2281 274 312 300 198 5 -254 -318 -232 -252 74 267 206 367 195 -14 -199 -301 -373 -296 -68 299 289 342 279 73
2305 73 -171 -309 -326 -269 -207 126 242 302 243 142 -66 -303 -405 -240 13 29 291 428 202 103 -68 -103 -263
2328 -263 -232 1 -94 244 285 356 152 52 -361 -256 -457 -176 50 276 427 144 281 0 -178 -341 -397 -236
2350 -236 61 56 269 318 245 50 -263 -297 -332 -155 -43 174 324 373 213 177 -34 -347 -486 -333 -125 83 253
2373 253 368 399 169 104 -232 -294 -362 -202 15 116 370 204 164 -76 -205 -284 -341 -225 59 219 357 326 178
2396 178 20 -99 -347 -262 -254 -176 40 309 326 243 169 -146 -313 -403 -264 -56 -36 270 340 277 145 -68 -297 -239
2420 -239 -322 -131 28 260 435 346 139 -77 -176 -362 -400 -319 -53 53 305 348 229 65 -222 -385 -353 -338 -65
2443 -65 110 320 410 288 107 -115 -251 -321 -157 -103 137 352 376 277 164 -53 -272 -347 -213 -64 -61 192 254
2466 254 207 87 -104 -294 -303 -382 -154 1 246 271 286 188 -112 -204 -297 -363 -233 -41 173 242 254 239 29 -71
2490 -71 -332 -421 -165 -74 195 346 330 261 112 -19 -241 -399 -389 -52 14 220 396 290 101 -93 -307 -286 -320
2513 -320 -201 40 241 390 327 257 -31 -154 -383 -280 -159 -36 215 389 408 247 -79 -209 -425 -356 -230
2534 -230 -15 138 284 420 217 158 -72 -303 -335 -335 -178 56 321 434 281 18 -177 -292 -398 -278 -82
2555 -82 123 241 364 247 120 -111 -235 -307 -321 -289 125 228 439 334 205 -160 -303 -318 -431 -268 25 263
2577 263 405 353 155 -1 -246 -471 -376 -82 -7 248 255 419 213 10 -225 -331 -352 -231 -8 79 363 330 264
2600 264 85 -75 -269 -251 -402 -131 71 294 308 185 165 -65 -310 -349 -315 -240 10 148 431 291 241 0
2622 0 -356 -341 -262 -196 1 217 254 289 273 100 -196 -436 -341 -127 -27 191 304 288 369 194 -57 -269 -302 -165
2646 -165 -33 176 342 296 307 -5 -121 -245 -472 -332 -136 91 119 302 274 99 111 -177 -405 -360 -186 48
2668 48 174 338 378 87 -58 -230 -277 -320 -176 104 229 256 376 210 -51 -233 -318 -314 -265 3 120 308 289
2691 289 225 30 -151 -385 -332 -244 -82 138 300 390 345 76 -42 -289 -270 -373 -72 45 169 432 199 149
2713 149 -53 -214 -272 -292 -229 74 164 196 358 231 -126 -225 -371 -445 -231 8 192 290 378 268 21 -241 -256
2736 -256 -320 -320 -56 270 260 236 286 59 -28 -255 -443 -239 -27 109 272 444 209 150 -134 -207 -343 -242 -82
2759 -82 38 257 402 304 135 -49 -324 -282 -303 -200 76 256 252 370 151 -16 -313 -344 -289 -170 -58 200 313
2782 313 320 123 123 -138 -226 -308 -171 -106 133 389 357 228 40 -198 -212 -349 -237 -78 123 351 442 422 181 -94
2806 -94 -333 -375 -302 -165 75 211 282 273 50 -87 -231 -428 -401 -198 -44 274 367 349 210 17 -148 -296 -334
2829 -334 -271 -68 245 348 333 210 -31 -83 -305 -241 -166 23 170 233 195 185 36 -83 -267 -375 -215 -175 41
2852 41 379 404 61 84 -21 -273 -316 -264 -159 142 225 282 172 139 -200 -315 -332 -255 -159 84 237 396 383 209
2876 209 6 -96 -241 -314 -198 -14 238 374 342 241 22 -258 -349 -275 -256 -63 119 239 350 264 153 -61
2898 -61 -384 -346 -204 51 96 276 390 261 204 -58 -357 -295 -284 19 -9 228 263 240 167 -56 -96 -277 -212 -182
2922 -182 54 116 286 248 212 -89 -193 -311 -299 -259 -51 130 248 160 133 2 -135 -277 -332 -206 -146 99 311
2945 311 300 236 128 -129 -237 -337 -218 53 147 286 267 301 93 -15 -198 -216 -184 -39 145 256 358 153
2967 153 2 -124 -108 -284 -280 -163 39 186 267 263 89 -56 -222 -325 -289 -271 -87 156 254 289 45 -20 -192 -262
2991 -262 -336 -267 89 21 215 231 230 -8 -159 -349 -313 -170 -56 173 248 256 308 29 -78 -371 -321 -167 35 96
3015 96 85 334 197 52 -106 -153 -367 -268 -110 17 232 371 223 75 -25 -166 -234 -222 -140 8 333 209
3037 209 254 221 16 -137 -155 -402 -187 6 224 241 302 150 -70 -258 -296 -192 -60 48 124 273 300 241 -39
3060 -39 -127 -219 -407 -258 -26 108 191 292 240 24 -82 -190 -257 -145 -49 101 274 336 243 188 -49 -115 -316 -272
3084 -272 19 -14 278 490 253 133 -81 -177 -248 -302 -195 59 48 200 346 171 -80 -129 -245 -249 -135 -28 172
3107 172 297 255 307 -12 -157 -373 -312 -121 -143 47 179 262 255 146 -150 -311 -226 -132 -79 142 181 140 200 96
3131 96 -130 -202 -189 -148 -138 65 108 263 192 56 -44 -259 -355 -204 -66 82 145 208 270 131 -22 -256 -335 -266
3155 -266 -116 -23 93 178 290 190 175 -53 -252 -244 -178 -77 161 191 241 374 95 -60 -228 -200 -83 -10 191
3178 191 154 241 141 107 -107 -282 -198 -279 -174 -23 165 247 227 94 -40 -187 -246 -145 -185 -13 155 260 207
3201 207 53 -75 -161 -169 -328 -14 30 170 233 241 148 46 -232 -301 -204 -105 -10 213 285 236 86 -112 3 -233 -304
3226 -304 -234 -166 114 223 353 120 -14 -133 -219 -327 -231 -102 51 155 272 60 85 -17 -205 -283 -177 -46
3248 -46 47 46 217 317 179 -79 -273 -154 -262 -176 -44 229 273 220 77 34 -228 -107 -171 -261 -72 140 197 154
3272 154 107 42 -92 -181 -211 -205 39 139 273 277 194 128 -45 -274 -292 -112 -50 92 165 300 147 129 -171 -217 -241
3297 -241 -194 -97 139 159 279 186 67 -85 -185 -132 -222 -166 -23 155 372 318 146 -75 -95 -238 -214 -42 12 85
3321 85 281 148 124 -8 -129 -132 -262 -180 9 159 200 266 190 98 19 -277 -309 -138 -51 70 171 210 196 87 -69
3346 -69 -92 -311 -113 -154 80 176 160 121 100 18 -180 -257 -215 -114 28 286 195 226 59 -20 -152 -202 -190 -127 -39 221
3372 221 321 160 97 -108 -286 -184 -161 -121 115 34 267 133 218 42 -51 -264 -214 -288 -126 146 165 91 149 62
3396 62 -107 -223 -140 -153 -102 19 -4 210 204 71 6 -175 -291 -171 -93 59 203 286 103 -18 -54 -136 -215 -51
3420 -51 -198 74 161 193 138 171 -136 -41 -197 -225 -232 20 159 141 259 50 124 -109 -225 -264 -104 -59 181 190 242
3445 242 134 -79 -134 -113 -273 -234 21 157 147 224 203 37 -81 -106 -279 -295 -73 7 200 171 274 56 -32 -18
3469 -18 -167 -145 -146 34 265 230 16 69 -131 -192 -189 -232 -76 81 25 253 222 109 -16 -92 -285 -137 -141 -108 133
3494 133 193 129 136 47 -145 -163 -210 -128 55 199 103 233 116 91 6 -77 -172 -194 -21 99 102 179 180 85 -206 16 -37
3521 -37 -188 -129 23 204 160 79 10 -14 -103 -236 -244 -115 -72 134 324 166 21 -58 -191 -200 -175 -39 39 30 204 202
3547 202 226 166 7 -160 -121 -141 -38 18 256 146 185 149 -136 -128 -161 -145 -88 39 205 165 200 151 -1 -203 -169
3572 -169 -144 -90 93 59 194 261 38 -16 -61 -158 -81 -140 97 5 78 211 47 -19 -71 -137 -148 -133 -34 141 80 156
3598 156 131 -2 -173 -293 -176 -155 -88 -26 136 264 274 57 -42 -206 -186 -201 -203 59 140 262 218 73 -26 -7 -174
3623 -174 -107 -62 -71 133 228 178 46 69 -138 -284 -147 -85 76 140 260 123 193 18 -132 -207 -68 -17 107 112 252
3648 252 179 159 3 -164 -43 -100 -166 -114 52 173 226 106 -8 -260 -212 -147 -9 32 -28 59 136 115 112 -7 -88
3673 -88 -163 -109 -32 109 133 245 161 5 -52 -120 -227 -71 -72 -29 77 250 155 45 -37 -152 -161 -93 -93 74 19 207
3699 207 54 54 -42 -99 -158 -183 -95 -22 57 168 203 145 53 -6 -185 -276 -201 3 -14 102 175 120 -21 -79 -71 -148 -87 -48
3727 -48 0 231 109 23 69 -93 -46 -198 -201 -69 110 10 110 55 107 -80 -137 -129 -128 -81 -77 150 182 145 56 9 -70
3754 -70 -116 -283 -124 -19 106 85 147 182 -8 -80 -99 -179 -52 -10 67 90 147 57 -47 -63 -157 -66 -163 -16 -28 101
3780 101 137 194 109 -71 -136 -153 -88 -118 106 67 256 210 148 83 -151 -142 -87 -56 -8 82 86 176 165 143 15 -163 -127 -62
3808 -62 44 142 238 113 144 4 -127 -203 -155 -51 -44 -37 124 142 117 88 -34 -72 -120 -119 -7 62 67 108 131 121 89 -208
3836 -208 -122 -102 54 38 133 78 94 125 -106 -130 -197 -145 -169 89 134 196 204 92 10 -128 -99 -16 -101 -16 11 106 108 -41
3864 -41 46 -146 -78 -94 -104 100 139 -10 36 116 107 -63 -123 -52 -139 36 36 212 191 110 162 7 -130 -43 -88 -13 74
3891 74 120 107 154 120 -61 11 -154 -101 -133 24 20 23 194 54 4 -143 -195 -105 -135 -35 107 100 174 86 70 -160 -92
3918 -92 -50 -49 -86 17 237 81 162 38 -55 -75 -106 -105 -22 -59 127 171 171 54 -5 -269 -184 -82 -96 77 104 125 119 -27
3946 -27 -17 -176 -82 -78 19 -177 90 108 146 -7 72 -18 -265 -184 -57 -38 28 120 269 117 69 -25 -180 -79 -52 98
3972 98 110 186 103 97 -66 13 -168 -166 -141 -1 -16 39 243 83 28 -34 -119 -183 -55 13 23 52 191 204 13 -246 -184
3999 -184 -239 -65 -84 30 148 84 266 80 -41 8 -122 30 -19 30 14 199 164 118 81 -30 -128 -125 -69 -47 96
4024 96 119 162 210 -44 -163 -99 -156 -106 6 45 119 149 52 16 -54 -110 -225 -106 -11 104 165 237 3 -21 102 -77
4050 -77 -157 -121 -37 107 115 82 106 0 -88 -89 -154 -88 44 -56 82 158 9 127 37 -103 -75 -64 -74 67 131 132 124 13
4078 13 -40 23 -47 -179 -118 35 86 -77 91 14 -47 77 -107 -207 -137 -103 165 116 79 71 3 37 -97 -108 -64 -113
4104 -113 159 -5 79 122 73 -78 -217 -76 -213 -30 -30 18 98 134 19 -153 -62 -143 -216 32 -37 104 157 153 162 47
4130 47 12 -70 -37 7 -37 92 122 5 182 103 -103 -51 -58 26 73 55 129 162 155 25 -44 44 -41 -148 -46 32 90 55
4158 55 90 22 -105 -123 -21 -188 -53 99 25 81 108 33 -57 74 34 -77 -77 87 76 186 63 174 77 -6 -151
4183 -151 -160 45 -36 136 133 95 53 128 -67 -135 -135 -79 -54 -108 59 168 81 159 20 -161 -103 0 -12 49 68 137 171
4210 171 27 -13 14 -88 -79 -24 77 65 192 141 -85 4 6 -194 -60 -105 64 111 197 86 17 -73 -78 -123 -143 -60 -15
4237 -15 74 207 65 -4 -156 15 -18 -82 19 14 93 159 29 94 -40 -91 -86 -83 -29 21 21 97 48 121 5 6 -131 -91
4265 -91 23 49 -46 162 165 121 124 -98 -105 -15 -61 -3 85 -26 95 97 64 16 -152 -127 -131 -16 66 91 95 140 55 -88 -101
4294 -101 52 -29 35 -41 86 227 175 77 -55 28 -15 -153 -131 73 15 62 7 80 49 1 -17 -103 -69 -53 45 78 193
4321 193 65 72 -46 -77 -115 -128 -58 47 166 162 75 166 -96 -75 -101 -11 -52 126 69 121 12 -108 36 -186 -96 -50
4347 -50 -105 -27 9 141 9 62 104 -66 -113 -151 5 63 80 145 71 -16 37 -26 -198 -57 -158 -59 176 134 136 56 -29
4374 -29 -79 -37 -127 -174 2 -17 15 152 -31 79 -30 13 -137 -194 -89 26 97 181 235 -37 49 -171 -117 -30 -194
4399 -194 66 155 127 29 29 100 -66 -8 -52 -164 26 40 33 76 147 18 -110 -166 -64 -92 1 -31 52 174 46 50 43
4426 43 24 -51 -4 -14 -11 192 83 50 76 -14 -96 -45 -94 8 -81 42 98 48 14 -25 -64 -30 -166 10 56 -5 101
4453 101 60 23 66 -102 -2 -67 -106 -6 50 123 62 29 -2 8 -30 -29 -100 -48 159 115 167 1 -70 -10 -26 -34 -142 -79
4481 -79 158 -38 55 218 -109 -38 7 -28 -58 7 54 41 -33 33 -67 -52 -127 -72 -110 -125 -57 -12 255 88 -25 -48
4507 -48 -5 -57 -14 -17 -86 72 102 33 47 -133 2 -176 -114 18 2 1 199 40 -66 17 -33 6 -174 -39 -47 28 94
4534 94 17 -12 -56 -123 7 -140 20 46 -60 32 42 86 61 47 -2 -73 -7 -119 24 70 74 89 38 12 -74 -89 -97 -43
4562 -43 -46 49 43 42 77 -41 -68 -78 -99 -72 -72 76 65 104 49 74 -33 -128 -128 -128 -97 26 159 110 -22 -46 -111 -82 -91 -98 -36
4593 -36 55 83 121 19 121 -41 -68 -111 -187 -16 -22 97 72 97 6 -69 -246 -66 -88 7 -64 61 21 99 44 -88
4619 -88 -162 -153 -77 -163 36 18 -70 126 11 1 -12 -90 -120 -31 28 9 92 49 -23 24 7 26 -83 45 -2 -73 91 29
4647 29 21 -54 -114 -141 -42 -57 -9 87 71 -36 -15 92 -28 -76 7 -38 43 -50 34 70 15 9 -13 -62 -152 -89 -81 -97 103 38
4677 38 175 60 -49 -76 -11 -53 -67 -71 13 91 -16 42 43 -40 -88 -159 -69 29 50 109 51 88 -64 -133 -152 -143 -88 -153 -51
4706 -51 -10 89 43 75 -30 -240 0 -35 2 80 -16 108 75 112 117 -49 -3 -146 1 86 87 -31 43 78 -34 23 -129
4733 -129 -160 51 28 91 135 29 15 21 -111 -131 -29 26 -1 40 67 52 27 34 -82 -73 31 -181 6 21 -2 80 -16
4760 -16 -21 25 65 -59 -38 14 90 22 98 192 -46 -62 -89 -130 -60 88 12 106 69 24 119 51 -10 -151 -78 -112 -10 112
4788 112 174 126 62 77 -61 -30 -113 22 37 1 4 127 -8 -81 -15 -42 -131 -13 96 47 -28 221 33 -43 -89 -66
4814 -66 -42 -152 104 102 164 1 -52 15 85 -91 -25 20 -117 170 133 255 11 -6 65 -130 -124 -105 24 14 126 62
4840 62 156 -14 13 -63 -45 99 -20 10 57 190 78 -6 24 -53 -88 -88 -51 28 62 70 -115 26 41 -36 -79 -100 -14 -37
4868 -37 80 123 70 -13 -51 -39 -62 -23 -14 -56 -35 69 10 7 29 -79 76 -56 60 -87 -76 59 70 44 116 57 -49
4895 -49 -120 71 -37 59 61 10 66 79 -11 -39 -26 -192 -35 24 45 95 41 18 -54 -90 -174 -159 23 -21 59 126 47 65
4923 65 4 -52 -79 -56 -22 64 50 112 96 22 93 -45 25 -20 -76 41 46 57 54 106 -22 -56 -82 -59 -31 -104 -13 132 1
4952 1 62 -29 -27 -75 -71 -91 -30 59 118 100 -97 43 22 -100 -91 -50 55 -62 65 60 -35 93 -20 -22 -95 -14 -98 36 22
4981 22 -11 46 63 11 13 -70 -35 -64 -20 90 98 20 -84 11 -89 -51 -97 -33 56 20 -8 85 31 -75 -44 -32 -166 -69 -36
5010 -36 63 104 140 83 209 -10 19 -132 0 117 21 67 90 -22 -96 -2 71 32 -138 66 135 9 -2 12 -91
5035 -91 35 51 -185 -158 -30 56 34 157 36 41 90 75 38 -102 21 -31 15 63 137 32 -27 -20 -27 -3 -67 -8 -17 87
5063 87 150 73 58 -28 -91 -24 -52 65 -88 96 -33 77 99 19 -79 -145 11 17 -1 25 213 9 -33 107 3 -112
5089 -112 -170 -31 -5 71 140 59 89 -127 -29 53 -92 -96 -58 31 18 90 102 98 14 -120 -87 -34 -52 84 139 59 -73 -31
5117 -31 -35 -92 36 -99 -56 -13 49 1 39 -47 -62 73 -59 0 -66 -78 121 67 -51 11 47 -53 -122 -60 39 12 153
5144 153 57 10 41 107 28 -66 -153 -38 -49 8 -18 47 -72 45 -50 1 -50 -94 77 118 -3 56 20 13 -184 -30 -140
5171 -140 46 81 -2 137 137 29 -43 -113 -24 36 -170 -71 67 48 38 99 50 -46 -13 -97 -121 27 -33 -42 11 -1 -1 70
5199 70 -68 -27 -84 72 -87 -101 13 103 -14 -24 -44 -98 -80 18 66 -18 144 167 61 98 -134 -108 -118 -79 -19 43
5225 43 115 86 -9 23 -82 -89 -90 -74 -39 15 12 99 -50 12 -16 -104 -65 -115 -24 -26 79 86 30 63 32 -139 -138 -82 78 4 0
5256 0 -7 71 -33 54 67 -106 -57 -61 97 114 80 113 62 -105 -25 24 -101 32 -4 94 55 92 88 56 -34 -152 -69 -78 63
5285 63 -58 8 32 24 -18 22 -2 -129 64 -67 38 -11 84 67 21 26 -67 -124 -78 -47 139 116 74 119 69 47 -104 -79
5313 -79 -67 29 -35 58 70 89 -35 21 -39 -116 -110 -29 55 5 144 119 109 49 54 -46 -119 5 5 64 -48 13 43 -24 -81
5342 -81 -112 -76 -66 -13 96 -1 26 33 56 -56 -8 -106 -27 63 68 189 135 79 82 -82 -137 -59 -47 -45 -17 175 16 10 81 -45
5372 -45 14 -74 -193 -12 20 42 154 -25 54 -35 -165 -89 -135 63 -56 156 98 150 -6 -15 -62 71 -46 -137 -59
5397 -59 165 13 87 102 35 34 -60 -37 -48 97 20 38 40 26 8 -67 -131 -74 -51 88 -68 -25 20 44 95 -131 1 -137
5425 -137 -51 -118 103 112 156 15 -31 -57 -81 -131 -21 7 16 91 28 96 48 133 -176 -65 -58 -110 -6 153 90 13 9 47
5453 47 -164 -48 -29 -55 -56 -11 63 137 21 -30 -48 -97 -66 -31 41 -1 277 126 -6 67 -31 -63 -115 -26 -42 58 75
5480 75 84 36 16 15 -89 2 -50 -59 94 57 97 127 121 22 -30 37 -16 -83 -134 74 22 44 56 -23 -149 -147 -84 -152 -89 27
5510 27 25 115 30 1 -1 15 -1 -7 -21 45 17 202 75 19 31 -9 -79 -49 -86 -64 19 57 69 67 0 -113 -117 -54 -96 25 88
5541 88 147 19 16 19 -39 -103 -89 72 -12 75 150 15 35 27 65 -91 -35 -8 54 83 37 78 80 29 -91 -80 -2 -37 -35 -52
5571 -52 11 207 64 39 -10 -47 -111 -17 -54 -29 51 190 84 -9 -88 25 -16 -29 -68 85 94 70 58 23 -111 -81 -34
5598 -34 -128 -25 37 -12 184 13 26 1 46 -2 -39 -31 141 136 117 119 -57 10 30 -123 -84 -46 -153 51 -23 -3 -109
5625 -109 -62 -2 70 -64 25 10 109 129 -113 47 42 56 43 -26 -31 -168 32 46 -31 73 -53 58 -22 -151 -20 -23
5651 -23 34 97 14 123 -92 -38 -93 -50 -120 -95 -20 -19 36 -42 19 -56 -44 -114 -38 83 101 4 34 113 100 -18 7 -81 -57
5680 -57 25 -105 102 32 136 70 122 -8 -59 -68 -67 -45 70 155 164 74 68 -111 -23 -45 -47 -26 105 96 127 -25 0 123 -14
5709 -14 -50 -134 -97 -40 25 28 31 102 18 56 -116 66 -66 9 99 67 29 15 144 -127 -207 -66 -66 19 72 161 119 21 59
5738 59 15 -54 -6 -126 7 166 94 -3 -28 102 101 -22 -21 -96 -21 41 87 98 59 -30 21 -60 -39 -110 -102 83 60 114 71
5767 71 21 20 35 89 -41 66 113 -58 210 82 50 -30 65 -92 -30 5 -45 136 -30 -66 62 -2 -76 8 -161 -127
5793 -127 -44 8 6 -5 91 8 -57 -56 -58 -98 -32 31 88 178 113 11 43 -39 -93 -53 -21 -7 115 75 79 54 -94 -98 -130 -87 68
5824 68 2 -15 171 -10 -48 -166 -31 -92 -152 -14 -80 25 143 98 19 32 -53 -95 -76 -8 -23 -46 105 138 4 -55
5850 -55 90 -17 -145 -58 21 10 85 13 62 24 -184 -24 -30 12 4 85 -12 162 17 50 22 -117 -102 -120 64 10 86
5877 86 122 43 -11 30 -104 -48 -18 87 -69 30 126 50 -67 36 -13 16 -168 -56 1 123 104 123 -38 22 2 -120
5903 -120 -59 -67 8 16 121 135 72 -33 3 0 -38 46 -53 -54 -22 43 100 26 91 -69 -135 -88 16 -63 83 22 144 14
5931 14 -54 -117 -9 123 -103 -23 -37 132 29 103 41 17 -34 -46 -87 -27 -24 67 -59 25 44 -90 40 -42 -8 44 -31
5958 -31 139 127 113 35 94 32 -54 -33 8 -83 3 86 12 66 2 25 -105 -41 51 -39 37 64 -64 -57 -40 -74 -26 -13 14
5987 14 1 -7 126 -63 77 -35 7 -20 22 -68 41 50 18 53 114 14 -72 -148 -16 -31 -112 124 -87 112 6 81
6013 81 34 14 -46 -37 -16 49 44 50 3 61 33 -1 -79 -133 52 32 7 69 132 25 -26 -49 -137 -106 -14 -163 87 76 -19 -8
6043 -8 -24 -85 -42 -83 -108 27 8 91 70 15 -143 -62 -74 -108 29 -37 -2 42 150 41 -16 -54 -85 15 -24 15 12 121
6071 121 107 28 22 -41 -170 -101 22 69 30 9 -41 32 -54 -84 -113 -124 15 27 3 54 67 26 -45 -63 -4 -54 -173 -63
6099 -63 40 71 44 104 103 34 -87 -65 -102 70 -32 96 160 148 6 -13 79 -87 -41 31 -177 -72 73 68 36 37 -57
6126 -57 -154 -84 -7 -118 70 122 25 -7 -13 -112 -73 61 -46 -131 -39 33 40 146 102 -52 -87 -58 14 38 -91 7 60 169
6154 169 -57 49 32 7 -137 -21 60 -7 121 108 81 -16 -35 44 -67 -21 29 -3 94 126 49 1 -32 -29 -143 -75 -55
6181 -55 40 65 45 84 -58 95 16 -130 -21 44 15 101 78 -12 -3 -15 -77 173 89 -58 -42 91 102 74 1 -59 -80
6208 -80 -58 -184 -17 -53 3 -87 14 120 -19 -82 -110 19 -15 -18 -13 63 29 44 6 46 -156 -20 -14 -26 36 147 144 88
6236 88 -107 67 62 -50 -33 -103 129 -46 17 129 124 6 -119 -61 18 -68 -5 -5 20 27 156 61 -11 -56 -19 -3 -77 160
6264 160 2 103 -80 -95 -15 -59 -16 -67 -3 66 -13 70 -16 23 -63 -100 4 -65 118 -1 91 41 195 1 -53 -38
6290 -38 -57 -35 -49 -48 91 84 120 -31 40 -60 -13 13 -86 96 -13 181 23 -69 -2 38 14 -40 -130 124 96 -21 187
6317 187 99 17 -19 -55 -117 24 -15 67 38 84 -74 63 -39 -18 -85 -31 -77 61 114 141 65 37 -68 -107 -58 -34 42
6344 42 -130 77 68 90 61 18 -82 25 -89 -100 61 115 87 162 -31 -30 -3 -87 12 -40 29 39 88 85 -93 -40 -32 -116
6372 -116 39 -123 -65 7 2 -89 95 -23 -60 -40 -87 60 0 -21 109 69 0 -26 34 -62 -74 -7 -73 13 16 7 -4 -27
6400 -27 -102 -2 -69 45 25 -26 -37 95 29 29 -120 -16 -55 -116 51 -72 8 -77 30 -23 0 -89 -163 -28 70 6
6426 6 -63 51 -27 -44 55 -2 -92 -184 30 -10 -39 50 109 114 -19 42 -22 0 3 -32 -21 63 41 17 35 -67 -121 -36 19 -34
6456 -34 59 46 140 94 69 -5 -120 -24 -25 -67 6 66 66 30 -74 15 -75 -66 -2 2 4 -3 8 70 -103 -51 52 58 -21 -85 59
6487 59 37 -54 148 -64 39 -45 -35 -50 49 -8 53 18 90 133 -32 30 -55 -96 -34 75 -113 19 -8 25 -10 -5 -19
6514 -19 -93 -2 -46 93 19 18 127 11 140 19 -7 5 -72 24 73 51 148 143 -95 -20 -40 -100 27 30 108 -2 -5 4 -30
6543 -30 -120 28 -48 -66 -87 66 49 48 89 -33 -2 -108 -105 35 -21 99 52 152 -6 -8 -54 -75 -63 -182 -32 -60 84
6570 84 144 -35 136 -46 -112 -43 31 143 16 8 22 123 53 -1 -69 57 -152 9 -7 32 33 42 34 -134 -28 -34 -119
6597 -119 -62 -57 -48 106 53 88 -25 -98 -40 -65 -19 9 51 18 -26 85 -57 -92 -116 -69 -31 -50 87 23 -11 54 33 -65
6625 -65 -64 -31 -31 -28 49 80 108 -21 9 -27 -99 -25 -102 -68 -87 -18 94 43 -33 -55 27 -101 -23 -101 -14 73 89 109 -13 74
6655 74 27 -13 -22 -59 50 4 6 -99 23 54 -51 -20 -63 -84 -1 -34 -25 13 3 16 8 3 18 11 -78 -57 -70 143 101 83 -10
6686 -10 -102 -51 -87 -18 -18 0 18 83 16 19 5 72 -104 -12 32 -14 161 153 83 -1 -13 19 -128 -227 -18 94 -25 111
6714 111 23 31 -54 -98 4 2 74 131 -28 60 136 90 -17 -63 -105 -44 -105 25 137 134 -9 96 -38 -27 68 9 54
6741 54 125 39 91 57 8 21 38 -79 -19 -73 55 118 -56 29 16 -11 -53 -54 -47 -35 1 35 57 -57 40 86 -5 -65 -43
6770 -43 -44 88 63 112 -63 81 36 -50 -123 67 39 -7 69 -1 89 115 -14 13 90 -34 -60 -15 -39 172 28 73 -32
6797 -32 24 28 -69 -64 -19 -8 10 36 -56 23 -60 -123 21 -102 -75 -102 -90 39 62 -35 73 -54 -32 0 -96 29 19 -30
6825 -30 124 -49 -34 105 -22 23 -80 -4 50 161 50 39 -14 -70 -46 -34 -162 -43 -40 13 -102 -42 20 -24 -141
6850 -141 -86 -9 -107 0 83 24 62 36 71 -42 -26 83 68 -96 -7 -60 -14 -44 -11 35 78 -69 -38 4 90 91 68 -88
6878 -88 18 11 -15 -92 -18 -96 -133 60 -98 -92 -20 -37 -121 -81 -24 -3 34 29 91 22 32 -1 -37 -15 -30 99 -97 -47 114
6907 114 46 23 -53 -1 -19 -47 -37 -17 58 128 47 53 80 34 -79 -5 -114 -41 109 -22 118 -88 11 -51 -66 -62 -53 -99
6935 -99 -81 -8 77 21 76 79 37 -157 -41 -1 -40 -52 46 44 38 2 -57 -7 32 -60 -35 -54 10 48 21 4 7 47 -48 -42 -36 -72
6967 -72 -97 14 0 3 -126 -65 -35 36 -73 -1 33 19 30 16 -93 -10 47 -16 2 26 57 14 98 44 -62 -14 71 -54
6995 -54 -8 117 -11 118 50 82 -27 29 48 -93 -84 54 66 119 21 -77 61 -97 -22 -120 -102 -58 -35 5 70 47 138
7022 138 -104 -166 -93 -45 -14 81 -36 113 17 -45 14 -49 -27 83 0 -23 204 2 -64 127 4 -57 37 -82 24
7047 24 46 176 101 -61 113 -31 -84 57 -88 -97 1 -27 -33 -86 -15 10 57 41 -24 63 14 71 50 -46 108 11 -29 74
7075 74 -90 95 27 4 72 80 80 -22 100 -28 -22 95 -84 -74 128 33 75 -26 18 -104 -48 -81 40 -134 69
7100 69 -7 52 145 60 16 -33 -119 -30 -32 0 29 68 39 -54 -74 103 76 -71 24 7 65 -62 -44 74 -61 -20 -38 19
7128 19 31 72 115 130 -87 20 95 65 -139 -54 -65 -61 -33 -112 24 -19 6 62 -8 -46 -27 70 -5 35 82 -37 29 -4
7156 -4 61 -14 -3 36 67 2 114 34 14 3 -122 -49 -35 -53 -95 17 9 -42 -26 11 -9 -90 -84 -17 6 -133 136 -4 -70
7185 -70 21 -45 3 -11 -22 63 70 -46 22 -85 -72 -30 -81 -72 -75 -27 106 47 190 74 105 3 10 -11 -74 3 -6 35 -58 -10
7215 -10 -108 -88 -15 19 -129 45 16 72 78 24 -91 -49 13 -14 -42 -158 67 -40 21 86 19 -5 60 -26 -98 47 95
7242 95 19 -116 -20 -23 -63 -96 -44 115 -13 22 -3 47 69 128 -5 -79 -100 -156 -56 37 6 38 92 30 -55 37 6 -69
7270 -69 30 -11 -44 99 80 181 -4 1 40 76 58 99 22 33 36 -2 -57 26 -80 0 89 179 62 70 44 39 -84 -20 85
7299 85 -16 -82 -84 -12 38 80 84 60 -105 -32 -66 -28 40 39 -55 73 0 49 -125 32 -63 19 -107 -6 211 -3 95
7326 95 16 59 78 -25 -65 -11 141 43 139 89 -63 -42 18 -67 35 -47 -71 -22 61 -40 28 -81 69 -2 -112 -114 24
7353 24 -22 -27 154 26 83 -148 45 -57 75 -32 -5 4 62 -15 22 -28 -35 67 -2 133 -95 68 96 23 1 -11
7379 -11 -99 -36 -83 -51 -3 -4 204 -53 2 57 -162 -40 -18 -66 -28 67 -2 -52 -92 108 -75 -27 -69 -47 -65 -139 -45 37
7407 37 96 14 91 -47 -119 -106 -41 16 128 42 -67 -30 68 -64 -67 21 -23 28 138 -40 176 19 100 -35 19 -27
7433 -27 -66 14 29 -32 16 53 26 59 -58 -42 -35 81 48 146 -59 37 22 3 -25 30 56 6 -78 75 23 97 66 39 -66
7462 -66 46 -73 30 20 61 166 137 41 -40 -79 -87 -4 -68 -11 -102 3 -11 -69 4 -163 -56 -91 -74 -126 -63 -19 48
7489 48 55 -18 76 -79 -70 -33 2 12 -4 3 -43 28 -41 -38 8 46 18 -41 -46 20 38 -28 -73 -31 -110 90 -3 125 22 86 -147
7520 -147 -13 78 -79 -87 -6 33 -61 -38 73 38 15 14 -45 44 -201 95 -4 0 79 145 -20 3 -66 33 -88 -5 -87 16
7548 16 78 36 16 19 -131 -20 93 -112 -113 26 12 -2 29 -18 -4 42 -58 22 17 -14 -84 4 77 23 -40 -111 0 -148
7576 -148 37 52 44 -3 46 -1 -71 12 -19 -40 -150 60 185 -1 -54 -77 25 124 -55 -146 41 -28 53 -44 -55 -86
7602 -86 -36 46 -39 -74 -19 -2 35 11 -12 -22 -24 -11 71 -176 118 6 134 47 31 84 43 106 78 -11 7 -3 42 54 -34
7631 -34 51 -20 148 34 37 -41 53 -79 -96 61 -1 -33 44 -102 7 2 -44 -34 13 140 -31 17 62 2 -85 -55 -91
7658 -91 0 16 -96 3 117 -3 -92 -12 -61 -57 9 -2 65 42 103 57 11 -47 -19 63 68 4 -35 116 -45 -31 48 15 -82
7687 -82 -61 -133 1 -33 30 -9 -19 -161 101 68 -50 -89 -11 -11 -99 16 13 3 15 31 -38 -20 84 49 37 108 51 96
7715 96 14 97 -79 41 -2 108 91 6 -16 -82 -22 -14 -35 -132 -8 -127 78 50 24 14 -5 -46 -80 37 52 -18 37
7742 37 59 -13 6 7 2 -98 39 -97 -41 137 114 96 -71 79 25 -5 -23 13 -12 13 46 128 -5 17 -57 -81 -87 -99
7770 -99 79 -31 -44 19 38 76 22 54 -31 -60 39 -17 157 91 7 61 66 -53 5 26 7 91 -14 206 21 69 -15
7797 -15 108 22 -5 5 -100 -51 -21 46 5 -58 -120 10 31 -52 -8 -19 -23 12 -24 -67 -40 -13 11 -27 -82 -34 -61 -85 -28
7826 -28 16 -62 -20 -119 -57 11 4 14 -11 41 47 -46 156 -104 -97 90 -93 -92 -103 -34 -90 -146 -27 123 -76 -24 -22 -14 -4 19
7856 19 11 -26 -143 49 17 -146 -14 21 45 154 -28 -53 73 -22 24 -18 5 45 23 45 -66 60 51 -17 7 -50 84
7883 84 14 65 -37 47 148 32 -36 -36 -56 -70 5 6 46 40 88 32 36 28 -24 -78 71 -1 -42 -4 35 -2 -7 110 -50 -63
7913 -63 -82 -13 -51 97 -10 -35 -36 -31 -18 -114 -59 65 13 43 6 95 24 39 41 137 32 85 43 -49 59 52 8 30 -75
7942 -75 -12 12 -114 -24 -67 11 -37 -44 71 -2 64 -154 61 -18 29 15 -43 -52 -1 24 -92 47 46 90 -18 58 167 -52
7970 -52 49 -22 40 -32 -117 124 15 -43 -132 8 -72 63 2 21 59 -88 100 67 102 -41 -36 60 15 -3 61 -13 225
7997 225 45 85 123 97 -1 -116 -78 47 83 40 -36 147 177 -59 54 4 26 -62 -75 41 90 -19 76 92 -32
8022 -32 -21 -94 -40 74 -29 -2 81 33 40 64 4 -58 -150 -61 109 -13 100 -38 13 122 -75 -74 -9 3 -3 34 55 110
8050 110 -15 19 -49 -40 42 56 9 11 -10 -52 -7 -65 -75 -90 -45 5 -91 29 -27 4 -18 11 34 -16 -31 -52 -15 102 125
8079 125 31 31 -10 21 -56 52 -19 0 -72 -8 -15 3 25 66 -90 21 43 -7 43 -43 39 0 15 41 -10 15 -37 -50 -18
8108 -18 76 46 70 -10 14 -54 20 131 -97 -84 -81 31 5 -55 48 -48 27 6 62 -59 39 34 2 -37 59 -80 -120 -91
8136 -91 34 -37 -23 14 119 60 -200 78 35 -89 71 61 75 16 0 -71 16 3 34 -97 6 38 32 -50 -49 -106 -20
8163 -20 -120 -22 -22 7 48 29 3 90 97 16 30 54 -144 15 26 102 -36 -1 156 -12 31 -77 -119 -43 -74 -3 -83 -25
8191b5
##END NTUPLES=NMR FID
##END=
