##TITLE=1H_DE-80H_X3
 200.13MHz, d2o
 8 sc
 
 19ns.26.2.2025
##JCAMPDX= 6.0         $$ Bruker NMR JCAMP-DX V2.0
##DATA TYPE= NMR FID
##DATA CLASS= NTUPLES
##ORIGIN= UXNMR, Bruker Analytische Messtechnik GmbH
##OWNER= pz
$$ XWIN-NMR		Version 3.5
$$ Wed Jan 28 13:46:47 2026 Russian Standard Time (UT+4h)  Yarkov@DPX200
##.OBSERVE FREQUENCY= 200.1313
##.OBSERVE NUCLEUS= ^1H
##.DELAY= (6, 6)
##.ACQUISITION MODE= SIMULTANEOUS
##.ACQUISITION SCHEME= undefined
##.AVERAGES= 8
##.DIGITISER RES= 18
##SPECTROMETER/DATA SYSTEM= spect
##.PULSE SEQUENCE= zg30
##.SOLVENT NAME= D2O
##.SHIFT REFERENCE= (INTERNAL, D2O, 0, 14.3821)
##AUDIT TRAIL= $$ (NUMBER, WHEN, WHO, WHERE, WHAT)
$$ ##TITLE= Audit trail, XWIN-NMR		Version 3.5
$$ ##JCAMPDX= 5.01
$$ ##ORIGIN= Bruker BioSpin GmbH
$$ ##OWNER= Yarkov
$$ C:/Bruker/XWIN-NMR/data/yarkov2/nmr/H-C/1/audita.txt
$$ ##AUDIT TRAIL=  $$ (NUMBER, WHEN, WHO, WHERE, WHAT)
(   1,<2026-01-28 13:45:13.81 +0400>,<Yarkov>,<DPX200>,
      <created by zg, POWCHK disabled, PULCHK disabled
       configuration hash MD5:
       00 E9 B6 7A A2 85 ED C7 34 08 36 98 17 FE 4E 26
       data hash MD5: 16K
       4A C1 C6 83 BC DE 02 B9 85 EB ED E0 AE 28 50 6F>)
$$ ##END=
$$ 
$$ hash MD5
$$ 7E DD E7 A9 D7 06 74 60 EA 9C 13 17 1A 32 BB 35
##$RELAX= 
##$RELAX= 
##$RELAX= 
##$RELAX= 
##$RELAX= 
##$RELAX= 
$$ Bruker specific parameters
$$ --------------------------
##$DU= <C:/Bruker/XWIN-NMR>
##$EXPNO= 1
##$NAME= <H-C>
##$PROCNO= 1
##$TYPE= <nmr>
##$USER= <yarkov2>
##$AMP= (0..31)
100 100 100 100 100 100 100 100 100 100 100 100 100 100 100 100 100 100 
100 100 100 100 100 100 100 100 100 100 100 100 100 100 
##$AQSEQ= 0
##$AQ_mod= 1
##$AUNM= <au_zg>
##$AUTOPOS= <>
##$BF1= 200.13
##$BF2= 200.13
##$BF3= 200.13
##$BF4= 200.13
##$BF5= 200.13
##$BF6= 200.13
##$BF7= 200.13
##$BF8= 200.13
##$BYTORDA= 1
##$CFDGTYP= 0
##$CFRGTYP= 5
##$CHEMSTR= <none>
##$CNST= (0..31)
1 1 145 1 1 1 1 1 1 1 1 1 1 1 1 1 1 1 1 1 1 1 1 1 1 1 1 1 1 1 1 1 
##$CPDPRG= <>
##$CPDPRG1= <>
##$CPDPRG2= <>
##$CPDPRG3= <>
##$CPDPRG4= <mlev>
##$CPDPRG5= <mlev>
##$CPDPRG6= <mlev>
##$CPDPRG7= <mlev>
##$CPDPRG8= <mlev>
##$CPDPRGB= <>
##$CPDPRGT= <>
##$D= (0..31)
0 0.7 0 0 0 0 0 0 0 0 0 0.03 0 0 0 0 0 0 0 0 0 0 0 0 0 0 0 0 0 0 0 0 
##$DATE= 1769593513
##$DBL= (0..7)
120 120 120 120 120 120 120 120 
##$DBP= (0..7)
150 150 150 150 150 150 150 150 
##$DBP07= 0
##$DBPNAM0= <>
##$DBPNAM1= <>
##$DBPNAM2= <>
##$DBPNAM3= <>
##$DBPNAM4= <>
##$DBPNAM5= <>
##$DBPNAM6= <>
##$DBPNAM7= <>
##$DBPOAL= (0..7)
0.5 0.5 0.5 0.5 0.5 0.5 0.5 0.5 
##$DBPOFFS= (0..7)
0 0 0 0 0 0 0 0 
##$DE= 6
##$DECBNUC= <off>
##$DECIM= 32
##$DECNUC= <off>
##$DECSTAT= 4
##$DIGMOD= 1
##$DIGTYP= 9
##$DL= (0..7)
0 120 120 120 120 120 120 120 
##$DP= (0..7)
150 150 150 150 150 150 150 150 
##$DP07= 0
##$DPNAME0= <>
##$DPNAME1= <>
##$DPNAME2= <>
##$DPNAME3= <>
##$DPNAME4= <>
##$DPNAME5= <>
##$DPNAME6= <>
##$DPNAME7= <>
##$DPOAL= (0..7)
0.5 0.5 0.5 0.5 0.5 0.5 0.5 0.5 
##$DPOFFS= (0..7)
0 0 0 0 0 0 0 0 
##$DQDMODE= 0
##$DR= 18
##$DS= 0
$$ [...]
##$SUBNAM2= <"">
##$SUBNAM3= <"">
##$SUBNAM4= <"">
##$SUBNAM5= <"">
##$SUBNAM6= <"">
##$SUBNAM7= <"">
##$SUBNAM8= <"">
##$SUBNAM9= <"">
##$SW= 18.0517328524113
##$SWIBOX= (0..15)
0 0 2 0 0 0 0 0 0 0 0 0 0 0 0 0 
##$SW_h= 3612.71676300578
##$TD= 16384
##$TD0= 1
##$TE= 0
##$TE2= 300
##$TE3= 300
##$TEG= 300
##$TL= (0..7)
0 120 120 120 120 120 120 120 
##$TP= (0..7)
150 150 150 150 150 150 150 150 
##$TP07= 0
##$TPNAME0= <>
##$TPNAME1= <>
##$TPNAME2= <>
##$TPNAME3= <>
##$TPNAME4= <>
##$TPNAME5= <>
##$TPNAME6= <>
##$TPNAME7= <>
##$TPOAL= (0..7)
0.5 0.5 0.5 0.5 0.5 0.5 0.5 0.5 
##$TPOFFS= (0..7)
0 0 0 0 0 0 0 0 
##$TUNHIN= 0
##$TUNHOUT= 0
##$TUNXOUT= 0
##$USERA1= <user>
##$USERA2= <user>
##$USERA3= <user>
##$USERA4= <user>
##$USERA5= <user>
##$V9= 5
##$VALIST= <valist>
##$VCLIST= <CCCCCCCCCCCCCCC>
##$VD= 0
##$VDLIST= <DDDDDDDDDDDDDDD>
##$VPLIST= <PPPPPPPPPPPPPPP>
##$VTLIST= <TTTTTTTTTTTTTTT>
##$WBST= 1024
##$WBSW= 4
##$XGAIN= (0..3)
0 0 0 0 
##$XL= 0
##$YL= 0
##$YMAX_a= 113006
##$YMIN_a= -113555
##$ZGOPTNS= <>
##$ZL1= 120
##$ZL2= 120
##$ZL3= 120
##$ZL4= 120
##$ABSF1= 10
##$ABSF2= 0
##$ABSG= 5
##$ABSL= 3
##$ALPHA= 0
##$AQORDER= 0
##$ASSFAC= 0
##$ASSFACI= 0
##$ASSFACX= 0
##$ASSWID= 0
##$AUNMP= <proc_1d>
##$AZFE= 0.1
##$AZFW= 0.1
##$BCFW= 1
##$BC_mod= 2
##$BYTORDP= 1
##$COROFFS= 0
##$CY= 83.5205535888672
##$DATMOD= 1
##$DC= 2
##$DFILT= <>
##$DTYPP= 0
##$F1P= 10.8118882576601
##$F2P= -7.23987719738617
##$FCOR= 0.5
##$FTSIZE= 0
##$FT_mod= 4
##$GAMMA= 1
##$GB= 0.15
##$INTBC= 1
##$INTSCL= 1
##$ISEN= 128
##$LB= 0.25
##$LEV0= 0
##$LPBIN= 0
##$MAXI= 10000
##$MC2= 0
##$MEAN= 0
##$ME_mod= 0
##$MI= 1.114404
##$NCOEF= 0
##$NC_proc= 0
##$NLEV= 6
##$NOISF1= 3.799351
##$NOISF2= 2.8
##$NSP= 1
##$NTH_PI= 0
##$NZP= 0
##$OFFSET= 14.38212
##$PC= 1
##$PHC0= -5301.097
##$PHC1= 7.62193
##$PH_mod= 1
##$PKNL= yes
##$PPARMOD= 0
##$PSCAL= 0
##$PSIGN= 0
##$REVERSE= no
##$SF= 200.129724274929
##$SI= 16384
##$SIGF1= 3
##$SIGF2= 2
##$SINO= 400
##$SIOLD= 16384
##$SREGLST= <1H.CDCl3>
##$SSB= 0
##$STSI= 0
##$STSR= 0
##$SW_p= 3205.1282051282
##$SYMM= 0
##$S_DEV= 0
##$TDeff= 0
##$TDoff= 0
##$TI= <>
##$TILT= no
##$TM1= 0
##$TM2= 0
##$TOPLEV= 0
##$USERP1= <user>
##$USERP2= <user>
##$USERP3= <user>
##$USERP4= <user>
##$USERP5= <user>
##$WDW= 1
##$XDIM= 8192
##$YMAX_p= 0
##$YMIN_p= 0
$$ End of Bruker specific parameters
$$ ---------------------------------
##NTUPLES= NMR FID
##VAR_NAME=  TIME,          FID/REAL,        FID/IMAG
##SYMBOL=    X,             R,               I
##VAR_TYPE=  INDEPENDENT,   DEPENDENT,       DEPENDENT
##VAR_FORM=  AFFN,          ASDF,            ASDF
##VAR_DIM=   8192,          8192,            8192
##UNITS=     SECONDS,       ARBITRARY UNITS, ARBITRARY UNITS
##FACTOR=    0.0002768,     1,               1
##FIRST=     0,             0,               0
##LAST=      2.2672688,     0,               0
##MIN=       0,             -113555,         0
##MAX=       2.2672688,     113006,          0
$$ Real data points
##PAGE= N=1
##DATA TABLE= (X++(R..R)), XYDATA
0 0 0 0 0 0 0 0 0 0 0 0 0 0 0 0 0 0 0 0 0 0 6 -8 8 -8 8 -8 10 -16 16 -17 22 -24 26 -32 34 -40 45 -50 58 -63 69
41 69 -79 87 -96 109 -119 131 -143 159 -177 193 -214 234 -259 284 -315 350 -386 430 -480 540 -610
62 -610 695 -804 939 -1122 1371 -1726 2203 -3955 87952 63279 -16230 37981 44436 -28054
76 -28054 -41545 -13384 -17579 10808 25972 -20529 -17675 44246 26456 -14409 6340 -13551 -69726
89 -69726 -29125 17048 -16562 20515 113006 54237 -59845 -32600 12148 -39625 -47168 14953
101 14953 31787 20169 14042 -17406 -13506 34111 3100 -61982 -24380 18844 -20199 -5415
113 -5415 69071 53169 3972 15859 -15376 -84145 -46514 24942 6460 -2670 44101 34738 -13226
126 -13226 -15872 -16558 -23287 5472 4072 -34477 1512 61442 26621 -6408 33256 17165 -57983
139 -57983 -56464 -17528 -20110 6135 55894 36232 12 10000 -6804 -45889 -24421 7546 -2640
152 -2640 8423 33032 12884 5827 32127 4818 -44149 -27971 -12933 -41006 -19167 41033
164 41033 42395 22033 28134 1736 -40908 -30241 -11244 -18127 7316 42177 23519 4849 18585
177 18585 626 -32460 -21858 -14866 -34358 -14900 24741 24050 23688 40944 16798 -25018 -24946 -22449
191 -22449 -34396 -6897 33227 27520 16711 24773 2920 -30187 -25905 -19531 -28557 -9458 19412
204 19412 18476 21011 36976 20915 -9970 -16525 -24019 -36332 -16073 13026 16247 24095 36642
217 36642 11383 -23270 -23712 -21320 -31339 -16228 13611 22676 26386 31993 17292 -2903 -9451
230 -9451 -22333 -36111 -21250 2282 9517 20412 32659 18492 -4519 -13301 -25250 -35773 -18544
243 -18544 7466 15681 23783 34963 25180 2416 -12036 -23241 -30634 -22479 -8652 2486 19401
256 19401 31307 20892 4031 -5236 -18466 -30789 -23398 -4968 8964 23031 32844 25851 9509
269 9509 -4584 -20162 -31785 -27849 -13920 50 15323 26421 24141 13767 1127 -14929 -25953
282 -25953 -23095 -11726 888 16472 28383 27107 15534 625 -15638 -27840 -28886 -20341 -5875
295 -5875 11126 23916 25967 19357 7138 -8330 -21123 -23787 -17282 -4705 9916 21985 25888
308 25888 19750 6200 -10159 -22945 -27677 -23474 -11293 5175 19666 26160 23262 13027 -1667
321 -1667 -15374 -22985 -20950 -10875 3129 15858 22776 21371 11586 -3590 -17562 -24726 -24084 -15594
335 -15594 -841 14791 24330 24942 17700 4317 -9945 -19960 -22820 -16824 -3957 9995 18687
348 18687 20921 14883 3553 -11063 -20260 -24165 -19509 -4839 10737 18481 22712 22096 10925 -7050
362 -7050 -17398 -20859 -19369 -10634 1712 13310 21033 20420 7555 -4949 -12893 -20121 -23254 -10967
376 -10967 5400 15041 21584 24679 13925 -1768 -9789 -19014 -24194 -15488 -409 7667 14718 20554
390 20554 14234 2745 -5777 -18096 -23609 -12482 65 5402 18628 29141 17912 1155 -4451
403 -4451 -15665 -25692 -18307 -4391 -138 11009 22793 14470 5243 2318 -9160 -21691 -15778
416 -15778 -6021 -3000 11634 28540 19868 7907 3376 -12685 -28889 -20126 -8174 -6342 10013
429 10013 24864 14235 5484 8764 -2873 -20255 -13990 -6317 -10051 3597 21196 17069 12226
442 12226 15270 -3111 -28484 -22966 -13640 -12756 5492 24292 17197 13997 15648 -8040 -23511 -6412
456 -6412 -2025 -18478 -5175 21792 13050 5522 15404 6681 -14099 -15342 -20123 -26964 -1959 24309
470 24309 16875 15863 25491 2142 -21630 -14350 -14547 -19289 6040 21344 -1422 85 26762 10084
484 10084 -20946 -11066 -2776 -20557 -17892 2603 11705 28170 34408 3713 -16612 -4615 -16292
497 -16292 -36952 -6993 23297 11456 9453 20068 -1349 -16530 4406 -3086 -29824 -11800
509 -11800 14948 1786 -625 25665 26630 8661 -3692 -27669 -37497 -5004 7107 -9230 17367
522 17367 47384 9638 -26750 -6447 -2278 -22293 -6440 9573 -4640 5205 27842 9611
534 9611 -4353 13677 2191 -31432 -27959 -12780 -7074 20941 37045 8899 1772 16471 -17666
547 -17666 -50608 -9771 24581 1153 -1521 22960 12940 -2625 6027 -4868 -20476 -5784
559 -5784 -7650 -27721 -2934 32933 22759 12457 18382 -9260 -34778 -13669 -6952 -19063 16218
572 16218 46108 9843 -14992 7563 1797 -24063 -13339 -1978 -11584 518 13256 2366
584 2366 14752 35766 4536 -29339 -15377 -12701 -27669 581 32722 18531 11543 18941 -11440
597 -11440 -36007 -10040 1998 -14974 -646 20900 7604 4437 18769 5620 -8543 -432
609 -432 -15632 -36314 -8122 20788 9910 14919 32383 4926 -26849 -17652 -14967 -22005 4538
622 4538 25405 8581 6983 20296 1361 -15001 -878 -5697 -24364 -9532 6017 -1581 12813
635 12813 33515 12080 -11029 -6067 -17717 -33224 -7704 17603 11450 16960 26505 2366 -16097
648 -16097 -5652 -9208 -21888 -4771 6998 -3805 6196 24759 11255 -1708 3982 -11105
660 -11105 -30527 -15175 2535 2508 17632 30933 10845 -6229 -3539 -16090 -27891 -7697 7526
673 7526 222 8201 21321 9079 -115 5484 -6685 -22143 -11818 -3922 -7576 8983 27306
686 27306 16406 4139 2538 -13645 -26959 -13810 -3040 -2948 12752 24925 10505 915 4970
699 4970 -5975 -19263 -11487 -5678 -7333 5378 18333 12639 9535 10236 -6507 -22418 -16112 -9570
713 -9570 -7916 7731 21299 15438 9382 7513 -7148 -18572 -12069 -8162 -8870 3252 15460 12413
727 12413 10256 10456 -2306 -14443 -13525 -13047 -12033 2358 15480 14699 13424 12017 -1727 -14603
741 -14603 -14198 -12933 -11049 920 11912 12374 12638 11646 332 -10300 -11498 -13456 -13243 -2080 9808
756 9808 12334 14817 14006 3402 -8412 -12709 -15143 -13934 -3000 7354 11406 14359 14051 4557 -6328
771 -6328 -10950 -13875 -13566 -5082 4125 9896 14554 14896 6365 -3582 -9717 -14030 -14861 -8132 1849 9650
787 9650 14621 14374 7781 -413 -7754 -13958 -15251 -8724 235 7468 12840 14666 10010 1432 -6698
802 -6698 -13205 -14687 -10210 -2372 5601 12121 14735 11181 3373 -5137 -11931 -14668 -11621 -4526 3956
817 3956 11575 14694 11855 5249 -2887 -10435 -14512 -12600 -6048 2321 9908 14083 12944 7297 -1477
832 -1477 -9617 -13459 -12490 -7583 -436 8164 13888 13635 8389 715 -7331 -12910 -13646 -9545 -1834 7013
848 7013 12849 13208 9641 2974 -5753 -12530 -13628 -10304 -3605 4983 11540 13374 10762 5341 -3883
863 -3883 -11706 -13334 -11252 -6047 2866 10737 13150 12076 6928 -2669 -10709 -12530 -11838 -8128 1993
878 1993 10230 12222 12008 8645 -641 -9230 -11711 -12272 -9934 -787 8080 11280 12943 11074 1342 -7830
894 -7830 -10402 -13007 -12049 -1753 8318 10834 12375 11328 2098 -6470 -9405 -12966 -12834 -2344 5835
909 5835 6869 11404 14627 5655 -4354 -7927 -12773 -14399 -4822 3596 6258 13775 16915 4578 -6373
924 -6373 -7123 -11243 -14169 -5682 2584 5532 12699 14632 3696 -1693 62 -9535 -18506 -9159 1187
939 1187 3297 10492 16278 8662 1727 -2061 -14813 -19912 -5330 3623 1530 9130 17111 8149 -242
954 -242 -1712 -10081 -13597 -4301 -3725 -7290 7556 20482 9873 1695 3561 -6593 -17555 -12292
968 -12292 -6832 -2077 14620 20378 5021 290 5429 -7689 -19218 -8233 -656 -2846 5351 11026
982 11026 4691 8640 12943 -5901 -18799 -7812 -5405 -11959 2635 18904 14315 9896 5973 -12037
996 -12037 -18536 -5050 -5114 -10646 6835 18865 5735 1159 7719 -461 -8169 -4232 -11231 -16236
1010 -16236 3182 14216 4213 9555 19629 549 -18708 -13592 -11354 -10589 7328 15308 5301
1023 5301 9083 13674 -6568 -15790 -1069 -2240 -13035 -2834 5911 1666 11223 18733 894 -8497
1037 -8497 -1306 -13189 -24522 -2718 15641 9967 12364 15660 -2450 -12078 -4717 -10954 -14490 4963
1051 4963 10665 -3159 3544 16155 4172 -3432 2297 -9258 -20231 -5517 2843 -1086 14532
1064 14532 26058 5286 -9740 -5063 -13089 -19264 -1180 8426 2299 10444 14917 -2283 -5360
1077 -5360 6121 -4453 -16569 -4187 -178 -7248 7161 21045 8613 2121 4492 -13034 -25169
1090 -25169 -7502 2807 28 13324 20598 2703 -4544 1830 -8619 -14860 -3 1342 -8176
1103 -8176 3809 14802 4504 4293 10983 -5472 -19661 -9647 -5948 -8361 9822 22411 9430
1116 9430 3396 4422 -11304 -18800 -3798 -128 -5704 6639 13751 1579 1799 9825 -2008 -12017
1130 -12017 -5038 -8159 -13738 3589 16294 8789 9565 12610 -5926 -18670 -9523 -7114 -7920 7540
1144 7540 15086 4278 4402 8628 -4689 -11558 -2049 -4674 -11714 -75 8915 4869 10372 15079
1158 15079 -438 -11056 -7047 -11878 -15151 1903 13371 7926 9195 10732 -2901 -10397 -4498
1171 -4498 -7285 -10419 1707 7548 2099 7257 13207 2566 -5275 -3735 -10758 -15430 -3245 5639
1185 5639 5100 12156 15515 1771 -7352 -5405 -9891 -12234 -824 5853 3557 8573 11440 1805 -3154
1200 -3154 -1438 -8488 -13665 -4905 1243 1599 9814 14865 6025 -932 -2551 -10458 -14112 -4828 1664
1215 1664 2695 9453 12307 4153 -1175 -1615 -7816 -11807 -5408 -1126 237 7618 12257 7202 3099
1230 3099 509 -7920 -12911 -7633 -2899 -35 7778 12032 7111 2848 -181 -7544 -11330 -6567 -3117
1245 -3117 -1053 6131 11019 7857 4689 1839 -5129 -10181 -8586 -6379 -2686 5268 10099 8208 5870
1260 5870 2763 -4799 -9916 -8415 -5960 -2630 4414 9165 8509 6690 3681 -3204 -8515 -8754 -7429
1275 -7429 -4353 2129 7414 8585 8055 4762 -2036 -7085 -8282 -7863 -5034 1507 6949 8581 8078 5197
1291 5197 -642 -6160 -8485 -8679 -6005 -293 5082 7868 8699 6319 984 -4607 -7594 -8358 -6532 -1425
1307 -1425 4218 7672 8881 6800 1852 -3516 -7587 -9122 -6862 -2363 2768 6630 8572 7820 3395
1322 3395 -1766 -6207 -8501 -7804 -3515 1757 5900 8362 8052 4251 -1048 -5734 -8500 -8331 -4896 178
1338 178 4906 8195 8557 5364 577 -4239 -7761 -8565 -5554 -923 3566 7531 8682 5915 1160 -3416
1354 -3416 -7402 -8812 -6561 -2271 2465 7208 9180 6718 2716 -1610 -6289 -8681 -7142 -3267 1410
1369 1410 6566 8334 6677 3705 -845 -6050 -9185 -7383 -4053 54 5095 8469 7835 5120 1097
1384 1097 -4983 -8307 -7158 -4963 -2120 3768 8426 8045 5602 1084 -4802 -7507 -6959 -6574 -3311 4987
1400 4987 9372 6813 4938 4057 -1748 -7616 -8020 -6615 -3720 2375 6240 6260 7152 5631 -1870 -7838
1416 -7838 -7585 -7039 -4506 2490 6503 6623 8694 6718 -3122 -7977 -4574 -5383 -7696 -1515 5898 7050
1432 7050 6760 5473 340 -3050 -4796 -9565 -9059 1013 6525 5481 8153 8642 249 -5293 -5661 -9162
1448 -9162 -9033 983 5314 2064 5394 9696 3263 -3970 -4603 -6258 -6989 -2822 -143 2900 11433
1463 11433 11603 288 -3978 -2161 -8894 -12628 -2811 4152 3650 7821 9494 1197 -2342 46 -5096
1478 -5096 -10033 -3293 1312 1062 5771 8838 4442 2897 -268 -11538 -13277 -2049 488 -1699 8815
1493 8815 14868 4162 -2680 -1195 -6032 -9025 -2237 -126 -1597 5370 8881 2398 1544 3108 -5390
1508 -5390 -10475 -5601 -5127 -3505 9343 13742 4220 2900 4496 -7570 -14239 -4301 670 -1395 4858
1523 4858 8475 2294 1773 3287 -4766 -7690 -1835 -4602 -7239 4179 10578 5355 7246 7870 -5865
1538 -5865 -12723 -5304 -5413 -6352 6215 12202 3622 1768 3679 -4890 -8099 -1467 -3078 -5593 3648
1553 3648 6763 1563 6660 10266 -1723 -8258 -4174 -8640 -10963 2685 10185 4986 6685 7680 -4615
1568 -4615 -9734 -2987 -4002 -5267 4587 6918 302 4408 8153 -1196 -4827 -646 -7132 -11764 -1098
1583 -1098 4541 2458 9276 12191 -741 -7031 -3239 -7529 -8931 3297 7653 2407 5603 6838
1597 6838 -3317 -4773 775 -5319 -9532 -1007 1791 -1375 6671 11901 3081 -909 -268 -9019 -11853
1612 -11853 -376 3964 1413 8117 9982 -1338 -5175 -1275 -6034 -7998 655 1670 -2037 4992
1626 4992 9328 2318 1295 3556 -5142 -10707 -3885 -1589 -1542 7748 10961 1700 -1057 69 -7834
1641 -7834 -10310 -639 1948 -569 5476 7970 1465 1456 3595 -3811 -7591 -2630 -3489 -5227 3781 8909
1657 8909 3704 3201 3155 -5985 -9702 -3303 -1936 -1578 6420 9196 2591 1575 2810 -3769 -6665 -2350
1673 -2350 -3409 -5084 1830 5611 2745 4673 5601 -2603 -6968 -3780 -4522 -4344 3810 8053 4423 4305
1689 4305 3672 -3702 -6719 -3436 -4138 -4676 1688 4519 2307 4369 5813 -251 -3745 -2674 -5092 -5705
1705 -5705 788 4879 3960 5868 5520 -1357 -5280 -4341 -5887 -5479 589 3674 2911 5059 5710 575
1721 575 -2232 -1784 -4636 -5970 -1233 2184 2650 5282 6044 1155 -2392 -3613 -6315 -6644 -1440 2107
1737 2107 2806 5859 6457 2101 -849 -1697 -4669 -5767 -2271 338 1287 4443 5957 2591 -272 -1943
1753 -1943 -5303 -6441 -3363 -287 2034 5587 6697 3709 1039 -994 -4608 -6132 -3763 -1479 433
1768 433 3790 5376 3543 1467 -609 -4158 -5904 -4171 -1763 688 4329 6296 4948 2916 367
1783 367 -3627 -5778 -5179 -3076 -738 2931 5063 4518 3056 272 -2712 -5577 -4902 -3053 -632 3711
1799 3711 4829 4726 4284 1828 -2755 -5258 -5343 -4514 -1329 1497 4913 4857 4208 1818 -1843 -4042 -4489
1816 -4489 -4471 -2258 1346 4391 5331 4962 2534 -1707 -4440 -4971 -5379 -3697 18 3337 5649 4952 3397
1833 3397 323 -2281 -5234 -4569 -3374 271 3098 5028 5454 3780 775 -3037 -5263 -5781 -4108 -1067
1849 -1067 1888 4081 5720 5259 1546 -1814 -4052 -5028 -3947 -1962 1590 4319 5412 4715 1231 -1977
1865 -1977 -3863 -4970 -5109 -2826 487 3950 5841 5111 3149 371 -2403 -4942 -5575 -2071 701 1761
1881 1761 4527 5699 3067 -341 -2853 -5106 -5276 -3602 -520 2557 5458 6554 3689 1264 -2211
1896 -2211 -5114 -5040 -3361 -1494 712 4725 5785 3100 334 -345 -3673 -6306 -4468 -720 1308 4151
1912 4151 6117 4856 2413 284 -4254 -5732 -3851 -1560 -204 3942 5043 3611 1927 835 -3477
1927 -3477 -5416 -3070 -2161 -541 2553 5781 4505 3597 508 -2795 -4584 -4663 -4994 -2242 3770 5434
1943 5434 2878 3084 2677 -2727 -5482 -3220 -2590 -2164 2253 4797 3147 2661 3534 -1262 -4475 -4352 -4459
1960 -4459 -3283 1071 3726 4051 5660 3428 -3192 -4520 -1737 -3638 -3970 1797 5116 2517 3005 3433
1976 3433 -590 -3400 -2675 -4626 -5127 -492 2652 2740 5156 5353 26 -2826 -2671 -5546 -4891 1713 3902
1993 3902 1757 4306 4842 -1274 -3629 -1730 -3394 -4702 -505 1370 858 4450 5917 1320 -574
2008 -574 -723 -5200 -6467 -776 1520 1703 5484 5666 -531 -3080 -1138 -4139 -5606 141 1687 191
2024 191 3439 5192 1199 515 1318 -3541 -6112 -2050 -1051 -1031 4640 6807 1601 -150 -137 -5405 -6583
2041 -6583 -444 1068 16 4115 5549 549 189 1767 -2813 -4777 -1063 -1891 -3317 2581 5618
2056 5618 2150 2268 2503 -3940 -6589 -2228 -1729 -1349 4938 6544 1081 892 1951 -3473 -4791 -565
2072 -565 -1436 -3217 1589 3597 679 2744 4491 -1499 -4684 -2169 -3328 -3789 2801 5859 2745 3339
2088 3339 2885 -3729 -5475 -1342 -2186 -3177 2123 3723 246 2208 4037 -597 -2397 -106 -2941 -5212
2104 -5212 987 3455 1625 4295 4660 -1634 -4590 -2510 -4776 -3209 1939 3505 1504 2829 3653
2119 3653 -861 -2646 -87 -3164 -4239 132 1287 718 3699 6230 643 -1690 -1697 -4756 -6040 16
2135 16 2355 1620 4392 4965 -437 -1958 -312 -2934 -4097 142 777 -688 2571 4560 729 -32
2151 -32 332 -3111 -5421 -1493 216 648 3896 5272 1251 -95 166 -3793 -4603 -913 546 -366 2734
2168 2734 4009 555 255 1713 -2944 -4937 -1665 -1714 -1378 3023 5499 2699 1654 811 -3221 -5282
2184 -5282 -2522 -1239 -674 2960 4113 1450 893 1102 -2070 -3728 -1767 -1618 -1440 2076 3913 2377
2200 2377 2265 2203 -1973 -4423 -2987 -2559 -1971 1876 3959 2743 2341 1739 -1991 -3364 -1842 -2070 -1701
2217 -1701 1319 3078 2053 2451 2364 -1046 -2993 -2621 -3303 -2618 546 3061 2801 3163 2684 -691 -2845
2234 -2845 -2498 -2864 -2143 702 2155 2389 3007 2367 -214 -2360 -2249 -3134 -2997 -610 1939 2564 3501 3272
2252 3272 720 -1629 -2171 -3375 -3050 -500 1460 2044 3248 2882 381 -1286 -2108 -3214 -3116 -937 798
2269 798 2092 3256 3276 1523 -759 -1909 -2934 -3418 -1583 194 1691 2850 2894 1424 -271 -1693
2285 -1693 -3140 -3168 -1535 136 1574 3037 3397 2025 327 -1207 -2849 -3324 -2151 -735 959 2537
2301 2537 3273 2151 617 -867 -2431 -3130 -2308 -864 885 2503 3154 2494 1206 -547 -2256 -3090
2317 -3090 -2695 -1410 242 1935 2927 2745 1581 -152 -2025 -2853 -2599 -1550 -40 1865 2914 2756
2333 2756 1805 61 -1666 -2854 -2819 -2001 -501 1446 2819 2864 1982 787 -1085 -2552 -2951 -2246 -569
2350 -569 1108 2299 2565 2411 1127 -1037 -2485 -2659 -2307 -1270 415 2248 2871 2566 1437 -500 -1903
2367 -1903 -2673 -2557 -1557 199 1965 2666 2196 1661 -463 -951 -2832 -2861 -1614 148 1606 2116 2775
2384 2775 2303 482 -1563 -2342 -2651 -1969 -497 1034 1985 2816 2244 542 -979 -1841 -2546 -2339 -791
2401 -791 686 1720 2742 2671 633 -749 -1395 -2326 -3509 -1254 525 1489 2499 2464 1158 -353 -1810
2418 -1810 -2666 -3045 -691 290 1196 2118 2812 1618 245 -399 -2297 -3397 -1173 -809 513 2507 3233
2435 3233 1738 74 -686 -2609 -2687 -1598 -665 -45 2479 3020 1142 577 213 -1938 -2884 -1773 -1058
2452 -1058 -471 1529 2845 1701 917 421 -1510 -3070 -1728 -1198 -620 1564 2948 1619 1232 822 -1461
2469 -1461 -2664 -1492 -1038 -1333 1160 2662 1460 1714 1522 -927 -2369 -923 -2292 -1781 1295 2956
2485 2956 1798 2355 1564 -1579 -2615 -1379 -1647 -1552 1322 2188 986 1801 1900 -431 -1877 -871 -2124
2502 -2124 -2782 -225 2369 2216 2395 2585 -431 -2355 -1773 -2386 -2380 -73 1740 1426 2436 2417 -940 -1620
2520 -1620 -719 -1602 -2201 27 1055 485 1730 3449 366 -1677 -369 -2933 -4066 31 1252 1503
2536 1503 3077 2442 -406 -1324 -166 -2096 -3173 -542 1454 -46 2269 2893 156 -546 541 -2251
2552 -2251 -3799 -764 262 -80 2654 3965 993 -42 -381 -2602 -3982 47 561 -43 2164 2893
2568 2893 221 -126 628 -1536 -2737 -514 -629 -1104 1669 2439 1442 1143 1185 -2124 -3748 -1373 -655
2585 -655 -639 2370 3277 775 243 741 -1687 -2700 -546 -588 -1243 1120 2554 1158 1429 1975 -905 -2794
2603 -2794 -1538 -1672 -1944 1513 3221 1587 1400 1399 -1676 -2756 -1035 -1144 -1301 1352 2343 553 1195
2620 1195 1993 -607 -1889 -780 -1885 -2464 388 2181 1301 2084 2236 -622 -2193 -1618 -1899 -1844 889
2637 889 2231 881 1620 1871 -612 -1747 -520 -1561 -2499 -103 1233 624 1970 2825 253 -1175
2653 -1175 -1013 -2409 -2895 -78 1543 1091 2100 2358 -174 -1440 -745 -1872 -2378 -15 907 76 1682
2670 1682 2613 692 -405 -374 -1883 -2795 -843 252 448 2187 2919 569 -703 -554 -2012 -2456 -513
2687 -513 421 316 1785 2299 625 -73 195 -1496 -2614 -1196 -545 -230 1740 2644 1278 387 44 -1690
2705 -1690 -2635 -1162 -333 -28 1746 2408 1110 436 276 -1304 -2254 -921 -858 -560 947 2148 1344 1195
2723 1195 634 -1164 -2255 -1475 -1158 -645 1220 2194 1490 979 624 -1129 -2042 -1522 -1107 -751 792 1762
2741 1762 1458 1226 1112 -629 -1598 -1315 -1529 -1125 330 1661 1399 972 1444 -620 -1374 -1962 -1703 -955
2759 -955 536 1100 1316 1566 1178 -224 -1325 -1520 -1617 -1407 8 1014 1471 1783 1434 81 -979 -1418
2777 -1418 -1762 -1531 -274 809 1450 1627 1692 223 -360 -1652 -1341 -1860 -162 1670 597 1654 2150
2794 2150 513 -430 -1092 -1192 -1067 -695 225 833 1821 1734 936 -748 -1587 -1332 -1477 -1558 45 1242 829
2813 829 1639 911 353 -671 -1174 -1652 -852 -176 455 1576 1594 1391 169 -503 -1569 -1553 -1227 -299 214
2832 214 1225 1840 1532 601 -300 -1022 -1963 -919 -368 160 1442 1318 -2 718 -216 -715 -1159 -1546 -287
2851 -287 -361 682 1463 1377 552 288 -635 -1046 -2197 -1125 -135 529 1732 2092 1025 -281 -547 -1686
2869 -1686 -1359 -1245 -298 516 1705 1587 1157 512 -358 -1096 -1421 -1082 -832 452 1230 1426 1272 1103 -30
2888 -30 -987 -1324 -1303 -1024 160 914 1362 1230 1032 -73 -1059 -1103 -1293 -1030 -244 883 1302 1496 1196 134
2908 134 -829 -1007 -1502 -1503 -330 511 1126 1852 1203 159 -744 -899 -1566 -1224 -446 791 697 1630 1392 697
2928 697 -68 -1069 -1346 -1648 -597 304 699 1587 1700 434 -627 -479 -924 -1787 -866 -5 647 1123 2019
2947 2019 616 -230 -428 -579 -1697 -946 723 -238 1132 1737 823 140 -566 -1254 -1958 -860 -400 -783
2965 -783 1151 1638 509 1481 31 -822 -1808 -1212 -251 -524 946 1827 894 656 421 -1050 -1838 -1139
2983 -1139 -637 -828 693 1775 1027 458 686 -660 -1846 -643 -1156 -1483 472 1448 347 530 1062
3000 1062 234 -1763 -584 -819 -998 437 1530 1377 1161 855 -404 -1328 -728 -528 257 649 1618 271
3018 271 -145 1176 -360 -322 -35 -1634 -1782 215 1052 449 1850 1870 569 -742 -1350 -1588 -1111 1081
3036 1081 1274 372 1058 1554 -947 -548 -603 -1362 -2164 409 1424 1124 685 1923 -30 -1489 -507 -1503
3054 -1503 -1781 -328 926 599 1418 1712 167 -862 -518 -1183 -1499 -151 669 -60 996 1517 400
3071 400 -339 295 -937 -2046 -647 169 26 1067 1996 128 -429 51 -710 -1942 -265 -21 -195 1421
3089 1421 1893 293 97 -17 -1183 -1770 -424 -284 -617 682 1761 783 302 390 -970 -2031 -653
3106 -653 -215 -38 1033 2091 230 391 397 -1168 -1539 -605 -440 -234 132 1588 724 471 1466 -433 -331
3125 -331 -689 -937 -610 681 1637 885 943 854 -1004 -1400 -749 -431 -1037 632 1125 912 722 1113 -283
3144 -283 -920 -469 -1108 -1345 122 1136 842 761 1111 -473 -1065 -526 -1194 -524 950 1635 474 1349 1261
3163 1261 32 -887 -426 -933 -1054 -135 679 388 907 1345 23 -741 -707 -1234 -1027 -157 735 381 1021
3182 1021 1282 78 -359 -298 -898 -1304 -233 349 568 686 1248 1 -330 -161 -1314 -1358 -902 510 799
3201 799 1141 889 748 -287 -25 -919 -1597 -416 163 110 924 1454 533 -50 -124 -725 -1318 -709 -82 51
3221 51 789 1291 779 280 -52 -705 -1350 -627 -287 30 749 1200 689 240 141 -481 -1195 -707 -284 -241 646
3242 646 1191 829 455 300 -631 -1254 -940 -711 -384 402 1038 904 447 391 -338 -1046 -868 -613 -386 299
3262 299 1000 734 678 476 -324 -908 -786 -860 -586 69 945 949 751 597 3 -593 -801 -844 -637 149 698 757
3284 757 847 627 -17 -724 -841 -840 -778 -231 540 804 946 820 256 -330 -674 -846 -784 -265 448 691 816 779
3306 779 111 -375 -714 -850 -876 -352 194 699 929 852 583 -98 -588 -1000 -1087 -621 57 422 723 920 547
3327 547 -39 -383 -811 -963 -661 50 431 857 1028 719 132 -402 -766 -996 -767 -161 277 635 945 723
3347 723 235 -261 -758 -1030 -728 -254 247 705 1017 921 531 27 -645 -940 -895 -487 -32 568 776 790 473
3368 473 59 -510 -903 -813 -624 -131 502 1012 852 510 75 -422 -911 -997 -758 -197 242 892 857 674 186
3389 186 -237 -828 -768 -665 -415 314 855 689 957 494 199 -464 -467 -217 127 -487 264 869 530 666 -85
3410 -85 -463 -763 -653 -648 130 514 667 831 759 97 -602 -761 -664 -824 -184 512 705 907 760 213 -403 -710
3432 -710 -803 -938 -154 409 696 972 857 172 -493 -548 -915 -923 -336 295 462 893 1217 382 -112 -328 -819
3453 -819 -1164 -487 146 397 848 1016 148 344 -93 -473 -1393 -565 960 582 593 947 613 54 -50 -567
3473 -567 -1131 -879 44 -316 347 1027 1054 86 151 403 -1488 -97 267 -144 589 1149 613 -285 83 -226
3493 -226 -349 -846 -77 -40 517 923 925 136 -27 -275 -1477 -799 -339 -494 629 1223 771 346 -284 -618
3513 -618 -437 -337 -889 -687 150 565 426 657 654 -106 -1194 -745 -537 -175 -368 1522 483 -388 -160 -631
3533 -631 -1504 -1580 -789 -607 -202 1069 -208 676 1433 -64 -742 -424 -346 -584 -418 671 628 473 743 73
3553 73 -609 -969 -736 -1031 -80 677 463 762 832 107 -145 -992 -77 -1047 159 1238 -5 517 834 505
3573 505 -12 -384 -433 -1131 -319 750 33 504 622 -78 -99 -234 -627 -969 -379 335 91 471 1005 367
3593 367 -254 126 -433 -1136 -571 17 9 546 1193 560 -49 -71 -634 -1294 -449 70 -135 327 952 645 91
3614 91 153 -435 -1070 -533 -154 -277 241 1061 601 131 275 -368 -1220 -707 -224 -336 471 984 475 128 318
3635 318 -380 -1069 -538 -51 -663 41 1048 597 629 383 414 -1242 -723 -30 -1018 396 932 455 444 547
3655 547 -243 -915 -450 -168 -477 -13 816 682 555 627 75 -404 -556 -361 -721 576 94 1028 843 1175
3675 1175 -229 -815 -194 -536 -1076 -306 355 153 356 1000 327 -585 -200 -551 -948 -631 288 156 -17
3694 -17 995 221 -1364 -72 -321 -366 -1103 -702 683 1726 565 555 -13 278 -210 -1346 -304 344
3712 344 244 754 812 810 -258 -496 -475 -944 -664 -72 11 308 774 869 122 -823 -25 -780 -156 -16 201 501
3734 501 988 314 104 559 -261 -694 -618 -230 64 412 909 865 134 -80 -328 -986 -634 -159 116 114 827
3755 827 724 437 236 -1030 -962 -733 -695 211 99 896 581 616 300 -279 -718 -626 -429 -281 237 830 653
3776 653 753 444 -340 -894 -953 -462 -403 32 759 854 607 458 -76 -417 -740 -417 -470 90 456 575 613 465
3798 465 -32 -595 -607 -719 -496 -50 455 712 625 503 286 -330 -482 -400 -620 100 632 437 538 807 292
3819 292 -301 -576 -764 -581 -438 267 601 576 784 372 -251 -520 -585 -665 -349 84 408 580 744 402 -119
3840 -119 -480 -550 -768 -470 -45 473 691 932 817 352 -689 -735 -1081 -908 -220 283 616 797 690 -110
3860 -110 -464 -656 -622 -381 -88 366 566 679 417 172 150 -594 -685 -693 -282 18 518 644 608 255 -60 -480
3882 -480 -623 -627 -345 38 342 667 729 402 -7 -475 -741 -638 -437 -178 269 573 774 469 -19 -226 -469
3903 -469 -555 -538 -199 173 584 627 587 219 -158 -643 -580 -425 -241 23 375 590 553 275 -40 -642 -786 -470
3925 -470 -397 30 528 612 556 503 129 -456 -585 -541 -504 -90 412 569 610 586 8 -410 -266 -910 -944 -50 357
3948 357 256 441 520 259 -323 -419 -498 -654 -408 498 425 762 224 -117 -425 -323 -367 -810 -108 192 655 424
3970 424 700 251 -128 -325 -541 -706 -391 177 367 584 828 412 -62 -165 -438 -783 -324 98 152 483
3990 483 644 458 -154 53 -442 -640 -345 -661 384 264 664 569 32 73 -78 -484 -1002 263 52 142
4010 142 309 688 75 98 -357 -658 -613 -131 -240 250 711 586 258 302 -348 -824 -770 -6 647 75 1122
4031 1122 715 184 -157 -186 -431 -298 59 -165 -11 409 1052 245 493 -130 -538 -457 -559 -534 -295 879
4051 879 565 152 487 -213 -524 -797 -406 -543 82 601 417 315 556 41 -543 -362 -305 -814 -155 551
4071 551 479 356 687 191 -667 -426 -471 -701 -154 478 318 1078 862 262 -643 102 -460 -728 -222 426 218
4092 218 344 770 447 -270 -244 -527 -808 -376 237 367 382 885 261 -404 -272 -438 -770 -295 131 76 430
4113 430 754 341 -160 -60 -476 -865 -465 16 110 364 870 516 -47 -62 -385 -809 -474 101 33 319 759
4134 759 365 83 20 -283 -787 -544 -26 -97 238 791 609 135 205 -380 -903 -499 -34 -127 366 836 536
4155 536 88 150 -140 -728 -490 -122 -309 135 675 523 258 368 -70 -737 -566 -377 -274 88 858 548
4175 548 224 213 -37 -677 -586 -289 -354 -56 577 372 247 435 -16 -526 -546 -433 -397 7 512 553 378 525
4197 525 71 -539 -610 -428 -477 -118 647 531 478 564 162 -440 -450 -406 -581 -283 306 272 343 538 296 -388 -457
4220 -457 -449 -701 -264 391 352 377 661 164 -386 -394 -393 -603 -310 102 297 334 590 413 -78 -297 -411 -653 -464
4243 -464 155 363 389 575 397 12 -180 -430 -643 -331 21 216 347 641 391 -40 -188 -514 -697 -407
4263 -407 -28 90 418 779 515 128 -92 -328 -583 -510 -181 185 266 548 435 154 68 -386 -686 -561 -135
4284 -135 -93 300 560 537 252 61 -219 -525 -450 -307 -38 223 598 504 353 136 -205 -490 -421 -660 -346 313
4306 313 482 539 242 262 -187 -449 -501 -414 -265 54 523 542 383 306 -50 -382 -486 -448 -292 87 331 488
4328 488 342 323 2 -333 -511 -470 -344 -82 313 555 472 276 101 -284 -462 -512 -383 -61 323 459 485 331
4350 331 -22 -159 -500 -450 -392 -181 242 275 454 409 233 215 -492 -505 -427 -59 59 704 318 381 68 -57 -386
4373 -386 -174 -658 -776 48 -61 311 447 720 -53 -30 -460 -465 -468 -92 223 309 575 419 68 -184 -334 -484
4395 -484 -440 -254 100 477 498 413 136 -64 -329 -539 -500 -123 90 409 497 411 183 -81 -416 -480 -518 -215 137
4418 137 270 399 499 181 122 -313 -506 -458 -354 -56 204 489 517 346 39 -248 -473 -498 -277 -138 199
4439 199 539 432 354 201 -293 -549 -567 -388 -188 126 452 554 260 394 -8 -512 -330 -560 -333 117 474
4460 474 926 308 480 65 -366 -555 -285 -850 436 450 476 768 669 35 -231 -153 -503 -448 59 187 645
4481 645 163 -71 55 -83 -336 -569 -194 -123 282 196 -40 625 112 -193 -419 -614 -860 -318 694 341
4501 341 285 531 197 -74 -287 -779 -562 -329 183 -183 765 130 661 -136 241 -701 -735 -454 268 -70 116
4522 116 901 1150 -280 -243 -594 -450 -292 -470 150 109 769 587 2 -71 -238 -534 -409 -23 217 365 677
4543 677 395 -109 151 -462 -641 -42 -349 -281 172 958 781 95 816 285 -380 -721 -481 181 227 406 647
4564 647 628 183 -104 -609 -237 -398 -177 204 480 571 493 272 330 -964 -557 -167 -682 390 775 460 415
4585 415 417 21 -586 -778 -286 -804 -184 251 74 313 35 -249 -496 -133 -445 -707 304 589 412 212
4605 212 415 42 -903 -435 -229 -605 529 1086 282 112 1209 -82 -892 -273 -587 -228 -253 505 286
4624 286 377 473 -58 -335 -362 -335 -494 -209 11 115 198 605 129 -408 -295 35 -21 -407 -267 474 394 703
4646 703 316 11 -483 -632 -371 -476 -156 174 414 854 505 -241 -308 -427 -606 -260 30 -19 538 755 141
4667 141 157 -23 -370 -666 -360 -189 4 373 617 358 -59 -78 -242 -544 -162 -22 -52 221 509 279 285 -117
4689 -117 -13 -1059 -154 246 -4 141 616 369 64 151 -157 -371 -372 -151 -172 197 553 361 135 142 -146 -349
4711 -349 -366 -280 -282 133 518 343 274 152 -140 -398 -439 -229 -181 159 336 222 327 295 -17 -390 -410 -289 -271
4734 -271 -28 635 220 191 184 -138 -500 -365 -249 -360 143 284 355 424 356 55 -279 -361 -240 -262 4 241 319
4757 319 382 384 97 -131 -437 -432 -343 -203 215 345 386 350 85 -228 -256 -346 -286 -149 190 334 401 423 160 -223
4781 -223 -282 -292 -436 -155 23 211 421 436 266 -37 -115 -306 -340 -184 9 212 335 386 313 -28 -70 -184 -373
4804 -373 -291 -127 240 246 339 402 97 -58 -345 -447 -270 -149 10 336 378 355 110 -54 -290 -337 -361 -54 -2
4827 -2 72 380 345 147 61 -265 -450 -374 -353 5 228 299 403 181 157 -96 -496 -280 -146 61 59 291 214 284
4851 284 41 -133 -315 -380 -270 -217 105 282 453 288 127 13 -209 -277 -224 -35 83 464 382 351 186 0
4873 0 -231 -298 -336 -166 -57 294 285 421 192 45 -352 -371 -301 -213 72 357 319 406 379 24 -140 -373 -444 -397 -181
4898 -181 138 294 328 343 -12 -181 -206 -383 -262 -116 133 371 351 256 110 -104 -217 -337 -385 -132 100 240
4920 240 371 518 231 -50 -150 -415 -461 -173 65 68 358 372 206 -58 -210 -187 -387 -248 21 203 373 256
4942 256 281 59 -22 -216 -360 -310 -22 22 287 474 183 59 -38 -218 -519 -246 -57 3 198 428 246 154
4964 154 30 -336 -479 -288 -117 -45 196 394 335 268 144 -193 -451 -231 -270 -118 196 302 429 179 147 -36
4986 -36 -330 -411 -140 -238 126 318 455 304 113 -40 -411 -364 -193 -245 13 463 363 328 183 -75 -289 -279
5008 -279 -211 -351 95 311 163 252 288 -52 -220 -282 -169 -230 25 263 210 182 326 53 -342 -310 -330 -266 43
5031 43 375 258 281 365 73 -175 -158 -264 -327 -47 225 269 241 334 123 -68 -178 -393 -289 -66 189 170 406
5054 406 424 119 -111 -259 -211 -312 -20 65 137 237 442 231 -46 -196 -271 -333 -185 27 213 294 401 136
5076 136 -2 68 -228 -404 -70 72 -20 186 452 110 -73 70 -247 -425 -240 -114 -50 276 543 215 -47
5097 -47 26 -285 -371 -263 -29 20 155 379 206 31 46 -222 -235 -241 -36 -125 115 331 216 109 102 -211 -350 -221
5121 -221 -129 -175 180 377 161 71 -54 -187 -369 -195 -88 -54 234 265 213 258 265 -109 -274 -220 -79 -192 175
5144 175 336 228 240 251 -77 -222 -200 -98 -178 20 195 235 224 259 -29 -327 -208 -211 -240 59 260 177 326 212
5168 212 5 -172 -244 -297 -253 -104 365 154 338 334 39 -152 -221 -206 -223 -30 213 186 200 321 100 -87 -71 -271
5192 -271 -343 22 132 81 266 391 48 -9 -184 -256 -216 -76 30 -14 308 400 71 -33 -187 -144 -432 -178 74
5215 74 109 230 335 161 -54 -124 -311 -395 -152 -10 49 203 328 227 -75 33 -245 -253 4 -67 -74 194 408
5238 408 107 180 -34 -250 -274 -214 -61 53 235 308 83 198 -26 -225 -326 -264 -112 -96 135 255 83 196
5260 196 149 -112 -276 -231 -189 -31 96 272 234 289 191 -203 -235 -219 -168 -202 114 228 290 276 197 -86 -272 -253 -225
5285 -225 -256 68 169 353 195 220 15 -284 -265 -169 -205 41 131 226 247 161 -24 -91 -140 -252 -181 -113 128 300
5309 300 89 160 55 -213 -130 -315 -203 -22 59 108 225 232 -25 -119 -228 -158 -199 -78 106 180 328 246 147 -8
5333 -8 -180 -226 -123 -265 116 169 305 295 187 -49 -147 -208 -181 -100 65 243 269 236 205 1 -80 -161 -249 -30 22
5358 22 125 249 431 74 -1 -142 -243 -197 -134 -97 145 221 129 209 187 -49 -190 -328 -315 -118 -3 142 272
5381 272 185 49 9 -161 -253 -200 -187 -49 134 231 263 50 36 -215 -406 -194 -111 47 145 216 303 168 35 -210
5405 -210 -198 -251 -173 -121 141 231 201 105 86 -136 -277 -318 -231 -60 -34 266 224 256 181 6 -197 -168 -265 -30 197
5430 197 305 96 48 211 -110 -102 -258 -136 -259 -75 274 213 257 100 -150 -126 -312 -162 -169 -180 129 178 259 338
5454 338 -31 -170 -126 -271 -224 -33 169 237 234 205 108 -46 -151 -225 -326 -69 132 102 180 347 7 -115 -152 -199
5478 -199 -348 -60 -64 190 143 -78 332 -233 6 -173 -357 -150 40 81 251 382 58 1 50 -158 -227 -93
5500 -93 1 -20 339 266 121 3 94 -162 -178 -341 96 160 120 344 119 82 -73 -130 -322 -147 -61 -36 117 272
5524 272 73 303 27 -156 -363 -133 -137 -78 76 369 178 189 65 -95 -285 -193 -159 -26 277 -82 151 287
5546 287 -80 -214 -230 -208 -194 -25 87 190 77 118 209 46 -550 -133 -56 -251 159 230 125 290 252 -319 -308
5569 -308 -48 -226 -200 42 182 94 137 112 -46 -107 -141 -299 -70 -220 -391 94 -97 87 -6 -344 -372 -88 -82
5592 -82 -145 102 182 321 197 64 -108 -10 -135 -291 212 287 -253 515 654 123 -107 -116 -383 -85 165 -487
5614 -487 151 433 299 -140 225 -333 -3 -595 257 508 572 -277 215 613 -210 -344 -48 245 -338 -140
5634 -140 -291 151 596 371 -473 -142 -92 -357 -151 22 426 118 225 367 52 103 -318 -230 -156 -5 47 167
5656 167 285 655 749 78 -605 -319 45 68 -227 1 145 315 -20 -104 42 -430 -156 -560 647 -192 348
5677 348 -594 -383 11 27 -62 -363 -68 -91 287 217 193 204 170 -17 -199 -185 -69 -139 276 225 214 90 7 -11
5701 -11 -185 -185 -108 -160 88 132 135 205 162 -184 -246 -149 -163 -202 -4 276 229 181 128 9 -102 -142 -166 -146 -6 198 128
5728 128 162 212 -41 -133 -161 -188 -148 -3 176 101 184 162 15 -60 -236 -283 -285 27 129 21 178 202 -36 -74 -152
5753 -152 -104 -166 34 44 400 -16 84 43 -143 -90 -203 -243 -152 122 72 131 239 -58 -43 -157 -119 -219 -93 3
5777 3 138 91 72 152 115 -46 201 -105 -411 190 -8 275 82 132 -68 34 -273 -195 -210 -45 3 185 306
5800 306 164 64 -53 -130 -322 -305 -44 13 184 230 205 13 -37 -56 -189 -152 -43 -64 139 137 149 72 28 -87 -214
5825 -214 -147 -178 -62 82 148 107 -18 70 -143 -180 -165 -163 13 352 -77 89 156 -62 130 -297 30 -127 -30 138
5849 138 103 -98 297 123 -39 -72 -219 -148 -60 22 120 66 109 115 -22 -159 -111 -178 16 32 141 123 199 205 -75 -146
5875 -146 -133 -103 -207 -88 -9 167 176 174 90 -154 -131 -121 -149 -39 14 248 332 122 97 85 -97 -217 -124 -83 127 143
5901 143 129 181 -5 -62 37 -145 -221 -48 56 76 215 174 -3 -32 -140 -153 -342 -83 -13 83 153 257 56 -44
5925 -44 -81 -228 -117 -42 -10 195 169 174 129 48 -158 -227 -157 -130 -13 128 139 185 65 171 -73 -165 -222 -114 -20 87
5951 87 84 233 129 69 55 -159 -256 -162 -117 16 263 262 227 71 30 -206 -218 -144 -109 -6 41 227 126 234 83
5976 83 -198 -39 -131 -127 17 -5 117 188 177 19 -161 -186 -179 -164 -9 20 158 204 210 92 -200 -155 -65 -205 -111 124
6002 124 317 145 121 246 -20 -23 -65 -167 -203 115 111 147 222 213 58 -178 -57 -109 -152 -42 286 164 195 156 -121
6027 -121 -162 43 -217 -119 89 207 188 135 188 -27 6 -73 -170 -154 29 52 70 137 219 56 3 -65 -193 -161 -19
6052 -19 70 86 144 222 14 -28 -41 -253 -257 -177 116 103 213 179 124 41 -61 -209 -291 -28 5 58 157 140 261 125
6078 125 -85 -226 -135 -182 -141 19 186 28 102 1 -383 -287 -249 -122 -63 112 345 280 46 -226 -80 -443 -176
6101 -176 -263 71 150 2 240 389 375 -236 42 -654 123 -335 -508 415 886 224 263 464 -84 -16 104 310
6123 310 212 99 -229 130 -61 402 -139 -100 -229 -88 -32 136 140 197 180 54 -129 -128 -51 -215 -103 101 108 138
6147 138 116 168 -65 -212 -154 -100 -168 105 196 88 203 160 -74 -46 -157 -262 -161 59 88 156 161 188 -102 -127 -170
6172 -170 -111 -158 35 31 78 342 19 -84 21 -172 -246 70 20 161 93 249 97 55 -12 -112 -160 -202 39 -41
6196 -41 -35 155 214 101 -7 -82 -217 -34 -140 -10 123 193 247 14 10 -123 -343 -60 -28 -8 53 250 216 -44
6220 -44 105 -164 -150 -196 -129 -47 106 160 268 78 115 -53 -183 -269 -24 -48 -43 169 178 -3 71 21 -162 -93 -180 -61
6246 -61 -22 170 153 146 114 5 -150 -166 -100 -49 8 222 206 92 116 46 -76 -67 -77 -191 49 11 229 192 38 126
6272 126 -18 -68 -96 -211 -86 111 90 177 41 165 -68 -203 -116 -172 -58 -36 105 121 215 130 -150 -261 -124
6295 -124 -61 -104 83 19 193 244 179 -61 -143 -115 -214 -66 17 124 102 254 219 -1 -203 -185 -218 -117 13 258
6319 258 9 219 23 -48 89 -5 24 -59 -51 92 68 15 -100 -57 54 -328 89 -237 -16 50 131 81 127 5
6343 5 20 -102 -366 -322 -246 190 121 216 -159 -26 105 -8 -113 -341 -231 13 200 354 118 -44 255 -247
6365 -247 -469 -124 -319 -44 98 243 196 231 24 -47 -476 16 -222 -231 126 1 191 146 189 -70 16 -250 -141
6388 -141 -69 4 42 252 171 28 -28 -181 -495 -163 -316 6 -545 517 -176 378 202 -746 -315 -858 174
6409 174 -459 265 662 -69 228 70 -70 -30 -152 -282 -82 199 -29 39 67 76 168 -174 -268 -204 -109 172 158
6432 158 294 90 -39 -128 -184 -137 -266 78 168 168 115 274 477 46 -88 -176 -258 24 -73 94 85 233 130 -12
6456 -12 -78 -146 -233 -134 -172 65 92 232 133 -127 -150 -20 -181 -123 -99 77 54 170 156 -122 -107 -122 -118 -150 -70 -20 143
6483 143 182 134 4 74 -144 -99 -81 -52 -12 130 303 262 196 9 55 -182 -96 -87 -46 54 115 293 171 122 -117
6508 -117 -128 -147 -136 107 219 129 328 359 212 -132 -478 93 59 -29 69 306 259 56 24 -216 -196 -147 -103 -105 -90
6533 -90 138 172 250 66 23 2 -138 -478 143 295 205 230 445 -30 270 -774 -275 -532 -48 269 11 -202
6555 -202 -709 225 588 -461 -995 -510 -559 -404 393 -341 603 240 177 330 496 -354 -1069 -64 297 697
6575 697 32 582 243 -298 235 -343 -213 -48 49 -610 127 363 -47 -62 -538 -737 -327 -5 -307 -152 522
6596 522 329 443 89 -264 -348 -459 226 -564 -432 363 676 -534 315 -557 -448 673 -223 -350 -441 -60
6616 -60 -131 -163 -112 208 346 165 -176 81 -253 -485 124 43 30 6 -74 -218 -77 -86 -173 132 155 70 119 -43 -156
6641 -156 -50 -182 -30 -123 -49 197 157 176 89 -38 -143 -61 -170 -145 58 198 25 129 131 -117 -292 -232 -92
6664 -92 -75 -398 507 16 124 -36 -549 -184 -409 221 -332 -91 213 -21 -46 669 157 -401 301 -73 211
6685 211 221 461 305 356 47 54 1 -244 -7 -150 -112 250 370 224 198 48 -77 -13 -51 -293 -145 218 151
6708 151 1 181 123 -113 68 -197 -133 -102 254 84 -201 618 -280 169 -63 -28 -150 -203 106 -35 70 45
6730 45 145 87 124 106 -465 107 -496 11 422 626 -173 84 -143 -252 -468 -364 -96 20 -12 143 137 232 100
6753 100 -372 -318 80 -243 -554 513 316 -366 -74 603 950 -503 1161 -111 -562 227 347 30 -166
6772 -166 -14 -110 -506 -139 337 111 -184 134 56 218 167 -194 -208 -101 -232 78 37 107 54 92 59 -230 -2
6795 -2 -363 238 -139 275 714 571 536 103 -311 361 50 23 -547 165 -182 535 723 -47 -438 -368 -35 -236
6817 -236 -219 40 56 43 264 120 -318 60 -719 -765 -214 -45 446 535 -15 -377 -232 -68 -310 11 -774 -20
6839 -20 88 184 93 -785 -280 260 -381 -357 -748 175 305 402 -857 -27 110 -83 -12 -249 -116 -230 293 23
6861 23 337 188 65 -104 -192 -44 -408 39 199 -545 -422 360 -18 46 -123 -634 -347 -158 -244 -19 576
6882 576 515 -313 387 -43 -413 -495 -186 235 -436 -38 245 97 265 186 -225 -153 -49 324 617 -338 202
6903 202 698 182 -86 -180 -975 82 -67 -74 135 15 19 397 -615 -383 -105 -423 -291 -34 258 522 -283
6924 -283 294 665 -1179 351 -719 106 73 -122 -65 -77 166 -261 -171 384 -473 475 229 -99 380 -178
6944 -178 129 108 652 -280 300 -460 -143 1026 575 284 89 -238 -342 -939 236 -88 -410 107 655 516
6964 516 68 -420 56 448 416 -559 -549 245 -544 384 72 231 -5 -65 -212 -86 -390 836 769 167 -180
6985 -180 -17 295 -134 -214 -280 77 -355 -70 164 33 -441 127 -127 -4 135 -441 -2 121 2 136 126
7006 126 281 267 -265 297 -49 83 113 737 -123 -504 390 4 294 -355 -101 65 -282 -25 -209 -192 246
7027 246 240 -711 -290 -11 -73 63 -125 199 177 140 55 103 -185 166 -332 259 1086 -127 -244 -31 50 -988
7049 -988 -4 114 -499 -87 -151 166 568 -56 492 141 -245 -480 -170 -138 -22 -121 330 311 -865 -135 336
7070 336 -967 -2 -135 -75 159 113 220 39 -288 -251 -1166 146 -48 -69 -11 329 -247 -34 113 -316 -423
7091 -423 113 174 -290 -688 169 81 450 -247 322 -164 -43 35 -227 580 -195 -153 -34 5 269 -110 -230 -78
7113 -78 -221 102 175 207 301 448 -248 -199 -661 -57 -75 -11 18 -251 47 240 -225 -289 -265 110 -312 -558 20
7136 20 41 147 3 -138 -70 17 -114 -156 -22 -19 80 183 275 140 139 -734 -184 6 15 -10 684 212 515 -535
7160 -535 127 260 -359 -205 -163 -30 -70 -80 129 106 80 67 -198 -191 -172 -39 -27 140 213 210 -10 -92 -80 -106 -156 -13
7186 -13 62 135 179 61 -65 9 -186 -179 -156 -64 22 204 2 311 -258 49 70 -136 132 -22 28 -62 0 225 -98
7211 -98 39 -290 337 -372 -522 -86 -222 81 -68 -26 67 107 -196 7 -100 -86 -99 185 80 210 12 18 -221
7234 -221 -315 -235 71 35 96 124 36 162 60 -41 -105 -104 -168 52 -87 177 67 112 72 -82 -63 -118 -36 95 93 103
7260 103 216 206 25 -81 -114 8 -132 19 123 172 58 217 -220 206 -146 68 189 -66 148 152 -54 -323
7282 -323 391 211 44 32 31 -371 -114 -51 360 -66 70 -212 -664 -503 -35 90 359 204 62 -231 108
7303 108 384 -48 -25 -311 -206 65 -89 115 152 247 98 130 -267 -308 -221 -288 -101 94 323 206 197 106 -104
7326 -104 -264 -115 -162 51 -46 221 -158 -33 -185 -173 -39 -112 -218 -22 270 -377 65 63 -588 -169 -291 -154
7348 -154 141 -31 139 29 96 152 153 -99 -113 -78 95 -94 61 196 172 104 -164 -287 -587 -6 -26 -324 139
7371 139 303 -42 38 236 -28 127 65 -85 -82 447 403 27 112 95 8 17 -92 -124 -96 12 138 114 206 183 -156
7396 -156 308 761 -171 -222 67 18 -210 317 461 397 -173 101 -203 -22 -180 -145 -146 304 391 -477 35 -524
7418 -524 515 232 -141 -362 -26 -156 -67 218 -120 57 29 -208 -79 19 41 181 86 58 -23 -7 -194 -5
7440 -5 -451 712 -311 92 400 -400 268 119 29 -10 -39 33 54 -27 150 7 151 -95 -94 -153 -75 -8 141 11
7464 11 243 -8 87 -473 6 249 -343 78 -16 204 46 175 1 58 -145 -181 -4 -28 -39 192 82 154 -9
7487 -9 20 -28 -59 -41 -14 88 46 25 163 85 -89 -88 -152 60 -164 81 -60 175 48 313 120 -56 -125 491 -239
7512 -239 -308 329 -79 -67 -44 124 -514 247 77 -105 258 253 -53 247 -5 47 -105 -36 -83 3 -197 29 -81
7535 -81 126 128 61 27 -82 -67 -25 -122 -18 -86 160 165 32 -14 -164 -99 -133 -95 22 40 118 118 16 86 -91 -71 -118
7562 -118 -103 -108 3 -50 21 39 29 6 -80 -126 -82 -358 -675 317 418 189 -139 220 241 252 -319 -219 -8 -788
7586 -788 143 421 -126 -337 -267 188 -478 233 -617 -227 614 -105 697 -139 476 97 239 -216 -221 512 568
7607 568 -55 147 -1 -775 364 -426 -900 -709 -200 61 168 -395 441 -61 -809 -608 -194 -462 -151 -103
7627 -103 -243 3 -395 -22 -243 -115 65 -213 -175 -262 556 -593 -650 -272 -450 -178 -21 -532 212 163 45
7648 45 230 136 561 295 -563 239 -370 -269 6 118 213 -97 312 131 -363 -94 -45 -141 167 -457 7 357
7670 357 259 -358 571 408 -247 133 64 -120 12 90 -86 124 88 202 387 81 115 -167 -121 60 151 -182
7692 -182 200 -153 123 194 -174 -65 60 172 89 -51 -655 105 14 -28 -35 52 133 63 271 152 -36 -109 -181 -93
7716 -93 61 -64 157 10 163 66 79 35 -193 -70 -80 -119 -97 15 148 51 -43 -32 -112 -104 -50 -56 25 10 193 71
7742 71 6 -95 -121 14 -165 52 -8 59 -30 100 34 48 -56 107 -120 50 63 -14 43 53 64 4 24 41 -117
7767 -117 -72 15 -1 65 109 -17 -56 -104 -62 -83 -153 -77 7 5 95 43 9 61 -98 -149 -81 29 -36 71 5 132 22
7794 22 -1 -126 -16 -23 -101 -2 121 29 192 55 35 -119 -47 -92 -79 -103 -54 7 70 45 103 8 -154 -89 -146 31 -51
7821 -51 158 151 118 85 5 -29 -62 -32 -40 43 18 48 63 110 -54 -49 -6 -128 107 40 -39 95 -62 144 -85 10 -201
7848 -201 -38 -16 97 31 107 -3 43 -22 -68 -70 -31 -41 27 -21 60 8 23 -46 -116 -55 11 -66 137 45 8 28 -41 77
7876 77 -81 -39 -115 -33 -30 -41 76 6 -5 22 29 21 -119 -190 -128 -35 76 205 123 15 -68 -5 -125 27 -54 -23 135
7903 135 219 106 20 -2 -221 52 -69 -146 -42 -42 24 -13 173 43 -214 -40 -172 -47 157 -21 43 158 110
7926 110 32 9 16 -168 -61 59 -69 43 18 113 20 -89 -110 -64 -60 -52 33 -80 132 17 42 39 44 13 -8 -48 -35 7
7954 7 150 165 160 5 46 -16 -73 -35 -14 5 -53 16 90 51 -28 107 -223 -30 -8 -66 -35 138 67 21 45 -12 -54 -43
7982 -43 -43 17 34 25 192 16 105 -35 -37 -190 -34 -45 -13 -6 70 33 32 -42 -19 -24 -42 0 -67 24 195 38 -65 54 -92
8011 -92 -81 -152 -16 1 124 31 123 109 97 -1 -28 -46 -4 -133 124 81 -21 -74 63 -25 -24 -66 -21 12 18 6 69 -9
8039 -9 -52 30 -232 -159 -46 -34 33 144 -17 42 13 -84 -134 -116 -64 47 45 131 27 15 109 120 11 -49 -78 -14 -81 55
8067 55 43 39 121 -78 -63 55 -132 -36 -72 10 71 11 166 20 106 11 -1 -28 -27 -14 30 149 127 -11 -174 -29 -114
8094 -114 -72 -138 56 -106 52 -205 58 -100 -323 -51 -143 -39 91 31 62 -59 72 31 -82 -22 -99 -73 -88
8117 -88 -441 475 4 -456 -403 266 34 -59 -214 -328 -21 482 297 -51 -53 -313 80 -597 177 -463 347 416
8139 416 146 572 -312 -688 544 -276 -504 248 457 -619 -654 429 -18 153 549 573 264 -521 -30 660
8159 660 210 177 -375 -112 73 152 -108 261 -158 34 430 99 -423 38 23 -40 -57 -39 -19 75 91 -34 154
8182 154 -29 -46 3 -48 -148 -19 18 -10 -1
8191a
$$ Imaginary data points
##PAGE= N=2
##DATA TABLE= (X++(I..I)), XYDATA
0 0 0 0 0 0 0 0 0 0 0 0 0 0 0 0 -8 8 -8 8 -8 16 -16 16 -24 24 -32 36 -40 48 -56 64 -72 83 -96 107 -122 138
36 138 -154 171 -194 216 -242 266 -298 330 -362 400 -442 485 -534 589 -652 717 -791 871 -963
55 -963 1067 -1186 1321 -1479 1664 -1890 2166 -2517 2974 -3603 4526 -6010 8796 -15839 72986
70 72986 98946 -49435 -9538 5905 -56973 -67083 2903 13890 27569 38058 -2038 -20458
82 -20458 30254 9671 -47508 -28641 -8897 -39625 6052 69076 34376 20349 71240 4003
94 4003 -113555 -70730 20251 -6982 -18148 47658 56653 9238 -11028 -30438 -30331 13000 2732
107 2732 -48103 -4496 58434 21366 3025 53264 24641 -51136 -42534 -30398 -62205 -12148
119 -12148 71979 46235 169 24235 11783 -44664 -39819 -9166 -3625 20218 29142 -5903 8918
132 8918 53713 9282 -46593 -13087 -4958 -59467 -40267 29124 33743 28649 50668 16571 -38018
145 -38018 -26809 -14829 -33512 -4263 39713 24447 10334 22129 -1939 -24706 -3189 -12985
157 -12985 -48733 -20093 20187 3277 10008 54691 38130 -11453 -15306 -21331 -44774 -18575 20986
170 20986 16199 19589 37253 7112 -27475 -14110 -13423 -34403 -13827 12674 1130 9924 40741
183 40741 27187 1319 5607 -10770 -42933 -27801 245 -927 15076 42025 20662 -11315
195 -11315 -8632 -16600 -36605 -18336 7550 4602 13997 33932 21085 3725 8528 -4742 -31280
208 -31280 -26079 -11557 -11269 6885 30668 21294 7741 8738 -11568 -37466 -23029 -304 -1025 9340
222 9340 31520 27058 10832 5452 -7894 -24207 -20769 -15890 -17579 85 22787 20534 13752 14673
236 14673 -1430 -22454 -20921 -14344 -12591 6122 27929 24395 14177 12860 -270 -21442 -26225
249 -26225 -20601 -15435 -2228 12829 17095 20232 20427 3919 -14192 -16424 -15988 -17039 -3796 15339
263 15339 21431 20457 17229 3277 -14260 -21546 -23216 -21640 -8849 8571 18034 21864 21261 10415
277 10415 -3872 -13448 -19464 -19843 -8710 5941 14785 19876 20304 9840 -5883 -17511 -23408 -23223
291 -23223 -13769 1089 14042 22909 24443 16150 2755 -9438 -18865 -21859 -15247 -2581 9762
304 9762 18243 20580 14635 2321 -11356 -21360 -23790 -17526 -5324 8720 20649 25533 20875 9145
318 9145 -4565 -16455 -22659 -20300 -10032 3559 15136 20601 18214 8899 -4378 -16959 -23223
331 -23223 -20285 -10302 3059 16264 24832 23991 14336 617 -12898 -22045 -22984 -15936 -3247 10472
345 10472 19959 20817 14032 2162 -11068 -20935 -21091 -15010 -3205 11832 23006 22970 16533 8144 -6985
360 -6985 -21703 -26069 -19226 -8577 4082 16135 22110 19817 10244 -6211 -18808 -20114 -16504 -11614
374 -11614 5042 20962 23709 19520 12139 -3153 -18779 -23157 -20678 -16117 -1244 15716 20712
387 20712 18802 15036 3145 -11903 -18470 -20370 -16343 332 16817 18802 20393 20914 2925 -18467
401 -18467 -21952 -21266 -20028 -5211 13143 17107 18800 21048 7041 -10684 -12633 -16371 -22114 -8357
415 -8357 9848 13908 19842 25283 9428 -13062 -17394 -22730 -27450 -9627 11681 14973 20807 27017
429 27017 9116 -10156 -8100 -13478 -24280 -11279 6735 7169 14395 26635 13427 -4152 -7655
442 -7655 -19098 -34093 -17620 6397 10980 20459 31139 14283 -3761 -6505 -19917 -29795 -6535
455 -6535 9739 -3004 4718 28806 15376 -6352 -2788 -8226 -25125 -20166 -6786 -2548 19141
468 19141 40048 21158 602 598 -15873 -35188 -17518 924 -379 17392 29745 2341 -9522
481 -9522 11960 -1092 -33118 -17562 6222 -4770 -1812 22265 25204 19341 13311 -17760 -37611
494 -37611 -14984 -6686 -17524 11355 41144 17910 -2428 2958 -11283 -27009 -3211 3964 -16930
507 -16930 273 31441 14984 -1398 15343 11005 -17879 -25811 -27960 -21907 14730 31779 8483
520 8483 12499 31236 -7984 -46220 -16225 7613 -8274 3007 24000 7825 2617 18676 135
533 135 -22488 -5548 -4483 -28881 -16171 14566 19229 26638 29219 -5819 -24283 -5243 -17513
546 -17513 -37884 6807 46015 13827 -7472 13557 4501 -18840 -10376 -7055 -18345 -1815 9365
559 9365 -5258 9964 38374 17194 -11416 -7563 -19773 -34985 -4290 18626 5401 20778
571 20778 38344 -3932 -37135 -8580 1529 -20700 -7874 14584 5532 7234 18876 4730
583 4730 1040 14561 -11022 -40818 -15567 7675 -2564 14331 38686 13061 -12807 -6033 -20030
596 -20030 -35134 -1422 22352 3034 5395 24367 7218 -8568 3813 -3437 -19938 -8096
608 -8096 -6227 -18372 7794 36149 15222 -389 9596 -11385 -38396 -16981 5361 1580 17235
621 17235 32091 6740 -8799 3480 -7868 -24009 -5618 2207 -12680 227 20389 9227
633 9227 7545 19631 -2760 -28771 -15670 -7450 -14201 9705 33807 16720 3294 7246 -12382
646 -12382 -29209 -9935 212 -9018 4962 19734 5403 3669 17488 1735 -17247 -8714 -9608
659 -9608 -20793 -1780 21800 15722 13379 17090 -5566 -25251 -14672 -10808 -15189 6144 23269
672 23269 9946 5372 13895 318 -13993 -6116 -8227 -18135 -3580 11770 6935 12372 22489
685 22489 4896 -15265 -13197 -15981 -20192 -933 16035 11867 14746 19273 66 -14760 -7876
698 -7876 -8900 -17229 -5089 8214 5850 10901 18347 6335 -5500 -5426 -14375 -22822 -7913 7785
712 7785 8832 15813 21667 7507 -6744 -8163 -14826 -19446 -6178 5298 4701 11207 18249 8379
726 8379 -2125 -3740 -11275 -18287 -10023 -272 3450 13772 21035 11404 513 -3826 -13638 -20630
740 -20630 -11644 -1171 3516 12183 18225 11026 2626 -1711 -10734 -17185 -11126 -4195 188 10405
754 10405 18108 13335 5790 -359 -9997 -17724 -14292 -7540 -643 11093 17262 14020 7860 1775 -8496
769 -8496 -15987 -13985 -8009 -2113 7847 14660 13898 9707 3558 -7153 -15315 -14813 -10232 -4228 5547
784 5547 14235 15893 11890 4509 -5388 -12875 -14453 -12315 -6256 4207 12802 14577 11931 6513 -2805
799 -2805 -11469 -15040 -13308 -7010 2278 10855 14718 13694 8396 -825 -9952 -14481 -13803 -8884 -237
814 -237 8486 13912 14473 9715 814 -8094 -13314 -14254 -10472 -2011 7281 13414 14541 10552 2757 -5889
830 -5889 -12794 -15065 -12238 -3065 4964 11286 14628 12691 5066 -4351 -11439 -14281 -12324 -5799 3037
845 3037 10502 14639 13197 6051 -2445 -9583 -14104 -13791 -7464 1542 9007 13826 13904 7891 -437 -7723
861 -7723 -13585 -14665 -8831 -293 6828 12748 14716 9563 1567 -5995 -13092 -15182 -9421 -1804 5076
876 5076 12349 15441 10231 2681 -3983 -11279 -15412 -10780 -3755 2164 10337 15190 11454 5059 -1105
891 -1105 -10339 -15562 -11306 -5294 14 9918 16491 11994 5033 -232 -9000 -14906 -11303 -6678 -1937
906 -1937 8649 14951 10209 6651 4748 -5625 -14863 -12568 -8408 -4471 6529 14398 11694 9556
920 9556 6640 -7217 -17157 -11733 -6838 -5027 4887 13375 11265 9622 6680 -5778 -12303 -7037 -8871
935 -8871 -12189 805 13898 11682 9869 9691 -1439 -11482 -11222 -13762 -12072 5452 16105 8968
949 8968 7941 11008 -802 -12122 -9834 -9835 -9568 2166 7426 2778 10751 18199 2497 -11472 -7738
964 -7738 -9746 -15303 -4242 7878 10091 16810 15983 -3873 -12754 -4366 -9458 -16662 -1689 11100
978 11100 6163 7536 11337 1783 -1740 1432 -12096 -21117 -3964 7001 982 9521 21388 9005
992 9005 -5234 -8067 -16812 -17800 950 7575 442 10961 19658 1905 -9064 -785 -4373 -12597
1006 -12597 -5146 -2821 -5040 10944 20864 4858 -695 6431 -9224 -25535 -11673 2495 3753
1019 3753 14543 18855 2624 -2357 2419 -11683 -19326 -447 5525 -5718 2274 13502 5955
1032 5955 5359 9346 -7855 -18713 -6057 -5732 -12110 8886 26385 11846 1191 2572 -11352
1045 -11352 -19574 -5421 -1490 -4750 10850 16723 -970 -1374 10914 -851 -13107 -4830 -6522
1058 -6522 -13714 2911 15784 7300 10434 15862 -6617 -23134 -10747 -5794 -8627 8420 18778
1071 18778 6014 4022 7656 -7634 -13236 1305 -2338 -13770 14 10472 1776 7905 17851
1084 17851 1290 -12502 -6768 -13212 -18815 3092 17751 8767 10065 13404 -6122 -15918 -4013
1097 -4013 -5437 -10733 4298 9975 -1665 4407 14725 1603 -6288 589 -9187 -19872 -4114
1110 -4114 8097 4291 13247 20410 1429 -11481 -6483 -12137 -15530 2924 11117 1833 6969 12840
1124 12840 -1406 -6658 2476 -5077 -14779 -3874 1549 -2708 9973 20095 5998 -2960 -296
1137 -296 -12702 -21052 -4841 5779 3124 11635 15884 388 -5497 578 -7670 -13699 -781 2861
1151 2861 -4112 5215 14435 5708 2394 4814 -8781 -18132 -7528 -2500 -3430 10572 19273 6893
1165 6893 -476 646 -9300 -14725 -3704 300 -2430 7041 12662 3251 1831 5917 -4408 -13186
1179 -13186 -7169 -5737 -6901 5901 14970 8593 6492 6155 -7149 -15591 -7595 -3881 -4153 6574
1193 6574 12632 5802 3941 4630 -4889 -10593 -5298 -5955 -7703 2801 10671 7330 8208 8925 -2350
1208 -2350 -11019 -8612 -8675 -7846 3450 10997 7780 7445 6796 -3533 -9699 -6541 -6835 -7134 1622 8013
1224 8013 6629 8488 9055 161 -6791 -6987 -9677 -9944 -623 6884 7546 9533 9061 221 -6625 -7133
1240 -7133 -9254 -8658 -123 6018 6344 8920 9449 2039 -4455 -6188 -9198 -9802 -3547 2805 5781 9847
1256 9847 10186 3366 -2866 -5554 -9495 -10083 -3560 2783 5853 9425 9778 4179 -1578 -5118 -9277 -10296
1272 -10296 -5330 368 4470 8632 10107 6041 635 -3959 -8724 -10052 -5961 -794 3809 8552 10317
1287 10317 6590 1083 -3640 -8197 -10248 -7363 -2425 2805 7894 9929 7565 3288 -1884 -7143 -9759
1302 -9759 -7735 -3307 1624 6862 9499 8062 3954 -1473 -6760 -9677 -8641 -4615 507 6091 9281
1317 9281 8205 5026 140 -5154 -8888 -8588 -5656 -715 4839 8746 8572 5775 1127 -4504 -8605
1332 -8605 -9256 -6418 -1687 3981 8225 9316 7166 2729 -3138 -7480 -8885 -7384 -3234 2572 7230
1347 7230 8450 7246 3570 -2230 -7204 -8918 -7624 -3905 1678 6653 8807 8470 5075 -938 -6181
1362 -6181 -8370 -8179 -5581 -94 5324 8070 8494 5340 -223 -5074 -7451 -8395 -6501 -528 5930 7363
1378 7363 8302 7084 1359 -3733 -7080 -8790 -7453 -1587 3349 5788 7926 7899 2765 -3122 -6772 -8677
1394 -8677 -7052 -1666 2245 5207 9533 9446 1916 -3567 -4421 -7000 -8949 -4721 1029 4613 8056 8117
1410 8117 3498 -5 -2545 -7744 -9893 -4322 1095 4173 8347 8744 3785 685 -2282 -9556 -10882
1425 -10882 -2786 1200 164 4874 10128 6446 923 -1850 -5858 -7377 -4683 -3736 -753 8111 11105
1440 11105 4695 1479 129 -6988 -10670 -5668 -2859 -616 7807 10449 2988 1217 3501 -2862 -9624
1455 -9624 -6255 -2398 -1048 3436 6083 5507 7285 4209 -7703 -11088 -4250 -4324 -5411 5145 11619
1470 11619 6315 3732 3318 -4829 -8188 -2873 -3293 -6162 1920 7646 4252 3952 4861 -1465 -5188 -5032
1486 -5032 -9842 -8045 5690 9657 3374 6992 9879 -3005 -11061 -5249 -4046 -5321 2202 5829
1500 5829 2005 4550 6621 -1576 -4947 -1375 -5766 -8839 -561 4061 3514 10373 11470 -1842 -6894
1515 -6894 -2475 -8364 -11882 1108 8598 3218 4260 6768 -763 -4023 -691 -5156 -7319 703 1799
1530 1799 -1448 6864 11858 2491 -1646 -399 -9824 -13890 -1902 3464 953 8580 12263 158
1544 158 -5263 -946 -5185 -7777 726 2405 -1500 5080 8395 783 1029 4096 -6320 -12664 -4239
1559 -4239 -1928 -3230 8082 14291 4050 -356 1179 -7721 -11484 -977 2265 -813 5847 8413
1573 8413 -245 -290 4191 -4143 -9076 -2481 -3593 -6726 4309 11326 5200 5336 6231 -6228 -12636
1588 -12636 -4287 -2302 -3504 6815 11033 1918 399 2736 -5717 -8222 -507 -2418 -6549 2706
1602 2706 7926 2819 5743 9049 -1625 -8515 -4937 -7385 -8080 4594 10405 3837 4691 5653 -5584
1617 -5584 -10045 -2697 -2895 -4735 3829 6878 1293 4649 8294 -668 -5337 -1942 -6875 -10307 -532
1632 -532 5661 3845 8193 9071 -2534 -7551 -3695 -6531 -7483 3527 7896 2899 5001 6904 -1156
1647 -1156 -4261 -1206 -5870 -8910 -1247 2161 467 6981 10450 1736 -3217 -2473 -8049 -9661 170
1662 170 4937 3335 7715 8543 -594 -4509 -2097 -6025 -8076 -1314 1306 73 5540 8667 2766
1677 2766 307 422 -6421 -9731 -2835 821 1477 7593 9804 2401 -1770 -2328 -7436 -8944 -2199 634
1693 634 437 5808 7986 2823 1133 1251 -4583 -7960 -3823 -1791 -866 5430 8565 4145 1607 -49
1709 -49 -6576 -9207 -4457 -1511 118 5791 8144 4269 2498 1350 -4265 -6828 -3818 -2796 -2268 3386
1725 3386 6796 4423 3204 1572 -4152 -7482 -5459 -3901 -1603 4607 7619 5449 4162 2272 -3321
1740 -3321 -6498 -4864 -4032 -2638 2283 5410 4370 4123 2752 -2331 -5677 -5186 -4691 -2824 2274 5891
1756 5891 5821 5483 3362 -1940 -5283 -5333 -5338 -3807 915 4343 4690 4680 3500 -690 -3968 -4612 -4881 -3529
1774 -3529 724 4065 5178 5853 4218 20 -3599 -4946 -5852 -4592 -933 2645 4060 5363 4462 981
1790 981 -1710 -3992 -5010 -3842 -505 2421 4993 5965 4551 1279 -1506 -4523 -6314 -5610 -2263 1639
1806 1639 3520 5628 4943 2898 -461 -3997 -5122 -3635 -2098 862 3643 5109 4462 2513 230
1821 230 -3109 -4884 -4959 -2922 -207 3370 5433 5528 4118 957 -1772 -4146 -4971 -3044 -1199 1315
1837 1315 4101 4775 3371 581 -2448 -4293 -5184 -3836 -1232 1715 4272 5369 4314 2209 -57
1852 -57 -3509 -4404 -4052 -2239 209 2638 4980 3673 1898 -33 -3328 -4730 -3829 -2455 -105 2662
1868 2662 4760 5256 3207 441 -2285 -3593 -4401 -3302 -1975 1426 4431 3083 1935 1937 -1394 -4059
1884 -4059 -4697 -3140 -963 1416 4334 4336 3803 2746 -1429 -3630 -4207 -4503 -2950 423 1808 3279 4079
1901 4079 2991 -1221 -3580 -2657 -2869 -3752 -36 3227 4237 3814 2614 -267 -1837 -3304 -5033 -4657
1917 -4657 -202 2983 2831 4104 3825 781 -1560 -1671 -3897 -3856 322 2143 2153 3281 5046 2585 -2197
1934 -2197 -2726 -4409 -4799 -2171 43 2139 5984 5287 398 -860 -707 -3823 -5225 -1070 1282 1202
1950 1202 3586 4874 1298 -579 -326 -3474 -5854 -3452 -398 347 3936 5008 3250 1798 -440
1965 -440 -5461 -6007 -1148 337 -1000 3765 5859 1560 -631 304 -2979 -5029 -2440 -1535 -1515 2899
1981 2899 5446 3338 2616 1952 -3320 -5597 -3233 -2657 -1603 4548 5843 1462 1158 1728 -3833 -6060
1997 -6060 -1613 -974 -1915 2254 4625 2511 3286 3664 -1691 -4717 -2861 -4319 -4014 2425 5669 2817
2013 2817 3780 3576 -3973 -5918 -1730 -2167 -2952 2765 5102 1607 2516 3850 -911 -3431 -1493 -3946
2029 -3946 -5326 273 3368 2096 4899 5428 -1341 -4681 -2616 -4482 -4533 2584 5239 2160 3504 4034
2045 4034 -1749 -3528 -864 -3318 -4902 174 1705 106 4268 6372 807 -2073 -1224 -5011 -6312
2060 -6312 238 3183 2124 5402 5850 -1488 -3617 -1448 -4201 -5079 604 1881 -407 3414 5313
2075 5313 661 -165 1224 -3901 -6586 -1601 622 176 5218 6937 996 -1518 -1466 -5742 -6352 -20
2091 -20 1721 181 4028 5357 172 -294 1524 -2730 -4826 -869 -1150 -1716 3372 6158 2201 600
2107 600 1104 -4723 -7081 -2048 -818 -61 4829 6316 1363 757 1576 -3951 -3943 -786 -1708 -2214 1765
2124 1765 4574 1595 1780 2599 -3160 -5963 -2911 -2619 -2125 3765 6373 2902 2179 1620 -3676 -5391
2140 -5391 -1631 -1373 -1961 2445 3916 881 2076 2820 -1607 -3945 -1752 -3165 -3519 1504 4572 3634
2156 3634 3132 3106 -2030 -4589 -2849 -3874 -3143 1979 4089 1616 2090 2598 -1498 -3142 -1117 -2966
2172 -2966 -3031 991 1992 1961 3603 4435 -995 -3517 -2777 -4282 -4414 658 3117 2233 3806 3422 -883
2189 -883 -2514 -1200 -2856 -3095 657 2174 1231 3135 3648 409 -1338 -1511 -3684 -4588 -1002 1559
2205 1559 1886 3779 4266 879 -1235 -1585 -3403 -3653 -306 1071 1085 3079 3542 673 -754 -1068 -3137
2222 -3137 -4029 -1468 94 1032 3407 4287 1855 365 -480 -3099 -4015 -1916 -218 636 2978 3364 1826
2239 1826 371 -658 -2544 -3553 -2260 -726 -138 2632 3400 2468 1119 118 -2441 -3675 -2471 -1380
2255 -1380 -210 2280 3398 2279 1346 241 -2217 -3218 -2415 -1361 -454 2129 3299 2719 2001 917
2271 917 -1697 -3122 -2754 -2240 -830 1357 2788 2616 1807 1226 -1299 -2854 -2404 -2414 -907 1191 2686
2288 2686 2631 2469 1309 -765 -2410 -2971 -2690 -1723 278 2045 2750 2728 1729 -311 -2073 -2521 -2563 -1630
2306 -1630 183 2070 2741 2871 1907 -50 -1573 -2565 -2946 -2306 -532 1487 2481 2714 2296 770 -1151
2323 -1151 -2259 -2806 -2249 -673 986 2014 2859 2517 965 -1048 -2218 -2840 -2630 -1286 667 2059
2339 2059 2888 2670 1350 -457 -1644 -2371 -2744 -1638 237 1686 2668 2561 1402 94 -1374 -2781
2355 -2781 -3036 -1701 -77 1176 2370 3033 2096 554 -1090 -2448 -2918 -2132 -992 769 2054 2917
2371 2917 2119 738 -810 -1906 -2894 -2121 -1363 407 2329 3118 1943 923 98 -1788 -2938 -2812 -1265
2388 -1265 75 1790 2654 2397 1547 283 -1788 -2750 -2303 -1391 -344 1415 2550 2439 2011 897 -1576
2405 -1576 -2574 -2079 -1467 -1121 933 2537 2274 1902 758 -1274 -1804 -2272 -2211 -1398 1043 2817 1940 1940 1630
2424 1630 -601 -2270 -1989 -2398 -1885 546 1942 2382 2666 2244 278 -1487 -2150 -2471 -1762 362 1681
2441 1681 1795 2721 2051 -859 -1602 -1465 -2419 -2561 -104 1262 1551 2030 2624 550 -972 -1137 -2540 -3098
2459 -3098 -383 1434 1752 2802 2832 438 -1387 -1327 -2478 -3213 405 1261 416 2628 2532 731 -558
2476 -558 -204 -2092 -3025 -1233 15 558 2765 3446 1366 -388 -955 -2116 -3006 -705 -58 876 2187
2493 2187 3211 812 105 299 -1617 -2996 -998 -408 -745 2080 2964 1219 771 815 -2153 -4059 -2084
2510 -2084 -92 -112 2040 4050 936 144 586 -2376 -3284 -759 -443 -964 1528 2741 822 958 1504
2527 1504 -1568 -3334 -1698 -964 -1993 1807 3434 1773 1409 1393 -1850 -2964 -1212 -1529 -1196 1349
2543 1349 3169 105 993 1949 -1296 -1381 -1052 -799 -2291 578 2192 1543 2720 2522 -360 -3105 -1597
2560 -1597 -2251 -1874 1266 2802 1424 1569 1737 -1195 -2083 -499 -1329 -2427 471 1370 964 1955 2655
2577 2655 -624 -1602 -680 -2743 -3215 139 2086 1281 2406 2675 -705 -2000 -746 -1874 -2328 534
2593 534 1346 75 1536 2668 250 -615 -129 -2305 -3343 -673 524 -88 2488 3700 487 -1046
2609 -1046 -695 -2453 -3034 -36 1045 292 1977 2471 -61 -614 293 -1514 -2698 -785 -209 -631 2076
2626 2076 3262 998 154 128 -2428 -3344 -668 -51 204 1949 2930 559 -283 310 -1619 -2464 -450
2643 -450 -162 -855 1200 2547 1072 924 1154 -1446 -2947 -1415 -1031 -963 1708 3062 1298 585 475
2660 475 -1671 -2810 -776 -527 -814 1426 2362 874 951 1446 -799 -2229 -1182 -1412 -1602 877 2267
2677 2267 1579 1650 1401 -1037 -2419 -1365 -1351 -1198 1008 2159 1103 1256 1252 -716 -1714 -970 -1498 -1713 164
2696 164 1545 1264 1736 1825 -40 -1575 -1293 -1920 -1929 273 1636 1310 1771 1663 -227 -1513 -1059 -1552 -1705
2715 -1705 72 1164 840 1560 2029 435 -857 -961 -1920 -2052 -463 819 1018 1905 2131 271 -843
2732 -843 -1074 -1682 -1881 -417 472 874 1596 2014 657 -358 -301 -1456 -2102 -889 21 519 1747 1737 1102
2751 1102 -245 -1042 -1061 -2301 -633 425 1137 1011 1910 663 325 -383 -1505 -1954 -1152 -435 207 1301
2769 1301 2070 1350 524 -148 -1379 -1882 -1351 -531 139 1215 1998 1357 737 -60 -1102 -1782 -1458 -742 -90
2788 -90 1289 1505 1809 1303 1062 -880 -1593 -917 -1156 -362 998 1831 1473 1491 591 -920 -1467 -1442 -1154 -705
2808 -705 12 1215 1028 1314 848 -147 -1199 -1471 -1455 -701 353 1253 998 1004 935 -141 -1183 -1565 -1543 -888
2828 -888 130 1014 1320 1493 980 18 -994 -1272 -1973 -974 -257 1003 1189 1637 759 -248 491 -1243
2846 -1243 -1722 -1132 7 848 1559 1076 1665 -181 -371 -1144 -1258 -960 -479 533 2268 2113 1448 806
2864 806 -785 -1539 -1642 -1288 -717 47 1196 1295 1530 663 -114 -1060 -1674 -1749 -863 13 695 1284 1475 991
2884 991 63 -617 -1588 -1612 -1099 -58 499 1401 1714 957 380 -459 -1202 -1623 -1074 -387 240 1083 1590 1324
2904 1324 625 -224 -1109 -1663 -1181 -496 223 1015 1531 1191 234 0 -917 -1660 -1098 -557 -391 779 1672
2923 1672 1184 803 316 -1020 -1676 -1297 -866 -451 647 1414 1170 1004 549 -621 -1775 -1652 -1407 -473
2941 -473 -30 1744 1292 430 940 49 -1423 -892 -1070 -839 -307 567 1570 1261 978 -139 -1179 -378
2959 -378 -1973 -1342 1139 1546 500 1097 1720 -196 -1644 -1659 -1505 -945 131 843 547 1401 1413 169
2977 169 -799 -742 -1421 -1628 -161 784 697 1661 2154 549 -882 -596 -1228 -1380 -120 471 220 967 2103
2996 2103 540 -87 -304 -1098 -1058 -1066 795 958 2156 1527 901 -315 -263 -1785 -1504 -725 317 845 931
3015 931 1302 816 -444 -163 -560 -996 -933 128 -478 722 1449 98 971 287 -1377 -2156 -813 -373
3033 -373 -231 587 2159 870 -497 126 -976 -1836 -813 307 -182 605 1712 1101 513 1071 -496
3050 -496 -1794 -513 -680 -1002 879 1848 866 555 589 -1063 -1806 -768 -379 -664 816 1579 615 416
3068 416 1034 -431 -1105 -904 -616 -1231 76 1561 637 895 1212 -200 -1768 -682 -581 -1262 597 1503
3086 1503 836 442 872 -606 -1246 -33 -533 -734 -100 865 239 1059 1489 292 -949 -546 -1176 -1588
3104 -1588 -2 1155 759 1294 1457 -205 -1460 -548 -1034 -1298 -150 675 628 1103 1527 -285 -527 -23
3122 -23 -157 -2520 -741 569 47 812 1697 658 -177 -363 -1269 -1687 -241 709 221 949 1314 346 -527
3141 -527 166 -898 -1526 -450 62 -249 685 1940 583 232 -188 -1210 -2197 -678 98 115 1734 1423
3159 1423 537 -140 -112 -896 -1401 -249 -292 -279 665 1353 769 501 492 -596 -1597 -719 -49 -463 806 1988
3179 1988 1057 245 500 -1018 -1480 -677 -207 -599 513 1425 701 313 428 -318 -1513 -671 -553 -913 441
3198 441 1142 801 1311 1006 -304 -655 -696 -206 -634 829 1124 1227 783 926 -169 -1024 -920 -761 -897
3217 -897 147 770 880 872 1166 5 -824 -895 -1102 -1191 -15 766 816 998 1040 151 -753 -804 -875 -990 -193 651
3239 651 655 945 1103 231 -564 -744 -1161 -1051 -433 302 690 1051 1130 421 -336 -574 -974 -1042 -421 258 556
3260 556 881 1095 496 -229 -453 -881 -1051 -733 -44 447 958 1311 720 86 -420 -957 -1160 -733 -112 279
3280 279 954 1098 766 79 -282 -868 -1204 -894 -229 332 834 1129 852 474 -17 -717 -1117 -873 -523 92
3300 92 594 1056 829 383 -19 -557 -906 -870 -398 -14 443 1086 942 634 150 -446 -958 -874 -830 -193 531
3321 531 835 821 751 216 -367 -769 -876 -631 -304 -27 688 911 770 363 -70 -654 -949 -711 -530 115 630
3342 630 979 842 497 -60 -594 -841 -683 -545 -12 593 827 674 671 165 -518 -869 -835 -653 -191 403 799
3363 799 904 645 193 -306 -731 -894 -770 -185 299 548 983 786 371 -279 -691 -755 -763 -481 169 725 895
3384 895 785 466 -33 -476 -893 -687 -520 240 282 872 619 223 -356 -604 -1197 -876 -466 -213 284 873
3404 873 730 421 94 -386 -640 -1024 -590 -246 202 588 926 623 164 -38 -505 -1024 -581 -280 -69 568
3424 568 971 733 217 59 -424 -869 -757 -462 -123 353 839 834 359 239 -407 -994 -716 -360 -149 425 879
3445 879 654 553 380 -313 -871 -633 -550 -514 255 884 791 503 661 156 -760 -867 -644 -927 -347 1201 226
3466 226 671 212 12 -737 -683 -632 -600 -198 414 603 748 721 180 -674 -122 -1319 -833 -68 1010 948 473
3487 473 1058 66 -857 -794 -521 -435 -165 -453 453 594 1214 192 -558 -879 -660 -647 151 394 552 885 956
3508 956 413 -541 -594 -386 -1040 -571 288 268 1641 615 580 186 34 -25 -896 13 126 -132 244 1217 819
3529 819 -658 -310 -639 -2216 -325 608 -653 1399 927 565 -27 89 -264 -1228 -403 -89 -123 240 1021
3548 1021 466 -54 -6 -56 -1524 -713 -93 -117 556 1321 596 364 249 -499 -1238 -612 -117 -82 284 852 489
3569 489 658 675 -464 -1640 -762 -253 -330 772 1162 1104 618 374 -171 -1318 -310 -297 -510 188 1030 479
3589 479 416 619 -15 -794 -360 -395 -825 -147 946 683 709 878 19 -975 -769 -658 -825 -19 809 513 448
3610 448 682 122 -882 -367 -259 -828 -331 591 113 932 1133 63 -604 -408 -582 -1061 -353 556 487 761
3630 761 1062 291 -584 -342 -507 -968 -175 289 542 740 1168 539 -536 142 -780 -832 -488 -24 259 583
3650 583 1303 455 -163 -495 -556 -1072 -341 420 157 423 966 377 -132 -86 -711 -1132 -997 -145 625 523 856
3671 856 960 -555 -169 125 -1720 -602 110 76 708 1166 383 73 324 -708 -622 -294 244 -1 573
3690 573 1210 657 856 696 -64 -789 -1176 -220 -394 925 1090 632 391 135 65 -631 -1773 -305 -182
3709 -182 779 692 338 897 280 -312 -558 -992 -976 -1136 235 582 682 750 125 -87 -963 -653 -168 -857 363
3730 363 454 1334 944 482 654 -452 -853 -984 -250 -197 442 706 613 716 146 -417 -586 -569 -638 -132 394
3751 394 429 730 878 -3 -557 -526 -647 -133 -374 428 -32 311 292 355 -212 -651 -541 -638 -377 58 474 680
3773 680 860 363 -110 -356 -452 -1002 -518 -100 117 510 654 427 160 -170 -395 -698 -375 14 334 562
3793 562 515 436 37 -196 -585 -683 -528 -192 114 485 778 692 125 -25 -463 -655 -751 -501 236 361 562 1078
3815 1078 659 -179 -618 -129 -384 -411 350 257 681 881 269 82 -287 -711 -618 -501 -124 204 504 603 539
3836 539 140 -231 -527 -637 -483 -202 140 521 671 238 166 200 -595 -371 -536 -899 267 710 272 428
3856 428 203 -179 -332 -571 -754 -320 4 454 746 324 248 24 -331 -685 -662 -554 -216 467 586 601 685
3877 685 175 -289 -530 -611 -455 -186 182 530 634 570 199 -250 -590 -662 -571 -329 111 499 615 782 80
3898 80 -172 -527 -576 -780 -458 126 306 519 592 431 -16 -232 -597 -706 -507 -29 393 596 646 394 -46
3919 -46 -128 -307 -635 -395 -103 164 620 736 619 197 -84 -503 -679 -526 -227 141 480 705 589 155 5
3940 5 -391 -423 -666 -554 985 -503 547 579 269 180 -305 -803 -664 -355 -85 301 692 622 404 561 89
3961 89 -677 -766 348 90 480 561 30 321 306 -135 -595 -599 -365 -309 41 606 598 463 385 -105 -696 -680 -444
3984 -444 -335 17 505 647 354 483 -170 -446 -784 -374 -539 -409 593 -625 971 532 -78 -727 -533
4003 -533 -734 -460 -585 1128 808 -450 676 482 -443 -337 -429 -752 -169 362 373 396 887 265 -373 -382 -494
4024 -494 -862 -380 351 493 322 2155 137 -851 -196 536 -223 -723 284 293 711 312 196 -101 -318 -364
4044 -364 -825 -544 50 89 421 1124 406 93 4 -803 -397 -743 236 157 547 720 345 -132 -62 -462 -816
4065 -816 -556 83 -173 232 861 522 133 113 -352 -1113 -689 -102 13 214 870 395 249 422 124 -1085
4085 -1085 -546 -68 -861 167 871 520 154 304 -171 -761 -520 -321 -357 143 970 727 329 205 -216 -770
4105 -770 -616 -207 -335 65 635 439 156 365 -33 -566 -518 -326 -596 92 733 475 379 652 -52 -761 -538
4126 -538 -275 -559 55 649 390 362 548 30 -577 -374 -389 -569 -140 494 354 345 679 196 -485 -389 -422 -708
4148 -708 -105 457 492 330 613 249 -544 -398 -513 -571 -165 363 281 330 616 314 -267 -166 -363 -723 -387
4169 -387 165 231 446 832 405 -214 -300 -525 -764 -345 198 298 486 815 390 -104 -46 -314 -714 -451 82
4190 82 -5 313 658 593 -22 -142 -381 -787 -412 27 -17 311 591 373 86 41 -338 -605 -508 -101 -89 244
4212 244 718 473 66 46 -294 -767 -573 -256 -101 303 756 531 288 36 -277 -537 -462 -203 -129 173 485
4233 485 548 350 264 -288 -664 -452 -348 -147 110 594 538 415 322 -127 -401 -631 -404 -341 37 535 547 355
4255 355 301 -52 -367 -536 -371 -289 -10 438 460 520 499 14 -297 -518 -446 -373 -33 320 478 534 347 65 -425
4278 -425 -507 -459 -465 -210 246 381 388 559 93 -268 -324 -428 -538 -300 199 381 538 500 252 -91 -240 -492 -402
4301 -402 -416 152 63 -116 626 246 108 -239 -441 -513 -276 -34 306 547 570 382 -43 -358 -421 -601 -340 -64
4323 -64 212 432 643 427 80 -169 -376 -614 -490 -154 136 395 551 553 289 -87 -342 -502 -421 -246 86
4344 86 272 565 507 258 -13 -336 -402 -562 -305 -10 394 502 442 386 -152 -299 -570 -738 -352 -41 234 319
4366 319 322 181 474 355 -959 -110 -518 313 365 282 1100 746 -23 -919 -945 -486 -164 -344 142 502 514 343
4388 343 252 -24 -371 -492 -422 -308 11 398 576 443 365 -7 -386 -467 -491 -362 -109 387 389 477 334 106 -243
4411 -243 -447 -439 -585 -99 194 308 472 545 216 -304 -347 -390 -504 -155 161 354 403 481 258 -254 -309 -481 -427
4434 -427 -158 184 344 454 641 353 -144 -176 -323 -651 -334 -28 138 517 435 393 96 -286 -390 -687 -492
4455 -492 -11 121 542 346 335 -1 -677 -399 -587 -632 -224 319 538 610 526 259 -281 -237 -520 -769 78 -283
4477 -283 308 732 303 -200 138 218 -693 -693 156 -72 167 651 728 -224 -269 -212 -593 -135 -174 -102 181 656 1085
4500 1085 -201 221 54 -993 -613 -88 -480 707 754 1185 137 197 227 -969 -379 -528 -378 81 537
4519 537 481 659 355 182 -920 -218 93 -724 368 965 169 765 156 97 -564 -250 -287 -419 31 476
4539 476 246 288 454 138 -231 -191 395 -589 -381 387 -153 208 691 433 -536 -68 -291 -542 -87 194 162
4560 162 80 446 234 -591 -58 -115 -494 -122 172 193 274 631 327 -519 -316 -210 -654 -423 601 237 620
4581 620 628 -98 -251 -98 -405 -498 -339 106 141 353 587 275 94 85 -148 -700 -82 -93 -106 480 555 311 -152
4604 -152 -10 -147 -395 -131 -175 341 253 566 243 629 -164 -469 -74 -235 38 -159 380 662 172 241 253
4625 253 -474 -570 -331 22 -127 238 339 236 353 -211 150 -272 -358 -308 -595 63 775 -14 293 237 -25
4646 -25 -779 -399 -163 -706 -65 280 332 -98 983 -518 -815 -667 -118 -552 -74 492 353 202 551 30
4666 30 -266 -371 -362 28 -54 290 325 133 239 -41 -340 -260 -304 -380 16 419 363 361 459 190 -254 -283 -285 -517 97
4691 97 481 271 367 506 214 -294 -303 -356 -445 -69 179 258 370 487 199 -220 -167 -292 -499 -279 120 168 334
4714 334 461 352 -28 -131 -315 -590 -275 45 176 366 452 228 -77 22 -305 -515 -283 32 109 308 500
4735 500 405 643 217 -286 -366 -340 -155 18 340 486 234 40 -12 -302 -517 -354 -102 87 219 507 356
4756 356 169 33 -261 -499 -424 -93 -27 224 506 397 194 52 -275 -376 -197 -107 70 237 545 327 349
4777 349 130 -183 -434 -410 -320 -139 56 300 370 292 180 -169 -362 -292 -319 -225 32 274 311 183 122 -16 -396
4800 -396 -372 -303 -210 90 232 475 411 259 90 -182 -321 -379 -152 49 172 407 375 290 -8 -313 -350 -339 -280
4823 -280 2 228 324 482 306 211 -167 -398 -142 -275 -245 235 160 366 194 52 -229 -305 -466 -311 -50 50
4845 50 272 309 376 254 -62 -279 -323 -388 -100 91 152 324 263 186 -28 -295 -382 -393 -257 39 93 378 421 280
4869 280 107 -211 -338 -352 -288 -64 136 238 455 308 126 -63 -304 -426 -249 -50 118 258 380 392 111
4890 111 -51 -253 -423 -176 -190 101 229 468 273 129 -31 -230 -371 -319 -212 32 223 298 379 133 21
4911 21 -122 -432 -333 -305 -53 140 401 469 239 83 -48 -330 -367 -297 -204 148 365 390 279 162 -293 -394 -275
4934 -275 -276 -245 59 406 323 373 355 32 -242 -279 -219 -248 4 338 257 116 224 18 -234 -332 -179 -214 -40 252
4958 252 170 306 315 -38 -149 -287 -283 -290 -89 119 281 257 260 38 -264 -222 -446 -335 -55 147 374 242 236 95
4982 95 -29 -150 -165 -479 -109 193 184 238 443 215 -26 -111 -229 -493 -81 198 148 339 404 182 -179 -65 -391
5005 -391 -296 -159 -34 110 433 362 106 37 -20 -177 -370 -146 -39 -73 284 484 298 -23 -56 -403 -422 -255
5027 -255 -37 -39 217 411 242 150 36 -154 -307 -161 -200 15 213 450 215 186 56 -223 -432 -291 -81 -107
5049 -107 138 386 284 103 27 -165 -413 -268 -61 -303 143 428 199 268 200 -95 -325 -232 -259 -160 87 409
5071 409 266 283 169 -187 -370 -255 -231 -355 104 265 199 185 323 -90 -285 -258 -246 -285 150 227 231 282 359 -14
5095 -14 -303 -49 -286 -301 -53 244 230 283 312 93 -155 -224 -237 -213 -77 146 68 312 342 -14 -173 -170 -335 -386
5119 -386 -51 132 117 302 368 68 -50 -168 -231 -439 -111 70 118 245 321 65 -53 -90 -209 -294 -126 9
5141 9 79 192 447 274 -135 -75 -201 -353 -228 43 62 250 391 151 -46 71 -257 -455 -260 -82 24 211
5163 211 310 210 92 -14 -235 -375 -273 -179 88 132 358 193 58 42 -225 -389 -113 -77 -68 69 392 201
5185 201 -9 114 -149 -395 -228 -64 -53 201 274 228 166 44 -57 -242 -203 -209 -220 64 341 201 208 259 -57 -296
5209 -296 -294 -251 -287 -11 335 216 169 150 -52 -314 -154 -198 -285 73 273 124 193 247 -52 -297 -289 -185 -216 68
5233 68 307 222 232 155 86 -132 -267 -228 -233 4 238 240 321 254 108 -99 -239 -274 -256 -57 57 162 161 235 163 -17
5259 -17 -182 -293 -402 -142 33 87 324 280 47 -109 -30 -332 -201 -117 82 20 272 250 105 46 -168 -159 -237 -167
5283 -167 -98 159 282 271 197 43 -209 -225 -237 -233 -53 -45 273 287 201 -111 -53 -172 -284 -192 46 98 150 181 278 46
5309 46 -91 -149 -294 -336 -46 85 274 341 161 170 107 -139 -245 -263 -102 93 121 332 267 98 -18 -277 -252 -246
5333 -246 -121 7 189 404 274 223 146 -205 -264 -221 -115 -105 75 245 221 148 -35 -20 -221 -224 -150 -74 144 224
5357 224 183 176 177 -7 -112 -363 -99 -151 116 249 332 326 211 -14 -138 -232 -279 -57 -29 179 253 262 138 81 -178
5382 -178 -272 -193 -268 -43 156 212 261 239 -105 -209 -9 -250 -298 -127 73 99 144 256 92 -118 -247 -216 -179 -82
5406 -82 38 153 215 237 148 -36 -107 -233 -340 -86 3 163 270 394 209 6 -213 -181 -274 -134 50 203 110
5429 110 404 122 -88 -167 -313 -235 -163 44 125 168 286 186 -25 -116 -153 -179 -206 64 -2 191 250 288 205 22
5453 22 -118 -235 -193 -66 -55 138 218 79 80 49 -232 -189 -167 -324 -64 106 256 184 204 -6 -172 -295 -253 -152
5477 -152 -5 -23 320 -17 225 219 -241 -30 -123 -195 -55 99 243 111 64 187 -36 -307 -183 -230 -123 126
5499 126 154 276 160 112 5 -281 -162 -244 -342 16 108 247 212 385 139 -214 -105 -181 -248 26 41 105 168 221
5523 221 20 -19 -119 -306 -218 51 206 181 265 190 -14 -61 -41 -287 -225 -71 171 163 366 280 69 -86 119 -185
5547 -185 -294 34 79 133 328 248 10 104 -57 152 -402 -74 321 113 442 254 171 -16 -69 -362 -430 -165
5569 -165 -96 134 232 268 51 -86 -6 -153 -275 -73 -88 -38 24 -24 233 -391 224 -424 -211 200 -351 94 503
5592 503 163 239 405 -29 120 -400 -137 -113 -317 275 349 690 305 -109 -362 75 101 -388 330 139 511
5613 511 462 246 149 -6 -117 -219 -122 -575 -125 73 41 736 -132 -265 -293 176 159 -190 -767 663 307 183
5635 183 694 -586 -116 -303 83 -168 246 48 370 -44 479 217 250 3 -490 14 -17 302 98 -21
5655 -21 263 -156 -138 -107 750 173 -669 -264 -439 378 160 132 -224 16 -138 -216 -215 -394 90 565 234 -469
5677 -469 -366 -88 -83 -194 -257 151 62 238 179 71 -131 -101 -246 -329 -128 99 120 246 190 29 -52 -133 -129 -303
5701 -303 -124 58 163 117 157 71 17 -60 -166 -199 -27 138 56 279 229 149 91 -123 -180 -126 -33 26 63 231 175
5726 175 86 29 -49 -141 -233 -88 -33 2 139 275 125 38 33 -207 -266 -79 -48 -15 118 110 116 167 58 -184 -173 -93 -55
5753 -55 -165 65 437 -120 -712 284 159 -168 -200 -131 2 169 128 -13 151 -38 -68 -162 -17 -190 -146 82
5775 82 198 149 178 -86 331 -67 -518 -955 -142 -93 253 334 184 215 43 -233 -187 -130 -108 51 110 141 252 78
5799 78 -159 -151 -285 -255 -186 -15 48 142 96 -9 -88 -47 -261 -114 -231 -94 160 39 167 213 38 -146 -214 -105
5823 -105 -176 24 99 207 171 127 28 -89 -239 -188 49 -168 52 49 290 150 383 62 -233 -277 -177 -432 -52
5846 -52 44 607 -35 -91 -20 -62 -130 -37 -36 -260 176 87 272 72 30 -128 -173 -179 -63 -5 12 298 212 173 119 -29
5872 -29 -73 -230 -84 -128 151 73 147 139 58 -9 -86 -171 -129 -108 72 127 184 198 88 33 -172 -257 -125 -95 -59 114 155
5899 155 230 -6 -23 -283 -174 -96 -132 -101 129 274 284 110 -4 -56 -220 -215 -142 1 -5 216 215 98 188 -96 -122
5924 -122 -99 -157 -113 -16 148 208 269 36 -129 -235 -247 -231 -257 84 115 155 175 43 -30 -178 -153 -182 -143 65 179
5949 179 55 260 122 50 -83 -156 -233 -96 61 119 188 109 173 -26 -109 -129 -144 -140 -28 0 72 126 244 51 -48
5974 -48 -166 -271 -179 -66 68 51 164 95 -4 -13 -159 -190 -152 -101 -1 174 251 241 131 44 -44 -189 -220 -110 88
5999 88 30 361 273 103 -10 -44 -235 -297 -153 -18 -5 239 196 185 74 -11 -141 -148 -57 -158 -102 143 245 78
6023 78 12 -84 -186 -101 -60 -72 20 157 80 58 162 -42 -189 -176 -88 -120 -22 206 196 160 196 130 -183 -178 -210 -104 -78
6050 -78 235 123 240 155 1 -127 -143 -124 -198 -109 140 256 100 107 92 -215 -92 -73 -172 -119 54 233 225 204 -48
6075 -48 -191 -236 -14 43 -259 60 268 105 424 -76 -236 -195 -228 -57 -268 31 -17 237 192 181 -102 -197 -279
6098 -279 265 -501 -159 238 -176 156 -163 -53 -50 -201 -309 -588 -239 297 -38 30 1195 20 -33 396 -113
6119 -113 -239 -202 -460 -224 504 17 -130 -45 -94 -293 -254 -32 2 84 107 183 74 120 -42 -206 -163 -39 2 -116
6143 -116 247 178 107 32 -75 -210 -221 -187 42 105 96 174 114 36 -119 -150 -226 -100 -127 123 141 99 102 132 -108 -115 -145
6170 -145 -58 -83 90 292 192 139 91 17 -186 -273 -117 -23 -55 -79 189 95 41 11 -185 -26 -124 -141 -101 17 145
6195 145 194 173 96 -116 -250 -57 -145 -27 139 114 174 184 123 -26 -96 -97 -128 -66 3 161 121 181 32 -69 -154 -189
6221 -189 -246 -131 42 134 112 215 98 26 -210 -125 -245 -182 32 95 141 184 100 -37 -54 -155 -110 -171 16 51 183
6246 183 247 184 28 15 -148 -132 -116 -105 -17 159 227 67 51 20 -3 -142 -93 -110 61 157 191 212 72 51 -30 -196
6272 -196 -17 -154 47 175 194 184 62 -40 -170 -164 -164 -109 19 -65 185 121 64 -15 17 -180 -191 -69 49 11 142
6297 142 307 126 159 -54 -172 -104 -102 -70 140 109 69 37 72 -48 -58 -82 -205 -163 71 127 301 379 64 36 -240
6322 -240 66 209 -107 -99 298 189 104 83 -167 -133 -390 -131 16 -164 289 -329 -39 -13 -111 -6 -165 -98 -169
6345 -169 -409 145 371 -267 53 -16 -229 -548 -351 -599 -76 -6 168 189 251 14 -74 -24 -413 42 62 38 195
6368 195 -85 299 54 -26 -46 -170 -160 -90 -181 121 182 96 25 56 -161 -193 -206 -206 105 135 120 134 238 -6 93 -95
6394 -95 -20 -20 -313 -358 435 306 -319 439 -14 -775 -986 -202 576 -134 -204 104 -76 -123 322 -82 -60 -109 -49
6417 -49 -2 -32 33 339 3 42 -242 57 -330 -365 -74 -68 353 159 70 17 -143 -220 -238 -55 -144 -59 368 240 18
6442 18 98 -159 -359 -244 -116 -123 175 120 133 49 84 -75 -109 -242 -112 -190 -78 130 325 213 112 -13 24 -55
6466 -55 -161 9 -2 211 179 288 125 -110 -150 -185 -143 -207 -65 45 25 166 158 13 -208 -139 -260 -293 9 141
6490 141 138 197 407 -133 -444 -177 -137 -161 125 165 -75 80 225 206 -63 1 -117 -197 -214 76 86 234 299 90
6514 90 -60 191 335 -413 -29 137 94 -22 214 76 -156 68 -123 -105 -39 174 0 191 178 138 -79 80
6536 80 -147 -73 -44 280 -94 355 35 92 14 127 -519 279 459 -250 -119 670 250 -481 188 -146 560 -414
6558 -414 -626 -291 53 -20 -116 -88 -173 278 -309 -1461 -697 -328 -498 392 569 -118 324 -104 91 -187 -519
6579 -519 -63 296 -5 324 420 403 -366 -162 292 -377 -213 -104 -114 716 -376 428 436 -302 104 -269 -268 -89
6601 -89 -513 339 -199 -32 358 -279 214 462 -208 -778 519 78 8 -144 -9 -141 48 193 -32 -833
6621 -833 -88 706 -451 -501 455 255 244 -346 23 -255 -14 136 128 77 184 1 -115 -108 53 -44 -85 108 178
6644 178 140 131 22 66 -160 -44 -186 -208 -49 63 60 113 16 -109 21 -86 -52 57 40 273 418 22 331 -152
6668 -152 -256 121 -79 -266 255 330 312 468 293 96 151 -145 -413 81 -73 155 262 71 -123 -205 -61
6689 -61 53 -13 -133 -191 66 231 192 247 -117 -41 -94 -59 -100 215 -269 57 225 269 134 20 -46 -175 -122 -153
6713 -153 3 119 205 92 43 96 141 97 53 -266 -1 -154 87 -20 -20 61 -119 -262 -254 -800 -265 327 570 382
6737 382 163 377 -607 13 -364 -267 22 -248 0 31 -20 -18 -145 -122 -296 -167 218 145 251 26 611 -140
6759 -140 -684 -353 -1082 -338 -19 443 216 -284 -55 43 310 -40 -128 -186 -181 -328 29 194 10 -258 279 -75
6781 -75 -100 -50 -259 -88 227 150 114 172 -12 -103 -70 -123 -367 -260 23 489 167 32 28 -155 -531 284 -71 651
6805 651 -442 303 83 477 39 478 -507 -281 -320 -283 62 -501 -97 282 137 329 231 -121 198 -90 140
6826 140 -355 752 67 -121 -180 -222 30 -318 -227 -111 118 492 627 208 -248 -213 -56 -1006 114 528 -308
6847 -308 515 40 298 180 -202 172 -201 -5 9 9 210 265 -145 -319 -587 3 -847 223 -201 -220 751
6868 751 261 -126 -506 198 26 -486 303 80 367 -41 56 -182 187 -228 241 -104 -1144 224 -88 212
6888 212 169 -27 324 -2 -459 -12 -193 -199 133 -86 63 -246 -497 -3 29 -226 -202 -8 112 -408 229 -97
6910 -97 -268 405 431 -587 155 676 30 -94 -137 453 -204 288 -724 -209 525 -277 912 158 469 -241
6930 -241 413 238 315 -279 533 -843 -117 27 239 -387 -430 -76 -595 62 62 186 43 -358 386 621 -592
6951 -592 538 111 -493 -436 723 147 413 57 -386 199 863 130 986 320 137 301 -180 467 -438 -341
6971 -341 -484 175 254 -92 -128 -223 51 -103 499 -657 180 -550 -395 1037 -850 136 -314 428 -316 141
6991 141 426 -222 615 -107 -114 -877 -129 -61 -179 -152 205 65 146 -107 -178 -83 -67 -345 -225 67 209 189 166
7014 166 5 -625 141 599 16 -239 262 203 497 52 302 168 301 81 212 4 -20 145 140 157 82 -11
7036 -11 -63 -114 -78 -134 -155 440 393 -544 174 -496 297 -653 -156 447 93 -454 58 -50 -266 282 -715 144
7058 144 -143 168 70 262 64 475 -380 138 -936 188 130 -67 -346 -195 -219 -195 636 -227 86 -24 395
7079 395 -744 -332 584 175 359 561 284 -99 265 -15 -431 -225 -431 -66 -301 309 356 56 94 -244
7099 -244 -315 532 42 -305 -540 666 -650 -198 57 -721 121 -110 36 -17 384 151 71 -21 -90 -147 -226 345
7121 345 25 -137 522 -53 449 44 -34 65 -141 124 70 165 -45 143 131 -52 130 7 -222 -88 -102 -149
7143 -149 210 63 103 121 29 -11 -125 -109 134 -373 82 -122 682 -222 624 708 -565 -16 -246 65 93 73
7165 73 187 477 233 27 9 -164 -111 -152 26 40 50 141 89 -3 -35 -143 -127 -41 -50 -39 42 106 122 -91 -52 -114 -102
7192 -102 -46 -56 13 64 78 106 252 -182 -107 -356 -262 -295 -92 92 123 113 65 95 101 -512 -656 64 -208 138 -434
7217 -434 525 238 -403 -95 -149 -89 -166 63 -66 195 56 204 -172 16 -184 127 20 -300 73 -134 70
7238 70 110 -78 -73 -126 -180 -128 17 -84 130 114 76 -23 165 -194 -111 -311 -54 -32 -81 218 44 228 2 -112
7262 -112 -145 -24 -91 -76 56 135 32 87 40 -287 -131 -305 -323 683 -136 -289 397 417 1142 -219 -487 297
7284 297 -143 23 -416 -85 -108 -15 442 -231 -119 -87 80 209 -357 -371 310 527 79 76 -412 29 -128 -47
7306 -47 -4 167 231 -1 115 -150 78 -357 -100 -74 -143 -54 250 455 65 -9 -79 64 -106 9 51 76 139 171
7330 171 92 -113 12 -384 -88 -265 -160 90 0 197 -22 -278 -95 -40 388 218 -12 174 11 89 38 -98
7352 -98 -91 -86 -314 -36 -237 22 72 -7 29 28 -25 -33 -43 -38 26 -36 -87 109 -94 110 -61 -99 -122 -121 -198 -80 -38 244
7380 244 217 279 -50 19 -71 -168 -209 16 57 67 118 200 -27 56 -161 -29 258 -729 -226 620 -731 -368 38
7403 38 -137 -552 -284 -229 -173 -172 51 105 422 -233 -97 -472 -828 -946 -398 110 325 181 -140 -284 -28 -231
7425 -231 -233 1 -545 -75 47 9 206 172 148 -4 -62 -226 69 -193 -421 327 242 -593 -236 452 158 -377
7447 -377 -46 -112 32 54 61 185 42 -26 -153 -67 -225 -6 -15 127 107 165 85 21 -44 17 -276 335 304 130 203
7472 203 166 321 1 31 -135 -23 -100 3 -127 123 128 38 33 -16 -2 -206 -149 -41 -48 17 126 120 171 -31 -108 -93
7498 -93 -41 -21 19 -27 130 87 126 -148 -5 202 -286 -505 -525 -464 88 -41 257 488 -252 -565 446 -769
7520 -769 -407 348 240 73 231 -100 13 -84 22 -71 0 -65 84 181 108 44 5 -32 -96 -60 10 -5 -45 187 62
7545 62 -11 38 -102 -81 -263 36 -90 21 77 129 22 21 -48 -105 -20 -108 13 126 83 125 96 63 -82 -22 -152 69
7571 69 -340 422 -276 91 -417 -34 -350 -307 -121 187 12 -111 131 -170 271 177 -22 277 92 -306 442
7592 442 888 -160 182 -198 286 278 -503 -417 -634 114 -751 273 -426 682 -263 -415 -437 452 -143 -11
7612 -11 24 60 178 529 262 -225 -473 -655 -444 -287 -3 -384 -354 434 -206 242 221 244 -282 34 176 287
7634 287 7 395 376 -123 -157 -519 -413 452 -140 -176 -438 -446 -85 -109 140 -321 -404 -84 46 -37 -418 273 -412
7657 -412 -334 181 53 39 -194 -336 -368 -218 -322 -297 292 42 405 -76 552 -543 -630 149 111 379 -30 -113
7679 -113 -200 -560 -286 195 -686 219 98 211 277 -150 200 -64 19 -308 61 120 -242 97 -183 278 -309
7700 -309 -224 426 -424 -292 427 -244 2 215 78 -54 -61 28 -91 -14 -300 115 6 195 50 -215 -242 70
7722 70 -188 -9 -32 -71 -22 -83 71 145 78 74 -173 -69 -19 -10 -1 90 177 71 22 -184 -125 -103 -153 -25 64 -2 37 51
7750 51 -116 0 40 -128 -182 -125 78 74 -54 79 -17 -10 -20 -98 -41 58 -41 8 52 192 8 64 87 -142 -46 -12 30
7777 30 21 172 177 -84 -1 -64 -4 -119 -23 21 41 -62 125 54 -83 -54 -78 -13 -24 -53 -26 111 39 66 -67 -67 -49 -57
7805 -57 -110 -130 28 -35 143 68 -21 -84 5 7 -86 -9 -37 168 222 97 18 -9 -16 -82 -27 -22 -16 -68 78 55 101 45 -111
7834 -111 -142 -69 -9 -77 -47 69 4 108 -2 -51 -39 -195 -8 3 55 90 89 52 135 -97 27 -214 -69 -134 23
7859 23 11 59 98 215 -25 -44 -41 -69 -152 -140 62 70 135 14 -17 -52 -158 10 -13 -75 110 87 78 18 -24 -70 -83 -99
7887 -99 -129 69 2 53 -88 9 114 89 -71 -186 35 38 34 -57 108 42 75 1 -7 -122 -72 -64 -5 -46 49 -62 19 -101
7915 -101 -96 -90 -16 22 -64 65 95 -78 8 33 -78 -162 -160 -123 0 124 54 65 -91 -66 151 -50 -47 14 26 65 -23 83
7943 83 157 58 -56 -170 -49 -2 -44 -68 6 145 46 99 20 13 37 -128 39 -143 -46 100 59 -32 87 -4 34 50
7969 50 -55 -21 127 35 -7 -12 38 -41 -84 -159 41 -24 -25 41 54 90 20 -11 -54 4 -164 -16 120 55 34 109 36 45 -1
7998 -1 -85 -103 -53 -65 25 40 97 -1 53 -85 8 -122 -58 49 43 159 29 28 -6 34 -62 -107 34 98 -33 14 187 46
8026 46 66 -63 65 -135 13 114 201 12 47 60 -71 -59 -105 25 -89 7 -39 12 11 122 9 -57 -102 -160 -215
8051 -215 -72 -13 42 58 10 -12 6 41 19 38 14 -33 18 99 49 57 -8 -3 -38 -4 -100 7 -40 67 154 83 97 -16 -96
8080 -96 -72 50 -36 4 140 28 2 56 22 51 -48 -74 -46 -39 -29 115 -71 96 -308 -210 -94 -173 20 -80 55
8105 55 -3 -8 170 126 70 -40 52 -176 145 33 137 -23 -459 252 481 -941 -778 240 -135 -145 -91 -8 180
8128 180 -125 -88 268 -137 -119 -281 507 -218 -98 -23 -136 -521 -260 -630 -8 -143 795 -759 -156 -30 75
8149 75 -139 376 -204 -296 216 242 320 -274 -306 -99 101 -228 66 -280 -45 17 56 -139 -13 60 -164 403 176
8172 176 168 6 -52 -33 58 20 88 -59 -16 -76 -182 -102 -43 62 -50 95 163 98 -167
8191a67
##END NTUPLES=NMR FID
##END=
