##TITLE=31P_DE-80H_X3
 64 sc D2O
 26.2.2025
##JCAMPDX= 6.0         $$ Bruker NMR JCAMP-DX V2.0
##DATA TYPE= NMR FID
##DATA CLASS= NTUPLES
##ORIGIN= UXNMR, Bruker Analytische Messtechnik GmbH
##OWNER= root
$$ XWIN-NMR		Version 3.5
$$ Thu Jan 29 12:04:06 2026 Russian Standard Time (UT+4h)  Yarkov@DPX200
##.OBSERVE FREQUENCY= 81.013821
##.OBSERVE NUCLEUS= ^31P
##.DELAY= (6, 6)
##.ACQUISITION MODE= SIMULTANEOUS
##.ACQUISITION SCHEME= undefined
##.AVERAGES= 64
##.DIGITISER RES= 17
##SPECTROMETER/DATA SYSTEM= spect
##.PULSE SEQUENCE= zgpg30
##.SOLVENT NAME= CDCl3
##.SHIFT REFERENCE= (INTERNAL, CDCl3, 0, 243.863)
##AUDIT TRAIL= $$ (NUMBER, WHEN, WHO, WHERE, WHAT)
$$ ##TITLE= Audit trail, XWIN-NMR		Version 3.5
$$ ##JCAMPDX= 5.01
$$ ##ORIGIN= Bruker BioSpin GmbH
$$ ##OWNER= Yarkov
$$ C:/Bruker/XWIN-NMR/data/yarkov2/nmr/P31/2/audita.txt
$$ ##AUDIT TRAIL=  $$ (NUMBER, WHEN, WHO, WHERE, WHAT)
(   1,<2026-01-29 12:02:58.98 +0400>,<Yarkov>,<DPX200>,
      <created by zg, POWCHK disabled, PULCHK disabled
       configuration hash MD5:
       00 E9 B6 7A A2 85 ED C7 34 08 36 98 17 FE 4E 26
       data hash MD5: 32K
       86 63 65 36 86 8E 88 F0 45 FA 34 90 9F 85 EC 74>)
$$ ##END=
$$ 
$$ hash MD5
$$ 54 9D DB 46 BC 67 8F E1 77 47 B9 E5 48 85 E9 96
##$RELAX= 
##$RELAX= 
##$RELAX= 
##$RELAX= 
##$RELAX= 
##$RELAX= 
##$RELAX= 
##$RELAX= 
$$ Bruker specific parameters
$$ --------------------------
##$DU= <C:/Bruker/XWIN-NMR>
##$EXPNO= 2
##$NAME= <P31>
##$PROCNO= 1
##$TYPE= <nmr>
##$USER= <yarkov2>
##$AMP= (0..31)
100 100 100 100 100 100 100 100 100 100 100 100 100 100 100 100 100 100 
100 100 100 100 100 100 100 100 100 100 100 100 100 100 
##$AQSEQ= 0
##$AQ_mod= 1
##$AUNM= <au_zg>
##$AUTOPOS= <>
##$BF1= 81.014009
##$BF2= 200.13
##$BF3= 200.13
##$BF4= 200.13
##$BF5= 200.13
##$BF6= 200.13
##$BF7= 200.13
##$BF8= 200.13
##$BYTORDA= 1
##$CFDGTYP= 0
##$CFRGTYP= 5
##$CHEMSTR= <none>
##$CNST= (0..31)
1 1 145 1 1 1 1 1 1 1 1 1 1 1 1 1 1 1 1 1 1 1 1 1 1 1 1 1 1 1 1 1 
##$CPDPRG= <waltz16>
##$CPDPRG1= <>
##$CPDPRG2= <waltz16>
##$CPDPRG3= <>
##$CPDPRG4= <mlev>
##$CPDPRG5= <mlev>
##$CPDPRG6= <mlev>
##$CPDPRG7= <mlev>
##$CPDPRG8= <mlev>
##$CPDPRGB= <>
##$CPDPRGT= <>
##$D= (0..31)
0 1 0 0 0 0 0 0 0 0.06 0 0.03 2e-05 3e-06 0 0 0.0002 0 0 0 0 0 0 0 0 0 
0 0 0 0 0 0 
##$DATE= 1769673778
##$DBL= (0..7)
120 120 120 11 120 120 24 19 
##$DBP= (0..7)
150 150 150 150 150 150 150 150 
##$DBP07= 0
##$DBPNAM0= <>
##$DBPNAM1= <>
##$DBPNAM2= <>
##$DBPNAM3= <>
##$DBPNAM4= <>
##$DBPNAM5= <>
##$DBPNAM6= <>
##$DBPNAM7= <>
##$DBPOAL= (0..7)
0.5 0.5 0.5 0.5 0.5 0.5 0.5 0.5 
##$DBPOFFS= (0..7)
0 0 0 0 0 0 0 0 
##$DE= 6
##$DECBNUC= <off>
##$DECIM= 4
##$DECNUC= <off>
##$DECSTAT= 4
##$DIGMOD= 1
##$DIGTYP= 9
##$DL= (0..7)
0 0 52 120 120 21 21 25 
##$DP= (0..7)
150 150 150 150 150 150 150 150 
##$DP07= 0
##$DPNAME0= <>
##$DPNAME1= <>
##$DPNAME2= <>
##$DPNAME3= <>
##$DPNAME4= <>
##$DPNAME5= <>
##$DPNAME6= <>
##$DPNAME7= <>
##$DPOAL= (0..7)
0.5 0.5 0.5 0.5 0.5 0.5 0.5 0.5 
##$DPOFFS= (0..7)
0 0 0 0 0 0 0 0 
$$ [...]
##$SUBNAM1= <"">
##$SUBNAM2= <"">
##$SUBNAM3= <"">
##$SUBNAM4= <"">
##$SUBNAM5= <"">
##$SUBNAM6= <"">
##$SUBNAM7= <"">
##$SUBNAM8= <"">
##$SUBNAM9= <"">
##$SW= 400.765351723535
##$SWIBOX= (0..15)
0 1 3 0 0 0 0 0 0 0 0 0 0 0 0 0 
##$SW_h= 32467.5324675325
##$TD= 32768
##$TD0= 1
##$TE= 0
##$TE2= 300
##$TE3= 300
##$TEG= 300
##$TL= (0..7)
0 120 53 12 22 120 120 120 
##$TP= (0..7)
150 150 150 150 150 150 150 150 
##$TP07= 0
##$TPNAME0= <>
##$TPNAME1= <>
##$TPNAME2= <>
##$TPNAME3= <>
##$TPNAME4= <>
##$TPNAME5= <>
##$TPNAME6= <>
##$TPNAME7= <>
##$TPOAL= (0..7)
0.5 0.5 0.5 0.5 0.5 0.5 0.5 0.5 
##$TPOFFS= (0..7)
0 0 0 0 0 0 0 0 
##$TUNHIN= 0
##$TUNHOUT= 0
##$TUNXOUT= 0
##$USERA1= <user>
##$USERA2= <user>
##$USERA3= <user>
##$USERA4= <user>
##$USERA5= <user>
##$V9= 5
##$VALIST= <valist>
##$VCLIST= <CCCCCCCCCCCCCCC>
##$VD= 0
##$VDLIST= <DDDDDDDDDDDDDDD>
##$VPLIST= <PPPPPPPPPPPPPPP>
##$VTLIST= <TTTTTTTTTTTTTTT>
##$WBST= 1024
##$WBSW= 4
##$XGAIN= (0..3)
0 0 0 0 
##$XL= 0
##$YL= 0
##$YMAX_a= 2199
##$YMIN_a= -1213
##$ZGOPTNS= <>
##$ZL1= 120
##$ZL2= 120
##$ZL3= 120
##$ZL4= 120
##$ABSF1= 60
##$ABSF2= -190
##$ABSG= 5
##$ABSL= 3
##$ALPHA= 0
##$AQORDER= 0
##$ASSFAC= 0
##$ASSFACI= 0
##$ASSFACX= 0
##$ASSWID= 0
##$AUNMP= <proc_1d>
##$AZFE= 0.1
##$AZFW= 0.5
##$BCFW= 1
##$BC_mod= 2
##$BYTORDP= 1
##$COROFFS= 0
##$CY= 9.86611175537109
##$DATMOD= 1
##$DC= 1
##$DFILT= <>
##$DTYPP= 0
##$F1P= 182.462994727601
##$F2P= 168.069089081705
##$FCOR= 0.5
##$FTSIZE= 0
##$FT_mod= 0
##$GAMMA= 1
##$GB= 0
##$INTBC= 1
##$INTSCL= 1
##$ISEN= 30
##$LB= 1.5
##$LEV0= 0
##$LPBIN= 0
##$MAXI= 11.51145
##$MC2= 0
##$MEAN= 0
##$ME_mod= 0
##$MI= 1.244541
##$NCOEF= 0
##$NC_proc= 0
##$NLEV= 6
##$NOISF1= 0
##$NOISF2= 0
##$NSP= 1
##$NTH_PI= 0
##$NZP= 1
##$OFFSET= 243.8632
##$PC= 1.4
##$PHC0= 1694.173
##$PHC1= 24.15952
##$PH_mod= 0
##$PKNL= yes
##$PPARMOD= 0
##$PSCAL= 0
##$PSIGN= 0
##$REVERSE= no
##$SF= 81.0140731611343
##$SI= 65536
##$SIGF1= 0
##$SIGF2= 0
##$SINO= 80
##$SIOLD= 65536
##$SREGLST= <31P.CDCl3>
##$SSB= 0
##$STSI= 0
##$STSR= 0
##$SW_p= 25641.0256410257
##$SYMM= 0
##$S_DEV= 0
##$TDeff= 0
##$TDoff= 0
##$TI= <>
##$TILT= no
##$TM1= 0
##$TM2= 0
##$TOPLEV= 0
##$USERP1= <user>
##$USERP2= <user>
##$USERP3= <user>
##$USERP4= <user>
##$USERP5= <user>
##$WDW= 1
##$XDIM= 64
##$YMAX_p= 0
##$YMIN_p= 0
$$ End of Bruker specific parameters
$$ ---------------------------------
##NTUPLES= NMR FID
##VAR_NAME=  TIME,          FID/REAL,        FID/IMAG
##SYMBOL=    X,             R,               I
##VAR_TYPE=  INDEPENDENT,   DEPENDENT,       DEPENDENT
##VAR_FORM=  AFFN,          ASDF,            ASDF
##VAR_DIM=   16384,         16384,           16384
##UNITS=     SECONDS,       ARBITRARY UNITS, ARBITRARY UNITS
##FACTOR=    3.08e-05,      1,               1
##FIRST=     0,             0,               0
##LAST=      0.5045964,     0,               0
##MIN=       0,             -1213,           0
##MAX=       0.5045964,     2199,            0
$$ Real data points
##PAGE= N=1
##DATA TABLE= (X++(R..R)), XYDATA
$$ [...]
9517f2j03q8l0J35J02J77J31J1j3j59j65j18p9k4Q1K03J03J13M9k4o7j56j60j13
9541b56oK8J60J61J51M4o3ok15j38q8l4M3P6J94Q6J24Oj10j19j14j80k5KJ48J74
9567D3J29M5Q0p1j68j17q6j35L3J07J19J58R7L1l4r4j87j48o8j2Q0J69J51R9M8
9592B69k1j21j78q7j12j7P3J29J37J38R8n3j13j52j70q7m8J01J17J75P9J01kq1
9616A75j27j67o0r5j5J53J98J17R0K6j09j48j13j37l0nJ56N2J71N7Q7q3q2j63
9640e2j16j05k5J52J46J51Q1K2p0q8j41j50k1l2J02J47J12R2J8mj22j12j01j90
9664c06rJ11J33J19J45P2l9p3j53j17j07m7L3J62O5J87J44l0j18j31j30j32q0
9687c01M7J47J35J16R8J5p8j11r5j36j20L2R6J00K05R9Jm4j01j88r3m1n1J28R6
$$ y = [-62, -165, -253, -283, -148, -46, 131, 262, 273, 260, 101, -64, -182, -261, -285, -204, -1, 102, 215, 264, 240, 173, 17, -143, -256, -262, -234, -74, 87, 238, 282, 219, 213, -2, -140, -228, -262, -219, -143, 51, 137, 261, 267, 157, 38, -76, -256, -281, -279, -131, 43, 172, 217, 297, 226, 58, -59, -145, -280, -247, -140, -21, 137, 234, 265, 231, 137, -50, -198, -266, -278, -198, -29, 122, 221, 269, 248, 127, -51, -138, -250, -267, -194, -65, 72, 210, 308, 255, 142, -10, -180, -267, -315, -214, -97, 78, 157, 258, 256, 175, 48, -119, -179, -274, -289, -136, 62, 179, 269, 295, 186, 38, -75, -212, -242, -247, -91, -39, 132, 189, 276, 193, 111, -52, -168, -273, -298, -146, 0, 151, 232, 254, 184, 96, -45, -195, -216, -248, -146, 1, 113, 205, 223, 219, 97, -15, -116, -306, -315, -204, -71, 48, 193, 265, 226, 153, 0, -117, -224, -271, -238, -76, -11, 176, 320, 290, 172, 41, -89, -221, -301, -254, -107, 28, 144, 242, 257, 179, 68, -27, -163, -283, -251, -155, -55, 150, 249, 250, 206, 105, -83, -176, -217, -268, -140, -44]
9712d4J63J13N0k3j28j27j42j34qL5J78J57J37NRn0j88j52j06K5K0J17R6J82J08
9737B93l5q9j31j91q9l6L9J19J44J70O1j2lj75j23j42p7O2L9J04K26J17J0m7j73
9762F1r6j34o5k9Q8J73J68N9O1r6p5j56o5j68j6J08J49J08J25O2l7q4j57j04j41
9787b61m2J00J29J66P9M5L7p0j70j53r0n5L4R3K13J25Q1Lj37r4j49q2m7NR6J47
9813CJ00J22K4p3j17j13j15j00J4R7J88J14J10k8n7r0j42j37q9L6J12J05R4J24
9837A82Q8p5o8j15j66j17J2Q0J07J84P0L7j5p5j29j53p0m1M2J43J43J36N5j5j26
9862A14j50q5j34MP7L6J70J23J06l6p2j20j33q4q0N6O5J32J61Q1Mo3j27j68n5
9887a78p6J4R3J06J75O4K9j1j03j42j52p2j9J31J00J80Q3N5n8j01j66q6n8l9Q4
$$ y = [-44, 119, 232, 282, 259, 131, 4, -138, -272, -280, -245, -67, 90, 227, 232, 241, 191, 3, -149, -255, -230, -210, -93, 3, 185, 293, 258, 169, 38, -153, -242, -278, -239, -120, 24, 194, 255, 243, 240, 65, -58, -200, -277, -215, -176, -72, 154, 271, 281, 234, 61, -35, -169, -234, -263, -175, -2, 166, 225, 286, 190, 115, -41, -106, -274, -290, -182, -33, 75, 200, 262, 225, 141, -16, -120, -261, -303, -203, -74, 92, 171, 216, 253, 183, 13, -140, -230, -285, -251, -158, 55, 180, 261, 264, 127, 33, -116, -198, -245, -240, -144, 3, 103, 225, 249, 176, 59, -54, -169, -269, -255, -158, 30, 144, 254, 226, 169, 79, -63, -200, -289, -253, -141, -36, 58, 182, 270, 195, 127, 12, -154, -271, -259, -179, -72, 112, 182, 219, 204, 129, 0, -153, -223, -264, -222, -79, 64, 200, 255, 240, 114, -36, -121, -255, -251, -174, -138, 32, 155, 261, 225, 153, 33, -100, -184, -264, -208, -143, -11, 150, 231, 235, 172, 45, -123, -178, -254, -240, -147, -41, 134, 198, 227, 216, 113, -29, -181, -253, -272, -141, -41, 139, 222, 277, 219, 118, -48, -134, -192, -231, -147]
9912a47P3J30J25Q2kj12j39j33j14l1P3Q5J78J32j5P7j34r0k03m0QmL8J45J81
9937A63R3L5j07j37j19j11q3M7J15J08Q8J02O8p4q8j13j34j04M3O4J27J20J03
9960B06L3J7j60j24j32q2LM3J34J32R0Q7jr6j28j86r4oM9J41J51J13Q3Mj33j13
9986C1j75q2k2O9N6J40R9Q2L9p9j08j62r7j03L9J16J38K01K7L8k8j47q5j44q5
10011b42L1N8J25J35P7J41q0j42j45j60o3K8O9J20J78N3P5k9j12j43j03j08lO4
10035a76R6J59R7Q0p0m0j27j48q0k3J7J80P6J00J21l9n6p7j66j62k8K5J29J21
10059IJ59N8L9q7j08k04m9r7Q1P6J23J41Q0N0o8m0j92j78o8L6J01J41J48L7R0
10084B78q0r4j17j35r8nP8R9J53J27O2j3o0k17q9j28k5Q8J03J19J76K6Jj00j08
$$ y = [-147, -74, 56, 181, 263, 261, 149, 10, -123, -237, -268, -195, -110, 68, 200, 185, 262, 128, 38, -165, -205, -197, -201, -163, -18, 163, 256, 291, 184, 47, -72, -183, -266, -219, -104, 4, 92, 194, 262, 188, 100, -13, -147, -251, -208, -144, -17, 103, 206, 239, 256, 96, -28, -160, -242, -239, -196, -62, 70, 160, 247, 246, 150, 22, -164, -258, -264, -215, -74, 77, 190, 273, 277, 144, 31, -144, -226, -248, -179, -123, 17, 116, 198, 237, 158, 50, -112, -209, -312, -273, -157, -19, 182, 209, 247, 219, 72, -13, -157, -242, -211, -153, -28, 107, 184, 325, 245, 103, -42, -202, -265, -237, -168, -48, 130, 183, 258, 229, 117, -26, -129, -237, -240, -176, -80, 79, 176, 256, 186, 146, 19, -129, -209, -232, -215, -35, 41, 141, 262, 223, 167, 90, -76, -238, -266, -241, -112, 9, 168, 226, 265, 178, 70, -134, -183, -280, -199, -123, 0, 141, 221, 271, 203, 163, -29, -207, -275, -239, -138, 3, 151, 188, 278, 198, 104, -13, -148, -246, -251, -173, -74, 79, 206, 268, 255, 195, -22, -111, -239, -264, -176, -73, 46, 222, 248, 249, 149, 41]
10109D1j69k7o8JP8J91J32N3K2n6j33j85q1r6L1J40J12J26J41Lj00r5j41r4q1
10134b55LJ00J22J60J14J4l8j57j22q7j16L1O9J15J76L5N3k0j03j10j16j35L1
10157b36K2R8K08R8Q8l0j00j80j42m4m6M5J30J09J09P8P4j41o7j68o7j03L1J58
10181g6P9J71R3j0n6j32j55r9n2M2P2J12J38Q5M8n3j01j09k17n0m2J70O6K06R2
10206B22J8l4j22q2j40p9l1J9J32J70J15L6J3j08j07j39j28j2R6R1J70J01J3K1
10230B35r6j35q4j10n3L5P5J49J54Q4l7l4j78j39n6j2oJ07R4J59J09q1pq9j51
10255f7j37p2N4L8J65J47R8K7q5n7j47j23p7j0P4J30J24P1Q8M4k01l6k06r1J3
10280b36L7J02J44J41N3n5m2j36j04r8l2K3J07R6J34R8j6l3j47j33j13l1l5J68
$$ y = [41, -128, -155, -223, -222, -144, 47, 179, 232, 254, 198, 65, -120, -201, -297, -266, -126, -14, 112, 253, 256, 156, 61, -80, -174, -255, -252, -152, -30, 130, 244, 258, 220, 63, -59, -146, -262, -231, -162, -47, 129, 164, 217, 197, 94, -16, -132, -267, -236, -214, -116, 92, 190, 278, 248, 148, -32, -174, -218, -264, -219, -89, 20, 129, 207, 281, 140, 73, -95, -162, -265, -234, -76, 3, 174, 267, 257, 201, 69, -86, -185, -237, -195, -123, -11, 127, 212, 260, 207, 106, -3, -220, -270, -312, -142, -76, 130, 222, 240, 206, 84, 2, -138, -217, -248, -229, -97, 73, 188, 224, 237, 129, 22, -117, -245, -257, -161, -70, 100, 201, 214, 235, 139, 4, -80, -190, -243, -208, -133, 16, 170, 254, 217, 183, 5, -134, -190, -202, -208, -101, -7, 152, 261, 180, 173, 84, -67, -204, -276, -222, -184, -19, 128, 226, 253, 168, 111, -36, -159, -236, -246, -172, -42, 82, 153, 241, 285, 84, 48, -158, -249, -236, -199, -97, 47, 188, 241, 186, 144, 8, -96, -194, -226, -203, -96, 0, 134, 232, 216, 183, 36, -97, -210, -241, -276, -108]
10304a08J43R4O6K6o8j12j11j49Ll4J11J12J44J25Rm8j67n1j76n6kJ24J04Q1J69
10329B29lj2j05j43r8j40k3Q3J76J08J07Q9p7l3j55j37o3NK7P0J61P3Q6K6n9j57
10355C5j43j16o0L1J78J21J46L3Qj04j06j17j18k3jJ15J70O8J18pm3p8j85j13
10379a91o8P4M3J59J08O6P3r2p2j34j22n4j2P5R1J16J91K8o7q7j63j32l2l7O9
10404a70J64R3R8P2o0n4j29j23n9n9K1J23R7J51R5jo0j89j04j30LN3Q4R5J35Q4
10430B30l8j5j43j18r7q3L3Q2J47J18J24jo2r8j38j10m8j6Q8J43R0J20N8m9j45
10455G2r9j29o4k7R4Q0J61Q5K0M1j13q0j49q5m8J02P5J30J15Q4K2j37j08j56j28
10480b42j8J15LJ95R8O0j2p4j03j14j14l5K1Q8J12J69O3P6j29j28j27o3r3Q3N4
$$ y = [-108, 35, 129, 195, 221, 153, 41, -70, -219, -216, -250, -139, -27, 117, 242, 251, 203, 36, -15, -191, -247, -249, -125, -21, 60, 229, 226, 214, 109, -34, -132, -272, -295, -212, -36, 72, 179, 268, 191, 158, 3, -134, -197, -192, -165, -95, 66, 139, 225, 251, 192, 35, -108, -224, -284, -253, -75, 46, 192, 225, 233, 129, 23, -94, -212, -235, -236, -121, 49, 117, 235, 228, 185, 107, -78, -191, -259, -185, -142, 17, 125, 191, 264, 172, 100, -34, -156, -210, -222, -147, -56, 60, 251, 279, 212, 125, -38, -170, -202, -239, -170, -6, 87, 185, 257, 197, 143, 14, -109, -168, -227, -206, -83, 14, 165, 260, 259, 199, 10, -94, -224, -221, -168, -84, 11, 146, 230, 192, 177, 34, -84, -181, -264, -231, -149, -2, 116, 240, 239, 177, 79, -59, -169, -217, -233, -145, -2, 88, 208, 266, 217, 72, -27, -156, -220, -247, -153, -73, 88, 173, 193, 234, 121, 41, -108, -193, -241, -139, -64, 66, 181, 265, 287, 150, 42, -114, -242, -260, -145, -142, 53, 151, 211, 199, 125, 22, -92, -206, -241, -220, -132, -20, 149, 212, 288, 159, 31, -96, -159, -252, -169, -115]
10505a15J09J05J18Rk7j27j05j25j02J1P4J58J19R8N1p8p4j51q2j06k4O8J38J57
10529I9K6J09n8k4j54o5j15p9J12O7J61J22M6j6j30q7j01r8n8P0M2J40J46R7p
10554B45m0j48j45q3n2nQ1J46J50R3Jo8j29q6j24o1%Q9J13J37Q6K6j3r2j68j15
10580a62q2nJ06J37J32O4Nl3k4j60j12q7J2J5P6J48J34N2J4j49j08j04j33M4R
10605b11J26J63N9P0j3m9r3j19j20n5J4P9K10P1P7M4n1j17j31o8j22j3J46J07
10629DJ13R2P4n3j56r4j27q9L0L9J70J33P5M0p8r8o3j53o9j2L2J56J09P0J01J8
10655B64j07j89j06l9r7Q1J30J30J31L6k1q7j09q2j44p0Q9M2J59J14R1Qj00l2
10679I2k26r2K6k0J20J16R1P7L3o2j07r1j29r2L3P9J45J11P7N9n5j08j20j01q6
$$ y = [-115, -6, 99, 217, 226, 199, 72, -33, -158, -260, -249, -175, -17, 102, 200, 251, 173, 99, -52, -134, -240, -264, -196, -58, 99, 125, 234, 176, 152, -2, -67, -182, -261, -149, -82, 79, 201, 247, 231, 101, 14, -87, -185, -243, -173, -131, 9, 155, 252, 245, 205, 57, -88, -171, -223, -228, -147, -1, 149, 242, 243, 175, 46, -40, -164, -225, -225, -136, -23, 114, 200, 226, 213, 121, -47, -162, -244, -249, -143, -6, 126, 190, 195, 162, 138, -22, -134, -221, -209, -194, -118, 30, 164, 216, 230, 81, -27, -131, -264, -220, -211, -85, 78, 137, 207, 194, 145, 52, -67, -187, -242, -228, -149, 61, 132, 209, 253, 202, 85, -46, -114, -236, -249, -103, 4, 117, 209, 283, 230, 74, -20, -147, -236, -206, -167, 3, 136, 211, 251, 173, 75, 12, -141, -210, -222, -190, -34, 75, 145, 246, 264, 157, -32, -138, -177, -274, -193, -63, 67, 198, 234, 213, 126, 17, -65, -209, -279, -190, -148, 11, 125, 216, 224, 124, 92, -134, -226, -200, -220, -100, 16, 107, 184, 217, 155, 48, -43, -172, -264, -231, -152, -7, 104, 181, 240, 185, 77, -43, -144, -230]
10704b30L4Q2Q8R2R2K3N9q9j63r0j33L1OJ47J58P5O9m0m7j79j22q5NK3R7J54J45
10731B02KL2o8j65j23o9m4L5J09J36J31P0Jn6j06j05j55l0j0R1J25J61L3M7k9
10756B15j06j57j33k9QR1R1J58Q0J6k4r0j19j30p5o7J10J18J01J73K1j7j22j29
10780a6r3q1l8R6P4R6J14J12k9o9n8j72j45jl7J58J50J23P8m4p2j16q2j09k6%
10806a87K0J94Q8Q7N6m4j24j02j51l9j4M8J42J33O7M4j9j19p2j35l4m2L5J14J51
10831I7J26Lj4o5j33j20j12k5J15Q5J82J2Q1j0p9j57q2m5j05O7N3K16R4O7Qr4
10857A65j05j76m8o7K3J16J05J60N3k2m2n7j35j80kqR7J19J49R4J3p0r4j23j42
10882a77j8j5Q5J13J49O7rj0p3j09j68r0OL7J76J27Q7L2Rj01j20j08j23lP6O2
$$ y = [-230, -196, -114, -26, 66, 158, 181, 240, 151, -12, -102, -235, -204, -198, -51, 107, 182, 251, 211, 164, -15, -137, -222, -217, -194, -97, 57, 202, 204, 236, 168, 3, -120, -189, -233, -198, -89, 47, 178, 248, 249, 193, 87, -18, -173, -203, -213, -122, 3, 164, 197, 244, 215, 109, -48, -181, -210, -202, -111, -20, 138, 218, 234, 210, 120, 1, -129, -204, -271, -161, -43, 58, 231, 252, 235, 113, -16, -109, -190, -228, -132, -58, 38, 152, 264, 235, 166, 108, -64, -209, -210, -247, -89, 61, 184, 262, 218, 146, 30, -52, -161, -187, -187, -167, 27, 115, 202, 258, 214, 90, -12, -163, -202, -216, -168, -26, 107, 174, 218, 199, 80, 8, -127, -161, -203, -168, -54, 97, 223, 226, 212, 147, 14, -106, -218, -243, -128, -43, 139, 151, 232, 222, 143, -14, -96, -141, -246, -179, -126, 90, 184, 251, 259, 165, 60, -116, -164, -231, -208, -92, 13, 173, 226, 204, 162, 105, -30, -210, -212, -220, -123, -4, 145, 239, 252, 182, 88, -35, -177, -195, -210, -125, -12, 137, 204, 195, 185, 112, 3, -165, -255, -249, -212, -36, 91, 178, 210, 219, 118, -2, -110, -233, -236, -160, -98]
10908i8Q0J69P6j6q9j03j10j09o6Q2R4O8J43O9J8k2j62j54j2p1qL9J90J09R5L4
10934B46p9j01j50j05j2J8O0R8J84K4M3o2o4q6j68l3l2K5J65J03J07M7n5qj83
10959a8j81K3p8M6J24J40J17RM2r3j36q2j23j1OJ45Q2J65N5jj05j27q2o6r7L9
10985b07J17J04J10J00J2m7j14j56p9q1P3N2J23Q6R9M2n9j04r2j09q9nN2J31R4
11010E3J53K1k1p8j31j76l7l7J07J20Q6J39K5r4J1j01j42p2l6L4M9J88Q8J26n3
11035B22r7p8j22j22qO2M6J12J39M7K2m3j04j55q3q0N9N9J13J34M3R7r0j64n1
11060d2j76K7j3Q6J09J25R6k5mr5j07j30q7J6M6K05Q5J02j8J0j24j02j07q6J2
11085a97L5J06R2J60M8n0m3j60j36l9n3M7J00R4J47P0J4j21m9j83o4n8O9P3P1
$$ y = [-98, -18, 151, 227, 211, 122, 19, -91, -200, -266, -184, -90, -22, 121, 190, 208, 186, 24, -130, -142, -213, -221, -182, 8, 117, 212, 246, 167, 66, -84, -189, -201, -183, -123, -25, 159, 183, 226, 164, 100, 14, -154, -187, -219, -194, -29, 74, 181, 228, 173, 165, -18, -199, -176, -254, -208, -84, 56, 173, 182, 224, 131, -5, -87, -210, -221, -215, -70, 12, 177, 232, 231, 126, -1, -83, -149, -246, -207, -90, 14, 124, 224, 236, 189, 75, -81, -160, -241, -168, -116, 7, 93, 192, 234, 175, 71, -21, -130, -219, -224, -172, -41, 53, 206, 227, 206, 128, -3, -179, -216, -253, -146, -26, 60, 199, 224, 130, 141, 40, -102, -174, -210, -176, -127, 61, 149, 275, 222, 125, 47, -75, -197, -205, -143, -97, 15, 154, 201, 223, 180, 76, -79, -162, -242, -183, -124, -11, 123, 166, 263, 173, 9, -42, -218, -191, -204, -118, -9, 116, 212, 187, 183, 88, -19, -149, -236, -220, -174, 31, 116, 218, 200, 210, 86, -16, -123, -209, -197, -162, -56, 36, 196, 244, 194, 151, -9, -145, -184, -237, -190, -90, 4, 151, 221, 235, 114, 65, -118, -182, -240, -171, -98, -27]
11110b7J87N4M7p4j22j27o2j08O6J3J63J01J08o2Po0j49j06k4l0M5J44J42N4R6
11135B76r4j00j30r9q4J1P4Q3J18P7Q1j9r3j04j22n4o8R1N6J49J25L3L8j22r7
11160B6j41o5oj5J43J35Q2M4K5n0j79o3r7p1J3J19J13J06J01mk9j47j12m2p2k
11186a88N3J23J29J05J7m5j14q5j52p4O6K2J15J05J21J6n1p0j35p9n5kJ5J12R3
11211D2J45P9p1j8j62j29n3n3Q6N6J18J09N6J0q5n9j52j07q8Q0R0J43J28L6L4
11236B35r8r4j19p1k5l1J16J00P9O8P7n1j19r9j29q4N5P6R8J23Q4M4k2j36o7r0
11262h0n8l5K6J20O8J48Q1m7j24q2j17r5pN5O6J50R4K7Qq8r5r9j04j2k7J37J41
11289E1R5P5Qq5r8j18r7k5kR0J02J43P8Po0o3j54q8m2n0R7Q0J87R6L6j12o4j75
$$ y = [-27, 160, 214, 261, 187, 65, -62, -124, -232, -166, -153, 10, 111, 219, 157, 164, 104, -45, -151, -175, -205, -160, -16, 126, 180, 276, 182, 82, -48, -147, -231, -220, -146, -63, 55, 132, 213, 194, 101, -3, -125, -179, -247, -156, -100, 49, 174, 207, 245, 123, 26, -115, -180, -186, -201, -58, 77, 159, 203, 228, 178, -1, -64, -161, -232, -219, -100, 13, 119, 220, 216, 187, 40, -72, -114, -186, -188, -135, -12, 117, 222, 239, 194, 80, -5, -157, -231, -165, -143, -28, 77, 198, 214, 163, 93, -42, -121, -176, -178, -163, -51, 42, 187, 266, 195, 177, 15, -114, -167, -220, -134, -78, 40, 149, 205, 215, 130, 71, -81, -188, -276, -196, -106, 37, 165, 201, 235, 137, 43, -76, -147, -172, -203, -87, 13, 92, 160, 237, 186, 67, -32, -161, -245, -190, -114, -16, 107, 191, 235, 213, 77, 10, -80, -138, -173, -147, -27, 41, 189, 270, 223, 99, 17, -100, -195, -202, -147, -81, 69, 163, 190, 198, 110, 15, -84, -188, -200, -227, -90, 51, 146, 221, 229, 144, 46, -72, -169, -194, -196, -106, -4, 139, 217, 224, 164, 101, -53, -141, -183, -233, -136, -56, 131, 227, 263, 151, 87, -88]
11317h8k4j28N4M6R7J15J01N8p7p3l0j42q0r6J17J25J02J21J6n4l1j45r7n9J6
11342a56J9O4J30J03M9Rm2j25q1j88m2L7J33J26J23lO9j07r0j16n7o7L9Q0J32
11367C9Q2N4K1k6p7j25j03o2lL0J66J02P7J8Nj31q5q4j11QR3P8J06P7J05n4j30
11394G0j11r3n0m5M1J12J53Q2L8l0k0j39q3j05m4N1Q7J30R4J15pr1j20j10j29
11419b04j7N9J6J59J13P6Lkj58r2j33n1J4R4J15O3J17O1p8q8r4j51k9oP5J14Q2
11446E8J43Rqp2j10j74o3QM5J13R1R9O6mn5j36j06j05L0M8K0J78O4Q3l5p3n9j19
11474f4j52L5N5J04O8J06L1Lk6j10j13p9n7L7N0J55N6J22j4j4j18j32m8j09L6
11499a78P4J21P2P4K3Kq6r0j65k6J6QJ06J08J72J8q1m8j48j03k5k7O2N0J51M2
$$ y = [-88, -112, -240, -186, -140, -43, 72, 173, 231, 154, 81, 51, -91, -171, -267, -150, -25, 77, 198, 214, 160, 129, -16, -113, -172, -156, -137, -73, 57, 160, 209, 218, 176, 51, -30, -218, -260, -223, -90, 36, 159, 156, 225, 118, 28, -88, -145, -212, -173, -93, 39, 121, 175, 196, 170, 93, -32, -135, -197, -200, -170, -4, 98, 175, 193, 198, 67, -18, -102, -213, -205, -112, -34, 72, 149, 254, 200, 70, -41, -134, -184, -229, -188, -76, 77, 159, 197, 167, 147, 8, -75, -180, -224, -173, -86, 44, 138, 253, 246, 155, 35, -75, -204, -221, -162, -146, 13, 126, 202, 205, 203, 45, -47, -180, -231, -217, -123, -8, 55, 172, 233, 155, 67, -27, -178, -207, -213, -138, -24, 58, 201, 210, 202, 130, 20, -154, -217, -209, -164, -51, 40, 139, 205, 201, 146, 10, -96, -201, -171, -123, -103, 75, 139, 222, 187, 114, 55, -64, -216, -181, -126, -22, 46, 152, 183, 186, 160, 50, -63, -142, -199, -162, -112, 43, 99, 221, 207, 193, 75, -57, -105, -214, -178, -104, 17, 89, 163, 186, 188, 102, 12, -153, -179, -163, -155, -49, 59, 231, 249, 168, 120, -28, -131, -156, -183, -121, -71, 80, 122]
11525A22J43q8l6r5j87m5LJ3J09J56L5J04l8m7j10j10j01k7K6O8J30J02P9L9o9
11550A76j23j24r3l0J2O1J36J15M4K8k8q7r3j56J4k2N4Q0R7J67k4k4q8q3j30r0
11576b11O8NJ19P6R0R9l5p0p9j29j24J3J1J33J24L7J26r1l6j73m2o4m3N4Q7J05
11602E0K9J46L0p1j28j29p6nl4N1J35J32O8N0r2j01q1j12k4j7Q8O1J47R4Mk1n3
11629A41j87o5q8RQ5O0J07J07Q6r5p2j03j36m3k0Q3N8J07J42K8M9q2j40j54o2
11654a85l5O8P5J06J10M2K9l6j19j10j31j0K6J11N3J11R8K2n4j50o1j35J7N7J4
11679h7R7J02Q7N2k4j37r8p2j08LL7J51O2R7L4j4j04j14p8q2%R0J06L5O6J58j4
11706B45j04j39m1j49m2Q5J00Q6R8R5j4j00j15q6n8n4nJ37J15Q3N1J7n5r9j16
$$ y = [122, 265, 177, 141, 46, -141, -186, -183, -170, -61, 95, 130, 234, 196, 149, 39, -71, -172, -199, -173, -105, 25, 127, 206, 245, 176, 53, -71, -164, -194, -182, -121, 15, 130, 174, 202, 174, 87, -6, -162, -148, -170, -116, -36, 61, 228, 204, 180, 92, 9, -121, -211, -143, -138, -19, 57, 147, 246, 211, 141, 62, -67, -191, -178, -167, -34, 90, 127, 253, 162, 126, -47, -89, -153, -196, -142, -55, 50, 79, 225, 255, 184, 56, -73, -149, -154, -188, -137, -2, 130, 198, 248, 156, 55, -26, -138, -162, -179, -91, -30, 117, 211, 215, 194, 141, -46, -111, -199, -190, -105, -45, 62, 169, 255, 160, 88, -15, -151, -194, -214, -131, -73, 34, 176, 204, 253, 171, 31, -123, -185, -220, -152, -77, 29, 139, 181, 210, 174, 55, -55, -186, -196, -170, -59, -6, 105, 203, 225, 171, 21, -40, -175, -158, -101, -87, 10, 112, 199, 251, 227, 90, -8, -80, -188, -185, -148, 3, 65, 162, 196, 182, 78, -36, -114, -196, -196, -106, 0, 35, 101, 259, 245, 141, 2, -39, -188, -230, -145, -45, 41, 139, 234, 220, 120, 5, -81, -139, -193, -198, -61, 54, 137, 188, 205, 150, 51, -65]
11731f5j16m5N5P6R0J44M3j4l0r8n8j49qk9R1J07J03O6P2n4p3j25j62k5J6O4J31
11758GQ8J05k1j4m1j42o9j04k6K3J25J85O7Rk5j0j49r9q6j7M4J07R3P7L5L5k8
11785A69j19j46o0m8j0J06J40J11N1M1j07r6j22p0q4N1P0R0R8J52l9qo1j26j25
11810a42p5M6O0J19Q2M1L1j5q2q2r0r1l3P3J45J09M4M0K0m3j57j12o9k4P8O3J05
11837D1J35KK3n3j08j09o1r0O8P9J38R0L4J9j03p5p9j02nl4J14O9J44O3ln3o9
11864G5j02j33n2PJ09R9Q5J28pn4j05o1j18m0n4J15Q5R4J22j5Lo5j53q9q7l0R9
11891a44J44Q4O5L4j3j6j41j16r6M9J1M1J30R7J02o2Oj53j33l1p0K2J50Q7K2J11
11917A80l1j3l9j24j26j6j9J27M1J58L2M2m5p9q0j40n9NM4J01J16R0L2l0p2r1
$$ y = [-65, -181, -226, -171, -95, -5, 139, 182, 168, 138, 40, -18, -167, -175, -204, -113, -6, 97, 163, 235, 181, 108, -17, -179, -204, -188, -124, 7, 95, 200, 179, 165, 124, -18, -87, -191, -217, -194, -69, 116, 183, 192, 167, 157, 8, -91, -177, -194, -150, -43, 50, 127, 162, 197, 169, 50, -96, -156, -204, -214, -108, 32, 143, 194, 235, 128, 32, -90, -160, -244, -193, -123, -33, 65, 217, 178, 170, 109, -17, -142, -217, -171, -111, 8, 90, 131, 162, 147, 65, -17, -107, -198, -231, -158, -13, 96, 140, 180, 200, 157, 0, -112, -181, -205, -127, -64, 41, 176, 178, 201, 148, 40, -69, -130, -220, -152, -73, 65, 155, 189, 208, 105, 30, -49, -151, -156, -190, -76, -7, 137, 200, 197, 144, 75, -27, -160, -212, -205, -96, 3, 88, 216, 209, 155, 50, -11, -129, -169, -223, -108, -23, 71, 193, 178, 181, 116, -37, -126, -213, -243, -144, 0, 84, 149, 183, 170, 154, 13, -103, -199, -150, -139, -98, 32, 129, 231, 169, 175, 22, -111, -142, -212, -190, -40, 47, 69, 180, 149, 136, 97, -27, -153, -169, -188, -61, -20, 138, 170, 212, 167, 88, 8, -132, -191, -186, -142, -41, 75, 165, 197, 167, 95, 4]
11943Dq2j00KqJ50J00J51j2J8j17j14j06n6MJ1Q8J10J11N0k3k4j18j21m6q1N4
11969a55N0J58P8J07n4m2p8j33p1k4L2J4J68L9Q8N3m8r4j31r3r2R7P9N3J43N1
11995A95mn9o4p8o9q4QQJ42N9Q1Q0jj35r2r8j03K7L5J41O0Q0J01m1l6o7j46p1
12023a31o3M4N6J31J12Q2Mr2j16j26p1o0J12J05P0O9M6N5r5n9j31j31QQP3J10
12049A0J01R8l9qj08r1r2m4L2L3R2J15Q7Nl4j6j81p4o0QNJ34J12N0J01l2p1j90
12077e7k1q5l9O6N0J50L8J19l8m4r7j40n7j6L6R9J18jJ14mm6q3j44l8q3P0QJ17
12105hJ52J9L5o4p8j07r4o0O6P1O3J24O2k6J2j31Oj85m3MO8J14J25L8K6l0r7n8
12133Dj43l7M3K3N8J01J10L9j8l1j02j36j05j7OJ28J02J36N5o8Lj10j11n5m8M8
$$ y = [4, -78, -178, -176, -184, -34, 66, 217, 205, 223, 106, -8, -114, -170, -166, -155, -67, 43, 154, 204, 181, 157, 39, -82, -128, -209, -155, -105, 53, 131, 238, 184, 142, 64, -69, -140, -164, -132, -118, 50, 89, 177, 230, 182, 88, -43, -136, -228, -131, -52, 1, 144, 195, 191, 132, 68, -10, -79, -163, -155, -147, -5, 54, 135, 215, 214, 79, -13, -111, -214, -187, -152, -11, 49, 129, 230, 189, 153, 86, -60, -131, -194, -150, -94, 37, 149, 231, 235, 143, 27, -99, -170, -230, -118, -13, 57, 126, 172, 227, 132, 73, -58, -189, -181, -173, -100, 10, 111, 209, 170, 162, 54, -37, -129, -173, -141, -108, -16, 99, 186, 191, 157, 141, -40, -114, -174, -166, -161, -27, 85, 135, 236, 204, 133, -57, -78, -163, -202, -136, -86, 64, 102, 221, 183, 139, 42, -98, -155, -171, -135, -36, 82, 81, 195, 191, 145, 62, -82, -120, -203, -133, -125, -8, 144, 163, 198, 134, 56, -51, -145, -205, -139, -68, -5, 119, 181, 155, 167, 36, 42, -143, -186, -182, -114, 0, 125, 163, 189, 159, 62, 4, -139, -176, -133, -110, -52, 49, 159, 198, 180, 149, 47, -89, -194, -211, -205, -77, 25, 161, 216, 148, 151, 41, -70, -125, -173, -125]
12159a25pJ46P4R7K9p0j03q2j06p8mJ23J09J14N9J1l2j08r8o4q4lN2J02J15J12
12185A79L7n8k6j62j12k4k6N1J16Q5R5N2o9m5j05p3n2p9O2J01R8Q9N8l6q8n8j28
12212a18j0p5N6O1J47N6O6mo1n4j39o8l6j3J13P5J15P6K2n8o7j19j36pjK7J55
12239CN0R9Q1l2r4j40j03q2J9K9J48Q3J15J0m7o2p3r9o6nL8J05J09Q5K3Lo9j37
12267iq5l0r8N9J03J01J33J4j1q3p9p6o7m5NM6J78R1P0lj00n4j31l1n7K2N1Q2
12295dJ29K7L4l0o0j39j29M1p2Q5R4J19N9N0%j50p0j07Lk8K3M5J83M8M4kj01n4
12323C8r5j34L5J0J08O5Q5R8k4m7q5r2p5p6J2J16J13M0J44j2p5j19n0j14p2P2
12349a34P3R2Q1M7Kl9p5q6n1p8K6K6N6J59O3K3k8q2r5j73j9RQ8Q0J19J27l6k2
$$ y = [-125, -132, 14, 88, 185, 214, 144, 41, -41, -147, -225, -229, -106, 3, 117, 176, 187, 155, 47, -51, -115, -199, -202, -150, -48, 67, 179, 216, 158, 132, -30, -142, -166, -192, -141, -25, 60, 155, 207, 138, 93, -12, -85, -137, -216, -154, -53, 45, 134, 192, 156, 68, 10, -118, -128, -203, -147, -86, 61, 117, 183, 179, 118, 64, -75, -143, -179, -192, -79, -4, 111, 187, 209, 151, 84, -35, -171, -178, -179, -152, 3, 53, 152, 233, 201, 107, -33, -136, -218, -199, -170, -22, 61, 176, 186, 139, 77, 4, -95, -161, -166, -128, -23, 86, 171, 194, 197, 128, -9, -94, -124, -222, -163, -60, 41, 174, 188, 177, 94, 15, -61, -128, -173, -168, -122, 56, 147, 217, 214, 114, 60, -71, -102, -159, -137, -86, -4, 125, 152, 186, 156, 96, -43, -172, -131, -203, -118, -24, 95, 154, 204, 204, 54, -16, -123, -120, -148, -125, -80, 103, 151, 195, 193, 92, 38, -57, -191, -156, -146, -38, 27, 112, 210, 186, 139, 54, -38, -113, -189, -177, -61, 52, 92, 236, 224, 149, 30, -20, -134, -206, -134, -61, 31, 112, 159, 161, 122, 47, -39, -90, -168, -142, -116, -60, 99, 162, 185, 157, 75, -20, -193, -212, -203, -115, -35, 84, 211, 175, 153]
12377A53o5q0n0j04m7K1J33J08Q5N4m6o5r5r4q0l1N1N7J15J08N2j0m3p6r0j39
12403a78lrJ33M3J16K9L9l2j30o8o4l2j0O8P2J37P1k9lp9r1j07p8K0Q8J12J01
12430A16N7Kk5q4m5j24q2J0P2Q2R1O3L0M4j06m7j39r4j0R9K7J11O2K9Kq1l8j00
12458g8p4l7N7L9J15R0P8qp5p7j08o8j6NR6J30J2Q7N5p1o3j53o4o1M9O7R5O1P0
12487A53N4p2j23p2o9m5M2K1P2J03J00%Lm4j27q1j04N5j0P1J24P9O0o8Oj19j16
12514a07l0n3N3O8J03J16L9n3jj07r4j02l7O2O7J08Q8N0l1Qj10q8j13K5n7R3J12
12541IJ26RM6r4n8p2j19kL8oR1J22R6K4o8l4j33j06l2J1L9J02O8J08j7M0q4j22
12569a8j00j7l4P3M3J19O4L6lo0q3r9j06PO4M8J37Q4%lk2j38o3r7oL3P2M4J23
$$ y = [153, 88, 8, -42, -146, -193, -172, -39, 69, 154, 208, 162, 97, 2, -92, -172, -203, -152, -95, 20, 128, 180, 170, 127, 51, -39, -178, -181, -190, -57, -14, 102, 131, 170, 138, 8, -60, -124, -156, -166, -98, -26, 111, 182, 153, 150, 71, -20, -127, -205, -185, -97, 15, 116, 173, 175, 150, 66, 21, -103, -185, -175, -103, -21, 70, 133, 163, 207, 101, 54, -85, -179, -189, -90, -63, 48, 110, 139, 141, 60, 22, -78, -152, -189, -132, -93, 22, 112, 190, 182, 107, 30, -78, -146, -162, -157, -61, 69, 81, 168, 223, 152, 89, -64, -128, -189, -140, -73, 22, 83, 153, 207, 135, 12, -60, -129, -174, -132, -111, -39, 64, 164, 164, 167, 123, -4, -85, -189, -134, -144, -73, 51, 130, 190, 122, 128, 9, -107, -137, -190, -137, -69, 34, 150, 189, 136, 135, 28, -66, -168, -205, -143, -76, 32, 120, 170, 139, 147, 37, -51, -164, -139, -196, -103, 9, 135, 144, 190, 96, 38, -34, -153, -155, -117, -123, -32, 90, 186, 210, 142, 108, -25, -131, -163, -152, -113, -11, 57, 165, 148, 188, 104, -18, -118, -135, -169, -96, -53, 66, 130, 166, 163, 103, 20, -79, -185, -178, -114, -66, 71, 155, 155, 152, 130, -8, -71, -168, -174, -141, -69, -25, 98]
12598I8Q6j0%j00j19j00l8N4L6J25P8N1l8Rq9p5p6n8L7MO2J13J25L1q3j6j19r3
12626a05p8J5j1J98Q3KP8n0n3m2j17n2j8oQ3J09J11K4J1l7j21o4j03l4P8O7P6
12653D4M9P6j1k7n5j32o3m7kP9J06J34L6J2q8l4r4p6m8J7L7J06J03J9O2k5o6j46
12681c4m5r4QN2J25O9J03J0l5p0p7p1r7K1k2J01J03R3N6j2r0q0m7j37k6O9J00
12708b7O6Q7O3K4n5j46n7r1kJ2P6O4Q4J06nl1o5j33j24rlJ33N6P8R1m2pm1j22
12737b0r4l8NM8R7O7J22K8o1o1j15r2l3L2L3N1J01O9RJ6Oj19r3p9o6j2J69J04
12765G4Q4L8mr6p7o7r0j4j4J38P6N3Q4J7p1n0j25j01n0pJ36R8P1M9M3n9n1n8j10
12794h3j7p4P5O2J34R6rK5j35p3j18m2j0Q1O7J08Q1K6l3q5o5j21k8Ln4J61O7J56
$$ y = [98, 184, 174, 174, 74, -45, -145, -183, -129, -93, 32, 110, 161, 123, 132, 43, -32, -108, -166, -129, -125, -63, 50, 175, 206, 123, 107, -12, -105, -183, -168, -179, 19, 102, 104, 182, 132, 79, 37, -80, -132, -150, -156, -73, 36, 147, 171, 182, 145, 24, -40, -143, -177, -99, -32, 44, 93, 169, 158, 131, 76, -56, -119, -166, -168, -89, 17, 151, 187, 199, 111, 77, -17, -93, -141, -124, -87, 19, 122, 141, 203, 178, 112, -34, -79, -173, -165, -113, 12, 81, 184, 194, 159, 89, 12, -59, -156, -135, -157, -56, 47, 140, 196, 184, 94, 14, -33, -170, -196, -127, -27, 39, 126, 189, 213, 158, 12, -45, -136, -138, -126, -50, 14, 98, 204, 199, 168, 103, -30, -154, -163, -166, -33, 23, 101, 192, 150, 143, 102, -20, -114, -152, -147, -99, -2, 65, 187, 215, 154, 93, -22, -114, -147, -115, -82, -31, 70, 139, 148, 164, 170, 51, -42, -121, -187, -199, -30, 74, 158, 196, 192, 96, 19, -48, -138, -152, -166, -28, 48, 101, 185, 202, 131, 81, -44, -145, -195, -202, -66, 32, 103, 152, 195, 136, 85, 27, -83, -100, -174, -99, -37, 97, 193, 184, 209, 74, 1, -117, -159, -169, -88, -21, 87, 168, 194, 161, 76, 11, -110, -138, -135, -189, -28, 39, 195]
12822A95p0R6r9j49l5j08J8J4R2P1O3L5N3n2j26l0j03j4K6L5J26R4K9J0n0p1j18
12849f8k4n3j3M6R8J04R9J7m0q3p5q3j19L3J1J28J17P6J9mj48m2o7o8k3OJ14N2
12877A0J28K8k5m2j35k3q6l0M5Q0Q0R7Mqk5p8q8n7o6N5K2J40R8M4J2n3j22j01
12905i6l4r0J00O7P2O3N5L0k7r3p6j30Po9P7J32R7R2l4j6m2j27n8m4Pj5J20Q4
12933E2J21K6k2n7r6j24r4QN8R2J16K5R2l6p5n0j29k5p5R0K4J17K4J34j0o2q0
12960D4p9j04l4pQ8J23P6M4L8o5n8j20n9m6J5J06L3O7P6M5n9n3n9j35q7L6P8O4
12988c2Q6Q1j0pl0q9q6n4J1lQ3R9P0Q8pj19p3j00n6n2Q5M4J00J05J0K8o3r1l8
13017b0j16jm8J41O2J16J6nm1j00l8r9n5L5O0Q8M6O7N3k4n8j40o3p8L7N1J22J17
$$ y = [195, 125, 221, 122, -27, -62, -170, -152, -138, -46, 25, 88, 123, 176, 124, -2, -32, -135, -149, -123, -88, 38, 132, 161, 171, 121, 50, -68, -92, -145, -158, -112, -14, 90, 189, 206, 166, 83, 8, -75, -194, -161, -150, -22, 95, 171, 190, 186, 38, -4, -71, -139, -162, -156, -42, 10, 138, 166, 141, 99, -36, -59, -145, -175, -130, -50, 30, 127, 131, 123, 98, 20, -68, -125, -191, -136, -114, 26, 124, 168, 180, 127, 5, -96, -130, -220, -120, -53, 19, 82, 137, 167, 140, 47, -29, -159, -152, -221, -144, -12, 85, 177, 143, 127, 85, -42, -100, -144, -137, -152, -32, 52, 173, 199, 177, 120, 24, -100, -194, -186, -128, -36, 80, 105, 197, 161, 86, 36, -93, -118, -193, -103, -79, 38, 62, 196, 186, 124, 44, -35, -139, -173, -180, -92, 31, 107, 151, 189, 124, 66, -54, -113, -159, -144, -38, -5, 62, 138, 183, 124, 71, 12, -123, -210, -174, -96, -32, 54, 135, 125, 118, 88, -1, -87, -141, -130, -133, -50, 49, 119, 207, 200, 81, 8, -92, -148, -200, -115, -71, 29, 134, 144, 172, 109, 18, -20, -136, -137, -185, -44, 18, 134, 150, 145, 104, 4, -34, -133, -188, -153, -93, -5, 41, 108, 161, 137, 79, -61, -124, -202, -165, -114, 8, 125]
13045A25P2m3Rq4j09q2rm1L9J14P8P4L4K4j05p8j20j4m2M9M5J33J00L2m6m8j20
13072a3o5o3p%N9J72M4M6m2l9o4k5j31n6O6N2N8J44J6k2K1q6j08l3o7l0Q4J40
13100E1O8P3k1o0p1r6o1m0%L2J25K1J30M2m0m0j44j4j31P5m5J31Q5LR8m4j9j10
13128br5l4l6N4Q3J9R2O2k6l0Jj74n9n6P8O5R5J01J9M9r8m5j02r4J3q5R9J45P6
13157A15K2M3k1q4j22p3m0L7L5O0J04P3lJ6j06m8j19k5j4M5J07O2Q3K0mj09p2
13184a8r7m2QL7P6J13N5J2J5n1q3j02j13LL2J14Q9Q3lJ5j3j20l5j12l0J9Q3J18
13212E3L9J01p0M1j34j4j28p2PQ8J10J01LN6Jj06j27r1J9j3j1N7J76O9M6n4j14
13239C3l5j23nJ4L7K1Q0J20Pll9r5q8r8QK7Q9Q8R0QJ1k5p7j01p3l2L8M7J29K7
$$ y = [125, 197, 154, 163, 79, -30, -112, -121, -162, -123, -9, 69, 143, 177, 201, 96, 18, -102, -116, -158, -109, -64, 69, 169, 201, 155, 107, -13, -78, -141, -148, -148, -89, 83, 127, 173, 131, 92, 28, 3, -128, -184, -118, -66, -8, 136, 152, 130, 151, 65, -43, -76, -143, -173, -89, 51, 119, 192, 171, 111, 40, -56, -117, -157, -157, -125, 0, 21, 151, 193, 153, 113, -31, -45, -176, -101, -146, -15, 70, 73, 171, 127, 108, -2, -97, -131, -167, -113, -30, -11, 81, 143, 117, 87, 88, -86, -145, -201, -123, -58, 37, 138, 157, 206, 108, 63, -39, -133, -120, -205, -106, 39, 115, 137, 180, 159, 75, -47, -120, -160, -123, -88, -28, 76, 149, 146, 162, 56, 8, -111, -136, -150, -105, 2, 64, 147, 167, 163, 54, -18, -115, -157, -149, -112, -36, 77, 132, 144, 159, 108, 25, -77, -190, -187, -155, -41, 48, 131, 128, 143, 130, 10, -25, -137, -167, -148, -65, 53, 92, 193, 123, 164, 30, 16, -112, -184, -177, -89, 21, 122, 125, 181, 182, 76, -51, -142, -123, -136, -147, -90, 86, 155, 201, 147, 33, -2, -125, -130, -116, -79, -58, 22, 142, 149, 146, 107, 12, -76, -174, -166, -139, -50, 38, 128, 136, 147, 122, 45, -56, -129, -161, -123, -76, 53, 80]
13269H0J03rn8o2q5j19k2N4M7N0J39M8Kq8l3r2q7j8K0P0N8N4J29j9J2q6j13j04
13297a29n5M5J2J25N3J38k3k5o6q0q1p0j7M4Q2J08J08L8o1k3r9p7j18KL6L9J60
13324F6O9%J9n4l5j33nn9J0M5R3P7M4K2m3p3q6j31J8j9J42K0J28j8R7p1p2m0j45
13353a34k8L4J2Q6J00N7P2m8m3j30n8j07K0M7Q7J06PR4k0m6m2j25q8k4M2Q5J18
13380G4Q8NK1p9q3q4p5K2j0O9N2Q9O5J2n8r8l5q5m2M2Q0O1R2N7pq3l8j35k1l2
13410a36j7K7J28Q9K8P8n8n6j07n4j1o5N7J10O5N5Q8r4k6r0r5m5l2J04K5R5P6
13437A39K3J7l5j41q2n4k8N3K3J58O7K4j0k8r1o8p9j2M3l6J50O1M9K7k1j10q1
13464d2q8K0m0J06L7Q6N4Mj3l6j22o4j3q8J04J11P2O1Lkq7q1m6r1L0L2P6N2J09
$$ y = [80, 183, 174, 116, 54, -31, -150, -172, -118, -71, -21, 118, 166, 168, 80, 47, -45, -132, -150, -130, -60, -2, 52, 181, 162, 174, 88, -25, -129, -184, -139, -127, -2, 51, 189, 166, 141, 75, -5, -86, -156, -173, -129, -47, 61, 169, 207, 146, 123, 24, -53, -171, -169, -133, -94, 66, 135, 135, 154, 100, 65, -68, -73, -132, -122, -77, 16, 93, 137, 159, 116, 43, -43, -174, -156, -175, -33, -13, 115, 97, 194, 123, 51, 11, -134, -162, -128, -116, -30, 70, 127, 199, 151, 108, -22, -80, -187, -167, -120, -33, 73, 80, 174, 154, 108, 66, -59, -147, -171, -129, -44, 74, 162, 167, 188, 109, 26, -58, -133, -111, -121, -52, 0, 89, 154, 166, 108, 10, -25, -110, -152, -110, -30, 31, 123, 180, 173, 90, 52, -83, -104, -136, -153, -126, 2, 91, 119, 197, 139, 83, -24, -78, -89, -154, -97, 13, 78, 133, 221, 127, 101, 11, -84, -129, -161, -57, -32, 63, 139, 162, 179, 144, 3, -79, -133, -161, -108, -85, 73, 140, 164, 154, 126, 35, -33, -112, -124, -81, -117, 33, 94, 143, 170, 149, 39, -42, -130, -110, -150, -44, -7, 79, 133, 137, 124, 88, -34, -98, -111, -199, -95, 16, 88, 149, 152, 150, 63, -18, -64, -155, -125, -93, -17, 35, 144]
13493A44J0k1j5j13o5j08J5N2O5R5N3O6n6mn8j32m8m7J9Q3R4O9Q3j9k6o8j34q1
13521a47Nl1Q4J51J4O0N9r5o0q0l7p7k5R8J03J3J36ok4n4j04j00m8N2j0J17L9
13548C3P9O0k2k7r5j23m0l3N9Q9N1J43J3%j57k3q8m6J4m2R6L8J63M4pk7p7j40
13576f5n0k7m0Q5J09J24M8m1M7j58o5o2p0O4NJ12M8Q4L9m3q9o0n8r3L2Q0L5P7
13604F8J6Q0m0m4q1j03n4OL1Q1P0J16N0o1n4o2j36j0j9L4K9J04O9P1km1j02r4
13632g8q9J3M1N3J37L2K1J9n5n2j22o5J1k8O3P4Q6O9K4m9n5j35o9m3N8N5M8J06
13660G0Q3L2o2j18j2j01l4NN9O8N4J30k7K3p7j16n4j06N5J1O7R0J17K3o8l3l8
13687D1p9o9m0J0N6J03J21k5M9n5j16j01m6j6L9Q8K4J13P1m2J4j00q0o4m0K6M1
$$ y = [144, 154, 133, 118, 5, -60, -168, -153, -101, -36, 59, 112, 178, 122, 118, 60, -72, -120, -167, -148, -65, 29, 98, 181, 162, 136, 68, -66, -147, -142, -173, -89, 62, 76, 136, 195, 100, 40, -40, -77, -154, -179, -81, 22, 35, 171, 165, 141, 87, -17, -117, -165, -113, -123, -6, 33, 112, 172, 150, 123, 28, -95, -135, -168, -109, -20, 31, 174, 187, 187, 30, 7, -81, -127, -113, -155, -59, -21, 142, 186, 179, 152, 75, -65, -115, -142, -182, -97, 12, 136, 184, 143, 190, 32, -33, -95, -165, -101, -96, 16, 64, 148, 187, 144, 55, -5, -63, -156, -124, -44, -9, 68, 84, 164, 124, 80, -1, -104, -158, -152, -121, -40, 30, 146, 196, 135, 81, 19, -117, -127, -146, -112, -83, 21, 90, 161, 159, 118, 16, -78, -167, -154, -113, -60, 77, 109, 130, 149, 94, 42, -80, -145, -134, -162, -99, -25, 61, 130, 154, 105, 50, -85, -154, -197, -139, -84, -36, 70, 153, 185, 123, 5, -7, -108, -142, -137, -78, -10, 44, 174, 147, 170, 93, -23, -77, -183, -128, -117, -50, 40, 157, 180, 112, 79, 41, -38, -107, -147, -137, -81, 22, 143, 118, 167, 112, -4, -105, -151, -167, -128, -40, -16, 97, 168, 126, 140, 40, -40, -104, -144, -118, -77]
13714g7P8P4Q1m7Mq4k2r9o0J8M0J06P3oP4l4j0j06j03k5j2JR2J35LP4Kq3j21p1
13744a05m9L9P7J9N9L8L8M4m6n5j51l4k2KR5P2Q9N8L4r6j27m0o7l7M8J8J40O9
13772A10M7K5n3o6o3j20k0L8NJ28M0J32k3p5%j39r1p2R7J5M6J15O0O4l3j18j5
13799C4j43ql4N1J25N3Q4l0M2p8o0m2j60NK9Q9R0Q0L6n7qn8j57J1l4K3M0P9R8
13828A00P9o0L7j19r7l5m4J0M7J03R2L7J8k5p7j16p0k2nP8N4O6M5Q2o6m2r0p8
13856i8p3rM8J83LP6M9n3n3p2p5n0m0O2M9P5R2L9K2p0r4j27J9k4M8LJ11R3l7N0
13886A47k6q4p3p1m1jJ09K3J04P2Km5j09n6o7l9O2LJ15M4N4L5l5l8r8p9p6L7N8
13915g3R4J06J4L2q7l0m8j05l8nQ6K8R5M2M2L5j07o2j09p6OP1P3M0Q8L3Nl9p9
$$ y = [-77, 1, 75, 156, 109, 113, 29, 7, -92, -152, -134, -94, 12, 85, 79, 153, 119, 109, 3, -100, -125, -137, -136, -44, 91, 94, 168, 170, 87, -34, -105, -154, -115, -38, -19, 40, 78, 116, 160, 114, 59, -92, -126, -148, -146, -51, 21, 110, 168, 202, 106, -21, -61, -128, -165, -117, -99, 41, 110, 157, 182, 129, 63, 0, -120, -140, -102, -97, 31, 71, 203, 180, 105, 105, -34, -125, -197, -100, -85, -39, 76, 136, 200, 167, 49, 34, -109, -117, -151, -100, 25, 78, 162, 132, 174, 96, 36, -6, -166, -161, -132, -43, 47, 127, 163, 106, 98, 40, -117, -106, -140, -117, -77, 2, 100, 179, 119, 156, 37, -60, -95, -139, -129, -82, 21, 113, 150, 168, 143, 66, -50, -120, -142, -147, -69, -15, 51, 96, 178, 112, 70, -20, -98, -171, -180, -132, 51, 54, 130, 179, 126, 73, 1, -74, -124, -164, -102, -53, 22, 114, 153, 175, 105, 11, -116, -97, -121, -73, -70, 41, 134, 97, 147, 121, 37, -36, -107, -148, -149, -40, -17, 87, 159, 161, 116, 7, -49, -116, -155, -93, -90, 25, 69, 123, 158, 123, 85, -13, -92, -168, -131, -73, 21, 127, 141, 173, 86, 56, 8, -97, -135, -140, -54, -26, 69, 111, 153, 188, 81, 19, -90, -166, -160, -89, -16, 24, 112, 145, 150, 111, 32]
13944C2p0q7jk4J15J6R2M8O0o1j01p2p1l5JJ07O3P5N0rqp1j31j1m2K3j9J16Q6
13973G1R8Ln1o7j10o1o4L4J7J35L3L9Q0om3q8q3j12nO3J27P2N7Mj5j4j37n1o2
14002a36j5j3J26R2M8j6O9l0j09r4n7k4K0K5J56K0Q3j3j2o1r3q8m2K0O0M0J40
14029I6L0P7p7o7j21p3k6k8J14P6M9J00qk0l0j00m4j28M4M8lJ41N8M1m5Jj23l3
14057e1j13%N9M8J10O1j5K8l1q4j15k5n3M2O7Q9O6J18n5l1p7j32n7QL3R9mN6R2
14086A33rl7m8r4o3o8RN8P2J17O1jj4o5j09J5q1K2N3k3R3Q8K7J3o7o5j37l2m0
14115a92Q2KJ84JP1l8k4n8j10k8m6N7J8R8P1K9N2j05m1q5m4k5qO5P1R9K6K5k8
14144A19j37J4q8m1J7L6P9K2J20j0K4q6j28m9l2J0K7J08P0M4M6ol5j00j06q5K9
$$ y = [32, -38, -125, -126, -150, -35, -19, 73, 121, 181, 120, 19, -53, -124, -159, -158, -51, 12, 87, 137, 128, 120, 49, -82, -93, -135, -112, -131, -15, 71, 169, 172, 121, 54, -56, -117, -181, -147, -130, 5, 38, 77, 157, 151, 108, 20, -63, -175, -180, -117, 10, 82, 139, 143, 128, 114, -23, -74, -136, -151, -164, -38, 54, 102, 86, 155, 125, 16, -78, -135, -159, -139, -114, 42, 62, 145, 132, 120, 59, -34, -122, -164, -144, -84, -44, 96, 126, 203, 126, 59, -62, -135, -161, -189, -75, 1, 50, 150, 142, 122, 92, -8, -52, -180, -136, -88, -91, 50, 108, 149, 104, 105, -18, -51, -164, -164, -105, -57, 53, 114, 99, 127, 96, 12, -103, -128, -181, -139, -72, 17, 83, 201, 146, 115, 38, -94, -151, -143, -110, -11, -15, 41, 133, 124, 87, 39, -55, -118, -186, -177, -119, -47, 70, 131, 130, 116, 51, -58, -43, -124, -102, -49, -72, 21, 109, 136, 149, 82, 17, -120, -152, -192, -110, -108, 76, 77, 148, 110, 86, 28, -82, -110, -156, -99, -81, 17, 88, 117, 169, 64, 23, -62, -106, -131, -139, -74, -3, 96, 122, 147, 119, -18, -4, -92, -133, -116, -80, -1, 21, 141, 131, 155, 69, -59, -108, -140, -130, -103, 5, 75, 119, 165, 159, 124, 24, -82, -167, -138]
14171a38K9N7N4J28M1k7j07j6q3o3m9L0R8O1J42J2m9k5p2l8j16j8K1Q1Q4K1J12
14198A70j5k8r8n5l9m6k1Q6N3J06QO2n6k7j05p5n7L2J1Q9J08L7j1Nq4n8o1m6m
14227a19LO2J23O0K8M2j64o0j02Kj3M4P2N0J03R%j12on0m6o6pR8N2R2K9N4r7o2
14257A9p5q0Jk8J11N9J11K3J6n2j1j63k0j8n3O0J44O8M7J4q3n0o6l0j32Q6oQ8
14285b0R9J15o4J3l5j26p3m5l4P8O7Q3O1R1q4k6j24q8k6kN6L1P3O8L2R5j05o6
14313D4j32n2L4n0J13O4Q5K0qL8j25r5n7l2J3O9P2J16M3M7p7r4j15n7j5P9m9Q8
14341c3J02K3M7j9m0q2j01m0qJ6J01R3Q7J5k8n4p6j02j6n2J05O2M5P1n4N9j8j27
14369b4m7j03J2N6N3Q7Q1P6o4n6q2m5o6nj6J7J16R4M9k2oo0j13l2m3M8O4M8N3
$$ y = [-138, -109, -52, 2, 130, 171, 144, 37, 21, -62, -125, -174, -144, -46, 15, 157, 169, 120, 95, 23, -15, -131, -149, -128, -47, 37, 58, 170, 155, 127, 29, -26, -65, -111, -132, -46, 7, 113, 121, 183, 127, 100, -5, -80, -137, -105, -94, -5, 103, 140, 129, 134, 50, -8, -69, -115, -119, -116, -54, 69, 129, 157, 199, 35, -25, -127, -125, -138, -94, -22, 28, 131, 140, 140, 28, 22, -28, -74, -140, -147, -49, 3, 95, 124, 178, 81, 19, -56, -136, -135, -163, -52, 7, 118, 141, 157, 105, 94, -69, -89, -107, -160, -100, 44, 112, 159, 173, 90, 40, -26, -56, -188, -102, -108, -20, 79, 194, 130, 143, 108, -18, -91, -136, -170, -92, -25, 58, 119, 210, 126, 100, -24, -112, -138, -140, -84, -53, 20, 88, 120, 215, 110, 44, -88, -140, -106, -156, -43, 21, 106, 126, 118, 156, 31, -64, -121, -153, -140, -71, 1, 117, 160, 207, 130, 36, -79, -136, -151, -72, -121, -33, 69, 92, 139, 120, 80, -2, -103, -143, -151, -135, -34, 59, 146, 161, 133, 79, 3, -99, -115, -167, -62, 0, 45, 116, 62, 121, 103, -24, -71, -174, -162, -106, -53, 34, 115, 191, 127, 71, -11, -56, -122, -127, -143, -126, -10, 84, 133, 111, 105, 45, -68, -100, -143, -95, -31, 17, 70]
14398G0Q1nq9Mq9q5m8K4N5N5N9O7N5m9l2p9r4n5L3J9J24O2NnL4k9p5o5j03K8L9
14429h8M3R6Q7Pk3n5o0r9qn3L2J08M5N1PN9k7p3n2j03n0L2N3R6O8O1l3n8l4q1
14459e2n0rj8J3P9Q2R6j4ln5j00l4j51P2N3P5J07N9K3m2n5j02p5J7n1N0K6Q4P2
14488I7P8j8m5j13p5k1k1L4K2J00K7Q7l6o3o8j6o8j5m2M7R6R5L0O0m2j02n3q2
14516a07j1j8N8J11O4PO5m4q8m6n8j05L7P0O1Q2J8J21j24l8n0p4m0n5R4K9Q4O3
14544A06L4kp2m0q2j13P7k7L9J12Q0M1n0n1j22M3j24M3J7K9J27j2J01p%j13j23
14571h9j1m1RP9R5J04l0Ll0l4j23k3l6LK5P9J03M6M6l9o7j23k5j00L9O4Q3N2N2
14600A11J0M2j03l9q6p4K2K5M9R0O4N8k4n4q9o0q3L0K7N6Q6J0J2M1Pp2j36rl9
$$ y = [70, 151, 146, 57, 61, -28, -113, -161, -137, -82, -27, 32, 99, 154, 105, 73, -6, -100, -155, -122, -103, 21, 83, 88, 83, 117, 88, 13, -52, -155, -127, -88, -45, 51, 138, 145, 122, 67, 7, -92, -100, -153, -121, -13, 32, 83, 90, 149, 122, 49, -3, -106, -156, -124, -71, 25, 93, 154, 121, 63, 29, -52, -102, -111, -129, -116, -37, 45, 141, 127, 124, 69, -31, -65, -216, -144, -91, -16, 91, 150, 173, 131, 76, -26, -101, -84, -135, -85, -59, 25, 97, 175, 157, 112, -1, -76, -97, -118, -84, -62, 38, 65, 152, 116, 53, -15, -31, -99, -114, -156, -109, -13, 82, 112, 172, 130, 28, -25, -107, -118, -136, -78, 33, 97, 104, 169, 125, 37, -9, -67, -172, -135, -65, -4, 78, 96, 217, 93, 55, 5, -69, -109, -164, -70, -41, 43, 106, 140, 138, 66, 26, -56, -169, -92, -119, -80, 32, 112, 153, 103, 52, -70, -27, -151, -108, -91, -62, 65, 53, 154, 147, 147, 34, -89, -100, -141, -132, -53, 42, 146, 116, 119, 89, 55, -68, -91, -127, -124, -99, -20, 83, 129, 175, 136, 69, -54, -79, -179, -140, -76, 7, 59, 111, 121, 163, 60, 21, -65, -139, -117, -92, -43, 47, 111, 169, 145, 91, 2, -58, -141, -111, -84, -28, 58, 68, 80, 121, 128, 56, -80, -89, -128]
14629a28JO9P3J30lJ0l2j14q3j7n3lR0N1P0L5M2l4j1r5j31l4K2Q3M7P4R3J5p6
14658I1k1j40j4n2KJ6J07Q2J7N8J0r1q5o8po3N0P2M4J08j9Km9Qo8j06m0P1K4L7
14688b4J55O1j2p4r3o3o1Rm9R7L9R7J0O8m9p8l3o6j02M1P5O9O7N0N0m7j02j29
14716i4lo4M0K3O6P5N8M4l8k2o4q9q2QM2O3Q1P4j8M4l9p0j28o7L8J6N3P0R2N5
14746A64o4J6n3j41q3N6J5M2P5M2O4j8l9n2p1l3n7PM8R9M1J07J0n7l5j19p3n7
14774a66L8N0L3J17M3K2nq3o4j00l1m1J18K9J00R1J8m6n4p9j29L6k4O3L8Q3jP6
14802A32om2n6n6j01l6P1O6M9Q8O0m3m4o8l8q0l3nR0L5P1M6K4j6p7l0j20qj2P4
14832f5L2J22K3pjm7n0n5j12L0M4R4M5R9nk1o8o2o5q7L7RQ2P9M2K7Rk1r3o2k3
$$ y = [-128, -127, -58, 15, 145, 142, 152, 120, 6, -77, -94, -147, -150, -60, -9, 61, 96, 138, 104, 93, -2, -133, -167, -145, -62, -15, 59, 152, 167, 91, 70, -70, -84, -136, -134, -118, -11, 71, 88, 146, 156, 65, -20, -88, -95, -158, -108, -36, 8, 116, 97, 99, 50, 58, -10, -116, -156, -85, -61, -24, 131, 192, 180, 106, 13, -50, -111, -102, -151, -54, -15, 82, 92, 160, 111, 33, 0, -66, -168, -127, -52, 17, 84, 134, 184, 137, 35, -94, -97, -161, -121, -98, -32, 43, 101, 145, 107, 85, 21, -68, -150, -142, -100, -37, 44, 118, 100, 144, 105, 35, -93, -160, -122, -106, -53, 17, 109, 164, 100, 116, 63, -78, -161, -105, -90, -48, 27, 69, 133, 115, 76, 24, -47, -80, -137, -130, -82, 17, 58, 165, 175, 118, 83, -36, -109, -166, -128, -78, -45, 72, 115, 137, 132, 49, -15, -115, -146, -187, -69, -40, 60, 151, 169, 123, 69, -10, -139, -103, -127, -64, -26, 57, 56, 132, 126, 84, 28, -28, -129, -165, -94, -28, 21, 109, 169, 126, 82, 14, -24, -104, -137, -142, -52, -17, 54, 100, 124, 108, 31, 1, -119, -127, -139, -65, -33, 89, 112, 105, 104, 57, 7, -48, -160, -130, -86, 8, 53, 152, 147, 126, 58, -4, -69, -156, -119, -110, -28, 51, 93, 120, 129, 108, 15, -47, -70]
14863g0r4O1P5M8O9N1m6p3J9j21o3L8j5R6N9P0J6j8ro2p5o3nrM0Q9O1O0K9o1k8
14894F9j52Km1oO2M3J00K5k1On2n5o6o9nP3M3Q5M6J2K1l5m3j34m0PJ8N6J00N2
14924A01L5J3p7l4p8j05j7J9P5R2N7O6K5q6o7m8p4m4M2M7R2O0N1K9l4p6j24l4
14952i4o2K3R2Q2KQ7nm2jn9j15l6j4lJ71M6L8L3l0m9o8m8r8j3Q8N6O7M4M1pj1
14983A15q2r7n6MK4N0P0O6R0j9r8n1r4j7p5O3K6J07M0Q1j1n8k5j11m6Rp1J05O2
15012AQ2N1jj5p6p6q9M3n3lJ61M3J3N6J6j11q5k7p4M0lR0M2J03k0L2j03n0o1j0
15042h4n1K0Q4L5Q3K2J6k1j03m7n8k8K1Q7M6L0N9K7n4j8q7p8n5M4mO9Q5J09Ro2
15072I6o4r9ql8j0L8P7N2Q0Pkq7q0o7j7J9L8M2P2Q0j0k1q5k4m9n6L4l1J09O3O0
$$ y = [-70, -164, -103, -28, 20, 89, 140, 94, 21, 40, -81, -144, -106, -121, -25, 34, 104, 120, 102, 93, 31, -44, -107, -112, -121, -81, 8, 69, 129, 158, 97, 69, -83, -81, -122, -128, -66, -23, 77, 102, 81, 87, 35, -20, -86, -155, -160, -87, -44, 41, 87, 99, 120, 85, 42, -92, -132, -125, -107, -51, 49, 101, 136, 149, 72, 38, -40, -145, -162, -143, -68, 24, 81, 147, 172, 86, 19, -29, -103, -147, -105, -58, 34, 94, 145, 174, 140, 64, -60, -94, -156, -133, -41, 41, 43, 130, 125, 83, 82, 23, -92, -128, -142, -145, 26, 72, 110, 143, 113, 64, -4, -52, -150, -163, -75, -19, 48, 92, 133, 126, 115, 33, -64, -120, -116, -92, -42, 28, 94, 184, 165, 67, 16, -78, -95, -170, -107, -81, 26, 66, 147, 136, 78, 53, -58, -104, -95, -166, -61, 1, 83, 134, 133, 118, 42, -34, -123, -80, -133, -136, 25, 68, 81, 137, 153, 42, -43, -70, -144, -104, -107, -17, 25, 128, 108, 140, 37, -13, -74, -84, -135, -115, -31, 4, 87, 109, 125, 104, 1, -46, -104, -132, -111, -24, 22, 52, 111, 138, 84, 66, -21, -99, -154, -110, -114, -45, 40, 149, 158, 96, 32, -67, -75, -113, -123, -85, -8, 44, 124, 131, 129, 42, -38, -105, -122, -103, -65, -23, 49, 129, 119, 98, 13, -11, -60, -116, -82, -113, -4, 59, 119]
15103A19M4rm4j19l0p5J1nJ15L4L6N4Rm3r1m4n4m7L3N5M8Q7R6p5pj05l6r1j1K2
15133a23P4J7J09M6J2o5j6n2p9j2m3M3R5QJ23P1j06m6j17l9o4N2OO0Q4N6olJ3
15162I8j24m3k9k1j9J00Q0P3K7m9j0j25m8k4J9k9J05J0P1K7P6o6p1n7n7p6K4O4
15190g4Q8Q5lJ3Lj22j5n4k8j4M9P8L7P8k6k1k8p6j14M5m2J7J35M6K8J8k2k8n0
15219Cj01l1ll9J19N2R9M7jm0j18p5k8J2k3O0J07P1J1j9m2n3p6%p0J2O1R1Q6K8
15249A40k0m0k2r7k6q6P6rJ00L1N9J2%o7r3k1q3NN3O8R1M6K7m1o1o6o0n4L0K0
15279h8Q2N4K0Q9Km7j08p5p9L1L8Q7L6Q3jMq3m9j9j01j0oJ29M2N3N5L6p2l3q7
15309a7r2l5M8O7P8J4N1L7k5j20n5l3q6O2N2M8O4O3K5k7n8p7m3o5%N3P4L5O9K9
$$ y = [119, 163, 154, 110, -9, -39, -114, -103, -108, 7, 41, 77, 131, 140, 97, 6, -38, -92, -139, -106, -51, -3, 84, 180, 105, 98, -7, -43, -134, -145, -123, -49, -32, 77, 123, 135, 70, 54, 2, -77, -89, -132, -89, 6, 14, 137, 208, 102, 56, -61, -100, -164, -112, -106, -46, 38, 94, 88, 85, 98, -26, -69, -98, -119, -138, -38, 42, 115, 142, 93, 83, -42, -90, -114, -95, -124, -19, -9, 62, 89, 165, 99, 28, -29, -86, -162, -138, -74, 14, 99, 96, 109, 112, -10, -25, -79, -107, -121, -72, 6, 43, 121, 95, 74, 46, -30, -144, -99, -141, -124, 11, 57, 85, 103, 81, 53, 3, -98, -129, -132, -171, -52, 0, 99, 146, 145, 105, -13, -88, -116, -104, -127, -67, 40, 111, 122, 103, 61, 8, -68, -68, -138, -126, -65, 26, 112, 140, 120, 80, 58, -39, -65, -151, -75, -84, 16, 47, 106, 118, 118, 51, -42, -63, -146, -141, -88, -20, 71, 117, 144, 103, 42, -24, -84, -138, -108, -88, -6, 48, 68, 157, 159, 112, 4, -71, -150, -119, -81, 6, 42, 125, 124, 128, 45, -4, -23, -124, -134, -140, -11, 31, 84, 139, 175, 103, 70, -17, -109, -144, -96, -29, 49, 63, 114, 151, 126, 6, -49, -82, -168, -106, -54, -6, 58, 121, 146, 119, 61, -16, -59, -124, -124, -71, 3, 38, 107, 136]
15339A36m8k2o3p8o6K7L0P3L7R9j2Pr7q7n0l6J7J15n6J11K2LQ3m7j11p5kl7KN1
15369g4R0O9M9J6r4Nj12m4rJ3N7QJ17jM7Nq1j02o7jj9N7N4Q6J06n6N5j39o8m4
15399g7j1k2J1O0R0N8L6k4l3r4q5m9K0N0L9O2M3R2o2j7j07j3o3l0j0O0J30O9J1
15428A34j7l7n3r7l1rj9P8M3N7M3P4l9n3o2r0k8l2Q9K4R5M5Q2j35Qq7q4j2N5l
15458f1O7M7M4N5n0Pj32n1Pr9L2J43R2j1J0Mn0l7j14J8%kK9L0J55k2Jj6l4j25
15488f3j5k9L9PP0P4OM0k7k6j11o4j6j7Q5N1M3P1k0J3j21m8j7n3nN7N1J01J7O7
15518A60o1m9n5j43J1j1R2lJ07P2n0kL0j03j08k9O3j7N5M0Q8K7l7K3j37n6j8J8
15546i3j3O0N6Q4N0j2o0k1j12n0k8N6L0K4Q7M8LJp6q7j5l6k1P2Q4oN7Q2n6j06
$$ y = [136, 88, 66, 3, -75, -141, -114, -84, -11, 26, 125, 113, 120, 23, -64, -114, -150, -133, -18, -74, 37, 59, 62, 145, 98, -13, -88, -90, -127, -125, -74, 16, 85, 134, 150, 56, 61, -51, -95, -104, -91, -34, -26, 91, 90, 137, 142, 61, -41, -108, -109, -128, -71, -17, 69, 175, 119, 174, 35, -33, -77, -88, -110, -99, -39, 51, 109, 145, 121, 88, -6, -91, -140, -120, -70, -31, 31, 74, 166, 104, 87, -20, -33, -96, -126, -136, -76, 54, 123, 134, 117, 80, 27, -70, -101, -110, -129, -51, -8, 49, 92, 166, 127, 74, 12, -78, -106, -138, -49, -25, 70, 115, 197, 62, 70, -17, -101, -113, -58, -61, 6, 53, 97, 152, 102, 109, -23, -74, -67, -166, -134, 9, 101, 90, 100, 104, 54, 17, -97, -79, -79, -81, -52, -22, 133, 111, 112, 96, 62, -63, -78, -107, -68, -61, 9, 83, 89, 129, 102, 76, -35, -99, -115, -132, -47, 4, 47, 118, 98, 111, -10, -58, -75, -128, -133, -76, -25, 76, 93, 160, 99, 50, -5, -148, -137, -148, -56, -59, 48, 120, 70, 68, 98, -5, -113, -142, -79, -96, -41, -1, 87, 114, 77, 100, -37, -93, -111, -93, -106, -46, 10, 94, 144, 132, 72, 51, -61, -111, -139, -83, -53, -29, 58, 106, 109, 110, 34, -53, -68, -104, -125, -53, 31, 25, 82, 164, 108, 2]
15576BJ2j31J0m5P7N9N6N3Q3r3m2q6o1j3K2K2O4oJ22%j9j8p7q0Ko7O0L0J18K6
15606H0M2K4m1j01n3p8LO4M1JP4L8M7o8l1q5m2n9L9N0M8L3P8Pl8n7r0m4jK4N1
15637d4K8K6R3M6p4j1j16qq2J6O7N5J01m8O5l8l7k5o1m6m9L8O1R6K8R8k5j26l
15666B5q2o9J1OJ05K5JR8k0Kq8m3p0l0N2j2Q9P8L3L2n7n9n2k7l5j2L1M9P4N6J5
15697A26J0q7r5j0q9%Q0K6J06O9k9np1j9q0k6k7L8M5N2Q0N7On0j05o7o6j1P6N
15727f1P8J28J5m0j4j21k7k0n0O6LP9M0N0K7q8n6n5o7NNQ5M6R9l6K0k4k3q6n5
15757g7k0j8O6M0Q5O3k6Rr8o6j4p4N3jO7M4N3K9N0j03k5r5l4oK4L2R6K2L7n0R
15788G2q2o0k6n4R2K9O5L2P9n6K0r4l3l5m8K3K5J30J2O5n6m5j8q3rn5K8L6M9N9
$$ y = [2, 14, -117, -107, -152, -75, -16, 40, 93, 176, 83, 41, -45, -106, -119, -97, -75, -11, -17, 105, 105, 86, 68, -9, -89, -87, -154, -94, -64, 54, 80, 122, 146, 105, 4, -49, -127, -124, -60, -19, -18, 56, 94, 141, 73, 42, -43, -85, -144, -105, -55, -7, 26, 104, 111, 73, 16, -74, -118, -119, -95, -44, -16, 10, 103, 149, 75, 64, -52, -60, -142, -126, -59, -4, 97, 49, 114, 76, 39, 14, -47, -93, -142, -104, -43, 53, 81, 179, 154, 28, 25, -57, -126, -115, -109, -4, 21, 22, 120, 100, 102, 14, -29, -99, -129, -77, -89, 0, 78, 111, 143, 86, 27, -25, -52, -87, -99, -68, -19, 55, 111, 126, 136, 49, -46, -56, -145, -145, -65, -39, 67, 136, 107, 102, 31, 12, -68, -94, -121, -83, -38, 14, 94, 151, 157, 107, 2, -65, -131, -142, -66, -61, 17, 145, 160, 120, 106, -15, -42, -62, -112, -46, -43, 36, 76, 126, 153, 65, 9, -46, -113, -108, -103, -18, 28, 127, 91, 111, 87, 64, -22, -77, -97, -115, -49, -9, 76, 139, 113, 122, 24, -42, -56, -130, -77, -78, -11, 33, 86, 115, 165, 62, 37, -58, -92, -98, -74, -42, 54, 76, 113, 63, 72, -10, -70, -96, -150, -58, -29, 36, 68, 147, 91, 111, 17, -16, -51, -99, -76, -51, 79, 91, 156, 100, 55, 37, -46, -55, -110, -82, -46, 3, 62]
15818F2N1M0r0Kq2n3p4M7N8MO9P4M3r1oq2p1J1PoM8Q7J4O4j9l6qj56ko0Q2K2R2
15851D1O1Nq%o1r0j3m4L3N2M8O9L3j4l2p1n7o0n4N6N7N7N8N5k8Ml9j26o0k8M5
15882a11j4J23Q5k0K6M2p8r9l7Pk3K2K2P4J01q0N8j4r6r4K3l1P0L4Q2N7j4L6j09
15911D2l7o4q9%P0O0J7Q7M9k2l6m5q3o2j3Q1PJ12K8l0K1J4q1m5p9mmJ8J09K7M9
15942I7L6k7j05K3j65O0j2K9R0P9k2PL4p6m6q2k2j1J8N8N4O4P0n5l1q7k1n7oK2
15972h4K0N8M5J11p8J4l5j38m5M2JL8O5Q8J3Jm5nj27p0J0J2J7Q2M4R3J7n2q9o2
16002e9J2n6M7k1J13J5M6pJ5n6l9q3m7J9M3N3O8pL7Rm6r5n9k6J3L4N8N6O5K0J6
16033A38r2Oj19n9rK4Q6N8K9N0j5k2n3m6p9KJN7O6M2N7k1n5j4p5p6ok5J02MR8
$$ y = [62, 113, 153, 63, 65, -17, -70, -144, -97, -39, -35, 34, 108, 151, 60, 54, -28, -99, -88, -81, -87, -39, 48, 62, 126, 107, 71, 63, -93, -95, -155, -73, -51, 41, 102, 107, 99, 99, 38, -52, -65, -109, -76, -24, 24, 93, 126, 112, 80, 9, -48, -108, -162, -106, -49, 8, 66, 121, 93, 97, 58, -68, -128, -156, -111, -125, -2, 83, 63, 89, 131, 53, -46, -83, -76, -99, -77, -55, 19, 120, 40, 98, 84, -12, -106, -83, -114, -44, -10, 72, 129, 115, 151, 42, 5, -59, -148, -148, -78, -18, -1, 86, 135, 113, 77, 32, -51, -113, -126, -45, -38, 74, 102, 72, 93, 107, 26, -19, -98, -102, -106, -88, 21, 48, 97, 133, 106, 1, 24, -141, -81, -93, -64, 26, 105, 83, 90, 124, 48, 2, -80, -102, -113, -95, -37, 17, 81, 151, 96, 65, -22, -43, -100, -106, -84, -64, -6, 39, 150, 72, 86, 51, -87, -132, -90, -89, -51, 14, 102, 115, 116, 71, 66, -61, -131, -121, -109, -92, -10, 34, 127, 144, 92, 3, -59, -47, -103, -56, -77, 36, 51, 97, 90, 105, 49, 10, -73, -120, -101, -58, -5, 63, 56, 93, 102, 56, -39, -98, -124, -111, -77, -19, 37, 102, 122, 138, 46, 52, -67, -126, -135, -111, -25, 33, 62, 112, 97, 75, 22, -24, -103, -101, -100, -43, 23, 65, 122, 101, 46, 32, -43, -119, -125, -150, -48, -44, 54]
16064E4N1n4O9j04o1k4o3M2K9N9O3J3L8K6q0n2o5l1l2N3N8Q8L6nm7m0l3l2o8j6
16094a28J9N5R8M0K0j0qj00m6p4J0kM2Q9O5M0m5Kn2lj33m9P4N6L3O0O8Rj02O3
16124I1j28o2MmM8R4J3kL7Kp3n6rr8oK5R3P5N2m6Q1p8k9q2m2K1K1N4L1O3K8m1
16156G7m2j1j00l1k7P2J9N9M1R6l5j4o3p0n6L0l0j2R6O6j5P8j4j16n8m1k0L2L6
16185e3L0J14K7l2K3r6o4Jo4J4J4R2N0O6ol0%j18k6p0PK9J02K4Q1M3o5o4J2n5
16215a4p4k7L2rM9J39m3M5l3m3j10Ol4P7NL7Q0JK4k4q4o6k6j5qO0O4P0k2Q2p6
16246F3k4o9k7n7K7L1N6M9N7M8n6k9j14k1j9j9O4N3M2N5q%jj41o2Lj3J6J07J8
16276B9O2J5j8k8k1r7o9L1PP6P2k0O9nk2r7nq2k1%N3J42K0M3j3n5l9j07om0K6
$$ y = [54, 105, 51, 120, 16, -45, -69, -132, -90, -61, -2, 61, 74, 112, 138, 58, 6, -59, -90, -122, -69, -11, 77, 113, 108, 61, 21, -12, -44, -112, -128, -109, -54, 44, 84, 104, 94, 86, -14, -60, -134, -124, -126, -84, 5, 70, 110, 65, 67, 15, 12, -121, -170, -96, -40, -7, 53, 121, 130, 28, 91, -37, -99, -95, -99, -51, 43, 56, 54, 91, 93, 20, -36, -45, -143, -149, -124, -31, 44, 96, 50, 131, 53, 24, -58, -100, -79, -58, -4, 27, 90, 118, 77, 35, 24, -76, -107, -134, -62, -43, 16, 57, 153, 118, 104, 41, -29, -85, -55, -85, -97, -1, 65, 50, 128, 114, -2, -60, -101, -121, -89, -53, -23, 91, 118, 86, 109, 13, -51, -50, -114, -100, -86, 6, 56, 122, 116, 86, 86, -32, -58, -128, -121, -92, 10, 34, 115, 158, 93, 29, 41, -14, -88, -115, -83, -92, -43, 96, 53, 98, 65, 22, -88, -82, -116, -39, -34, 3, 83, 84, 108, 84, 0, -66, -92, -107, -115, -55, 9, 79, 57, 139, 63, 39, -30, -57, -114, -87, -56, 0, 49, 106, 154, 98, 69, -45, -66, -85, -104, -40, 13, 55, 110, 102, 102, 101, -40, -102, -99, -112, -96, 11, 29, 91, 106, 88, 60, 39, -58, -127, -96, -89, -13, 59, 39, 108, 103, 81, -16, -21, -103, -124, -124, -71, 71, 91, 134, 121, 66, 27, -80, -86, -126, -100]
16307a00K9P2K7O5M3l7m9j11J2o6KN8O2K7O1Pk5o0l8k6n9JM5K1N5J01o2K6j2q0
16337a1o1l7l3L8Q8M1R4J2n6k8k9q7m6kK1L5M5O6O6Mk9j04m5l7q0O9Q2K0R0qj8
16368F0K3q1Pq0j9RM0K7M0Q4L7o1Kj04l8
$$ y = [-100, -71, 1, 28, 93, 136, 99, 50, -61, -49, -115, -113, -55, 7, 34, 95, 102, 77, 17, -21, -47, -106, -105, -60, -39, 16, 117, 55, 81, 69, -11, -72, -109, -142, -104, -16, 25, 119, 131, 75, 47, 18, -69, -115, -117, -96, -61, -16, 50, 116, 120, 91, -13, -58, -95, -175, -106, -24, -4, 86, 78, 60, 83, 2, 9, -71, -90, -81, -41, -14, 26, 110, 147, 86, 88, -16, -54]
16383e4
$$ Imaginary data points
##PAGE= N=2
##DATA TABLE= (X++(I..I)), XYDATA
0@%%%%%%%%%%%%%%%%%%%%%%%%%%%%%%%%%%%%%%%%%%%%%%%%%%%%JlQj2J4j9K5l0
60a6L7m8O5q4J08j83K320j065M2j54o03o31o27j98m5L31N86O19M65K54j67m20
82E86o28o04l97o7K69N47O62M91K20l8m83n52n80m45o6J84N45N53O10K88j5l49
104G31n63n99n33j37J32N08O28N58K62P5k91n48n73m70k33M6L52O17N39N47L9
125A087j96n42o20n35l05R6L53N76O01L92J39j70m27n64n32l43r0K91N36O36M56
146H39K31j06m78n53n80l51n2K75M63O22M37L12n7l34n03o78m65j21J38N21O36
167A96N59L21Q1m28o00n99m28j44J30M11N54N63L62J20k42n21o51n19k83Q6M26
188f06O45N38L74J54k67m79n75n68k45l0L08N61N83M84J86q7m49o25n74l65p8
$$ y = [0, 0, 0, 0, 0, 0, 0, 0, 0, 0, 0, 0, 0, 0, 0, 0, 0, 0, 0, 0, 0, 0, 0, 0, 0, 0, 0, 0, 0, 0, 0, 0, 0, 0, 0, 0, 0, 0, 0, 0, 0, 0, 0, 0, 0, 0, 0, 0, 0, 0, 0, 0, 0, 1, -2, 6, -6, 8, -11, 14, -16, 21, -27, 38, -46, 62, -121, 2199, 1134, 1176, 1022, 419, -212, -839, -1037, -1082, -751, -165, 454, 919, 1173, 1006, 586, -42, -646, -1043, -1110, -841, -294, 368, 859, 1079, 1041, 558, 6, -574, -1019, -1085, -901, -356, 197, 807, 1095, 1080, 731, 168, -431, -964, -1101, -969, -461, 167, 725, 987, 1062, 771, 223, -350, -820, -1053, -1007, -655, -38, 501, 1048, 1087, 891, 349, -271, -806, -1111, -1015, -662, -86, 515, 907, 1046, 876, 449, -115, -647, -990, -1080, -789, -253, 383, 839, 1070, 964, 486, -67, -647, -998, -1050, -775, -312, 310, 747, 1059, 1002, 668, 165, -513, -978, -1099, -961, -440, 196, 755, 1076, 1157, 729, 129, -470, -898, -1042, -912, -501, 53, 616, 978, 1098, 856, 335, -316, -835, -1118, -1032, -606, 39, 577, 951, 1105, 838, 359, -216, -784, -1029, -1059, -751, -190, 393, 877, 1063, 976, 527, -98, -672, -1037, -1115]
209a115L15N78N95M66K36j01m21n57n51l83j57J26N19O44N72L10K3l89o26o10
229e26m19j15J87M08O15N40K60N1k61m69o24m58k42N0M26N55N71M67N4k66m79
250C25o10m90k54L9L34N67N76L65K05j43m50n79n93l33l2L15N30O10M82K29j76
271I17m51n23n92l20j01K50M88N84M59L09J5l68n53o40m54j50J95N51N67N16K67
292I66Kl09n52n23m66j10M9M23N27N91L52J29k57n75n74n38k01J13L78O00M74
313D99L77J30j67m76n14n22l44%L01N50N79M89J83j63m87n58o00k87%K34M94N92
335C10M72K29q4l67n38n42m46r2K13M74N87N62K34n9l42n46n44m00j94K30L74
356d69N41N18L82J6k60n08o10m26k67O1M67O19N42L34R1k46m91n56m57l00L0L59
$$ y = [-1115, -800, -222, 373, 839, 1075, 974, 553, -4, -555, -938, -1095, -969, -450, 194, 766, 1076, 1099, 710, 84, -526, -945, -1060, -873, -465, 150, 690, 950, 1001, 740, 271, -353, -811, -1053, -1003, -577, -22, 549, 1016, 1070, 804, 325, -285, -775, -1029, -990, -656, -89, 487, 852, 1057, 914, 464, -115, -708, -1041, -1073, -758, -228, 382, 864, 1093, 917, 466, -57, -649, -969, -1070, -820, -332, 252, 711, 1020, 1035, 667, 114, -526, -980, -1130, -935, -384, 183, 699, 966, 968, 659, 107, -416, -882, -992, -943, -520, 7, 598, 950, 1079, 822, 247, -327, -865, -1066, -953, -575, 25, 499, 876, 1006, 839, 363, -151, -673, -1017, -1017, -716, -166, 413, 902, 1085, 922, 435, -123, -723, -1010, -1010, -776, -282, 310, 782, 1011, 927, 560, 22, -520, -966, -1058, -845, -371, 216, 778, 1012, 953, 611, 65, -479, -879, -1073, -843, -469, 72, 590, 972, 988, 728, 220, -390, -816, -1083, -1022, -555, 64, 606, 940, 1031, 785, 294, -262, -719, -1019, -989, -630]
378f30M93O10M24J81j58m66n98n85l55O7L00N27O22M31J00p9l71n63n09l46j11
399a016J98N29N29N40K77n3l62o18n33m56r3J93N12O17M30L08k9k68m95n71m50
420h11k12J41L76N49O00L59Q9l06n33o00m97j83J03L54N39N45L74J67k21m61n46
441a74n38l42J3L72N58N98M30J41j82m31n47m75l24m1K38M73N23M66K47o5l59
462E81n35o22l37j32K15N19O11M19K82o0l00n34n53l71j75J00M38N40N90K93P9
483A048l02n16n92n09j69J17M30N90M79L38R4k58l97n79m42k91l3L07N91N92M35
504I33Q8j46m87n81n05l01J1L50M58N12M42J74p2l59n33n56l86r2K96M16O12N29
526H03K06m7l96n47n76m01o6J91M36N30N83K98l3k10o08n43m75k13J31N00N62
$$ y = [-630, -137, 473, 897, 1078, 920, 454, -144, -729, -1084, -1017, -717, -190, 432, 863, 963, 884, 513, -50, -559, -905, -1016, -818, -289, 240, 780, 1057, 1004, 642, 24, -509, -965, -1058, -865, -353, 264, 694, 1002, 973, 705, 210, -361, -811, -1023, -882, -506, 43, 643, 1002, 1091, 785, 252, -348, -845, -1028, -925, -571, -32, 513, 887, 1054, 833, 372, -174, -712, -1054, -1041, -669, -111, 487, 917, 1058, 876, 445, -102, -577, -901, -942, -704, -231, 292, 758, 1005, 940, 581, 46, -576, -913, -1045, -830, -311, 300, 719, 1001, 941, 641, 107, -446, -817, -992, -892, -454, 86, 676, 969, 1048, 746, 230, -362, -871, -1040, -923, -493, 97, 576, 914, 1008, 750, 353, -226, -668, -959, -992, -685, -94, 498, 933, 1021, 875, 388, -193, -698, -999, -988, -638, -180, 332, 774, 948, 876, 517, -16, -572, -958, -1050, -754, -338, 274, 803, 1009, 962, 566, 19, -557, -958, -1024, -833, -397, 133, 716, 1014, 981, 771, 163, -380, -855, -1068, -937, -437, 125]
547A25N08L12L6k71m63n69m58j72K4L58N24N76L54K22k74m38o32n39k72NM28N28
569h8N74L69J11j34m06n62m87l74o5L00N70M98N28J83m1m83n27n54m16mJ96N06
591c06N83M34K49j4k96n60n29m27k31J96M38O01N38L15M5l65n23n65l92k50J98
612h61L96M78N11L63R7j81m90n79m77l28R2L50N68O18L61P4j67m60n60m86k55
633i36l0K36N32N95M44K02q6m60o31m62l77r3K98N29N40M70K42j21l21n22n56
654e07l19k06K21M34N53N11K73L0l29n53n40l97k14J13N21N04N11L14J3k05m83
675B45o03m19k51M5M24N40N37M39Q9k05n34n83m57k98L2L82N67M86L96J27j00
696H59l98n51n15l77r5L09M92O35M82J85j28m19n44m92l38j00K31M59N08N54J96
$$ y = [125, 633, 945, 981, 710, 247, -322, -780, -952, -928, -570, -46, 530, 884, 1106, 832, 394, -238, -777, -1049, -1044, -616, -88, 486, 855, 966, 832, 426, -136, -623, -997, -1062, -762, -192, 306, 834, 1017, 976, 493, -34, -588, -1004, -1008, -812, -306, 277, 711, 960, 946, 650, 90, -439, -866, -1097, -901, -463, 138, 676, 991, 1036, 671, 148, -417, -809, -1059, -861, -465, 13, 524, 887, 984, 803, 313, -266, -743, -1071, -979, -629, -61, 557, 918, 992, 825, 365, -195, -681, -936, -966, -730, -198, 397, 841, 1043, 957, 497, -134, -596, -973, -1066, -768, -239, 301, 771, 1013, 892, 571, 49, -507, -826, -1032, -811, -377, 176, 687, 960, 990, 661, 108, -432, -829, -1043, -930, -409, 95, 606, 920, 933, 728, 245, -358, -777, -1028, -983, -559, -19, 518, 957, 1046, 841, 307, -276, -733, -1031, -999, -617, -50, 436, 832, 959, 859, 461, -90, -605, -982, -1077, -768, -276, 359, 841, 1026, 898, 479, -65, -557, -895, -995, -764, -305, 203, 757, 953]
717I53L0l10n88n52m53j51K38M08O09N53K08J5l32m71n09m16k19Q9L59O06M89
738E56M19P2k90m79o00m81k72J67L67N48N40K85J37j36m75n43m81l11o3L12N38
759a90N97M18K06j08m87n41n26l23jK67M79M60M62K48j08k63n36m99m83j45K02
780h71N02N95M67L50o9l46n14n62m21j26J30M06N27N54L18O3k56m39o14m95k11
801a012J19L65N90N01L80P1k64m71n10m67k70O0L16M98N14M54J45j85l68n81n19
822f34l54mK96N59N75L73J59j00l63n23n00l39r9J95M71N17N31K34Jm33n39n20
844d97l86j52K20N27M50M67L03N1l03m91n18m43j89M1M30N50N48L46K9k43n29
865B11m74m83j84N4K95N59M92M43Q1k05l99n40m86l08m4L43M92N82L93J67j16
$$ y = [953, 983, 673, 85, -467, -920, -1071, -833, -425, 184, 737, 945, 960, 628, 157, -352, -768, -987, -898, -539, 67, 556, 975, 1047, 757, 278, -322, -803, -1075, -908, -541, 7, 547, 832, 969, 833, 358, -185, -666, -977, -1040, -728, -190, 407, 825, 1031, 923, 436, -105, -631, -954, -955, -688, -209, 251, 713, 961, 853, 590, 54, -445, -928, -1073, -871, -369, 226, 693, 1043, 974, 628, 114, -448, -869, -995, -865, -459, 68, 622, 940, 1003, 747, 308, -306, -801, -1012, -893, -528, 62, 563, 943, 1014, 750, 279, -231, -698, -968, -908, -592, -94, 420, 874, 1019, 834, 466, -115, -634, -988, -992, -696, -137, 438, 811, 970, 870, 507, -16, -516, -855, -954, -759, -288, 229, 760, 994, 995, 562, 23, -497, -883, -1035, -815, -288, 162, 629, 932, 983, 680, 189, -329, -772, -961, -920, -490, 60, 608, 954, 983, 740, 211, -263, -746, -930, -876, -581, -22, 470, 913, 994, 789, 390, -150, -636, -944, -988, -645, -153, 429, 822, 989, 873]
886H73m25n84m13l51k6K28M40N67L94K36nl43n50n18m31j11K14M65N80M70K55
907I65o6k77m92n55l80k04J43M07N40M70L83O0k96n11n67m30j63J00L95N13M84
928E19L64R4k89l83m98m01k87k3L02M63O05L64J87j89m21n86m88k44mK65N11N00
950C61L86K04o2m11n05n09l87n4J65N12N65M68K44l4l80n62m73l31j05J46L79
971c83N27M20L25K2k68m27n76m59j55Q5M31N01N52K63K7k18m55n18m22j90L7L70
993e11M26N24M21J24k22m20n52m94k30%L30M95N13L76J82j50l96n01m78l50j9
1014i32K29M35N75L82K76q1l94m92n23l56p0K06M35N39M45K21j3l51m53m31m14
1035g67j85L3M98N21N33K67O8k95n20m68m66j71J22L33N19M48L66Q4j74m19n55
$$ y = [873, 448, -136, -549, -900, -926, -698, -258, 309, 703, 939, 934, 591, 41, -477, -908, -1019, -805, -340, 240, 710, 965, 899, 622, 130, -425, -805, -1009, -866, -459, 81, 551, 934, 994, 698, 187, -380, -810, -973, -873, -478, 35, 519, 883, 977, 688, 305, -193, -594, -881, -904, -602, -139, 466, 830, 1017, 828, 407, -179, -667, -911, -915, -650, -139, 361, 747, 951, 889, 478, -27, -536, -923, -977, -812, -300, 265, 733, 977, 943, 563, 1, -472, -803, -908, -762, -383, 144, 564, 889, 911, 643, 216, -360, -819, -974, -889, -458, 43, 595, 858, 885, 667, 212, -306, -728, -918, -881, -511, -85, 439, 860, 984, 762, 342, -210, -704, -934, -934, -604, -109, 404, 780, 962, 812, 416, -85, -563, -913, -932, -703, -268, 307, 689, 965, 884, 490, -2, -525, -881, -951, -745, -310, 229, 674, 895, 882, 531, 78, -353, -767, -952, -919, -421, 100, 633, 900, 968, 673, 153, -315, -781, -952, -830, -497, 22, 470, 836, 920, 746, 327, -228]
1056b28m47k76M7L33N00N07M22Q6j88l84n50m27k62k0K11N15N26L40K51q3l94
1077D79n33m96l23o1J89M96N07M34K24q6l10m71m89l82n6J69L16N48M70L09K5
1098I59k83n44n48l66j42J30L87M98M65L14P0k68l88n51l95k45K0L31M93N84L27
1119H48J34k21l84n89m86k38L9L39M07N35L68J65j19l68m93m80l20r6K80M90N19
1140C30L85K59j12l69n06n04l35n8K08M37M76M21K96o8k69m38n58l87j55J48M05
1161c94N15M43L64q0j92m96n27l26j83Q0L45M44M98L85Q0k29l90n64m93j92K7
1182h85M33M36N20L40P1j58m22n17l85l07k8K36M83M39M48K19m3m16n61m58l41
1203h96k0K40M16N45L42K30l3k47n25n07l75j23J62L86O01M26K87nk76n20n08
$$ y = [-228, -675, -951, -904, -571, -71, 436, 858, 944, 756, 372, -178, -605, -867, -887, -676, -161, 365, 705, 956, 873, 479, -54, -550, -873, -934, -745, -249, 258, 692, 916, 830, 520, 49, -440, -822, -878, -709, -393, 155, 625, 934, 959, 676, 132, -416, -782, -924, -794, -407, 91, 556, 870, 940, 672, 284, -267, -662, -907, -887, -556, -63, 521, 848, 982, 761, 377, -212, -698, -936, -897, -558, -151, 384, 752, 917, 798, 430, -63, -543, -863, -959, -679, -189, 330, 715, 974, 862, 493, -13, -517, -852, -910, -702, -265, 211, 632, 928, 860, 591, 153, -405, -792, -947, -799, -394, 121, 564, 928, 848, 656, 160, -367, -693, -876, -796, -451, -7, 491, 876, 956, 727, 337, -227, -720, -912, -885, -452, -16, 504, 844, 915, 757, 335, -182, -567, -874, -902, -666, -183, 256, 704, 923, 880, 464, -97, -555, -896, -916, -676, -260, 285, 627, 857, 824, 577, 52, -455, -830, -953, -791, -405, 196, 622, 909, 904, 628, 108, -400]
1224d00l67j05R2L66M82M95K79R6k18m63m99m45k58Q6L43M89N37L43J23k40m58
1245B78m57m39k37M1K35M77M48L79K29j43l52m85n27l31k3K39N21M98M20J44q9
1266H26l91m74m32k92j20J49M06N04M64K58Jl14n08m98l56j71J60M92M43M43K86
1287H76Pk48m53m77l97k03J03K70N49M48L83P1k19m46n11m20k68O2L79M56M69
1308D31L81J08j66m18m55m28k74q2L21M40N01M63J33r5n06m63m29k19p5J74M25
1329b33M13N01K26o1l13n07m80l73j25J59M47N67M83J76Mk66n09m71l64j45J11
1350g60L83M75M22L12N6k12m49n04m36k24J23L56M72N54K42N7k11l49m98m30k64
1371h85L4K57M89M72M14J67j19l68o07m66k85KK86M74M76L44J86q6l34n18m20
$$ y = [-400, -767, -872, -780, -414, 68, 563, 842, 938, 720, 257, -242, -687, -945, -859, -516, -27, 510, 853, 976, 736, 278, -179, -618, -855, -814, -579, -102, 346, 725, 954, 811, 459, -26, -553, -884, -907, -668, -147, 351, 771, 915, 826, 435, -39, -471, -763, -883, -734, -328, 176, 640, 898, 899, 585, 77, -421, -777, -948, -788, -296, 147, 590, 876, 883, 635, 182, -295, -692, -895, -792, -522, 27, 475, 858, 929, 710, 264, -247, -667, -935, -873, -494, -38, 431, 812, 920, 754, 336, -119, -547, -821, -903, -582, -142, 359, 822, 955, 860, 354, -109, -538, -757, -832, -658, -233, 180, 681, 907, 846, 533, 26, -454, -827, -952, -793, -346, 221, 704, 880, 884, 618, 109, -362, -726, -871, -760, -377, 98, 520, 832, 888, 676, 227, -277, -713, -937, -814, -458, 14, 568, 810, 867, 656, 307, -191, -621, -885, -851, -594, -105, 367, 781, 948, 829, 461, -146, -612, -897, -895, -609, -135, 341, 685, 871, 785, 451, -67, -487]
1392d87k65j63J78M25N35M22K73m9l71m56m65l52j05J39L43M97M47L09j5k38m16
1413A86m79m52k36J39L29N86M69L26L1k14m84m78l89k20J2L12N01M65L03J30j21
1434G16l74n18m62k35k4K95M41N09L71J85j56l34n00m55l01j2J76M16M76M96J92
1455I02o4l06n13n07l40n6J34M35N45M10J93Jk77l71n59l98j28J35L25N32M59
1476E52L35m2j53n16n34l53k10J20L45M56M60L16P2j29m08n36l74k95K2L09M38
1497a25M96M36R5j79l75m95m55k02l6K50M01N24L10J87l9l24m60m96l24o2J58
1518g15M54N32L92K17o6k99n07m13k98j14J31L45M48M72K28J00k85m11n46l65
1538g00j70Q1L76M91M65K50N5j89m21m43m39j73k7L05M98M65L68J30j26m82m88
$$ y = [-487, -752, -915, -737, -312, 223, 645, 918, 869, 498, 42, -423, -775, -880, -741, -398, 99, 546, 855, 840, 602, 186, -293, -745, -981, -842, -513, 73, 542, 868, 899, 685, 201, -277, -666, -886, -874, -562, -61, 404, 707, 837, 716, 342, -176, -638, -873, -897, -602, -161, 348, 719, 904, 748, 414, -86, -541, -842, -854, -678, -262, 214, 710, 902, 838, 532, 19, -488, -828, -884, -750, -315, 230, 640, 833, 834, 557, 186, -373, -771, -899, -764, -439, 93, 552, 887, 845, 692, 176, -358, -711, -921, -801, -456, 0, 460, 776, 848, 719, 311, -225, -599, -894, -872, -563, -125, 371, 807, 902, 723, 348, -147, -602, -804, -840, -590, -189, 335, 645, 832, 793, 469, 9, -487, -811, -873, -715, -261, 271, 663, 880, 814, 515, 8, -405, -703, -817, -686, -341, 107, 579, 807, 907, 622, 211, -335, -700, -870, -789, -413, 78, 543, 793, 848, 659, 238, -205, -644, -817, -844, -539, -41, 424, 792, 922, 796, 314, -174]
1559a74m32k77O0K96M51M18M03J35j61k81n24l59l35q5J84M35N44M04J65j21k65
1580D81m99m46k67r6K13K96M86M29K33Jk29m33n21l65j73J42L80M91M58K46Qk35
1602F00m10n43k79j61P6K75M37M73L63Pj19m43m65m43k58R0K72N08M33L36Q1j60
1624F70l57m24m14j99n3K13L97M69M26J32m2m32l97n00k49j27K33M28M44M52J43
1645H13j06k44m35m08l16j77J17L89M89M69K29j8k60m32m51l33j88J57L50M17
1665F2M69K52N5j98m24m35m06k32P6K54M88M82L09J11j97m02m33m29j73mK56L80
1687a39M36L93J51n7l48m96m79k72n5K10M94M29M36J50j21l29l89m47k91o7J43
1708f48L25M76M34K41%k81m47m88l26j64J90L80M21M07K61K6k38l92m45l71j86
$$ y = [-174, -606, -883, -823, -527, -76, 342, 745, 880, 719, 438, -86, -445, -780, -865, -681, -246, 298, 702, 867, 746, 481, -18, -464, -731, -827, -614, -318, 168, 597, 830, 831, 602, 169, -352, -717, -890, -748, -368, 123, 581, 827, 835, 600, 190, -353, -632, -793, -717, -442, -5, 468, 831, 838, 719, 276, -189, -632, -890, -800, -528, -20, 413, 749, 830, 670, 313, -111, -525, -724, -777, -564, -167, 302, 728, 860, 818, 386, -11, -511, -760, -887, -654, -226, 218, 670, 813, 707, 463, 28, -380, -696, -873, -756, -367, 122, 591, 820, 802, 542, 110, -341, -674, -862, -705, -355, 62, 531, 783, 838, 640, 216, -219, -625, -857, -781, -527, -39, 443, 752, 863, 666, 264, -169, -598, -771, -775, -519, -139, 297, 690, 841, 784, 436, -60, -539, -811, -866, -656, -162, 267, 703, 853, 732, 403, 14, -433, -724, -791, -648, -323, 153, 587, 828, 828, 547, 100, -388, -714, -878, -688, -308, 113, 520, 781, 807, 569, 177, -268, -639, -825]
1729h25N0L31M25M93L06N2j62l71m98m61j96Q5K98M29M03L23J19r9l46m39m27
1750e10k91JJ83M46M66M03J55j35l20m90l55l02n1K21L38M58L76K05k6l06l90
1771G6m60l19j80J52L63N03M43K01K9l39l77m18l44j39O9L81L97M17L00O7k05
1792F17l99n05l51k06L8L71M30M70K58Q4j94l18m45l90k34jK12M05M50L77K00
1813H69j07l99m71m24k68k7K24M55L92L90J12l4k94l77m38l45m5J11M18L76M79
1834E97K23k2k54n18m05l43r2J33L28M48L81K82J6j80l81m76m11j61J01K98M68
1855C2M07K96O6k46l31m54l56j84j1L21L51M67K76J60j44k92m40m67k59pK71M15
1877a29M84L06J33j18l42m06m05k81l9J39M04M31M10K36q6k13m76m51l62q3J72
$$ y = [-825, -775, -444, -19, 474, 780, 832, 670, 299, -199, -660, -856, -771, -473, -44, 359, 682, 801, 702, 356, -83, -510, -801, -800, -617, -171, 295, 698, 853, 718, 398, -92, -447, -749, -800, -579, -241, 217, 593, 798, 772, 466, 76, -384, -703, -883, -731, -368, 135, 578, 779, 808, 469, 92, -326, -670, -809, -740, -359, 38, 455, 755, 822, 617, 218, -287, -638, -844, -806, -435, -5, 465, 723, 807, 613, 295, -150, -540, -774, -775, -563, -158, 292, 669, 869, 762, 363, -108, -532, -800, -827, -603, -148, 244, 634, 746, 712, 418, 41, -397, -742, -787, -676, -258, 118, 597, 820, 798, 544, 26, -379, -722, -814, -681, -353, 95, 476, 758, 774, 594, 213, -263, -674, -835, -734, -436, 32, 439, 735, 801, 555, 224, -230, -586, -770, -781, -460, -109, 358, 634, 794, 650, 358, -82, -549, -808, -815, -544, -129, 355, 661, 794, 676, 334, -72, -477, -758, -797, -658, -254, 177, 587, 823, 737, 524, 48, -403, -765, -848, -676]
1898f76L83M26M40K10pk65l18m98l50j43Q0L34L98M60L16L6j77m07m43m13j51
1919g65j5L72L62M87K54J13j57l59m49m15j67j7K25M10M73L38J53j18l35m80l97
1940d87k76lK11M28L80L65J96n9k79m79l78l66j11J98L93M43M06K04j7k82l82
1961A05m82k94j41J01L39M35M59K21N5j93l51n05m25j38N0L53M61M29K84j8j41
1982F04m25l63l53j84l6K37M25M30L65J57j69l32m64m17k44j4K70L69M68L44J25
2003G93p0l24m45m14l03l7J74M07M62L91J73n7k99m23m60k73o8R0M27L65L95K51
2025G55J6k08m29m75l39j16O2L51M61M23K97j4j67m34m56l25j55K2L04L62M22
2046C57L59R1k04k87m60m18k50J9K75M00M96K55J81j77l42l68m58j89m0J69L65
$$ y = [-676, -293, 133, 573, 783, 776, 511, 193, -305, -655, -798, -718, -384, 14, 474, 790, 826, 649, 242, -201, -614, -765, -780, -408, -46, 441, 695, 808, 651, 292, -157, -572, -739, -756, -531, -121, 352, 690, 843, 725, 390, -90, -487, -763, -766, -555, -127, 253, 618, 814, 755, 476, -3, -381, -747, -858, -660, -267, 176, 582, 786, 769, 487, 105, -377, -671, -812, -711, -372, 63, 522, 743, 798, 605, 254, -251, -676, -814, -764, -411, 50, 479, 763, 745, 604, 179, -184, -537, -721, -757, -520, -95, 335, 700, 857, 688, 356, -108, -525, -769, -783, -513, -144, 324, 668, 793, 723, 399, -46, -460, -763, -800, -626, -219, 243, 634, 807, 750, 451, 28, -432, -705, -773, -683, -256, 109, 504, 755, 771, 563, 134, -341, -680, -796, -734, -383, 78, 501, 798, 784, 617, 183, -273, -598, -753, -731, -427, -65, 357, 716, 807, 603, 316, -144, -562, -812, -793, -518, -118, 378, 633, 814, 637, 295, -73, -531, -720, -760, -591, -226]
2067b26M24M02K25l6l05n09m38k60j03K08L82M60L67K00n0k87l82l88l14j42P4
2088f98L03M70M32L13m8k64l91m23l42j59N4L63M15M18K35Q9j64l44m45m23j68
2109g77l4K66N22L94L18R7r5l71m31m16k88P3J86M12M30L09J45o1k56m63m02l40
2131g82k6J83M23M10L69K35j18k65m43l60k76j21J66L44L63M42K19l2k02l79m69
2152c19l55j37N5M17M25M37K24Rk32l23m45l33j84KK95L65M75L32O3j40l64m54
2174a87l89k25L7K43M60M13K86J21j74k36m47l76k44o7K21L88M23L59J53n7k96
2195D06m82m27k60m8J75M22M28L06K13ok52l62m25l52j34J03L54M46L92K46nk19
2217E19m44l84l27j26J30K75L41M22K96L8j53l33m43l67k14N9K48M49L67L15J03
$$ y = [-226, 198, 600, 825, 789, 484, -25, -463, -723, -826, -618, -236, 224, 591, 791, 741, 454, 72, -316, -630, -772, -698, -395, 75, 507, 820, 772, 508, 117, -306, -648, -807, -753, -390, 25, 443, 678, 767, 603, 259, -186, -609, -777, -811, -545, -23, 371, 689, 786, 691, 320, -111, -527, -815, -742, -556, -144, 286, 595, 740, 679, 423, -40, -442, -782, -808, -625, -202, 208, 577, 812, 694, 429, -14, -374, -650, -771, -605, -261, 102, 544, 763, 731, 529, 150, -319, -674, -811, -756, -339, 86, 523, 747, 756, 524, 201, -244, -577, -761, -759, -464, -99, 376, 708, 771, 631, 267, -187, -576, -801, -764, -521, -61, 352, 638, 759, 585, 349, -98, -474, -718, -785, -564, -176, 247, 606, 759, 702, 406, -76, -503, -763, -811, -636, -214, 214, 520, 733, 727, 475, 113, -312, -664, -798, -695, -341, 105, 497, 743, 738, 519, 75, -309, -636, -762, -632, -357, -16, 406, 702, 740, 587, 254, -189, -556, -770, -711, -463, -14, 353, 668, 771]
2238G71j35l95l73l78k03l2J87M44L59L81J43q6l61l01m83l14k7K35M07M42K50
2259E31J88k1l14l26m25k79j28J07L53M24L63K61jk45l58m98k93j34J25L58L70
2280E8M11K09N2j69l26m83l40j72L6L43L49M56K87N9j58l67m49l56j63j1K61M10
2302f3L29L31J37m9l50m03l53k99k2K04L86M34K88J85p8k92m22l98k53l4J57L09
2324b56M33L60J97Lk75l71m42l00j15Q5L80M08L93K05J1k31l77l75l26j15N6K47
2346d05M70L82K59Q1j79l69m66l17k20L9L01M28L80K59N1j31k73m08l64k12j8
2367g12K45L53M18K96J90r1l75m08l98j86k8J88L07M60L13J10J6k70l10m24l40
2388f46j44J63M00L96L91K03j2k89l59m20l12r5P9L10M29L30K37Q1j70l61m38
$$ y = [771, 636, 241, -132, -510, -713, -745, -558, -114, 245, 626, 769, 683, 322, 21, -462, -776, -803, -568, -161, 281, 531, 719, 698, 384, 58, -367, -646, -774, -667, -314, 110, 473, 734, 733, 488, 130, -368, -661, -795, -670, -312, 58, 469, 678, 730, 561, 235, -248, -588, -760, -724, -381, -32, 424, 711, 770, 612, 245, -204, -560, -723, -734, -473, -63, 266, 597, 734, 685, 335, -68, -421, -720, -742, -538, -152, 282, 570, 755, 677, 385, -37, -435, -688, -722, -565, -256, 177, 537, 734, 737, 462, 91, -351, -651, -766, -681, -301, 107, 500, 705, 716, 485, 108, -267, -593, -708, -652, -405, 65, 447, 706, 787, 608, 239, -227, -544, -764, -725, -424, 4, 384, 643, 694, 563, 290, -118, -482, -694, -712, -467, -114, 304, 600, 790, 699, 324, -84, -482, -668, -696, -508, -201, 259, 572, 682, 698, 428, 118, -306, -646, -790, -627, -227, 169, 560, 763, 751, 462, 103, -317, -629, -724, -645, -335, 94, 424, 661, 742, 572, 211, -227]
2409b27l60j45Q1K62L90M11L12%j45l18m60l14j59k9J98M19L77L46J36j22l02
2430C51m26m17k24j1K00M60L36K92J29l5k71m10l74k68m2J41L21M43L72K40r7
2451G10k26m32m28k53j14J77K44M58L19K11P6k67l62l91l15j27L4L03L73M53K40
2472F83O2j82l31m61l71j08M9K89L49L35L07J38j60l03m61l46k13kJ96M47L95
2493C12L26J24j39l04l81l62k51k4J81L09L69L10K48l4k28m43m21k97j20K31L77
2514b17L92K93K06qk28l84l96k71j11J01K62M41L99K34M5k16l64m38l63j23N1
2535f95L43L63L99K43K4j32l19l95l41k25J7K32L86M28K92J79k11k61m36l65k20
2556f94qK21L61L86L16J15r5k33l59l99k38j46J88M13L28M26J41r0k49l39m24
$$ y = [-227, -587, -732, -651, -389, 1, 412, 724, 724, 579, 261, -199, -513, -672, -701, -503, -84, 293, 639, 775, 653, 351, -75, -492, -716, -727, -527, -67, 269, 561, 690, 655, 384, -26, -400, -668, -710, -569, -248, 195, 567, 807, 710, 484, 52, -376, -629, -743, -566, -322, 136, 455, 666, 742, 475, 113, -278, -593, -720, -686, -383, -10, 443, 683, 745, 563, 232, -229, -600, -708, -659, -370, -21, 314, 621, 759, 599, 296, -165, -511, -724, -726, -530, -83, 312, 638, 762, 623, 319, -62, -424, -675, -699, -518, -209, 160, 470, 718, 684, 456, 13, -408, -705, -825, -594, -217, 175, 468, 674, 666, 438, 54, -342, -613, -724, -623, -361, 80, 479, 713, 758, 542, 178, -260, -623, -746, -695, -352, 11, 410, 653, 677, 545, 226, -169, -510, -735, -718, -486, -100, 328, 620, 799, 588, 327, -109, -474, -694, -702, -481, -120, 266, 582, 697, 602, 369, 10, -389, -627, -773, -585, -172, 156, 582, 723, 633, 384, 45, -379]
2577c79k58r6J35K98M20L46J83O5j59m29l89l27j53J19K62M37L63K70Nj49l69
2598A95l96l30j84O7K47L50M00L21P2j53l37m07m13j66M3K20L85L84K87J22l4
2619F73m10l40k87k65p0J47L93L50L83J91p8k74m21l55l36j2J34L43M30K99K00
2640F95K3k91l29m21k54j60Q1L72L60M05J94P5k61l54m40k34j42L8K45M17L58
2661C77K79N2j08l87l74l48j82QK13M20L91L03Q5j66l04l92l21k01j8J99L02L89
2683B17L41J89p7k69m53l41k83p9K17L80M03L14J51j44j87l64l43k69j36J63K83
2704b87L94L97J38N5j91l88m13l05j66J30L26L94L53K33K4j50l74l98l25k00J48
2725f05J66L86L80L32R1j62l13m52l69j28KK82L46L47K42J87j39k47l85m40j75
$$ y = [-379, -637, -733, -598, -300, 120, 466, 649, 714, 555, 126, -263, -590, -743, -624, -362, 75, 438, 708, 713, 564, 195, -201, -531, -715, -648, -401, -51, 349, 670, 742, 589, 252, -155, -568, -734, -691, -471, -86, 298, 585, 707, 673, 263, -77, -364, -629, -699, -552, -159, 191, 574, 765, 687, 413, -8, -363, -699, -711, -577, -234, 196, 495, 695, 718, 427, 98, -323, -577, -737, -656, -284, 76, 481, 675, 750, 489, 135, -305, -539, -681, -643, -398, 19, 377, 656, 708, 600, 213, -161, -509, -691, -683, -470, -50, 341, 644, 729, 563, 259, -133, -454, -655, -673, -474, -172, 217, 558, 747, 670, 401, -52, -393, -676, -755, -538, -158, 245, 559, 710, 566, 379, 15, -328, -597, -733, -570, -287, 107, 504, 642, 697, 506, 118, -295, -600, -766, -636, -310, 84, 437, 670, 694, 544, 170, -228, -553, -753, -605, -439, -53, 327, 659, 750, 588, 275, -177, -546, -674, -672, -390, -44, 303, 545, 732, 593, 346, -39, -479, -654]
2746f54l2J52L53M50L20J29l8l63l61l83j99m2J46K94L72L54J70K4k19l61m28
2767c16l28r8J47L02M41L32K20o5j44m03l53l08j24P2K50L57M01K55L0j06l45
2788B17m06l22k45R3K27M25L34K40J00r2l10l30l69k18mK10L08L55L68J86j25
2809F42l36l36l67k77k2J83L14M16K91J69m8j92l85l75k82j16J70K43M71K78L20
2830G61n5k39l43m13k52j66J53K56L44L61K18P4j73k90m41l55j30J5K42M09L85
2851C61K20J10j25l38l69l58j67J7J80L43L59L54Q8n8k92l94l95k34j9K27L68
2872a22M07L01J23r4k88l20l25l33n5J66K74M07L23K07j0k43l86l78k49j53J50
2893e98L28L32M13J63Lj97k89m24k93j04K9K49M18L60K43jj18l32m08l58r1K2
$$ y = [-654, -686, -534, -181, 269, 589, 718, 680, 317, -44, -427, -626, -668, -522, -228, 144, 498, 668, 692, 473, 112, -316, -644, -742, -595, -293, 148, 480, 700, 635, 491, 88, -265, -573, -697, -625, -375, -18, 383, 638, 668, 562, 217, -189, -511, -756, -663, -436, -11, 323, 563, 663, 571, 261, -69, -438, -656, -660, -450, -142, 213, 581, 767, 642, 306, -30, -397, -674, -696, -513, -199, 217, 508, 677, 629, 437, 52, -323, -605, -721, -551, -308, 163, 441, 761, 706, 467, 124, -289, -541, -707, -554, -298, 46, 407, 625, 699, 526, 236, -205, -560, -690, -675, -433, -24, 361, 581, 691, 566, 228, -141, -499, -666, -649, -469, -126, 233, 587, 675, 617, 325, -69, -464, -698, -717, -490, -122, 285, 586, 709, 615, 327, 7, -318, -651, -706, -540, -266, 141, 464, 671, 661, 418, 32, -346, -595, -748, -598, -270, 62, 475, 638, 641, 444, 155, -269, -562, -666, -637, -388, 30, 390, 633, 632, 514, 182, -226, -584, -675, -653]
2915f53K53L30L66K79P2p5l18l29l52l12L6K19L70L88K51J24p5k68l78l74j56
2936f02n7J48K88M10K92J36N1k85l60l61k70q9R5L61L56L93J27j2j79l44l57k91
2958e50j22P9K62L76L29K83K7j59l79m08k90j72J16K26M03L38K74Pj31k89l28
2979a08k89k75j9K21L48M06L29P8r4l02m10l40j66j6J53L32L53K93J47k2k76l44
3001al33l14p8J73L19M12L12K14k0k71l51m31k15j10J60K76L53K54K73K6j60l57
3023A31l67l56j16R2K75L82L78J81R5k23l07l35l55r0L5K07K86L74K95M8k5l27
3045B78l96l40k78J39J63L79L40K38J46r6k45l48l53k00j27J85L11L37L72J88
3065F93m1k83l60l26l18q2J92K95L66L70J29j1j94l13l75l19l9J2K92L76L72K65
$$ y = [-653, -400, -70, 296, 575, 647, 572, 254, -75, -427, -739, -703, -484, -114, 274, 525, 649, 574, 306, -72, -446, -602, -659, -511, -223, 187, 479, 615, 666, 381, 21, -340, -610, -699, -604, -243, 113, 506, 633, 621, 442, 98, -259, -550, -672, -593, -331, 45, 374, 657, 684, 525, 146, -262, -552, -724, -608, -382, 21, 359, 633, 640, 509, 220, -108, -397, -672, -691, -470, -122, 284, 613, 691, 597, 295, -115, -455, -621, -637, -484, -152, 201, 494, 641, 619, 343, -1, -334, -648, -726, -553, -234, 178, 490, 704, 684, 413, 62, -369, -584, -694, -534, -258, 95, 349, 622, 648, 488, 131, -236, -592, -708, -616, -341, 41, 419, 600, 695, 472, 165, -170, -525, -615, -580, -373, -87, 287, 582, 630, 605, 278, -118, -458, -736, -597, -434, -55, 285, 523, 669, 573, 328, -20, -373, -573, -700, -515, -204, 133, 505, 693, 652, 369, 9, -317, -635, -717, -525, -230, 136, 506, 635, 624, 430, 117, -258, -577, -616, -604, -312, 64, 436, 701]
3087G01j9j79l88l57l32q1J06K29L29K68L28jq4k70l91k64k61J5K23L60L65L05
3109F02P8j58k74l15l93j57pJ46L16L99K51J76pk79l68l53k65o7J92L15L29L51
3131E12J23j2k24l32l59k78m3M9K62L97L28K63Nk53k62m29k33k29J35K54M16K73
3153C63K31L1j32l17l17l26j91OK57L47L47K53R2o5l16l79l39j84l4K24L37L54
3175B42K74R0k4k36l61l76j81r4J57L95L35L30J47n9k89l67l19k38l0O1L11M21
3197A89K68J74k2j51l36m03k60j15R4K21M31L48J80L4j95l35l50k24j76L9K46
3218c43L27L88J91J13j55k90l76l68j66K2K70L64L73J94P9o9l16k98l22k22n4
3239f58K09K73L82L22J26o3k84l27l60k65lJ73K67L74L10J18mk14k99l34l15r9
$$ y = [701, 682, 503, 115, -242, -574, -655, -549, -320, 9, 277, 605, 604, 520, 250, -141, -405, -666, -651, -428, -68, 297, 602, 680, 522, 248, -67, -460, -617, -624, -478, -162, 237, 488, 664, 657, 378, 10, -343, -608, -675, -483, -168, 161, 512, 635, 623, 399, 67, -292, -570, -613, -564, -302, 95, 423, 686, 691, 438, 176, -253, -486, -715, -580, -326, 90, 363, 594, 625, 493, 176, -141, -467, -658, -652, -395, -48, 299, 552, 644, 579, 263, -116, -455, -639, -673, -449, -112, 242, 516, 606, 582, 346, -15, -391, -572, -666, -509, -114, 221, 551, 698, 639, 350, -17, -336, -574, -604, -543, -232, 189, 457, 631, 609, 458, 122, -281, -541, -656, -562, -341, 90, 438, 618, 652, 457, 122, -228, -452, -628, -589, -343, -16, 372, 563, 676, 521, 231, -145, -513, -679, -657, -387, -23, 350, 544, 623, 554, 238, -60, -382, -604, -658, -449, -176, 206, 528, 654, 591, 307, -20, -380, -645, -648, -475, -208, 166, 476, 594, 590, 376, 77, -257, -572, -671]
3261f71R4L29L39L52J95K7j90l67l62l02q6Q8K85K98L67J64N1j22l14l49k89j86
3283f49L1K12L70L38K81R6j56l07l68k74k05J3K35K13L52L37J53q0k97l51l24
3304c80k59m6J70L38L63L36J35j45j74l24l72k00p3J34K51L62L09K05Kj58m69
3325El08l34p0J83K09L91L00K18K9j62l38l40l09r7lK24L62L88K09Q7j75k27m77
3348b35l06r2NK57L37L50K34O0q9k77l23l21k31k7J56L27M15L06Q2o2k69l81l17
3371d01k07l8J63L18K58L55J53j4j49m03l25k76j82J21L41M28K62K41j00j37l39
3392F9l16k66j01N6K27L72L34J57J08j06l33l88l04j39J5K39L62L78J94M4j12
3413D90l02l06l15k05O6J61L32L41K99J14j09k48l60l74k21K1J81K64L83K90J43
$$ y = [-671, -577, -248, 91, 443, 638, 665, 475, 108, -254, -556, -642, -554, -269, 29, 396, 560, 611, 489, 175, -174, -463, -649, -618, -406, -36, 302, 583, 679, 523, 216, -152, -426, -631, -618, -383, -170, 182, 519, 672, 592, 295, -56, -380, -639, -685, -515, -177, 186, 522, 657, 512, 338, 14, -358, -558, -631, -497, -246, 116, 425, 630, 632, 474, 5, -303, -637, -707, -524, -315, 76, 376, 594, 623, 461, 123, -217, -526, -623, -626, -402, -40, 348, 557, 644, 469, 242, -235, -541, -633, -628, -371, -34, 316, 550, 610, 521, 244, -79, -400, -631, -658, -502, -175, 240, 546, 628, 566, 297, -84, -401, -608, -646, -483, -165, 93, 448, 601, 587, 438, 35, -290, -566, -748, -627, -286, 142, 404, 645, 545, 408, 69, -247, -513, -614, -558, -331, 41, 375, 532, 640, 534, 201, -187, -491, -630, -615, -376, -14, 364, 558, 602, 490, 188, -118, -433, -638, -572, -411, -79, 262, 561, 675, 566, 318, -42, -416, -637, -616, -435, -171, 212, 502, 645]
3434F45q3j88l48l98j83q6J05K96M07K95J80l2k28k93m08k03j20J24K57L23L73
3455D35J30N3j57k92l53l19r7K4K35L57L61K59N2k07l10l45k43j89P1J51L43L25
3477B84K50J28j11k76l67l24k22jK49L04L40K31J67j29k13l41l13k19m1J40K75
3498a89L29L55J51J4k23l88l56k68o3J69K69K80L75J74m9j87k69l70k37j37J8
3519f02L06L32L34K62K1j72k72m38k37k18J36J97L67L02K27Q9j10k75l48l17j82
3540e98j01K72L58L46K91P6p1l37k85l34k11j3J23L46L27L21J12q1j81k83m00
3561c23k76l2Q5L56L35K73J96j1k53k72l76k72m5N6L07L04L59J83L6j84k91l86
3583b31l15j08R2K40L66L31K21O0j84k72l51k94j43k8J71L78L54K89P3q5k97l69
$$ y = [645, 562, 374, 26, -372, -555, -641, -536, -240, 167, 462, 642, 610, 382, 89, -319, -522, -642, -518, -261, 62, 435, 565, 618, 461, 169, -184, -503, -600, -576, -341, 16, 377, 636, 688, 481, 171, -174, -417, -606, -535, -384, -41, 284, 534, 662, 551, 275, -92, -416, -638, -639, -390, -86, 254, 485, 652, 523, 310, -31, -344, -563, -604, -464, -189, 140, 495, 646, 660, 437, 49, -307, -575, -638, -469, -200, 80, 455, 629, 580, 393, 124, -246, -483, -620, -602, -296, 36, 370, 632, 653, 481, 209, -229, -466, -684, -548, -351, 16, 318, 545, 634, 524, 249, -99, -416, -598, -699, -427, -69, 277, 568, 644, 573, 236, -49, -383, -594, -607, -484, -138, 189, 510, 622, 541, 360, 77, -323, -599, -631, -546, -190, 145, 418, 614, 603, 350, 78, -298, -570, -615, -559, -252, 52, 411, 594, 630, 446, 155, -231, -546, -654, -562, -322, 44, 375, 596, 656, 472, 200, -151, -445, -588, -616, -445, -67, 287, 576, 649, 564, 267, -102]
3605a02k99k26J3J86L25L53K69N4p1k25l09l31j81r2J42K55M40K25J45m4j86l40
3627Al69k26j0J40K60L21K70K16j7j41l13l59k91j30Q5K68K92L57K56j0j69l16
3649A15k99l48nmK25K57L22L02K7o1k95l70k76k31L4J75L32L78K75R6j66j92l66
3672g5l27j17m5J34K44L32L19J64m6k39l76l14j98o8J32K82L81K36J63J6k19k94
3694H5l61k32j10R2K58L24L02K11J5j43l41l17k66j20N1K61K95L70J68L6j00k96
3716A82l17l31j59N1K01L12L32K65M7j04k56l62l00j24rJ53L32L12K21J49n6k07
3738C32l85l29j79m5J36L19L11K95J37p1k08l14k90k78pP6K43L59K62J91J4j67
3760D02l07l70k65j04J54K37K93L34K17Mk12k64l00k98j21JK70K71L32K26J46
$$ y = [-102, -401, -627, -614, -428, -103, 250, 519, 573, 502, 277, -32, -363, -544, -636, -494, -239, 201, 426, 571, 527, 341, 1, -368, -594, -604, -464, -204, 117, 387, 603, 586, 445, 132, -227, -518, -648, -563, -295, -3, 354, 610, 600, 431, 115, -184, -532, -537, -541, -316, -59, 263, 565, 592, 531, 236, -134, -410, -641, -607, -432, -100, 278, 553, 649, 483, 291, -75, -402, -519, -564, -430, -186, 146, 465, 629, 583, 344, -32, -346, -544, -612, -480, -198, 183, 419, 582, 598, 379, 85, -276, -508, -618, -526, -268, 56, 358, 569, 584, 441, 100, -217, -483, -603, -552, -291, 4, 374, 542, 578, 478, 182, -135, -466, -625, -574, -373, -61, 271, 536, 583, 479, 223, -139, -439, -563, -572, -419, -87, 225, 446, 595, 539, 332, -53, -382, -561, -606, -470, -151, 160, 455, 592, 521, 313, -1, -291, -569, -576, -500, -257, 102, 364, 555, 569, 402, 95, -275, -540, -644, -490, -253, 40, 374, 591, 595, 383, 119, -181, -479, -600, -599, -329, -58, 274, 500, 646]
3781F46j52k98l70k54k38P7K23K83L54K07Q6p1k14l34l04k18o0J85K95L43K95
3802D81J34j14j98k97l49j92n1J28K47L79K27J46K0j87k90l33k29j61J00K87L41
3823H9L26J77k9k12k49l75j94j12M7K28K96L07K37P2j27l34k56l56j84P6J96L81
3845DK82K67O3j83k33k97l10j62pJ73K86L08K54J56o1k22l22l55k17l2K16K40
3867a52L67K52P2M6k69k61l36k67m9J06K59L10L55J92l6k43k70l09k91m9P5K62
3889b36K97K97K14j9r3l00l21k22j91k2K66L25L35K48N6j75k59l52k63j60L5K27
3911c13K35L41K02J38o7k31l57l44k12J7J57L34K92K93J21o0k26l41l03j67n4
3932e45P3K93K85L22J31J8j87l07l08k82o4J08K39L45K50K13l6j70l05k80k19
$$ y = [646, 494, 196, -174, -428, -666, -589, -366, -83, 271, 478, 564, 493, 279, -55, -359, -577, -637, -452, -157, 186, 481, 615, 501, 303, 6, -343, -535, -586, -458, -211, 168, 395, 541, 561, 374, 84, -249, -478, -639, -539, -252, 89, 415, 592, 563, 351, 102, -273, -467, -579, -532, -304, -8, 299, 536, 608, 481, 147, -109, -465, -649, -573, -377, 4, 286, 553, 616, 433, 200, -97, -407, -569, -576, -403, -117, 191, 445, 601, 540, 318, -4, -359, -576, -608, -392, -152, 215, 467, 539, 585, 316, 55, -281, -548, -597, -491, -232, 78, 433, 625, 589, 346, 76, -233, -524, -573, -498, -236, 61, 358, 572, 553, 460, 160, -161, -383, -574, -596, -330, -5, 330, 578, 634, 459, 200, -152, -415, -575, -540, -313, -78, 263, 465, 603, 536, 305, -52, -396, -608, -591, -434, -100, 192, 485, 606, 546, 320, -21, -324, -491, -545, -472, -179, 106, 428, 559, 577, 390, 83, -225, -507, -571, -463, -224, 121, 371, 584, 548, 378, 73, -207, -426]
3953d26j49P1J87K88L55K01J07j76k85l70k87r6M3K41K60L45J92Q3j08k26l22
3974g2l12k16j0K05K95L51K85P2r1k34l73k70j57J9Q1K75L15K41J32mj95k98l65
3997c26j87j16J10K63L85K84J64J2k60l00k80k61o5J29J84K81L29K19L3j21l48
4018A29l36l38o6O4K07L73K93J94Oq3k68k96l26j61P0J90K75L16K52R5o3l20l39
4041a32l03j50nK05K89L25K69J04j17k10l44k79j65r3R6K83L92L25J39l4l05l06
4063a6k50k59j04J36L11K49K70J97j0j42k51l07k71j57O8K52L25L33K27j2j67
4084D22k97l46k02j47M6K24K49L34J93J09r1k63l47l17j83J9K02K85L89K35Q9
4105F03j10k69k65l17j28r7J64K56K77L14J49ok16k88l95k23l7J38K61L07L10
$$ y = [-426, -575, -504, -317, -29, 326, 527, 634, 458, 173, -197, -484, -580, -537, -296, -36, 309, 501, 584, 476, 250, -72, -384, -600, -610, -405, -110, 241, 526, 598, 507, 273, -100, -370, -527, -508, -427, -152, 163, 404, 536, 532, 337, 39, -326, -513, -629, -519, -256, 129, 413, 577, 589, 329, 29, -251, -512, -577, -448, -264, 17, 346, 565, 598, 477, 129, -207, -545, -611, -547, -340, 33, 326, 520, 526, 443, 175, -121, -447, -608, -538, -348, -73, 243, 495, 590, 527, 207, -132, -435, -585, -590, -385, -96, 229, 498, 602, 485, 275, -69, -348, -513, -606, -510, -227, 165, 490, 629, 595, 290, -16, -266, -525, -629, -493, -182, 67, 337, 534, 524, 382, 131, -176, -447, -604, -536, -284, 41, 374, 601, 589, 422, 125, -221, -423, -570, -524, -300, -51, 283, 476, 585, 494, 231, -116, -433, -616, -597, -395, -110, 279, 514, 603, 493, 224, -41, -358, -486, -583, -419, -163, 114, 428, 577, 571, 355, 67, -328, -551, -588, -450, -189, 118, 428]
4126D28J49p8j10l23l10k27p8M4K19L26L08J78L0j55k69l85k48j14Q4K18L37K97
4148C21J58N1r0k84k68k49k24JK23K70K99L19O4q9k71l48k79j98O6J59K40K92
4170A63K36J77j00j71l29k85j95o7P3L34L55K21J18j8j48l91k47j81j27J62J98
4191b22K77L15J29R9j72l29l03k59j30K0K69L27L04K07J4j37k48l30k42j32M8
4212d95J19L42L10K62Rl0k72l62k92k07P7J97K85K44K64J15r6k22l03k51k15n7
4234e78J22K68L80K47J35o2j91l65k68k36j5J07K90K96K52J30j7j43k96k61k82
4255d87r9P3K46L36K96K11Nj84k76l32k49j22R6J94L35K22K42M4j06k46l16k65
4277c82j59nJ85L17L13K19O3j27j81l14k98j26m3J18L01L01K76J14n2k33l01l20
$$ y = [428, 577, 499, 389, 66, -244, -471, -549, -505, -286, 40, 348, 526, 556, 401, 132, -253, -501, -615, -531, -313, 24, 321, 479, 530, 440, 156, -112, -361, -585, -584, -361, -91, 208, 527, 591, 502, 231, -117, -396, -594, -528, -369, -129, 163, 399, 576, 476, 305, -24, -309, -504, -571, -498, -164, 191, 412, 530, 512, 364, -27, -274, -455, -582, -420, -222, 55, 370, 499, 598, 426, 97, -206, -465, -595, -575, -306, 21, 325, 532, 546, 409, 161, -169, -411, -543, -495, -376, -34, 276, 538, 547, 517, 245, -117, -409, -616, -539, -342, -57, 187, 451, 566, 470, 248, -55, -306, -521, -578, -456, -188, 192, 439, 574, 512, 321, -44, -312, -548, -563, -456, -166, 130, 382, 512, 495, 352, 56, -205, -487, -586, -513, -267, 69, 365, 576, 581, 397, 121, -211, -460, -582, -486, -292, 43, 265, 507, 551, 445, 199, -117, -382, -541, -546, -361, -44, 269, 488, 551, 424, 243, -71, -369, -495, -538, -420, -119, 182, 458, 572, 520, 287, -14, -334]
4299c34j90k2J52K56K57L16R8k4k18k70k52k33j17Q1L01L09K16K31N5k21k91l43
4321b43k00j25R7K59K91L00J33Q1j75k40l30k86p9n5K39K89L73J96O8j17k96l11
4343a31k78j33O2J44K82K47K53J54q4k61l00k72k36k6J79K62L18K76J43p5k35
4364B89l00k75j99k9N7K39L43K42J60M8k14k65l93j98j09Q2L23K35L54J58k5j83
4386C40k51l10j72j29J5K22K71K77K57L2q1k92l06l02j11K9J87K85L06K10L1p4
4408D34k34l08k16j73n8J89K17K91L22J26p1k33l68k82j39r3K03K36L37K12J38
4429E30m3j85k64k77k09j64J41K15K91L91J37j2j95l13k64k80m6M7K71K75K52
4450B98K35Lj23k95k71k92j58J13J69K94K98J86J15j54k84k48k68j36LJ46K51
$$ y = [-334, -524, -546, -394, -138, 119, 435, 533, 509, 291, 21, -231, -464, -581, -500, -199, 110, 326, 557, 612, 391, 100, -243, -443, -568, -471, -212, 79, 379, 512, 593, 418, 178, -152, -438, -517, -572, -333, -44, 329, 525, 593, 476, 180, -131, -409, -542, -480, -336, -54, 193, 446, 600, 516, 255, -45, -317, -553, -579, -400, -138, 180, 456, 599, 524, 289, -11, -286, -485, -514, -457, -218, 125, 367, 527, 575, 361, 96, -297, -495, -604, -522, -199, 36, 390, 548, 523, 340, 89, -221, -393, -522, -507, -285, -14, 263, 520, 552, 471, 179, -127, -429, -540, -511, -324, -39, 267, 477, 508, 434, 200, -108, -324, -497, -555, -366, -149, 142, 464, 590, 519, 286, -82, -364, -503, -596, -393, -157, 180, 392, 530, 487, 302, 38, -239, -448, -612, -471, -256, 35, 426, 563, 551, 356, 43, -221, -501, -547, -500, -229, 46, 298, 533, 536, 413, 118, -153, -445, -603, -490, -321, -27, 271, 457, 572, 418, 134, -114, -382, -518, -515, -369, -118]
4471a18L14K45J22q1k16l41k96k31M2J75K98K77K39O1k2j75k43l26k42NL0K77
4493b06L45K67J96r1j61k70l49j98p8J12K10K78K69J50O2j67k44l23k10j58L3
4514e33K31L10K43K68N9j68l02k86k65j37O7K20K37K81K39Q5q0k51k74l03j28
4535d87m1J14L61K71K55R5j24k29k85k02k50JJ60J80L03K46J47m9j21k59m02j90
4557e06n6J20K36L09K83J44l4j60k62k55k08j36N9K09K77L36J64P0j78k59l35
4578a82k67j09M3K53K75K75J68R8j41k39k17l04k31N3J30L10L03K47J19j31k13
4599B40l11l27j19l0J83K85K74J70J55rj99k33l68j68p4O3K97K95K63J65m9j73
4621C30k64l20k22j5P9J82L00K72J71J3j29k50l76k13j39N4K11L62L23J42K9j45
$$ y = [-118, 196, 441, 563, 482, 266, -75, -371, -602, -560, -385, -87, 190, 429, 490, 468, 293, 50, -276, -518, -513, -483, -206, 139, 406, 602, 511, 350, 80, -269, -467, -545, -433, -223, 55, 324, 474, 536, 369, 125, -198, -408, -566, -533, -302, 8, 251, 519, 578, 410, 108, -178, -443, -580, -513, -293, -56, 225, 464, 549, 469, 218, -56, -359, -487, -528, -414, -53, 218, 473, 568, 444, 215, -70, -272, -522, -521, -361, -181, 122, 368, 515, 466, 345, 86, -316, -506, -562, -442, -206, 103, 386, 530, 496, 336, 74, -181, -389, -525, -466, -257, 20, 356, 520, 590, 412, 153, -182, -449, -558, -515, -262, 13, 288, 456, 554, 413, 174, -43, -347, -578, -525, -395, -85, 218, 465, 584, 453, 240, -71, -398, -517, -547, -364, -79, 195, 365, 520, 511, 312, 79, -289, -457, -531, -468, -171, 124, 387, 552, 503, 330, 66, -254, -476, -491, -412, -230, 70, 342, 513, 526, 397, 147, -229, -442, -581, -527, -316, 46, 369, 511, 540, 395]
4643C95k27l09k45j47L2J84K57L23J91J01q4k24k68l68j34K2J68K57L15J85J42
4664E66j01k89k24k66j68n0J20K36L56K47J20lk08l13k49k40j03J42K47K91K13
4685C24J89kj34k75l07k22j23R7K29K92K47K04P0k16k31k96k76p1Q7J05L07K85
4707B83K49l5l6k56k96k86j15k5J85K77K80K53R1q4k61k90k52j97L4J40K31K93
4729A83K49J52j24j57l89j88k29o1J39K40L50K46J94j03k22k31k66j89j09P5J94
4750b46L04L07J19P8j48k74l37k76q1P7K12L12K34J90N3j31k55k58k58j29j4K00
4772c21K88K59K79O5r2k51l20k79j49jK12K65K52K10J44k4k88k38l15j77o4J73
4794c72K31L21K49J12K7k80k76l04j49j01J24K52K08L37Q2J16j89k88k75k90p5
$$ y = [395, 168, -141, -386, -533, -501, -317, -60, 263, 454, 555, 471, 247, -21, -389, -523, -501, -333, -76, 239, 424, 566, 465, 176, -48, -314, -482, -532, -412, -176, 180, 427, 547, 544, 336, 23, -226, -466, -569, -427, -180, 111, 324, 513, 511, 377, 102, -205, -427, -550, -453, -224, 68, 315, 519, 589, 373, 142, -154, -430, -501, -414, -309, -2, 283, 532, 497, 461, 205, -91, -377, -492, -517, -332, -55, 225, 478, 569, 485, 224, -66, -318, -515, -481, -341, -110, 183, 432, 584, 460, 303, -86, -274, -503, -564, -425, -185, 165, 411, 605, 502, 280, 49, -217, -406, -515, -440, -246, 58, 365, 484, 562, 414, 140, -197, -473, -554, -477, -265, 47, 281, 471, 524, 393, 138, -120, -378, -507, -521, -321, -33, 226, 505, 570, 478, 227, -93, -372, -521, -522, -310, -45, 207, 417, 561, 537, 249, 11, -304, -481, -545, -372, -141, 180, 429, 541, 568, 288, 12, -292, -441, -542, -418, -166, 42, 379, 461, 577, 388, 100, -175, -465, -540]
4815e40L2K83L27K11K18pj55l12j94k58j45M4J70K86K71K10N9j24j39l60k65j38
4837e26J7J84K98K90J43J12j23j54k51l26j26m5Q5L04K90K17J51n1k29k61k96
4858b97j72n8J20K43K83K43J59m9j72k47k53k74r9R5K41L18K77J84k0j20l33k47
4880a78k60l5J3J78L25K40J79N4j24k18l02k57j32J2J77L02K96J61M7p1k67k55
4902a15k01j98K5J51K66K51J67J34lk07l03k59k18l0J13L00K86K35J18q0j80k59
4924gk39k21j3R2J40L75J75K22l6j71k51k93j92j15P3K64K34K98J08O1j31k53
4946A20k65k25j58M1K29K47K28K44O7j45k31l08k14j29PJ55L13K83J64R0j25j62
4968B26k52l21q6o6J50K39L03K05J52m8k37k92l29q4p0J84K02K00L30N5N3k14
$$ y = [-540, -508, -225, 102, 313, 531, 524, 369, 57, -137, -395, -540, -496, -326, -40, 231, 441, 500, 376, 237, -123, -388, -526, -509, -325, -27, 263, 406, 518, 395, 241, -10, -336, -462, -507, -422, -118, 172, 389, 540, 489, 260, -1, -297, -469, -527, -407, -164, 119, 362, 521, 472, 300, 53, -200, -474, -573, -478, -237, 81, 358, 542, 522, 402, 69, -178, -438, -473, -460, -282, 43, 283, 462, 516, 392, 174, -128, -385, -517, -505, -328, -26, 270, 431, 478, 407, 140, -115, -316, -514, -489, -338, -72, 179, 346, 480, 477, 270, -33, -292, -510, -540, -427, -127, 159, 394, 512, 432, 252, -7, -246, -467, -480, -388, -248, 127, 302, 524, 488, 317, 66, -227, -419, -534, -461, -197, 37, 335, 443, 504, 373, 120, -145, -370, -528, -487, -258, -11, 217, 461, 528, 383, 152, -156, -370, -499, -492, -337, -24, 259, 423, 513, 388, 226, -26, -347, -433, -499, -349, -110, 193, 398, 550, 502, 265, -27, -356, -440, -510, -326, -124, 76, 406, 461, 514, 300]
4990C00k55k45k66m8P7K53K60L12P6L8j33k47k62k83p4P4J66K97K50J69O2j19
5012D02k30l29k31j43O9J88L06K56J19J02p3k35k90k30j44l7J65K58L00K06J01
5033E30p3k24k74k92j27m1K04J75K96K13P6l1j41k49k92k16m0J03K27K86K37J72
5055E19Mj84k68l02j90p1O4K76K45J94J74J5j22k49k43k57q7O5J99J97L15J84
5077D78L2j34k46k76k54n5PJ33K79K62K20P7o2k81j97k90j66l2J19K98K64K62
5099D38O8j06j67k69k05j94j6R8J89K58K28K54j04j47l12k68j97q9J07K89K82
5120A37J76J23N3j73k13k66k31q5L4J78K93K96R6J14j46k58k40k82j16Q6J56K47
5142b1K06K44O8j11j96k81k80j30K0J29K72K76J93J33j10k02k53k93j34l6J66
$$ y = [300, 45, -200, -466, -514, -437, -184, 76, 388, 464, 502, 369, 122, -140, -423, -497, -423, -257, 40, 290, 459, 521, 402, 172, -157, -388, -531, -462, -274, 32, 288, 407, 509, 436, 201, -89, -319, -463, -500, -335, -77, 223, 429, 530, 457, 233, -41, -333, -460, -501, -297, -122, 174, 387, 463, 432, 291, 42, -250, -466, -506, -403, -176, 110, 347, 519, 523, 339, 71, -231, -421, -492, -428, -152, 93, 287, 461, 476, 354, 105, -138, -395, -482, -417, -218, -21, 294, 478, 510, 376, 130, -146, -400, -455, -448, -315, -36, 226, 446, 523, 461, 180, -17, -307, -473, -505, -386, -88, 176, 438, 506, 400, 233, -36, -241, -435, -451, -353, -164, 94, 322, 576, 472, 325, 13, -255, -452, -541, -434, -145, 137, 313, 436, 489, 316, 103, -163, -394, -479, -445, -267, 26, 322, 418, 532, 386, 128, -112, -394, -510, -424, -268, -21, 185, 429, 497, 386, 190, -91, -371, -501, -481, -352, -80, 196, 389, 522, 412, 210, -43, -336, -470, -506, -340]
5163c40K06K97K11Q5Pk35k53k53j69o1Q8K33L01K28J10%k18k14k21k63J1pK43
5186b14K14K66J68P3j54k87k10k49j18N2J68K66L30J34M1j35j99k79k14j41L3
5207d55R0K90K76K49N7j12k10k99k26j16m8J63K57K71J91P7m6j74k10l25j33p9
5229e12J54K53K00K72J68r1j66k39k88k66N4R3J50K96K25J57L2k21j69l00k17
5250d15j44R6K10K23L30J55M3j84k44k66j89q4k3K24K15K72K01O1j02k24k19k88
5272c52j39L2J65K65J95K72N7r7k10k60k32k11N1R2K43K64K11J69j41j08k95k40
5294b69j76m9J47J99K53K64O3L0j88k50k23k25j22J11K12K56K55J86Nj52k79k88
5316b40j87n0O1J62K40K44K29m3p4j89k75k15j59MJ30L49K35J85L6o3j84l33j32
$$ y = [-340, -134, 163, 374, 459, 466, 231, -22, -275, -444, -505, -417, -184, 117, 345, 455, 455, 237, 23, -198, -461, -450, -457, -214, 0, 266, 434, 507, 353, 66, -144, -393, -511, -459, -291, -25, 305, 439, 480, 345, 146, -133, -347, -488, -455, -365, -75, 201, 450, 507, 395, 185, -114, -340, -456, -504, -341, -84, 187, 378, 455, 409, 235, 25, -300, -433, -512, -358, -105, 95, 367, 535, 444, 278, 39, -249, -515, -461, -368, -218, 78, 303, 460, 492, 271, 102, -198, -415, -559, -463, -253, -30, 300, 455, 498, 314, 70, -196, -385, -469, -492, -268, -53, 219, 420, 481, 379, 155, -64, -352, -491, -459, -294, -29, 166, 438, 495, 398, 188, -72, -304, -515, -464, -372, -129, 135, 346, 515, 374, 266, -29, -269, -445, -494, -347, -148, 105, 369, 432, 462, 274, 24, -199, -424, -546, -435, -223, 33, 288, 474, 479, 327, 48, -240, -427, -477, -416, -254, -14, 230, 459, 416, 342, 153, -122, -337, -496, -492, -362, -13, 222, 407, 443, 380, 196, -137, -269]
5339b69j86M1J16J85L27J59J05o5j95k11k69k18OM2K94K79K08R8j0j93k62k23
5361b41k02k6O2K39K22K56J36Jj33k40l16j74q6L8K67K45K49J60%j26k16k41k25
5384c51p9KJ61K56K79J83J10j52k63k74j88j43NJ63K69K12K08J24j36j38k77k92
5406c21p2j19J60K17K64K95O1m8j55l17k11k11k4J57K14K01K38J05L7j45k42k85
5428b01k03r5O5K33K96K37J33O4j91k35k60j73j27O3J51K56K33J38R6j13k07k67
5450a07k96o6QK12K10L02J30J25j00l06j56k53j42l2J61K23K45K36J21q1j87k70
5472b3k82j34J7J15J76K42K51O1J1j66j99l02k10j3M1K26K47K56J71n8q5k91k75
5495b24k13m1P1K39J67K47J54P6j21k35k63k40j16O0J65K52K76K25K9j44k00k93
$$ y = [-269, -455, -414, -298, -113, 214, 373, 478, 413, 218, 7, -262, -480, -474, -432, -138, 141, 349, 447, 437, 244, -18, -241, -443, -469, -407, -168, 54, 310, 446, 447, 314, 74, -242, -416, -502, -464, -197, 48, 297, 457, 457, 331, 115, -126, -351, -430, -428, -267, -11, 268, 451, 561, 409, 146, -128, -316, -459, -454, -291, -22, 190, 398, 522, 386, 248, -29, -321, -393, -512, -352, -135, 129, 424, 485, 437, 282, -35, -246, -457, -481, -324, -110, 91, 329, 434, 471, 326, 84, -201, -404, -499, -434, -201, 95, 332, 465, 529, 338, 103, -157, -330, -457, -394, -243, 13, 246, 384, 480, 367, 160, -107, -403, -469, -461, -249, -39, 263, 393, 518, 418, 112, -44, -297, -439, -471, -310, -87, 158, 394, 515, 434, 247, -23, -305, -439, -422, -307, -131, 111, 362, 423, 434, 268, 69, -233, -443, -456, -415, -189, 58, 314, 485, 427, 342, 51, -224, -437, -478, -407, -168, -1, 246, 400, 476, 355, 120, -143, -383, -499, -439, -274, -22, 254, 479, 508, 364, 164, -129]
5517a29k19j22M8J32K46K42J82R0l0k05l15k08j59m9J22K52L34J38J32j5k41k28
5539bk64j52j4M7K32K47K59J64l5k04k22k87k20j8Q1K15K62K35Q4k0p1k64k29
5562a76k01q9O1J03K84L03J70L2j26k22k73k24j16JK02K17L12J03P7m9j87k48
5584d6k43j79m5J93K46K47J86R5n7k01k64k04j43l9J13K12K31K43J19j6j46k77
5606B5k80j42o6O5J73L28K06J46o4j38k11k60j52j06J01J70K55K01K04J8j22k37
5628A14k94j93j08M9J60K50K77J76O1j34k18k61j93j01q5J37K74K59K14N1j6k16
5650B03k79j88j99jJ40K40K84J81P2p9j58k13k19j73r6J47J71K45K22K12q5j62
5672B65k51k66j92j9R7K02J85K64J57m6p4j86l20k10q4P4J27K98K53J52O6j36
$$ y = [-129, -348, -470, -422, -290, -44, 198, 380, 470, 440, 235, -80, -288, -447, -496, -374, -122, 212, 350, 482, 467, 226, -2, -266, -418, -432, -385, -153, 94, 353, 517, 482, 278, 56, -231, -451, -469, -388, -173, 89, 324, 408, 388, 317, 53, -176, -377, -466, -405, -302, -18, 285, 455, 487, 361, 139, -134, -358, -474, -473, -271, -54, 258, 361, 438, 389, 202, -46, -289, -468, -513, -320, -74, 173, 359, 454, 397, 196, -68, -272, -415, -454, -341, -129, 102, 345, 464, 448, 302, 25, -255, -397, -463, -398, -225, 103, 309, 455, 391, 253, 42, -218, -370, -476, -375, -205, 50, 251, 455, 473, 351, 114, -180, -373, -481, -432, -272, -22, 255, 431, 492, 358, 140, -121, -314, -415, -500, -363, -89, 170, 384, 435, 419, 203, -76, -264, -463, -464, -324, -84, 200, 381, 453, 374, 216, 3, -216, -389, -485, -338, -167, 78, 300, 512, 427, 265, 14, -252, -444, -463, -366, -164, 21, 285, 442, 396, 322, 136, -184, -394, -478, -404, -277, 21, 274, 426, 492, 356]
5694C56k68j91k64r8M4J42K77J95J36J47p0k04k57k41j96J8J49K48K68K00P7j10
5716C58j57k27k37j42m0J09K08K48K12J36m2j83k65j95k09mO6J97K30K38J72k3
5738D50j91j77j77k65l2PJ70K23K56J79K9r7l09j57k75j12J07J93K14K09K06k8
5760D23p7j82k25k31j51j0J39K32L01J84L7q3j60k37k48j21kJ13K42K20K43M5
5782D52j8j56k56k32j85j00Q3K70K34K37J16o0j12k48k09j62q7J08J21K49K20
5803B65K10Kj05k52l17j66j20P9J88K58K42J50K3j39k04k07k36r6K1J54J85K46
5825A81K28M4o0k43k56j95j72R6J02K33K11K46Ol1j62k54k08j66k3R0K61J85K78
5848C91Q3m9j22k68k53j52n7Q9K27K05J99J49k2j51k23k20k22qM0K02K14J88J91
$$ y = [356, 88, -103, -367, -465, -421, -279, -2, 193, 329, 476, 406, 202, -55, -296, -492, -474, -325, -77, 191, 391, 468, 358, 201, -26, -263, -405, -445, -336, -128, 120, 332, 468, 426, 243, -22, -217, -426, -430, -364, -167, 63, 301, 473, 450, 259, 82, -95, -360, -392, -385, -215, 8, 264, 443, 472, 375, 66, -91, -366, -478, -371, -178, 36, 245, 451, 423, 346, 164, -61, -292, -443, -453, -314, -82, 219, 403, 440, 357, 197, -40, -288, -409, -411, -298, -56, 164, 407, 452, 434, 278, 22, -210, -395, -495, -412, -142, 92, 329, 445, 385, 273, 25, -184, -346, -433, -325, -204, 45, 265, 475, 477, 372, 120, -197, -363, -483, -404, -216, 42, 284, 434, 457, 318, 114, -93, -329, -425, -404, -250, -65, 181, 409, 453, 393, 150, -106, -301, -473, -377, -275, -42, 169, 415, 421, 390, 228, -26, -234, -400, -423, -333, -72, 113, 391, 474, 425, 303, 35, -218, -370, -427, -338, -111, 94, 293, 442, 420, 269, 46, -174, -396, -404, -364, -162, 52, 240, 431]
$$ [...]
16383F2
##END NTUPLES=NMR FID
##END=
