##TITLE=31P_DE-80H_X3
 64 sc D2O
 26.2.2025
##JCAMPDX= 6.0         $$ Bruker NMR JCAMP-DX V2.0
##DATA TYPE= NMR FID
##DATA CLASS= NTUPLES
##ORIGIN= UXNMR, Bruker Analytische Messtechnik GmbH
##OWNER= root
$$ XWIN-NMR		Version 3.5
$$ Thu Jan 29 10:29:16 2026 Russian Standard Time (UT+4h)  Yarkov@DPX200
##.OBSERVE FREQUENCY= 81.013821
##.OBSERVE NUCLEUS= ^31P
##.DELAY= (6, 6)
##.ACQUISITION MODE= SIMULTANEOUS
##.ACQUISITION SCHEME= undefined
##.AVERAGES= 64
##.DIGITISER RES= 17
##SPECTROMETER/DATA SYSTEM= spect
##.PULSE SEQUENCE= zgpg30
##.SOLVENT NAME= CDCl3
##.SHIFT REFERENCE= (INTERNAL, CDCl3, 0, 243.863)
##AUDIT TRAIL= $$ (NUMBER, WHEN, WHO, WHERE, WHAT)
$$ ##TITLE= Audit trail, XWIN-NMR		Version 3.5
$$ ##JCAMPDX= 5.01
$$ ##ORIGIN= Bruker BioSpin GmbH
$$ ##OWNER= Yarkov
$$ C:/Bruker/XWIN-NMR/data/yarkov2/nmr/P31/2/audita.txt
$$ ##AUDIT TRAIL=  $$ (NUMBER, WHEN, WHO, WHERE, WHAT)
(   1,<2026-01-29 10:28:25.25 +0400>,<Yarkov>,<DPX200>,
      <created by zg, POWCHK disabled, PULCHK disabled
       configuration hash MD5:
       00 E9 B6 7A A2 85 ED C7 34 08 36 98 17 FE 4E 26
       data hash MD5: 32K
       6B 6B DA 8A D0 FF 7B A5 AD A6 F6 6F 18 B9 B7 E4>)
$$ ##END=
$$ 
$$ hash MD5
$$ CB 2E 9E ED 4C 56 60 2C F7 D4 FE 2D 44 18 57 43
##$RELAX= 
##$RELAX= 
##$RELAX= 
##$RELAX= 
##$RELAX= 
##$RELAX= 
##$RELAX= 
##$RELAX= 
$$ Bruker specific parameters
$$ --------------------------
##$DU= <C:/Bruker/XWIN-NMR>
##$EXPNO= 2
##$NAME= <P31>
##$PROCNO= 1
##$TYPE= <nmr>
##$USER= <yarkov2>
##$AMP= (0..31)
100 100 100 100 100 100 100 100 100 100 100 100 100 100 100 100 100 100 
100 100 100 100 100 100 100 100 100 100 100 100 100 100 
##$AQSEQ= 0
##$AQ_mod= 1
##$AUNM= <au_zg>
##$AUTOPOS= <>
##$BF1= 81.014009
##$BF2= 200.13
##$BF3= 200.13
##$BF4= 200.13
##$BF5= 200.13
##$BF6= 200.13
##$BF7= 200.13
##$BF8= 200.13
##$BYTORDA= 1
##$CFDGTYP= 0
##$CFRGTYP= 5
##$CHEMSTR= <none>
##$CNST= (0..31)
1 1 145 1 1 1 1 1 1 1 1 1 1 1 1 1 1 1 1 1 1 1 1 1 1 1 1 1 1 1 1 1 
##$CPDPRG= <waltz16>
##$CPDPRG1= <>
##$CPDPRG2= <waltz16>
##$CPDPRG3= <>
##$CPDPRG4= <mlev>
##$CPDPRG5= <mlev>
##$CPDPRG6= <mlev>
##$CPDPRG7= <mlev>
##$CPDPRG8= <mlev>
##$CPDPRGB= <>
##$CPDPRGT= <>
##$D= (0..31)
0 1 0 0 0 0 0 0 0 0.06 0 0.03 2e-05 3e-06 0 0 0.0002 0 0 0 0 0 0 0 0 0 
0 0 0 0 0 0 
##$DATE= 1769668104
##$DBL= (0..7)
120 120 120 11 120 120 24 19 
##$DBP= (0..7)
150 150 150 150 150 150 150 150 
##$DBP07= 0
##$DBPNAM0= <>
##$DBPNAM1= <>
##$DBPNAM2= <>
##$DBPNAM3= <>
##$DBPNAM4= <>
##$DBPNAM5= <>
##$DBPNAM6= <>
##$DBPNAM7= <>
##$DBPOAL= (0..7)
0.5 0.5 0.5 0.5 0.5 0.5 0.5 0.5 
##$DBPOFFS= (0..7)
0 0 0 0 0 0 0 0 
##$DE= 6
##$DECBNUC= <off>
##$DECIM= 4
##$DECNUC= <off>
##$DECSTAT= 4
##$DIGMOD= 1
##$DIGTYP= 9
##$DL= (0..7)
0 0 52 120 120 21 21 25 
##$DP= (0..7)
150 150 150 150 150 150 150 150 
##$DP07= 0
##$DPNAME0= <>
##$DPNAME1= <>
##$DPNAME2= <>
##$DPNAME3= <>
##$DPNAME4= <>
##$DPNAME5= <>
##$DPNAME6= <>
##$DPNAME7= <>
##$DPOAL= (0..7)
0.5 0.5 0.5 0.5 0.5 0.5 0.5 0.5 
##$DPOFFS= (0..7)
0 0 0 0 0 0 0 0 
$$ [...]
##$SUBNAM1= <"">
##$SUBNAM2= <"">
##$SUBNAM3= <"">
##$SUBNAM4= <"">
##$SUBNAM5= <"">
##$SUBNAM6= <"">
##$SUBNAM7= <"">
##$SUBNAM8= <"">
##$SUBNAM9= <"">
##$SW= 400.765351723535
##$SWIBOX= (0..15)
0 1 3 0 0 0 0 0 0 0 0 0 0 0 0 0 
##$SW_h= 32467.5324675325
##$TD= 32768
##$TD0= 1
##$TE= 0
##$TE2= 300
##$TE3= 300
##$TEG= 300
##$TL= (0..7)
0 120 53 12 22 120 120 120 
##$TP= (0..7)
150 150 150 150 150 150 150 150 
##$TP07= 0
##$TPNAME0= <>
##$TPNAME1= <>
##$TPNAME2= <>
##$TPNAME3= <>
##$TPNAME4= <>
##$TPNAME5= <>
##$TPNAME6= <>
##$TPNAME7= <>
##$TPOAL= (0..7)
0.5 0.5 0.5 0.5 0.5 0.5 0.5 0.5 
##$TPOFFS= (0..7)
0 0 0 0 0 0 0 0 
##$TUNHIN= 0
##$TUNHOUT= 0
##$TUNXOUT= 0
##$USERA1= <user>
##$USERA2= <user>
##$USERA3= <user>
##$USERA4= <user>
##$USERA5= <user>
##$V9= 5
##$VALIST= <valist>
##$VCLIST= <CCCCCCCCCCCCCCC>
##$VD= 0
##$VDLIST= <DDDDDDDDDDDDDDD>
##$VPLIST= <PPPPPPPPPPPPPPP>
##$VTLIST= <TTTTTTTTTTTTTTT>
##$WBST= 1024
##$WBSW= 4
##$XGAIN= (0..3)
0 0 0 0 
##$XL= 0
##$YL= 0
##$YMAX_a= 1290
##$YMIN_a= -1136
##$ZGOPTNS= <>
##$ZL1= 120
##$ZL2= 120
##$ZL3= 120
##$ZL4= 120
##$ABSF1= 60
##$ABSF2= -190
##$ABSG= 5
##$ABSL= 3
##$ALPHA= 0
##$AQORDER= 0
##$ASSFAC= 0
##$ASSFACI= 0
##$ASSFACX= 0
##$ASSWID= 0
##$AUNMP= <proc_1d>
##$AZFE= 0.1
##$AZFW= 0.5
##$BCFW= 1
##$BC_mod= 2
##$BYTORDP= 1
##$COROFFS= 0
##$CY= 9.86611175537109
##$DATMOD= 1
##$DC= 1
##$DFILT= <>
##$DTYPP= 0
##$F1P= 182.462994727601
##$F2P= 168.069089081705
##$FCOR= 0.5
##$FTSIZE= 0
##$FT_mod= 0
##$GAMMA= 1
##$GB= 0
##$INTBC= 1
##$INTSCL= 1
##$ISEN= 30
##$LB= 1.5
##$LEV0= 0
##$LPBIN= 0
##$MAXI= 11.51145
##$MC2= 0
##$MEAN= 0
##$ME_mod= 0
##$MI= 1.244541
##$NCOEF= 0
##$NC_proc= 0
##$NLEV= 6
##$NOISF1= 0
##$NOISF2= 0
##$NSP= 1
##$NTH_PI= 0
##$NZP= 1
##$OFFSET= 243.8632
##$PC= 1.4
##$PHC0= 1668.373
##$PHC1= 24.15952
##$PH_mod= 0
##$PKNL= yes
##$PPARMOD= 0
##$PSCAL= 0
##$PSIGN= 0
##$REVERSE= no
##$SF= 81.0140731611343
##$SI= 65536
##$SIGF1= 0
##$SIGF2= 0
##$SINO= 80
##$SIOLD= 65536
##$SREGLST= <31P.CDCl3>
##$SSB= 0
##$STSI= 0
##$STSR= 0
##$SW_p= 25641.0256410257
##$SYMM= 0
##$S_DEV= 0
##$TDeff= 0
##$TDoff= 0
##$TI= <>
##$TILT= no
##$TM1= 0
##$TM2= 0
##$TOPLEV= 0
##$USERP1= <user>
##$USERP2= <user>
##$USERP3= <user>
##$USERP4= <user>
##$USERP5= <user>
##$WDW= 1
##$XDIM= 64
##$YMAX_p= 0
##$YMIN_p= 0
$$ End of Bruker specific parameters
$$ ---------------------------------
##NTUPLES= NMR FID
##VAR_NAME=  TIME,          FID/REAL,        FID/IMAG
##SYMBOL=    X,             R,               I
##VAR_TYPE=  INDEPENDENT,   DEPENDENT,       DEPENDENT
##VAR_FORM=  AFFN,          ASDF,            ASDF
##VAR_DIM=   16384,         16384,           16384
##UNITS=     SECONDS,       ARBITRARY UNITS, ARBITRARY UNITS
##FACTOR=    3.08e-05,      1,               1
##FIRST=     0,             0,               0
##LAST=      0.5045964,     0,               0
##MIN=       0,             -1136,           0
##MAX=       0.5045964,     1290,            0
$$ Real data points
##PAGE= N=1
##DATA TABLE= (X++(R..R)), XYDATA
0 0 0 0 0 0 0 0 0 0 0 0 0 0 0 0 0 0 0 0 0 0 0 0 0 0 0 0 0 0 0 0 0 0 0 0 0 0 0 0 0 0 0 0 0 0 0 0 0 0 0 0 0 0 0 0 3 -5 6 -8 10 -13
60 -13 18 -21 27 -37 50 -95 129 1290 1059 924 668 510 292 263 214 232 232 198 64 -53 -365 -567 -759 -916
84 -916 -981 -874 -858 -611 -542 -387 -329 -349 -346 -412 -406 -334 -219 -17 217 452 614 759 854 862 685 526 446 385 364 362 408
111 408 449 389 339 150 -53 -282 -542 -653 -858 -862 -856 -743 -614 -590 -572 -577 -661 -690 -698 -675 -615 -401 -194 105 344 528
137 528 671 703 684 633 563 513 581 645 715 798 871 846 765 592 367 56 -130 -228 -399 -359 -387 -342 -343 -349 -438 -546 -678
164 -678 -816 -814 -909 -770 -539 -366 -158 10 184 218 235 226 201 235 304 429 590 777 799 874 786 708 568 300 174
189 174 -59 -194 -160 -199 -185 -190 -259 -376 -524 -735 -876 -1005 -1053 -998 -886 -674 -523 -368 -242 -161 -148 -159 -148 -103 3
214 3 108 371 658 803 1019 1036 996 891 743 597 469 399 348 460 422 387 375 221 36 -206 -391 -631 -738
237 -738 -814 -747 -689 -559 -438 -362 -308 -349 -376 -449 -399 -324 -166 24 195 480 654 752 779 724 671 594 462 422 482 469
263 469 509 572 521 468 299 77 -138 -431 -584 -727 -744 -719 -665 -657 -596 -613 -672 -739 -830 -819 -810 -706 -561 -306 -59 126
289 126 316 385 438 417 436 417 400 517 616 732 817 882 825 721 585 379 240 -2 -115 -195 -246 -184 -194 -164 -308
314 -308 -363 -518 -641 -768 -808 -786 -669 -506 -307 -117 55 157 192 183 155 203 243 305 508 642 812 927 960 992
338 992 794 647 464 252 160 83 25 -4 48 -16 -57 -209 -429 -635 -771 -892 -1012 -941 -828 -698 -505 -433 -319
361 -319 -367 -308 -380 -321 -268 -191 28 223 442 604 768 810 822 721 619 548 421 407 450 431 451 438 356 238 53
386 53 -121 -331 -531 -647 -673 -730 -571 -495 -400 -369 -371 -348 -426 -405 -433 -382 -228 -62 231 397 596 700 779 666 619
411 619 537 526 521 585 659 725 744 722 623 436 243 -8 -279 -398 -480 -517 -477 -496 -445 -493 -536 -642 -758 -872 -865 -902 -794
438 -794 -609 -352 -174 -26 135 161 251 182 221 210 224 320 490 620 726 757 739 596 470 289 135 -19 -134
461 -134 -119 -212 -130 -74 -167 -226 -343 -510 -683 -809 -833 -767 -703 -557 -412 -201 -73 27 38 42 14 66 147 245 445 592
487 592 811 905 963 950 799 689 547 413 295 222 239 208 274 200 74 -93 -319 -472 -655 -783 -887 -805 -707 -660
511 -660 -510 -444 -348 -439 -417 -428 -455 -376 -267 -85 119 346 468 584 630 659 545 456 436 362 333 344 489 494 429 396
537 396 229 63 -216 -370 -520 -683 -686 -632 -580 -492 -457 -495 -505 -551 -591 -610 -611 -520 -332 -154 24 258 429 528 562 544
563 544 501 492 503 549 591 674 765 828 845 696 578 334 126 -60 -184 -274 -285 -295 -291 -274 -329 -440 -498 -698 -774 -798 -787
590 -787 -723 -567 -415 -196 -50 43 82 99 102 91 128 191 325 431 619 661 724 725 610 500 295 182 75 -75 -55
615 -55 -91 -49 -95 -92 -252 -367 -538 -725 -820 -906 -842 -757 -680 -503 -357 -243 -171 -151 -162 -134 -89 -24 183 305 491 671
641 671 824 880 780 802 664 584 487 465 396 374 396 381 318 188 89 -122 -307 -481 -615 -637 -622 -521 -453 -434 -380 -391
667 -391 -386 -402 -451 -454 -327 -288 -112 68 262 392 523 611 517 507 484 406 383 340 475 482 510 494 419 286 135 -104 -286
694 -286 -435 -564 -600 -559 -559 -498 -441 -502 -543 -661 -704 -747 -705 -620 -439 -289 -125 28 205 284 312 397 344 361 333 477
720 477 535 694 770 822 830 686 642 410 190 139 -57 -44 -78 -78 -104 -116 -174 -288 -429 -545 -659 -715 -737 -622 -494 -375
746 -375 -187 -56 29 39 26 53 57 98 236 312 499 628 717 787 722 663 527 388 277 193 85 49 107 49 19 -38
772 -38 -138 -356 -436 -660 -748 -812 -841 -769 -617 -539 -448 -376 -378 -364 -340 -291 -234 -175 -37 146 346 525 642 706 668 672 566
799 566 486 462 409 432 418 488 422 422 257 115 -25 -215 -369 -475 -490 -498 -469 -437 -350 -255 -356 -359 -443 -446 -483 -387 -229 -115
827 -115 61 254 378 461 515 502 481 431 420 407 497 531 619 694 650 526 394 194 11 -157 -285 -362 -385 -448 -402 -400
853 -400 -471 -525 -532 -686 -713 -754 -786 -699 -582 -357 -231 -63 49 91 98 122 167 201 285 355 399 540 682 656 674 610 518
880 518 412 227 163 21 -13 6 -23 -43 -58 -180 -301 -394 -541 -619 -690 -664 -601 -524 -290 -221 -143 -81 -57 16 -25 0 56
907 56 210 287 511 625 726 797 792 730 549 537 329 305 236 233 259 195 205 74 -68 -137 -375 -492 -631 -687 -681 -692 -592
934 -592 -531 -482 -387 -402 -426 -443 -412 -336 -278 -114 34 233 317 404 519 520 479 421 356 352 363 419 400 456 388 407 293 92
962 92 -71 -207 -333 -408 -453 -424 -428 -377 -381 -342 -425 -504 -490 -471 -541 -457 -314 -172 47 174 320 359 354 412 462 414 468 518
990 518 526 608 702 696 697 592 568 344 187 69 -79 -116 -183 -200 -184 -237 -306 -419 -514 -595 -668 -707 -648 -574 -554 -437 -316 -190
1018 -190 -94 -8 -19 -4 52 50 147 239 343 488 635 642 581 514 495 369 207 184 68 65 -2 69 -32 -100 -181 -290 -393
1045 -393 -552 -626 -619 -632 -638 -528 -398 -259 -248 -161 -185 -134 -103 -81 17 128 270 359 546 665 736 697 670 573 542 526 403
1072 403 473 417 383 383 277 221 85 -4 -226 -325 -451 -468 -474 -490 -428 -419 -382 -415 -411 -382 -411 -436 -348 -272 -144 -28 175 229
1100 229 347 357 393 351 413 381 309 407 332 486 472 444 337 277 157 8 -184 -230 -338 -446 -394 -412 -408 -386 -416 -430
1126 -430 -492 -553 -571 -582 -498 -417 -262 -108 3 135 192 231 305 308 386 380 462 556 524 650 668 710 647 523 485 307 197
1153 197 121 78 -53 -45 -71 -72 -187 -267 -320 -437 -546 -559 -627 -514 -501 -407 -252 -194 -116 -52 -30 -52 19 97 90 195 326
1180 326 490 486 593 551 562 434 363 274 202 166 102 127 95 4 -58 -133 -271 -364 -469 -557 -634 -664 -630 -565 -486 -385 -367
1207 -367 -298 -310 -302 -239 -234 -104 -20 87 232 341 444 524 588 509 494 513 479 434 415 406 452 390 367 265 170 21 -74 -251
1235 -251 -325 -365 -373 -371 -410 -410 -362 -389 -388 -403 -432 -368 -355 -255 -157 -13 117 260 269 310 363 303 346 425 377 413 464 499 475 459
1265 459 374 344 230 59 -56 -146 -224 -243 -280 -340 -394 -396 -450 -470 -559 -596 -568 -642 -589 -543 -390 -252 -154 -89 29 75 72 167
1293 167 134 139 225 365 445 525 534 615 569 542 408 288 223 149 68 54 19 -1 -82 -108 -212 -263 -370 -457 -534 -534 -514 -458 -351
1322 -351 -314 -239 -209 -87 -90 -76 -30 16 134 206 301 447 478 553 479 510 521 430 375 328 255 183 189 174 77 35 -112 -208 -281
1351 -281 -397 -539 -512 -570 -555 -505 -516 -422 -463 -422 -398 -410 -363 -326 -199 -90 -8 103 218 376 300 411 413 363 387 363
1377 363 371 345 416 405 408 401 304 201 97 -34 -184 -232 -298 -339 -316 -303 -308 -288 -352 -347 -397 -383 -402 -316 -246 -196 -64 -1 128
1406 128 220 296 338 359 412 360 358 428 444 551 548 556 512 442 314 203 99 -9 -43 -121 -168 -218 -241 -281 -330 -397 -458 -493 -528
1435 -528 -564 -547 -543 -431 -350 -267 -143 -101 -9 -29 29 111 124 221 253 389 435 510 492 488 437 391 253 219 158 125 140 -2
1463 -2 -5 -72 -124 -107 -286 -366 -402 -429 -468 -470 -447 -383 -293 -267 -225 -125 -121 -105 -14 -11 56 195 325 366 445 534 558 498 557 465 468
1494 468 402 381 402 320 304 240 149 76 -2 -167 -220 -320 -385 -434 -437 -406 -397 -449 -403 -385 -381 -318 -341 -337 -290 -163 -105 38 112 200
1524 200 302 347 303 316 334 304 318 347 384 409 360 291 281 232 108 29 -123 -169 -245 -326 -275 -359 -348 -358 -416 -430 -388 -409
1552 -409 -451 -376 -324 -273 -154 -93 49 111 167 227 297 335 335 360 401 464 467 514 524 547 475 417 405 232 184 93 14 -39 -69
1581 -69 -99 -217 -228 -273 -369 -394 -438 -457 -435 -492 -401 -358 -246 -202 -77 -56 -70 -22 43 88 148 205 292 353 447 426 447 423 362
1610 362 340 232 207 120 99 57 0 -36 -93 -168 -277 -290 -392 -432 -463 -500 -459 -424 -395 -349 -275 -309 -264 -204 -147 -46 -14 33
1638 33 167 234 371 428 446 517 542 449 425 425 403 359 362 338 337 287 175 123 -12 -95 -173 -255 -308 -303 -339 -345 -380 -404 -387 -339 -343
1669 -343 -336 -334 -254 -209 -139 -28 76 155 241 243 315 311 348 302 281 349 402 336 332 371 264 253 156 44 -25 -170 -241 -290 -266 -308
1699 -308 -327 -348 -394 -411 -478 -482 -476 -445 -442 -384 -296 -191 -100 -36 49 116 163 135 240 265 311 373 420 403 453 466 421 390 366 351
1729 351 249 104 65 21 16 -45 -118 -137 -249 -274 -297 -395 -356 -476 -400 -370 -286 -219 -232 -160 -86 -57 0 15 50 76 153 263
1757 263 332 427 399 487 464 424 356 302 256 192 156 126 73 18 -25 -92 -179 -262 -337 -360 -473 -490 -492 -448 -437 -386 -334 -290 -331 -280
1787 -280 -246 -140 -159 -125 60 136 216 237 366 426 365 416 360 346 334 328 356 341 322 311 251 180 83 2 -110 -186 -257 -266 -313
1816 -313 -295 -364 -290 -278 -309 -302 -309 -269 -260 -203 -128 -56 32 109 179 241 323 366 322 383 330 386 412 386 404 439 405 330 254 150 69
1847 69 21 -101 -166 -246 -293 -312 -332 -318 -433 -421 -447 -468 -494 -487 -390 -319 -297 -202 -115 -59 20 77 116 126 183 241 292 288 412 439
1877 439 408 417 371 366 324 220 136 103 88 17 23 -69 -68 -138 -229 -255 -306 -355 -410 -345 -376 -343 -218 -187 -147 -107 -74 -21 8 51 101
1908 101 161 240 338 358 465 496 467 511 425 360 292 277 241 202 172 123 83 57 9 -121 -206 -283 -348 -371 -443 -431 -362 -322 -330
1937 -330 -310 -271 -287 -298 -247 -203 -199 -120 -30 135 183 231 321 307 396 339 312 298 318 309 266 282 260 256 170 107 62 -121 -127 -219 -273
1968 -273 -262 -308 -288 -280 -290 -294 -270 -286 -256 -323 -290 -236 -154 -11 23 189 171 258 325 302 308 298 339 369 389 429 466 368 340 320
1998 320 253 188 105 9 -56 -133 -140 -183 -191 -225 -278 -318 -358 -415 -458 -490 -452 -398 -310 -271 -175 -122 -27 7 20 51 43 147 169 210 287
2029 287 318 386 402 346 283 265 187 140 85 54 45 1 -24 -68 -172 -168 -229 -317 -392 -410 -435 -418 -364 -348 -260 -245 -172 -111 -134 -63
2059 -63 -86 5 73 117 218 309 382 482 449 466 421 410 360 322 264 217 245 206 223 157 74 15 -146 -140 -271 -309 -382 -384 -368
2088 -368 -324 -291 -255 -237 -282 -271 -269 -281 -205 -173 -62 46 147 217 239 258 301 275 252 282 228 234 297 309 293 205 218 110 63
2117 63 -33 -152 -256 -290 -272 -301 -306 -292 -265 -323 -352 -321 -360 -417 -343 -318 -293 -151 -84 59 95 150 224 215 254 243 242 269 356 413
2147 413 423 436 407 405 338 217 131 63 72 -28 -23 -123 -87 -103 -143 -175 -308 -354 -405 -404 -441 -375 -307 -215 -124 -78 -56 -27 23 41
2177 41 23 64 79 165 290 316 386 399 447 369 305 251 158 146 34 66 7 8 -11 -94 -81 -210 -253 -376 -403 -421 -481 -396 -347
2206 -347 -280 -250 -204 -170 -184 -111 -165 -96 1 7 147 216 312 372 410 414 377 294 363 294 287 300 300 288 305 265 165 83 -14 -71 -201
2237 -201 -231 -255 -261 -260 -252 -219 -194 -217 -208 -250 -180 -254 -215 -131 -68 25 101 175 303 268 258 272 251 260 282 260 316 341 313 352 326 227
2269 227 177 3 -62 -109 -181 -274 -218 -217 -208 -227 -241 -301 -370 -396 -425 -417 -380 -252 -197 -101 -14 55 84 151 162 119 133 199 176 290
2299 290 349 428 423 411 410 358 219 170 90 41 -5 15 7 5 -18 -101 -121 -198 -192 -359 -329 -386 -361 -246 -209 -139 -112 -69 -2 0 75
2330 75 -11 87 82 190 259 334 408 415 432 411 356 252 198 209 172 152 98 147 69 35 -47 -120 -226 -335 -351 -415 -421 -401 -350 -254
2360 -254 -242 -260 -277 -210 -230 -238 -164 -170 -75 22 166 254 309 304 336 290 329 248 209 221 235 272 284 259 208 188 121 1 -112 -171
2390 -171 -248 -221 -234 -238 -207 -213 -195 -239 -232 -291 -297 -298 -274 -193 -106 -5 72 147 227 251 247 239 197 207 228 301 313 321 402 400 370 243 138
2423 138 100 -52 -88 -112 -97 -139 -183 -110 -204 -228 -294 -389 -415 -413 -443 -407 -325 -306 -173 -116 -33 -26 -7 9 46 -32 74 125 179
2452 179 274 364 377 368 325 293 188 134 76 37 -24 -2 6 28 2 -57 -149 -219 -290 -373 -364 -349 -359 -315 -201 -184 -76 -70 -54 -121
2482 -121 -75 -48 -30 87 130 208 280 371 391 440 445 337 252 229 229 185 174 180 192 186 87 46 -39 -145 -249 -359 -349 -361 -299
2511 -299 -294 -261 -218 -206 -217 -223 -269 -300 -211 -198 -114 -31 80 186 200 214 221 245 177 160 183 169 229 244 304 259 232 213 79 13
2541 13 -106 -149 -200 -226 -264 -212 -174 -192 -179 -246 -279 -311 -313 -345 -304 -278 -128 -64 28 62 177 170 190 201 154 199 211 266 317 376
2571 376 442 485 401 315 226 170 56 -4 16 -29 -46 -29 -46 -61 -221 -226 -291 -384 -369 -432 -363 -306 -187 -163 -101 -42 -3 -20 -14
2600 -14 8 13 5 104 196 245 338 367 348 338 267 194 120 106 50 102 72 98 89 70 -27 -151 -207 -259 -336 -390 -391 -311 -293 -213 -182 -125
2632 -125 -125 -130 -147 -159 -125 -119 -36 69 132 235 330 380 371 348 305 272 244 184 211 283 283 287 263 250 138 6 -30 -148 -230 -287
2662 -287 -303 -264 -234 -199 -142 -123 -205 -213 -262 -292 -245 -242 -93 -45 10 195 200 196 197 175 155 180 136 149 233 289 309 323 301 258 113
2693 113 64 -60 -143 -161 -226 -154 -137 -148 -171 -231 -211 -294 -339 -403 -423 -401 -304 -190 -134 -5 50 135 81 117 51 52 100 155 186
2722 186 292 352 401 420 365 262 257 142 104 83 7 -11 25 24 16 -19 -68 -148 -262 -309 -336 -356 -364 -269 -126 -100 -64 28 -58
2751 -58 -47 -49 -46 -40 17 103 97 255 328 306 333 322 298 206 119 110 84 89 110 84 123 73 24 -49 -173 -280 -343 -380 -395 -393 -298 -223
2783 -223 -204 -207 -204 -243 -231 -244 -253 -198 -58 -22 76 191 226 301 258 213 192 167 94 187 212 217 286 251 349 279 157 98 -66 -146
2813 -146 -194 -199 -191 -132 -126 -151 -183 -161 -221 -282 -307 -336 -275 -200 -148 -37 52 135 201 169 179 177 115 104 138 154 268 311 371 310 333
2844 333 240 166 83 -54 -38 -122 -127 -117 -97 -54 -90 -170 -203 -299 -365 -388 -403 -368 -315 -324 -174 -59 17 -4 32 -41 -22 -36 27
2873 27 57 133 215 301 351 356 369 287 180 114 89 4 56 0 88 73 50 31 -72 -124 -224 -283 -335 -341 -275 -290 -204 -92 -97 -64
2903 -64 -83 -73 -129 -70 -60 -12 62 170 214 336 400 320 289 281 213 224 167 120 191 151 208 189 188 98 8 -153 -200 -254 -300 -311
2933 -311 -267 -213 -184 -228 -128 -201 -215 -262 -314 -236 -240 -166 -77 86 120 174 213 224 197 181 127 141 133 212 232 342 281 280 249 162
2963 162 72 -68 -146 -186 -190 -138 -153 -61 -72 -101 -96 -198 -194 -345 -288 -276 -262 -125 -62 52 113 185 150 143 133 110 117 113 246 272
2993 272 336 390 402 389 330 201 122 82 -24 -27 -52 -35 -14 -4 23 -78 -149 -219 -300 -382 -324 -322 -245 -218 -106 -83 -23 -62 -55
3022 -55 -73 -61 -108 -40 22 134 224 274 329 377 282 231 181 127 93 77 59 110 113 139 99 41 -41 -130 -246 -317 -311 -327 -269 -250
3052 -250 -143 -137 -110 -82 -127 -101 -176 -201 -143 -67 58 132 281 300 358 289 286 265 181 166 153 209 183 278 279 258 215 162 90 -37
3082 -37 -138 -230 -260 -207 -187 -150 -187 -122 -159 -213 -210 -280 -287 -290 -257 -108 -45 24 125 145 166 148 152 112 57 114 72 204 229 278
3112 278 268 287 246 151 101 -37 -97 -162 -107 -138 -114 -80 -49 -122 -200 -244 -330 -389 -329 -344 -268 -178 -106 -27 50 88 67 16 35
3141 35 42 73 57 175 246 364 383 339 305 253 213 70 62 42 35 58 4 91 56 61 -10 -143 -177 -264 -273 -339 -289 -254 -193 -109 -70
3172 -70 -56 -81 -105 -83 -140 -113 -70 -11 162 159 275 307 256 253 222 173 115 47 66 103 126 146 128 91 57 -42 -138 -219 -284 -308
3202 -308 -271 -247 -241 -183 -126 -99 -123 -219 -224 -266 -224 -232 -148 -20 59 156 203 274 225 195 146 85 139 114 184 215 217 309 246 253 145
3233 145 62 -29 -131 -173 -210 -133 -122 -133 -83 -67 -142 -180 -228 -309 -305 -318 -236 -133 -52 59 53 118 123 90 142 103 27 45 138 173
3263 173 293 255 293 283 182 161 32 -74 -54 -114 -104 -80 -77 -53 -71 -64 -223 -285 -298 -354 -393 -355 -297 -177 -119 -47 -21 -7
3291 -7 -19 -47 -81 -42 -24 20 178 225 284 308 277 383 235 148 76 51 65 106 67 112 155 105 45 -21 -74 -137 -245 -292 -297
3320 -297 -235 -219 -189 -57 -70 -62 -86 -93 -167 -67 -98 -61 36 71 199 271 311 239 301 208 156 122 87 125 124 174 163 201 159 96
3350 96 23 -51 -158 -255 -295 -238 -242 -194 -148 -79 -152 -176 -194 -268 -273 -275 -217 -127 -58 67 84 177 147 198 142 104 75 93 150 189 211
3381 211 265 319 283 246 150 104 -42 -75 -140 -128 -91 -75 -9 -53 -68 -112 -142 -155 -242 -267 -299 -173 -103 -27 47 65 138 117 90
3410 90 34 48 76 113 132 220 276 333 294 330 227 149 76 42 -28 12 -49 7 35 3 -17 -72 -122 -214 -265 -265 -294 -311 -259 -191
3440 -191 -160 -71 -29 -59 -46 -67 -109 -50 -60 -2 73 175 250 289 263 287 211 147 87 8 85 78 126 141 155 173 131 32 -107
3469 -107 -195 -237 -285 -253 -238 -225 -126 -92 -16 -56 -73 -133 -160 -157 -126 -49 15 106 150 210 306 273 261 232 104 173 110 127 184 223
3499 223 267 234 203 108 17 -56 -131 -183 -178 -209 -171 -104 -128 -68 -64 -188 -187 -256 -266 -281 -234 -158 -94 27 65 133 146 111 61 68 43
3530 43 61 121 125 246 256 263 273 177 141 3 -36 -77 -89 -97 -48 -47 -27 -75 -98 -134 -155 -234 -280 -288 -310 -244 -173 -93 -12 57 58 89
3562 89 23 -8 16 8 57 133 213 275 331 342 303 233 204 123 53 50 21 45 56 65 95 7 -38 -109 -190 -237 -311 -302 -241 -241 -134 -103
3594 -103 -62 6 -105 -141 -65 -128 -116 -125 -17 77 158 224 234 279 266 181 77 63 30 94 85 116 146 106 152 49 11 -81 -246
3623 -246 -213 -275 -235 -192 -177 -104 -76 -83 -57 -139 -217 -179 -259 -183 -97 -14 92 130 183 245 223 198 96 177 106 117 142 282 268
3652 268 276 243 252 175 118 33 -65 -89 -105 -89 -58 -11 -23 -97 -37 -168 -233 -245 -266 -304 -195 -127 -76 37 -1 88 24 111 57
3681 57 60 45 97 140 174 229 270 261 272 221 147 15 6 -60 -40 -30 -65 -41 -2 -8 -50 -150 -192 -275 -303 -283 -311 -226 -202 -102 -23
3712 -23 -9 8 19 -43 -94 -44 -3 69 122 247 283 299 308 249 245 140 108 84 80 78 128 127 144 119 85 31 -35 -130 -197 -229 -257 -230
3744 -230 -131 -131 -72 -20 -41 -101 -80 -137 -129 -120 -94 -44 71 226 223 224 214 209 200 119 101 132 110 148 181 207 182 156 84 20 -53 -141
3776 -141 -209 -192 -163 -160 -129 -111 -112 -110 -156 -205 -208 -238 -183 -204 -138 -31 31 115 124 183 111 113 67 121 51 128 182 208 260 262 277 192 177
3809 177 110 18 -28 -80 -83 -70 -1 40 52 -73 -107 -111 -163 -213 -244 -203 -188 -108 -59 5 62 73 52 29 27 -16 52 51 65 190 251
3840 251 291 282 265 207 160 101 -1 -22 19 35 37 70 1 -48 -47 -168 -98 -250 -306 -307 -306 -214 -136 -130 -140 -41 -30 -90 -110 -108 -67 -50
3872 -50 1 92 201 184 209 262 170 197 119 98 91 56 96 94 170 139 126 100 38 -46 -116 -193 -204 -209 -193 -174 -100 -118 -59 -121 -104
3903 -104 -159 -146 -164 -133 -50 -13 76 117 194 169 234 120 154 116 87 81 125 157 219 185 220 172 107 51 -44 -80 -157 -176 -186 -183
3933 -183 -107 -100 -106 -129 -197 -206 -266 -243 -196 -257 -148 -42 -1 20 30 72 33 54 14 22 28 27 139 160 235 269 189 164 116 9 5
3964 5 -70 -90 -48 -74 0 -47 -68 -74 -130 -162 -240 -209 -238 -253 -191 -153 -55 -69 41 -29 1 0 -59 -16 -42 39 105 156 246 232 253
3995 253 222 266 119 149 61 53 54 69 58 87 49 22 -8 -75 -130 -193 -244 -268 -253 -186 -186 -104 -100 -84 -110 -134 -141 -147 -89 -134 13 26
4027 26 79 151 205 195 160 126 74 117 54 84 76 109 129 88 138 89 3 -84 -121 -195 -190 -192 -156 -91 -63 -99 -84 -141 -156 -168 -205 -164
4059 -164 -194 -109 -69 27 66 130 184 135 106 87 93 86 112 185 202 195 201 245 211 124 49 12 -61 -101 -105 -44 -81 -57 -52 -60 -85 -132 -169
4092 -169 -205 -266 -219 -147 -121 -62 12 24 51 11 35 1 18 54 62 75 112 180 198 203 225 206 145 103 23 2 -22 -15 -39 -5 2 14
4124 14 -56 -108 -114 -222 -164 -156 -207 -168 -177 -91 -26 -19 -18 -24 -47 -73 -33 14 47 125 245 191 301 286 189 236 147 73 104 117 109 82
4156 82 164 127 98 111 50 -25 -110 -127 -178 -161 -132 -135 -93 -77 -61 -49 -88 -104 -150 -154 -129 -55 -8 82 101 179 157 197 175 124 125 95
4188 95 119 99 116 171 192 169 130 81 42 -10 -94 -139 -109 -131 -145 -124 -78 -68 -81 -124 -157 -158 -157 -168 -177 -48 -31 24 60 118 127 104
4220 104 107 71 91 99 143 172 145 215 207 226 204 110 143 74 2 -42 -64 -43 20 16 -2 -41 -59 -103 -197 -135 -200 -230 -133 -97 -52 -23
4252 -23 25 21 65 5 5 -30 2 -2 77 166 177 175 237 226 163 108 129 31 23 54 10 53 24 -5 -40 -31 -74 -119 -177 -221 -211 -198 -242
4285 -242 -142 -142 -95 -18 -96 -117 -79 -114 -99 -69 14 36 113 123 152 227 171 188 89 98 58 107 105 123 128 109 122 104 61 -41 -131
4316 -131 -113 -157 -156 -147 -98 -128 -84 -29 -85 -107 -94 -166 -142 -121 -88 -41 -10 57 98 122 103 124 114 104 92 117 118 88 140 125 149
4347 149 142 56 50 -17 -33 -114 -117 -103 -98 -110 -100 -150 -129 -126 -184 -154 -192 -214 -158 -192 -82 -56 11 -2 -15 32 10 32 -16 60 109 87
4379 87 162 210 175 163 157 124 72 37 30 -49 -21 -13 13 -46 -35 22 -102 -100 -166 -184 -169 -204 -155 -141 -78 -36 -76 -9 -31 34 -12 3
4411 3 1 18 102 94 187 177 239 180 199 134 91 76 13 81 63 78 76 41 50 -32 -30 -91 -110 -193 -150 -182 -167 -152 -112 -98 -84 -51 -183
4444 -183 -151 -110 -152 -90 -42 38 55 95 148 144 172 95 108 96 118 101 105 111 111 141 128 86 38 -17 -38 -84 -86 -119 -86 -92 -108 -87 -65
4477 -65 -76 -96 -129 -171 -105 -156 -57 -32 -10 68 133 122 103 99 109 108 64 119 142 145 196 220 195 137 134 71 13 -11 -47 -59 -58 -92 -54
4510 -54 -54 -124 -67 -78 -115 -125 -207 -155 -128 -169 -94 -66 -9 -8 -53 33 -4 24 43 44 102 102 141 140 220 191 134 121 71 61 -23 35 47
4543 47 44 27 10 41 -19 -7 -70 -78 -146 -156 -173 -158 -100 -101 -63 2 -40 -21 -44 -28 -8 -2 90 83 39 98 141 206 197 170 162 140 120 122
4577 122 144 138 116 74 71 85 10 -5 -45 -115 -114 -148 -140 -108 -121 -114 -107 -59 -91 -103 -139 -85 -90 -58 -28 54 49 78 139 101 125 124 133 68 76
4612 76 109 80 123 154 112 125 68 53 17 -90 -109 -127 -106 -102 -99 -79 -71 -88 -133 -94 -161 -181 -170 -173 -137 -69 31 51 46 6 79 64
4644 64 99 101 94 130 142 149 155 229 168 175 124 98 72 5 -10 -11 -33 18 -33 -33 -6 -54 -80 -143 -169 -181 -182 -149 -148 -110 -57 -34 -21 -4 -15
4679 -15 -3 5 -23 43 48 53 89 120 122 164 138 105 74 85 26 17 15 39 -33 -25 -24 -19 -76 -70 -111 -149 -163 -143 -226 -128 -83 -117 -90 -30 -36 -67
4715 -67 -35 -94 -49 -47 21 71 44 123 157 140 123 130 103 60 94 60 81 103 88 69 44 45 -16 -46 -31 -40 -88 -99 -73 -96 -103 -71 -107
4748 -107 -123 -131 -118 -100 -93 -96 -61 -6 51 39 73 115 97 79 93 105 79 138 94 118 111 124 143 88 55 36 -53 -59 -46 -96 -99 -81 -116
4781 -116 -90 -113 -141 -141 -142 -142 -175 -178 -123 -93 -92 -55 47 -20 -19 43 59 50 42 47 118 98 102 136 162 193 135 95 119 21 8 2 -20 -63 -18
4816 -18 1 -4 -28 -101 -103 -126 -154 -173 -114 -138 -38 -94 -46 -7 -18 -33 8 -8 -23 9 14 91 83 147 149 177 157 96 127 133 81 77 41
4849 41 27 0 19 -34 -19 -77 -57 -53 -117 -95 -130 -201 -121 -85 -70 -79 -92 -58 -92 -91 -78 -99 -44 -4 41 34 126 126 108 126 130 129 84 114
4883 114 135 95 122 115 134 134 53 29 27 -28 14 2 -102 -86 -71 -62 -59 -21 -91 -35 -92 -137 -117 -54 -74 1 11 59 88 69 105 99
4915 99 80 128 154 158 121 148 165 115 136 101 94 29 25 19 -22 13 -25 -33 -26 -34 -65 -83 -102 -58 -140 -131 -150 -99 -90 -92 -66 -7 31 54 18
4950 18 70 38 32 54 110 143 96 121 88 110 127 129 104 13 30 18 45 -6 -4 26 -13 11 -12 -68 -52 -124 -122 -123 -103 -111 -95 -11 -43
4983 -43 -25 -36 10 -3 26 31 1 83 57 141 120 157 165 124 113 162 76 71 69 112 52 71 24 40 -6 -28 -66 -77 -132 -138 -151 -91 -118
5016 -118 -118 -138 -92 -98 -100 -40 -39 -71 -49 -42 -1 16 96 75 85 161 100 128 54 91 55 100 99 125 74 128 46 10 23 -7 -62 -38 -82
5049 -82 -80 -161 -137 -102 -109 -57 -83 -90 -156 -71 -48 -76 -71 -9 74 1 28 91 46 98 74 104 81 59 119 100 75 145 129 86 49 17
5081 17 38 8 11 -34 -64 -55 -71 -76 -74 -81 -109 -95 -179 -116 -159 -121 -79 -49 -73 -30 -34 -44 -12 0 -7 -13 42 60 52 111 58 104 116 87 58
5116 58 47 14 -6 17 -28 -28 -14 6 -18 -63 -80 -77 -150 -118 -159 -125 -139 -80 -104 -115 -65 -68 -46 -77 -73 -29 15 23 32 92 95 89 113 107 53
5151 53 67 124 95 71 60 86 65 38 61 17 -25 -8 -26 -100 -151 -112 -124 -107 -75 -123 -71 -125 -62 -103 -52 -106 -63 -98 -36 8
5181 8 24 51 42 79 68 56 45 31 51 101 77 67 80 64 99 42 10 -30 -67 -54 -81 -124 -166 -33 -141 -127 -113 -111 -85 -124 -158
5212 -158 -129 -134 -80 -64 -7 -74 -5 27 61 80 31 59 72 95 85 88 97 126 141 108 121 79 79 10 -18 6 0 -28 -28 7 -8 -45 -68
5245 -68 -85 -89 -104 -122 -95 -79 -26 -45 11 10 43 12 5 14 12 35 51 119 139 137 99 157 111 78 86 69 -4 45 28 32 8 5 16 -15 -60
5280 -60 -49 -95 -168 -106 -118 -126 -95 -112 -88 -52 -94 15 -97 -69 -22 -23 20 -3 87 94 120 137 146 120 108 104 61 114 90 61 88 92
5312 92 84 85 32 19 -8 -57 -66 -112 -59 -60 -56 -44 -44 -72 -41 -37 -38 -103 -46 -55 -66 70 39 70 99 84 64 82 78 83 81 74 117 139 94 81
5348 81 94 128 77 -2 56 -24 -22 -98 -56 -47 -83 -56 -80 -73 -99 -115 -123 -150 -94 -71 -101 -76 27 7 15 24 62 13 19 5 63 61 109 126
5382 126 81 151 102 125 81 59 6 4 -23 -12 17 -17 15 9 -63 -46 -85 -112 -100 -66 -95 -104 -88 -68 31 24 29 -6 15 4 7 16 15 92
5416 92 83 129 129 102 113 65 101 71 66 13 10 22 12 67 -15 29 32 -4 -104 -121 -68 -130 -161 -108 -106 -92 -106 -71 -59 -37 -94 -63 -43
5449 -43 -51 -33 33 69 76 109 121 95 81 70 88 29 50 83 107 65 50 22 40 55 -44 -40 -40 -86 -109 -75 -70 -68 -52 -87 -82 -96 -67 -124
5483 -124 -65 -37 -30 -11 10 37 66 63 51 106 97 49 91 93 58 147 126 118 126 72 93 25 41 -12 -26 -88 -45 -52 -63 -33 -57 -47 -70
5516 -70 -128 -161 -136 -114 -114 -66 -31 -72 -26 28 -33 -6 32 -4 9 -15 110 78 91 94 104 171 57 73 23 5 37 -29 -2 -20
5546 -20 73 26 -47 12 -53 -77 -112 -147 -171 -132 -56 -122 -77 -80 -41 -9 -23 -44 -25 -56 31 32 59 67 107 131 114 179 121 95 64 72
5578 72 75 61 78 40 45 75 -12 -5 -18 -86 -89 -96 -77 -77 -82 -85 -63 -94 -55 -64 -51 -77 -87 -67 -45 17 45 21 89 81 81 65 81 113 102 -3
5614 -3 0 81 53 83 77 73 68 20 14 -28 -87 -90 -38 -66 -37 -43 -63 -88 -55 -84 -100 -106 -112 -39 -47 8 23 36 51 74 88 41 84 44 44 74
5650 74 66 82 145 178 109 152 88 53 -21 20 -23 2 -20 -33 -23 -11 -10 -45 -38 -30 -113 -126 -114 -96 -41 -59 -17 34 27 79 11 29 -10
5683 -10 17 45 62 111 77 105 101 121 95 102 74 48 61 -61 12 -1 44 72 -10 20 -55 -70 -84 -108 -133 -119 -81 -60 -61 -21 -28 -23
5715 -23 -14 -23 -44 -14 -51 -11 89 54 108 149 67 137 81 148 68 57 45 80 96 103 91 91 65 78 -4 -44 -38 -91 -83 -102 -18 -75 -56
5748 -56 -49 -23 -87 -62 -77 -63 -92 -65 -25 -40 52 103 115 99 65 76 74 48 29 48 114 74 124 92 78 46 71 53 -36 -15 -70
5779 -70 -71 -67 -29 -58 -55 -56 -106 -75 -142 -124 -101 -57 -52 -49 12 10 34 46 12 63 -8 -3 17 28 115 92 129 121 112 91 86 -17 -2 13 -26
5814 -26 -31 18 -37 -3 6 -28 -24 -72 -115 -121 -119 -90 -97 -44 -20 16 -10 35 -30 -9 -18 -57 -1 0 31 43 83 68 128 57 77 39 50 28
5848 28 -10 -25 -16 -17 5 33 -34 11 -25 -58 -129 -129 -168 -104 -61 -135 -31 -49 -41 -63 -70 -54 -99 -56 -68 -33 -10 59 51 127 127 88 69
5881 69 20 -18 37 7 61 36 65 52 66 62 -9 4 -67 -81 -102 -107 -42 -89 -45 -55 -35 -39 -90 -72 -114 -97 -93 -59 -14 -8 0 60 90
5914 90 44 17 23 -18 50 118 13 39 58 130 67 61 44 11 47 -15 -42 -45 -29 -59 -67 -61 -75 -30 -91 -93 -107 -142 -165 -143 -58 -95 -14
5947 -14 22 -21 -8 4 -7 -45 -10 3 -7 43 71 82 131 121 90 29 94 -22 -15 -18 -63 5 8 15 -27 -31 -52 -57 -130 -93 -97 -116 -96
5980 -96 -68 -42 -32 -14 -4 -23 -15 -42 6 -35 -23 51 43 124 116 99 90 107 99 43 71 22 26 24 68 53 127 11 53 -48 -12 -94 -109
6013 -109 -134 -105 -66 -75 -41 -77 -31 -5 -50 -56 -53 -73 -54 -80 32 6 73 54 158 33 43 18 22 36 12 107 34 57 131 111
6043 111 122 29 16 -43 -40 -97 -85 -23 -42 17 -42 -16 -31 -36 -81 -67 -104 -56 -80 -6 3 45 70 84 20 33 16 23 102 -18 63
6074 63 103 116 121 91 172 107 66 45 28 6 -8 -9 30 38 32 13 4 -34 -63 -97 -108 -89 -105 -27 -5 3 39 42 37 28 6 -22 -32 -40 34
6109 34 61 62 137 98 178 95 73 54 -13 25 41 34 -8 62 20 53 47 6 -26 -4 -87 -96 -109 -78 -53 25 -5 -15 13 11 -44 -17 -50
6142 -50 -50 -36 3 16 161 68 144 80 74 105 51 75 37 -20 62 41 52 78 112 59 38 -16 -64 -60 -76 -67 -44 -33 -57 -12 -2 -22
6174 -22 -42 -49 -58 -71 -70 -6 -22 59 47 65 26 61 72 8 34 -6 40 59 114 75 108 97 28 -11 29 -60 -29 -24 -58 -3 -51 -23
6206 -23 -38 -14 -87 -77 -89 -91 -94 -105 -35 -40 12 37 59 7 8 24 5 -12 14 -18 50 56 107 33 117 136 113 100 39 12 -3 25 11
6239 11 25 44 -19 43 -29 -19 -71 -79 -84 -146 -106 -95 -57 22 6 19 5 -22 -55 4 -37 -19 21 18 90 86 119 124 65 38 4 -10 -2
6272 -2 15 17 28 49 21 11 7 -54 -19 -71 -83 -58 -82 -95 -109 -4 -23 -24 -59 -55 -24 -90 -75 -111 -39 -26 16 59 88 61 121 49
6304 49 65 17 35 44 54 45 107 72 78 104 47 22 -74 -73 -65 -38 -20 -95 -64 -10 -45 -4 -79 -103 -78 -168 -38 -20 -66 -44 48 70
6336 70 7 44 42 -2 2 26 25 48 73 94 92 79 89 70 18 -27 -36 -5 -51 5 -47 -31 -4 -32 -69 -56 -67 -106 -102 -149 -129 -122 -101 -29
6370 -29 28 39 -8 8 -4 -12 9 17 -24 51 48 95 97 135 99 63 10 0 7 33 -15 -14 38 81 34 17 -24 -47 -53 -115 -76 -120 -88 -22
6404 -22 -4 20 9 16 -31 10 -38 -56 -3 -6 22 36 64 106 121 80 89 67 46 42 3 -32 25 50 26 66 83 56 -11 -51 -87 -68
6436 -68 -73 -57 -42 -54 -11 -11 -73 -8 -46 -54 -91 -101 -42 -52 2 14 62 110 54 65 50 -3 -1 30 19 90 112 139 104 108 97 33 -27
6469 -27 6 -42 -88 -45 -19 -12 14 -23 -12 -21 -69 -65 -105 -106 -48 5 -19 12 50 4 61 52 18 32 34 57 7 63 87 113 132 62 110
6502 110 48 25 48 18 -32 40 22 27 9 53 -1 -36 -22 -28 -70 -72 -142 -85 -77 -21 2 -39 39 -9 -38 -22 -7 -31 -54 16 70 75
6534 75 63 85 76 45 45 4 74 -18 31 -6 -23 48 37 -3 15 -16 -51 -94 -110 -103 -120 -80 -39 -26 2 9 5 -17 -106 -59 -56 -35 -31 57
6568 57 8 70 74 107 88 19 62 -1 12 22 64 106 35 85 70 121 35 47 -72 -86 -56 -81 -46 -80 -14 -37 -30 -21 -57 -33 -90
6599 -90 -80 -87 -83 -84 -52 35 22 69 54 16 2 -3 42 -57 45 67 77 99 90 65 67 27 -13 -38 -93 -44 -57 -63 -79 -40 -45 -36 -24 -33 -119
6634 -119 -100 -70 -60 -82 -44 -13 38 -19 54 -25 -25 -26 -7 11 35 49 41 78 118 74 114 61 32 23 12 -35 -8 -14 0 -3 -7 -19 -15 -25
6668 -25 -63 -123 -113 -90 -100 -80 -45 -29 -2 -18 -38 -60 -77 -52 -98 -59 27 72 44 97 63 70 41 31 -39 1 10 -51 50 50 82
6699 82 47 0 -1 -1 -69 -85 -94 -93 -94 -50 -61 -48 -14 -34 -28 -39 -67 -67 -69 -66 -72 -54 54 38 20 107 53 82 57 -37 51 -44 -3 56 86
6734 86 85 34 68 5 -20 -35 -61 -58 -55 -38 -22 -38 25 -36 -25 -66 -44 -105 -69 -89 -62 -57 -23 17 34 81 67 63 1 -22 34 15 26
6767 26 53 69 81 105 94 42 34 -1 2 -26 -48 22 17 -11 -5 31 11 -39 -81 -64 -104 -56 -72 -78 -52 -45 8 15 1 16 -25 -3 -26 -19
6801 -19 26 53 51 99 115 132 53 115 121 21 32 18 42 21 24 30 44 55 -17 -10 -30 -76 -96 -45 -77 -78 19 13 23 16 17 3 -11 -28
6835 -28 -43 14 38 51 56 147 119 92 43 37 -15 15 25 98 40 81 45 71 80 32 12 -8 -39 -7 -34 -31 -28 -25 -19 25 -12 -41 8 -82
6869 -82 -85 -40 -10 -26 -20 32 45 76 55 78 20 52 47 -1 46 36 68 85 79 74 78 28 26 9 -4 -13 -7 -32 9 38 -16 -6 -38 -10 -44
6904 -44 -49 -34 -79 -20 -19 7 22 32 28 11 21 1 13 65 44 48 65 73 72 105 90 27 44 -59 48 -11 10 -12 39 73 24 -50
6936 -50 7 -71 -29 -68 -105 -86 -70 -66 -4 -10 -31 21 -10 7 -1 -34 -53 -47 4 45 93 67 89 80 89 47 -9 34 27 15 16 33 29 37 82
6971 82 14 -30 -85 -28 -90 -126 -71 -85 -34 -53 -26 -26 -27 -61 7 -35 -40 -47 7 7 4 70 62 66 69 39 80 15 30 56 26 59 48 73 103
7006 103 69 38 22 -44 -48 -33 -83 -33 -91 -37 12 -53 -49 -64 -19 -71 -82 -85 -56 -21 -6 35 65 43 -6 0 -20 -34 9 12 5 49 44
7039 44 72 45 71 53 22 19 -27 -41 -62 -37 -78 -1 -76 -10 -59 -71 0 -95 -49 -105 -104 -33 -60 -12 -6 16 4 -4 -6 -4 10 -17 -9 61
7073 61 44 94 88 87 57 23 39 53 -26 -25 8 16 -8 29 15 -22 -31 -81 -84 -66 -101 -101 -80 0 -56 -45 -32 5 -27 -57 -24 -77 -61 -42
7107 -42 -7 13 -10 41 56 26 45 21 -32 -5 -53 -19 46 25 42 21 49 5 12 -81 -43 -69 -96 -65 -42 -24 -35 -8 -7 -25 -28 -42
7139 -42 -32 -73 -93 -1 -29 25 53 96 51 1 5 38 -29 27 31 -5 63 65 81 97 63 49 -15 12 -30 12 -31 1 -29 9 48 -4
7171 -4 29 -1 -85 -74 -110 -86 -46 -73 32 5 31 12 22 -19 19 -16 -31 50 -22 81 54 74 65 25 2 25 -1 -16 -2 -69
7201 -69 38 -20 39 -2 3 -3 -39 -43 -72 -64 -97 -43 -87 -50 -70 -13 44 0 -8 -3 -44 48 -21 6 8 59 72 101 90 55 97 46 21
7234 21 26 58 -16 37 32 -10 70 37 -27 -26 -34 -33 -88 -27 -33 -78 10 7 -22 0 -31 -62 -18 -53 -28 5 22 17 92 53 54 60 51 74 39 33
7270 33 43 47 15 75 28 60 28 29 -3 -57 -52 -29 -51 -54 -38 -6 14 -30 23 -11 -59 -69 -47 -28 -34 -12 -21 12 66 57 -6 23 60 20
7304 20 45 -26 0 65 40 96 51 53 103 50 26 -52 23 -31 -38 26 32 -2 18 -18 -7 -64 -52 -40 -57 -101 -42 1 11 47 56 56 38
7337 38 26 27 -4 -28 -11 -2 31 62 87 74 62 36 15 -3 16 -2 21 7 14 6 57 -19 -11 -58 -54 -63 -78 -100 -65 -30 -29 -1 -11 -49
7371 -49 -20 -32 -28 -44 -17 6 -23 12 5 78 56 84 15 0 4 -7 6 42 52 79 42 13 43 9 -18 9 -93 -51 -30 -2 -7 -19
7403 -19 7 -42 -18 -28 2 -68 -98 -50 -45 8 -39 11 16 64 59 68 73 28 4 -1 43 23 26 57 36 70 33 -26 -22 -31 -8 -28 -39 -78 30
7438 30 8 -23 6 -25 -27 -43 -86 -85 -71 -40 -61 -15 -15 -21 35 -17 -28 -10 -52 29 10 -3 45 20 73 72 69 49 6 -22 -26 -45 -33 -19
7472 -19 -37 -32 -12 -19 -30 -70 -44 -102 -100 -72 -60 -41 -58 -7 4 43 -3 -28 13 -36 -10 -35 -35 74 60 74 68 50 66 91 -6 25
7504 25 -12 -19 -16 10 36 24 -40 19 -61 -26 -20 -57 -76 -44 -41 -40 0 11 -1 -62 -2 -86 -71 2 -14 19 -33 25 38 48 49 -5 61
7537 61 25 47 19 18 -12 -13 0 87 60 2 67 21 -59 -13 -46 -42 -24 -18 -5 -37 -16 8 -52 -70 -70 -54 -57 -80 -32 -19 -23 48 66 46
7571 46 34 17 39 -10 39 51 25 59 90 63 74 53 37 57 22 -11 1 -35 -24 -10 -14 -36 -5 -12 -13 -8 -27 -57 -68 13 -2 -6 -36
7604 -36 9 0 -44 28 41 -36 50 47 9 36 70 71 73 53 29 7 52 15 -38 53 -35 -33 28 37 0 -5 -1 -70 -68 -37 -24 -26 22 -15 12
7639 12 8 6 -30 -8 22 -16 21 6 45 30 41 111 63 108 37 11 17 71 29 21 25 20 49 -12 78 43 34 -7 1 -9 -36 -64 -76 -41
7673 -41 12 24 26 -22 -9 -14 -40 -30 -44 5 -8 -5 46 62 53 74 57 18 54 21 -20 23 31 68 57 25 27 2 51 26 29 -32 -2 -40
7707 -40 -13 -17 -15 4 -32 -25 -23 -46 -11 -44 -10 -17 17 22 39 34 23 22 21 32 30 43 11 40 53 14 80 56 42 24 7 49 40 -35 47 -30
7743 -30 -31 -25 -34 -6 3 -41 -61 -67 -77 -34 -50 -87 41 -9 -2 12 34 4 -46 -2 -12 5 67 28 10 23 57 -11 57 38 20 -11 -19
7776 -19 21 -11 -12 -26 -1 53 -22 -21 -93 -66 -60 -101 -87 -54 -20 -25 -8 -48 -3 -32 -32 -36 -10 -13 -33 -17 -14 43 10 75 68 -16 -6 40 54
7811 54 -6 2 4 33 15 81 11 -36 -23 -62 -53 -66 12 -11 -13 -7 -39 -33 -29 -22 -43 -71 -21 -25 -45 5 30 7 20 30 9 24 -24 40 17
7846 17 -20 60 24 33 38 65 19 -45 6 -93 37 -30 -71 -39 -23 -80 -67 -19 -56 8 -89 -108 -56 -79 -72 -84 7 -20 -19 -27 -21 -20 -41
7879 -41 -14 -22 -18 35 5 56 40 76 -5 19 26 16 -7 15 -33 -10 -2 15 2 -57 20 -51 -54 -30 -47 -21 -27 -32 -45 -38 -26 1 -33 5
7913 5 12 2 12 -26 12 17 41 47 -22 66 37 -4 27 68 26 26 60 -23 55 36 -10 -17 45 18 -28 6 -56 -49 -45 -60 11 10 -12 -12 15
7948 15 -62 -11 29 -76 -15 4 58 16 12 63 40 54 37 31 36 -13 -17 15 30 66 35 57 14 46 -21 24 -27 -18 -12 -42 3 -3 -22
7981 -22 -14 1 -36 -33 -35 -6 -45 -39 -30 21 53 46 64 21 3 35 76 59 9 13 41 79 104 70 47 22 30 -21 -19 -25 -17 4 0 7 -23 -7 0
8018 0 -30 -5 -44 -53 -54 -23 -17 -24 -9 28 78 -9 21 5 0 40 13 20 15 36 38 89 55 39 82 69 14 12 31 25 22 27 7 41 -4 0 3 3
8056 3 6 -38 -4 -34 -36 0 8 -5 12 -44 -17 2 12 47 20 15 37 -36 39 71 103 50 73 7 41 30 33 7 50 24 50 23 -21
8089 -21 -39 40 -34 -32 -38 -54 -35 -44 23 -10 -47 -19 -32 14 -57 -30 -1 -12 25 -17 9 36 64 59 33 37 14 25 -1 11 82 20 57
8122 57 19 9 -4 -30 -39 -23 -8 -2 -23 -10 -42 -32 -42 -45 1 -20 7 -30 -68 -19 -1 16 3 31 -3 -29 -20 26 21 55 -30 -13 46
8155 46 6 2 65 18 17 51 12 -20 24 -27 25 -4 -49 17 -12 -14 8 -8 -29 -80 -33 -54 -27 -42 -49 16 -27 -1 -15 -1 -20 -43
8187 -43 -15 69 -48 47 20 16 8 23 50 -24 15 19 -13 17 36 -3 -5 17 -20 -3 -34 -37 -14 -40 -26 -14 -69 -24 -53 -51 -36 -36 -57
8220 -57 -33 -36 22 -2 -46 34 20 35 30 -26 54 27 87 24 14 7 14 -7 -14 -16 21 -2 -6 5 -35 -22 -35 -42 4 -67 -35 -24 -27 -60 -40
8255 -40 -45 -36 -39 12 -14 -2 1 69 -3 33 33 30 -50 37 -2 38 0 15 -2 18 45 19 25 -7 16 15 -30 -40 -12 18 -40 -31 -17 -12 -22
8290 -22 -70 -9 -39 -13 -29 -54 -33 9 -40 7 10 -6 -25 10 -13 51 28 23 34 27 46 10 82 -15 51 -1 -21 -20 -1 -12 -8 -14 -20 0
8324 0 12 -31 5 -2 -11 -54 29 -69 -42 0 -1 17 -8 -15 -1 5 -9 -2 10 24 42 39 47 21 21 26 -7 17 38 3 42 50 71 42 37 18 -24
8361 -24 28 -44 -3 -9 -17 -5 72 -57 -30 -44 -24 -49 1 35 23 -32 31 55 33 36 8 21 10 33 -14 3 37 12 3 -10 47 47
8393 47 -3 27 -7 1 46 -33 3 -16 2 -27 8 18 -19 -8 -35 -18 -67 -26 -56 -17 -26 30 54 21 -8 48 55 58 6 51 11 67
8425 67 41 35 33 -2 61 26 66 -10 11 -34 1 29 -10 -17 -27 -35 -34 -10 -12 -25 -21 -33 -30 -39 -23 19 5 7 24 16 7 5 1 22 28 -5 73 52
8463 52 45 1 38 65 -12 5 -22 25 -38 -16 -34 27 -20 18 10 -83 -58 -70 -30 -45 -40 -44 -35 -49 -3 0 -53 13 30 0 5 -4 14 38
8497 38 7 55 28 27 -28 24 -4 29 -26 -2 0 16 52 40 -21 -13 -33 -16 0 -40 -18 -45 -103 -18 -42 -34 -80 -28 -16 1 -21 -36
8529 -36 -23 11 -30 -30 -7 38 16 23 36 4 29 -8 18 -3 50 46 35 -5 -18 8 47 -44 -16 -12 -72 30 -44 -37 -20 19 -5 -57
8561 -57 -37 -38 -50 -21 -7 -40 -17 10 20 -6 -12 -14 -5 -42 29 7 39 20 5 70 -23 26 47 -6 22 54 28 -3 -52 -29 -24 -25 -27 -39
8595 -39 -19 -21 -50 -20 -50 -12 -79 -28 2 -45 -25 16 32 -20 -32 -15 -27 -8 1 22 46 25 -11 -1 59 20 -11 -62 11 4 -39 -44
8627 -44 -9 -9 -33 -30 -2 -38 -12 -28 -9 -59 -51 -10 -30 -21 4 -45 10 -18 9 27 23 -3 -45 46 -18 30 65 60 51 17 44 8 6 56
8661 56 16 41 -20 20 -21 17 31 -20 -14 -37 1 -75 36 -9 -36 30 -33 -20 3 -57 9 18 -28 7 -15 8 21 35 -8 -18 -17
8692 -17 5 -7 11 10 50 4 10 26 -20 23 21 -17 -71 -49 -12 -24 -40 -5 33 -21 -44 -34 -12 -15 -24 -50 6 14 9 -40 -5 49 2 83
8726 83 43 34 -14 35 77 16 14 10 -2 5 3 35 27 39 4 26 -41 -26 6 29 16 -9 -8 -23 -49 -26 -21 -23 0 -9 -13 -23 -10 34 22 37
8762 37 35 41 12 52 -8 26 40 44 51 35 76 20 25 8 37 34 -23 3 6 16 13 17 49 -44 14 -59 8 -22 -43 5 -20 -6 -39 -7 -2
8797 -2 3 4 -32 17 4 -14 3 58 87 77 50 51 -21 8 31 23 7 12 29 61 49 20 41 34 -14 22 8 -9 17 23 16 11 38 -20 31
8832 31 9 26 23 3 -15 -15 16 33 13 -20 21 1 15 41 14 64 31 21 34 54 19 0 11 26 1 -2 -20 -20 -12 -31 -5 -4 14
8865 14 6 -38 -34 -31 -20 -52 -39 12 6 -12 61 17 18 -20 28 9 15 -7 -11 15 63 44 -4 33 43 36 14 23 68 1 -20 -3 1 -17 -13 7
8901 7 -24 20 -28 -33 -52 -3 -52 -52 -67 -45 -33 6 10 -23 18 -54 -11 -46 -17 22 35 10 1 36 30 34 -30 20 47 40 8 45 -23 34
8935 34 0 -26 -4 -46 18 -17 -11 -33 0 -53 -15 16 -28 -29 19 -50 27 1 -32 -10 5 6 -16 59 15 -11 -25 71 -14 -4 -4 6
8967 6 24 54 42 8 29 4 29 -12 -11 -56 -21 -21 -2 10 2 -5 -14 27 -9 23 -30 -2 -25 1 40 -3 31 11 21 38 32 -31 1 -19
9001 -19 44 35 2 31 14 2 5 27 -7 14 -9 -48 -15 -23 -4 -4 9 -26 -9 -33 -2 -18 29 -53 -27 -3 -96 -48 -39 3 24 -40 36
9034 36 -9 -7 -43 -78 8 7 12 22 46 -2 10 -22 -44 22 -11 1 -39 7 6 -18 9 -17 -22 -32 -37 8 -38 -38 -30 -29 25 -78 60 -37
9068 -37 9 -19 -3 -11 -24 -25 39 43 31 51 14 4 3 0 0 -6 -33 -5 14 46 -1 -18 -16 -13 -2 -5 -2 -44 -27 -21 32 -3 -10 0 -32 19 15
9105 15 -58 -27 30 48 -21 13 40 13 59 -9 24 -25 8 21 63 46 -3 35 33 35 22 30 23 -20 -17 -40 9 -17 -76 4 9 -25 7
9138 7 -19 -51 -33 -2 -23 -4 5 33 10 28 43 64 13 -15 0 -11 33 10 31 30 31 46 53 64 -14 28 0 30 -8 -44 17 -6 30
9171 30 -32 -7 -28 -16 10 -23 -52 -13 1 32 -14 7 9 -5 -28 1 3 -49 -17 4 28 23 34 40 35 9 50 27 15 34 -37 6 -35
9204 -35 54 2 1 10 33 21 -16 -42 -41 -28 -3 -16 36 -10 -22 8 35 -23 -20 40 -16 19 12 33 77 38 88 42 13 25 13 41 24
9237 24 22 7 60 1 2 27 6 29 49 -26 -23 -47 -15 9 39 -41 45 -1 -19 7 -8 -14 -28 -11 24 29 43 23 26 25 -11 56 29 12
9271 12 9 7 -7 51 -10 49 60 36 -29 -8 -30 -14 -4 -9 -16 11 31 -3 -4 10 6 -31 -38 -56 -3 -39 -49 -32 35 -21 45 22 31 -76
9305 -76 6 -4 -1 13 -16 42 -6 40 11 -9 8 -13 -15 -4 -41 16 -9 -24 17 1 3 -9 -19 -28 -2 8 -6 -52 -55 -27 -2 -21 -50
9338 -50 15 -46 9 -4 -28 49 -26 32 28 12 -22 38 34 -64 -31 28 -31 -11 3 52 36 -24 -25 38 -17 -22 -29 -52 -43 -24 -12 -17 -4 51
9372 51 -38 -44 -30 -79 -23 -15 -17 48 42 -14 2 8 23 12 -9 3 -38 31 -15 7 55 -3 3 26 12 29 -56 0 -21 -6 1 -42 38 42
9406 42 -30 49 -13 -11 17 29 12 12 -35 -50 19 10 75 64 21 -8 33 4 -20 -27 18 13 20 30 45 8 -4 -37 3 -47 19 19 -34 5
9440 5 46 -10 -15 -26 8 -8 -45 -37 -5 -15 6 22 -29 23 21 -27 8 -4 19 -2 34 60 -33 45 48 20 42 -11 29 -9 6 12 20 32
9474 32 36 61 -16 41 -5 22 -2 -31 -34 -56 -22 -21 65 10 5 51 -39 17 -12 0 -5 -14 4 31 -4 49 72 41 59 8 3 -17 -8 -24
9508 -24 -7 39 43 17 33 31 -10 24 -10 -37 -48 -18 -18 2 -1 -17 47 0 4 -26 -45 6 44 60 48 8 57 32 31 15 30 21 3 -17
9542 -17 0 43 21 32 6 49 19 -10 13 -39 -15 -10 -20 24 -2 11 -54 -10 41 12 -41 36 -13 -19 -6 -3 18 59 34 30 20 51
9574 51 21 -17 58 34 68 25 58 25 39 65 9 47 -6 35 -22 -66 -19 -12 54 -13 18 21 27 11 36 26 9 -51 -10 37 -11 -2
9606 -2 5 0 -9 31 -56 1 6 59 -32 3 102 50 28 44 11 -25 12 27 -9 5 28 25 2 -2 -35 12 5 -7 -65 -30 -1 -2 -41 6 5
9641 5 8 -1 -17 6 -35 1 11 7 -11 -2 61 27 4 18 8 11 10 35 -2 15 -12 -3 3 13 28 -10 17 -20 -40 -10 -9 33 42 -8 22 33
9677 33 -4 7 -26 -18 28 -42 -17 -26 -38 56 11 33 25 -31 -1 -17 4 -8 0 19 2 -17 18 -6 18 -16 -32 69 -12 -12 23 -31
9709 -31 -9 26 27 40 -26 -6 -55 0 -49 -48 18 0 -8 -3 -22 22 -28 -35 10 -18 -20 -41 8 -17 39 -8 26 67 5 -3 21 7 -15 -24
9743 -24 16 -7 66 -28 -3 -34 4 -27 -9 -28 -59 10 -32 8 -59 -11 -30 -35 6 -30 -5 -23 -29 -33 -28 16 69 19 17 -1 -3 9 -17
9776 -17 17 -4 -34 -37 -10 16 19 31 29 -26 -47 -46 -48 -52 3 -56 1 -1 -9 -16 3 -13 -71 -30 -80 -51 -10 -48 21 73 -20 1 13 36 -29
9811 -29 -3 -15 -45 -50 16 30 -5 20 -10 -28 4 -61 -57 6 25 -31 2 0 -14 13 -63 -43 -44 18 -71 -42 -37 -14 29 5 4 5 31 25
9845 25 -18 25 15 -24 0 28 6 22 47 16 8 7 40 -23 16 -9 -29 35 3 8 17 5 -62 -64 -59 -77 -14 -37 -37 32 -13 -7 7 -16
9879 -16 -39 -13 -25 -4 56 21 58 61 25 65 -22 25 42 -17 -17 -20 0 -56 -4 18 -2 23 -25 35 -33 -40 -12 -47 -22 23 -11 31
9911 31 -8 29 -6 34 25 19 -10 -30 27 -17 55 -12 32 47 29 41 30 39 1 34 15 51 38 61 37 26 37 8 -11 -42 -39 -4
9943 -4 3 43 32 -30 3 -7 -10 -12 13 11 -8 32 -24 23 23 24 12 12 9 -6 -23 29 9 57 15 44 33 26 64 55 31 32 -14 2 -14 1
9979 1 -39 -1 -5 -7 17 -28 35 3 -15 -1 -32 31 11 51 28 -2 41 24 41 -19 25 22 57 32 32 118 68 82 -9 -8 28 -22 33
10012 33 -2 -7 11 39 -25 43 50 19 -2 -24 -4 -21 -28 8 34 -23 28 48 8 38 4 -43 18 -16 29 22 37 -11 54 52 -56 72
10044 72 -12 -2 13 29 -7 -11 11 33 25 10 9 -11 -2 50 22 -28 13 9 -43 1 32 8 7 -22 -48 -51 20 25 -37 7 39 44 58 -10
10078 -10 53 -26 32 -13 -21 -20 -31 32 47 2 26 -11 1 -15 -41 -5 -4 -38 -14 34 13 14 9 -3 -41 -19 -45 -8 -10 -1 0 39 21 31
10112 31 11 30 26 -2 2 43 -18 0 38 47 40 -3 25 -15 -20 -11 -11 -32 17 -64 -1 18 -31 3 -18 -28 -43 -34 -22 -5 34 -23 -42 -50
10146 -50 -2 -50 -3 13 4 -7 -5 48 -1 25 16 17 47 7 -28 22 -16 -4 1 42 -5 1 -10 -11 29 -5 -43 -30 10 -34 -12 -39 33
10179 33 21 1 -56 -9 -54 3 -48 -25 -20 36 7 2 19 24 12 20 -10 41 8 48 -35 -7 27 2 2 -2 17 -57 13 44 -23 4 -44
10212 -44 -22 -24 -44 -5 -20 6 -12 -8 11 -33 -38 -31 -62 25 -50 34 25 -18 -36 36 -26 -22 -54 -25 -12 34 51 -14 76 -26 -8 -23
10244 -23 -16 17 -49 -31 -9 24 -56 -46 -13 28 -31 -48 -33 -29 5 26 -39 -5 26 -3 -12 -3 10 -24 -1 -32 -31 5 -8 -7 17 42 33
10277 33 20 42 -23 -7 14 -29 41 -13 -3 36 -27 -38 14 -9 -26 -29 30 -10 7 28 25 14 -24 -33 26 -7 24 53 16 5 25
10308 25 51 25 45 23 19 36 17 0 -14 18 11 -19 14 49 0 -25 16 23 -14 31 -76 5 -20 -50 -3 -9 0 -17 22 -16 -20 44
10340 44 -30 -17 20 2 5 23 -1 47 60 -5 2 -15 10 -5 43 12 35 35 12 -8 -18 -19 1 -9 -12 -34 -4 -2 -66 12 -1 6 -44
10373 -44 -62 13 -43 -28 22 15 -21 19 16 9 23 25 -21 50 33 -1 8 23 33 2 29 17 11 -3 -11 22 -10 -5 -48 34 5 15 5 -15
10407 -15 2 -18 11 4 -55 -29 -13 -7 -27 -9 -37 -11 7 -13 12 10 21 19 -15 35 28 56 19 20 18 -13 20 -2 -12 -46 5 -13 -4 -30
10441 -30 -25 -8 -26 -31 -34 -6 -6 9 -66 42 -8 21 31 -23 -24 -46 18 -47 -5 -22 -28 28 28 -2 7 -3 4 39 -11 -27 26 -21 -4 -12
10475 -12 -8 47 20 16 1 -19 -42 -32 -15 -38 -13 -36 -22 -13 -14 -14 -16 -23 -4 3 -18 31 -14 -4 13 9 25 -3 -6 -9 0 17 4 -13 -9 15
10511 15 -25 31 22 -31 -9 -38 -17 -19 -10 16 -28 -73 1 -13 1 -12 -26 -11 -71 -14 2 41 25 23 12 46 2 -5 -32 -67 14 3
10543 3 -14 9 -18 30 3 -7 23 -21 -41 -57 31 -13 23 -15 -22 -41 -29 23 -11 -25 -43 -15 -33 -4 -27 -11 9 8 0 6 -20 -1
10575 -1 -6 -16 -60 -7 -5 51 19 29 -1 13 49 8 29 -24 -22 43 -1 -7 16 -31 -21 -24 -18 -34 -6 -22 -26 -21 60 -44 -23 15 -23 -33
10609 -33 -4 -5 -30 11 2 -15 60 12 -26 25 6 13 -17 5 5 5 5 4 30 19 -7 -10 -30 2 -12 -14 -12 -42 15 -19 -5 9 -12 24 -2
10644 -2 -32 -11 14 25 -22 17 7 12 25 -16 15 -7 3 6 4 27 32 19 16 69 -11 -2 16 -11 25 -6 14 40 -26 69 -13 44 12
10677 12 60 -10 30 1 -31 39 -18 19 17 12 50 47 32 -25 20 21 17 4 12 40 45 6 -24 -17 19 -43 4 31 -2 9 -26 33 26 29 -11
10712 -11 5 4 1 5 26 12 11 34 23 -7 14 -17 12 -10 -28 24 -16 30 -1 1 33 52 13 -2 28 7 4 -11 44 35 49 -6 24
10745 24 15 60 23 -10 2 22 8 2 -10 -16 75 0 20 23 22 28 -10 -32 -33 13 -19 26 30 26 71 5 16 42 21 46 -31 -4 9 9 23
10780 23 23 12 24 39 -81 10 -21 3 -6 53 4 13 41 -30 -11 9 9 13 -32 -40 -37 41 55 40 27 41 -10 30 -35 6 27 26 40
10813 40 10 35 -38 30 7 42 10 13 -3 12 -6 6 19 21 10 18 -31 -5 11 -30 -33 -13 13 -50 -39 -31 7 18 -14 -13 8 -13 -9
10846 -9 13 -2 35 29 -7 -5 12 28 45 3 4 -29 -4 -2 1 12 3 14 -12 20 -25 -51 -29 -34 7 -12 -24 9 11 49 -13 -67 27 0
10880 0 -30 -13 -3 -4 -6 32 13 4 -37 6 -15 -61 6 0 -52 0 11 15 19 25 -86 -8 -36 4 -30 3 -10 14 -24 5 -13 -22 -24 13
10914 13 11 -3 -40 14 -36 -11 29 -12 35 -13 42 -4 31 17 10 -1 31 18 31 57 38 -38 31 -32 -38 -23 -38 -32 -10 37 -51 28
10946 28 -72 38 -18 -29 -15 -37 -49 -30 33 -39 -9 9 -40 33 -23 8 19 -12 0 -20 58 22 9 13 -1 23 -11 -42 -66
10975 -66 -26 -7 -12 -11 1 -12 17 -30 -22 16 -51 4 10 -11 -54 -35 32 -26 -21 -55 21 -40 32 -11 -14 -4 -8 -1 32 49 -30 -11 -8 -18
11009 -18 -22 -1 14 -38 35 -12 -18 16 -52 25 -32 19 -34 -2 -37 6 1 -3 13 -16 8 -20 -21 -47 -22 23 43 32 2 16 7 -8 -25
11042 -25 4 -48 -26 7 11 46 38 48 3 21 38 -16 -9 -1 -12 -26 44 3 11 14 -28 -19 -4 39 27 26 7 11 3 24 21 4 25 30 15 -7
11078 -7 -41 28 13 1 7 4 9 17 45 37 20 26 -15 44 5 -1 8 21 -25 -21 4 13 16 -18 14 0 -48 3 -28 59 2 18 9 -13 22 -20
11114 -20 -12 10 -24 -18 22 50 24 32 24 7 24 -6 33 3 41 -2 15 48 -12 44 -29 -15 -20 -8 -7 -14 -23 8 3 14 -12 2 -3 17 -23
11149 -23 -11 67 -31 51 38 36 0 23 15 63 69 -5 47 22 19 13 7 35 38 7 47 -18 -38 43 64 8 8 17 -10 3 -19 38 3 0 1
11184 1 8 -1 9 -14 32 51 3 11 23 37 26 46 -10 -57 41 24 -1 61 -13 -23 26 -10 4 -26 11 -56 -30 -22 1 20 -23 -4
11216 -4 16 -54 2 -49 -36 -2 -6 -30 14 24 -19 21 5 58 19 -2 20 67 33 -40 21 -35 55 -39 -20 -1 61 -9 24 -32 -56
11247 -56 39 -18 -33 -38 38 -28 -19 -24 -64 -37 -51 -42 -2 -6 -25 -19 49 -10 0 -34 27 25 -14 2 -37 25 -16 -14 38 -24 -9 11 -13 -42
11281 -42 18 3 -37 -13 -23 -17 -11 0 -23 -57 -9 -44 7 0 0 -37 -16 -26 6 -45 -51 -5 -26 2 -64 -14 2 4 10 20 72 -18 -27 25
11315 25 65 1 -14 6 -20 29 22 24 -17 -24 -31 17 -36 -46 -32 18 44 31 -56 -12 -11 -53 16 23 -34 -29 1 -24 21 9 26 27 30 -55
11349 -55 9 4 0 30 -17 16 -28 24 -17 -14 -36 23 7 -4 3 11 -9 -10 -27 -26 -34 -8 15 -28 -2 -17 2 -54 15 -51 -5 -10 -5 -12 -35
11384 -35 -21 12 1 3 -5 7 22 5 -19 -20 -21 0 28 -20 -20 8 6 -44 -29 25 11 -22 -18 4 -11 -36 14 -8 14 -7 7 -3 24
11417 24 -18 -16 -10 -15 6 2 4 24 -6 -11 97 -12 -29 -1 34 -42 28 1 23 -25 31 -32 19 21 12 37 -10 -6 35 12 -4 8 -7
11450 -7 38 36 25 21 -18 23 8 49 11 15 22 30 26 53 2 69 14 49 -4 -10 17 30 7 32 41 0 47 11 -56 22 4 -17 -24 62 -16
11485 -16 -29 17 19 -29 4 51 5 23 22 34 18 27 73 -10 40 55 -14 62 2 6 11 15 -14 54 79 23 45 2 24 11 7 61 32
11518 32 14 5 25 22 -33 -5 23 -26 28 -4 27 22 27 -17 -26 40 45 20 -36 -3 13 47 42 -60 28 31 -26 -11 9 22 11 44 -4
11551 -4 13 6 51 49 -15 47 -1 16 14 -53 4 -40 -2 -45 -15 -37 33 28 -16 -33 9 44 -18 9 4 33 29 5 20 -21 41 3 35
11584 35 23 5 9 29 2 23 37 28 -41 -15 -68 -25 -31 -36 16 -19 -9 -4 8 -13 -4 37 -19 23 -22 -10 44 16 -20 -19 -9 -44 28
11617 28 -43 -26 -14 -22 -14 -7 29 27 -33 -7 21 0 -22 -13 10 -32 34 20 1 -19 -47 -47 -6 -29 -41 -47 6 -5 9 8 -10 -2 -51 18
11651 18 -5 -44 10 28 -2 9 28 -20 -39 -6 2 -15 -21 25 7 -9 -29 -5 -25 15 4 -28 -22 24 30 -13 9 22 -37 6 -40 -11
11683 -11 -6 34 -20 -10 -29 -30 12 9 14 -14 -22 -21 -4 13 12 -16 6 4 35 16 3 13 44 -32 -8 24 12 0 1 -5 20 -38 8 -49 -4
11718 -4 -35 6 -24 -34 -6 -67 -44 42 -38 5 -32 1 -5 11 22 -8 15 43 34 -11 -40 -10 -34 -18 17 20 -10 -30 -21 -14 26 8 -37
11751 -37 18 -19 41 -26 -13 -17 -26 32 -58 3 -56 23 2 0 20 -45 19 -20 -30 -16 -87 -3 -23 -4 -59 -31 11 -15 9 -51 -5
11782 -5 -28 11 -5 42 52 -18 16 -6 7 10 -33 18 -8 -38 -12 -30 -7 -59 -5 7 7 9 17 -7 -7 -17 -27 -48 32 6 -24 19 0
11815 0 18 -8 8 2 86 3 60 -8 -8 14 -38 36 -4 -16 36 -25 5 6 -10 -37 7 13 -2 -16 11 16 28 27 50 -16 25 -4 14
11848 14 40 2 15 18 2 21 18 -24 -19 14 -10 -9 8 33 -23 4 27 14 5 -1 -35 -28 10 -14 8 42 24 23 -1 -9 24 31 14 -5 -33
11883 -33 15 -2 -6 25 29 -3 15 14 25 32 9 -4 21 17 -31 15 24 42 70 26 16 90 -34 6 -29 49 -23 40 34 -49 13 0 24
11916 24 4 -36 33 7 45 20 3 65 4 -23 -18 58 -37 0 -15 35 26 -29 43 -7 29 28 -17 26 5 -1 10 17 -20 14 -35 -37 -11
11949 -11 -10 -9 -52 -16 18 -16 5 25 10 18 6 1 -26 37 -7 11 -3 30 29 36 2 9 4 -14 -45 -32 -50 10 44 16 14 -31 0 37
11983 37 -3 35 -13 32 -22 -1 4 -22 4 50 25 -16 -1 18 20 15 12 9 29 -3 -27 46 -5 -21 29 14 17 -24 -24 19 -17 29 -46
12016 -46 17 -3 3 -32 4 19 4 -39 -28 -47 8 -19 -12 -54 20 48 -53 -28 -29 10 3 15 -21 -21 33 -21 -15 22 28 -9 6 -21 -17
12049 -17 5 -45 5 -46 11 30 28 11 -12 -8 -15 -17 27 -33 -3 11 -16 -3 -39 -36 -3 -25 0 -25 15 34 21 0 -25 -27 -27 -22 -35 3
12083 3 -3 31 -25 22 26 -34 25 -31 14 31 15 2 -9 9 -43 -18 23 -20 -36 -10 -27 -25 -31 -10 17 0 16 10 10 -36 -11 14 19 -2
12117 -2 13 59 -41 11 -11 -13 -37 9 -15 -20 24 -21 -39 -21 -24 13 17 9 -19 51 22 -9 -1 34 -42 -21 0 -35 6 28 -38 40 5
12150 5 -48 6 -21 26 -36 8 34 -17 -19 -20 -30 13 58 31 -20 -12 20 -30 19 18 13 0 -45 23 23 -52 34 29 -30 20 29 -23 -12 -12 -1
12185 -1 -23 -16 33 -21 -10 -10 -9 41 5 -1 -14 2 -24 -12 -36 -4 5 3 11 60 28 27 -14 24 3 6 26 24 -17 24 -12 12 -3 -15 -19 -31
12221 -31 -8 7 -12 -48 20 -32 -6 5 -1 23 0 16 -10 30 -14 30 28 15 -1 62 22 -6 17 12 16 -7 59 -16 -12 -3 1 -31 34
12254 34 -26 -8 9 7 49 21 -30 20 50 53 -30 2 -26 8 -15 -31 -4 4 45 6 20 -19 25 -21 33 -2 20 46 8 16 46 -8
12286 -8 -32 0 -9 7 7 32 3 62 -4 -16 39 -32 -51 -38 22 -20 -33 -22 -46 -14 10 -15 -23 -10 40 16 19 34 42 16 -12 12 -21
12319 -21 7 -44 13 10 -3 17 0 19 -3 -43 5 65 -37 2 -20 -34 6 -7 5 3 -63 -27 -25 18 30 21 17 -32 -18 3 -29 38
12351 38 42 18 -11 -5 -7 8 0 26 15 49 10 12 -42 12 -36 3 -2 19 65 -15 12 7 47 9 -35 16 12 5 -58 28 -9 -4 -31 -6 48
12386 48 -48 -3 30 -35 23 37 1 -51 9 -38 -1 37 -23 43 -86 -17 25 3 -7 -14 -11 -5 -12 -28 -8 3 -14 -6 -48 4 -56 -25
12418 -25 -4 5 -18 16 38 15 -4 -26 -3 -7 4 -15 39 -41 29 -24 -8 -18 -21 -65 -3 -8 -24 12 -5 -39 31 26 -34 -7 -4 -19 -36
12451 -36 -35 -55 -9 11 -34 -5 -58 -18 -23 -1 -31 -4 -20 8 -6 -29 -17 -53 -13 -6 12 45 -12 33 7 -49 9 -42 -30 -10 29
12482 29 18 -67 -16 5 -26 -46 -13 -5 -16 5 -2 -16 -9 -14 -24 -4 -2 11 -36 -25 13 -13 -40 -13 18 -5 8 7 30 -32 38 -7 -15
12515 -15 0 -46 -12 -34 -59 17 -11 -4 -58 40 41 16 -15 -22 8 -39 21 -20 -6 47 -20 1 30 28 11 8 -23 -74 -55 -9 -3 -39 -13
12548 -13 27 -8 27 -41 -16 -22 -35 8 -28 14 -42 45 -12 37 35 -28 -40 -42 18 21 52 6 1 4 6 -13 2 -12 33 -40 20 22 49 17
12582 17 31 22 7 53 5 35 -8 -10 28 11 25 -14 0 -16 8 -23 -4 -22 -13 31 31 10 9 17 37 17 1 15 -33 -1 -23 -4 -3
12615 -3 11 52 13 9 20 -2 -8 7 11 -8 7 25 -4 -8 -2 58 24 21 -25 11 12 -5 -25 -1 60 9 22 -3 11 44 -11 -1 -7 29
12649 29 -10 10 12 41 43 -22 7 -5 34 15 25 15 -27 -7 14 -31 33 23 62 15 2 11 34 28 -28 -2 -11 49 30 38 21 6 20
12682 20 -35 5 -7 -14 -9 19 43 41 47 31 4 19 35 53 14 18 16 26 57 26 14 19 40 21 31 -7 21 10 65 -37 -4 0 -3 46
12716 46 7 33 -46 -2 36 -10 -9 -26 -7 -7 -8 -20 -43 36 35 36 15 21 8 3 46 40 23 -7 7 2 -3 -2 20 -7 21 30 10 30 15 1
12752 1 13 37 36 -29 -13 -20 27 -19 -4 3 -67 -4 15 17 13 -24 -28 21 11 20 11 18 -7 66 26 39 11 -27 -10 36 -15 34 22 15 6 37
12788 37 19 -13 -5 -48 13 -6 31 -20 7 -20 -31 -19 15 -23 6 13 1 -14 46 -38 -19 36 8 19 30 2 -12 -5 -34 -19 17
12819 17 -17 30 -55 22 22 -15 -32 4 -3 -6 15 -43 -18 -20 -49 -19 14 -4 -25 -2 -15 -16 30 -55 -9 -61 12 3 15 29 18 17 6
12852 6 42 20 -26 -19 30 -48 4 -18 -16 -9 -10 5 29 21 -11 -30 -41 -15 -29 5 -5 -5 -44 -68 -7 -34 -16 -43 -8 -28 -6 -6 -34 -47
12886 -47 25 -24 9 -5 -29 -6 -23 -11 -23 5 -19 20 56 9 2 -35 2 -19 9 43 -46 -13 -1 -20 -39 -15 -24 -30 22 -38 30
12917 30 -11 -53 10 -9 23 -28 3 13 30 -1 -42 0 0 58 5 -52 27 -49 47 -22 -8 -17 -15 11 -18 -10 -2 -31 -48 30 15 4
12949 4 -3 29 4 -21 14 -19 22 88 -28 -14 15 -73 -26 -32 -1 -12 -11 -2 -21 -4 -29 -5 -27 -27 -13 -2 7 -22 26 22 5 -8 63
12982 63 8 3 -20 -11 -23 -30 -29 18 -18 -73 -5 -7 45 -38 -2 -27 14 55 34 14 -42 -9 -20 -1 83 -7 18 15 -6 25 27 -4 -12 65
13016 65 37 39 -12 -3 63 -26 19 42 -38 22 6 -19 33 13 -43 4 0 -7 -2 -20 19 -13 21 -3 42 10 -12 39 -7 37 0 -29
13048 -29 16 27 25 -2 35 15 -28 52 -5 20 -4 27 37 20 4 -13 8 5 23 17 25 20 11 3 24 -11 10 -18 -20 9 -26 30 5 8
13082 8 0 -2 49 -21 8 26 16 10 13 -8 30 -8 9 49 33 28 11 6 -7 9 -5 -22 8 -3 21 16 -39 13 -10 29 35 30 26 6 11 -26
13118 -26 25 -20 88 34 31 -30 8 -15 -11 -2 2 16 42 -7 -19 8 28 46 -46 -10 0 -15 -32 24 5 -12 2 -4 19 11 5 -7 -26
13151 -26 -10 3 -39 12 -15 -22 -10 8 27 -12 -15 -6 0 41 37 -19 -16 -4 -22 -24 -21 21 -4 -2 -32 -3 -47 25 -3 6 -15 -36 -46 -8 -1
13186 -1 43 -5 8 -15 -17 4 -4 40 23 38 25 -50 13 -46 -7 -17 52 0 -15 -16 9 -4 -58 3 -13 -29 9 49 11 -46 -2 21
13218 21 -43 -4 18 30 -37 -59 19 -3 0 -22 -38 14 12 -26 -8 20 18 -22 1 12 -2 17 10 -1 21 -9 27 -13 -3 42 -22 3
13250 3 10 -16 24 -29 56 1 29 -3 -21 -3 -11 1 22 -2 41 -14 -8 -31 8 10 0 2 -32 -1 -21 22 29 -4 -25 -7 9 3 -5 34
13284 34 -1 40 -6 4 -4 12 27 -36 -11 -40 -20 -7 6 18 -25 -26 29 -36 -1 3 -16 2 -33 2 29 -31 47 -22 -62 32 40 -24
13316 -24 8 15 39 19 15 25 15 9 -6 14 -7 -10 -13 25 7 -9 -3 5 3 20 -21 -6 1 -2 33 -10 0 42 -10 -25 0 27 -15 -41 -19
13351 -19 -11 12 -7 20 17 18 -25 -19 -18 11 14 17 -36 1 26 -4 21 7 14 -27 -16 37 53 11 13 2 -23 9 33 30 19 20 7 -13 35
13386 35 62 51 26 -27 32 33 -16 43 39 25 0 7 7 11 22 -15 -18 12 -14 -26 23 2 15 15 27 -18 -6 3 -2 -11 -8 38 52 -8 29
13421 29 7 -10 15 64 -17 9 -45 -16 -5 -41 52 52 -23 -3 -8 8 14 44 1 51 20 -43 30 19 18 -9 25 26 16 44 11 27
13453 27 39 47 15 23 -20 23 26 -12 4 -29 -14 40 67 50 -2 -23 -15 38 17 25 39 -18 69 -32 2 24 -39 -32 -39 26 2 1 13
13486 13 43 26 6 -2 23 -4 23 -30 -15 -18 -11 -8 -3 35 11 49 -10 22 -65 2 13 10 27 36 -1 13 -16 -2 27 -6 -43 32 15
13519 15 -4 16 -61 7 -9 -36 12 10 -20 13 0 -33 16 36 -33 9 -47 27 -20 19 17 -6 -7 -33 8 11 40 24 3 4 -47 -15
13551 -15 -49 -8 -13 -3 1 -16 -9 -17 -8 7 -40 14 -20 -36 -20 -11 7 -37 -32 3 -4 27 5 14 -19 -37 -28 -32 -11 6 -9 55 4 -55 -15
13586 -15 -24 14 10 -17 50 44 24 0 34 -22 -7 -20 -57 -17 -25 11 -25 -21 -37 -17 -41 -17 -23 -6 73 -28 2 -17 -7 -37 -13 13
13618 13 -18 -4 -18 -14 -27 -20 -17 -15 6 -4 34 -73 -20 -16 -16 29 -39 31 2 10 -16 -42 -10 0 -8 12 17 14 -37 14 14 -4 19 -15 25
13653 25 -18 -32 -41 16 8 -3 -29 -15 30 -19 33 -15 6 -50 17 6 9 -16 -43 18 29 6 -13 -15 -31 22 11 7 -10 -26 -28 -7 -14
13686 -14 5 0 -7 -31 -21 -3 5 -1 -7 -2 -19 -6 -27 7 6 -21 -4 -30 -30 -25 -1 2 -41 -33 27 -12 -33 7 -29 22 -31 -26 20 -29 -9 -4
13722 -4 43 -15 -11 -27 9 49 -41 17 -26 8 -23 -28 30 21 -9 -9 7 -15 -23 -16 -31 35 -4 -24 -41 -10 -24 -16 -7 -26 2 -10 23 4
13756 4 27 0 2 26 19 -21 -6 0 -18 -23 77 -32 11 -32 -18 -9 11 24 -68 -24 27 -7 13 31 -4 -24 20 -2 30 16 -3 0
13788 0 -13 10 1 -6 -38 42 -25 -9 -4 28 -17 -2 25 26 2 -18 9 43 17 -4 -24 -4 28 37 17 14 16 45 16 12 31 -30 17 20 32
13823 32 0 -23 25 14 22 38 4 16 8 31 -18 -31 32 -8 45 9 -15 -6 13 44 23 -8 1 6 -1 1 5 6 44 -19 -11 14 15 -3 26
13858 26 22 12 -3 -23 15 -5 -8 -7 -20 25 27 53 -32 13 28 6 19 0 20 20 14 27 -5 54 -10 38 24 39 29 39 -26 23 15
13891 15 32 0 12 52 -27 16 -18 53 25 48 -6 -21 34 -26 44 5 3 27 -14 37 14 43 23 -21 13 16 12 -25 53 10 -13
13922 -13 8 4 46 17 -47 15 -10 19 1 65 -30 0 25 12 4 -2 25 5 54 14 -5 -32 39 30 -22 1 45 22 13 10 5 4 7 -11
13956 -11 -11 14 23 38 13 -63 -41 -10 37 2 5 60 -5 33 -9 31 19 -4 30 -28 -8 8 6 -25 2 7 -28 -6 -51 27 -50 -47 -22
13989 -22 -22 -3 6 33 -59 -2 19 -22 55 12 -11 8 -6 -28 -15 29 19 -6 17 -10 6 -4 14 -20 35 -29 18 -6 -12 3 -19
14020 -19 14 -48 -7 31 7 -34 12 -22 4 -43 -36 4 1 9 -37 7 -27 3 -36 -25 22 8 1 3 30 15 -10 9 19 -8 -30 6
14052 6 -2 24 -12 -43 -20 -6 17 -23 24 2 1 -39 32 22 -12 23 39 34 36 11 -66 9 7 9 -39 34 -12 20 11 56 -2 -60 -22 -16
14086 -16 -4 -7 3 11 0 -20 1 8 -5 -7 -9 -15 18 22 9 -42 -31 -4 23 -7 9 -15 4 -6 39 -17 -18 -22 0 54 -14 16 19 -20 16
14121 16 28 44 8 36 24 1 31 12 -33 22 -15 18 -25 43 8 4 2 -2 -4 5 -9 0 26 -17 3 27 -17 -1 6 -9 -10 53 -7 0
14155 0 24 -22 10 -13 42 -12 39 9 22 27 -35 24 12 39 -55 30 34 38 -21 -27 12 2 -15 4 -21 -19 -4 7 -6 23 31 3 31
14188 31 -4 17 -9 10 51 5 43 -37 -11 48 22 16 23 32 43 0 51 1 -40 7 7 58 41 -18 -1 13 3 0 35 15 32 -3
14220 -3 59 3 5 7 17 14 37 -9 27 49 16 41 27 14 -11 21 -7 30 52 19 36 -3 42 -43 27 65 57 -10 -8 -5 -14 -15 -17 44 39
14255 39 -17 20 26 -24 -2 69 9 -5 -12 35 24 27 -5 -15 4 -10 -48 35 -10 0 -15 -17 14 65 22 5 8 -39 -20 1 -11 32
14287 32 6 3 1 26 37 -36 -8 4 34 -36 -5 -29 30 -32 42 -4 -32 44 -13 -19 1 -49 7 20 45 -6 -15 46 29 45 -2 59
14319 59 8 18 1 -3 -4 -8 30 -26 -8 -14 -25 10 28 -10 27 -33 17 -7 -12 -37 -27 -12 -38 7 -15 -25 -20 -13 33 9 8 25 -76
14352 -76 -9 -25 4 10 -3 -72 20 -65 1 -13 -49 40 -28 26 14 -18 -40 -32 22 -20 -25 -21 8 -33 -51 -31 -21 13 32 -11 25 41
14384 41 42 -2 17 20 -9 22 -24 5 -28 -17 37 6 -43 -12 -10 -12 -16 14 9 29 -1 17 55 -38 -6 -49 -2 -8 7 25 10 26 3
14417 3 11 -8 26 47 -2 1 -19 -24 -27 -33 18 2 -10 3 13 36 -29 6 -46 2 14 8 -4 -21 -8 0 24 7 8 -1 24 29 16 35 -39
14452 -39 23 40 12 20 -24 -29 -3 12 -4 -8 17 -50 -21 3 17 40 29 6 -35 3 -9 -36 23 -38 23 -18 45 19 8 -1 -8 32
14484 32 -32 -41 2 -19 22 19 29 -35 2 30 -1 7 -18 27 26 -11 -37 12 -34 -26 -17 -16 22 22 -1 -21 -18 48 18 -36 20 -23 -15 -5 40
14519 40 47 -34 65 -54 48 9 4 -3 -17 40 -17 21 0 -8 54 -19 1 -41 -21 30 11 51 54 31 12 40 37 65 1 42 82 -11
14551 -11 -4 -13 59 -2 9 71 44 21 23 14 39 18 36 -19 39 39 17 7 -31 16 30 48 31 38 -5 -9 28 45 35 2 13 34 15
14584 15 41 -10 12 4 15 11 61 13 -16 6 21 14 -3 27 19 32 -30 9 0 43 17 36 -14 41 25 18 46 13 8 6 39 54 31 17
14618 17 22 40 12 -5 38 -41 69 7 38 17 -15 28 13 36 44 20 -25 -5 20 4 -8 -8 37 1 -16 -3 19 9 -1 19 30
14649 30 7 45 -33 22 21 54 47 -19 -31 -17 25 39 34 -2 42 49 31 33 -5 20 28 22 27 -15 -26 57 15 20 1 -4 33 35 48 -15 -3
14684 -3 4 -1 18 57 -14 25 19 -23 37 -6 -6 -39 28 15 16 18 -12 3 29 9 10 1 44 21 13 -9 24 26 22 37 23 -1 5 -5 57 11
14720 11 22 -11 4 -6 -46 -1 -9 18 4 -11 -11 -70 5 -40 12 -8 19 42 43 0 -11 -16 -16 44 -31 -6 21 -27 -25 6 55 7 -13
14753 -13 22 1 -19 9 16 25 -16 -53 -38 16 -17 8 24 -11 -27 -22 -1 -22 -32 3 -18 33 8 15 35 -25 51 42 7 12 -10 -14 13
14786 13 2 -4 22 6 -48 11 21 37 -21 7 -14 -37 27 20 -15 -27 -23 -11 -4 36 17 -18 -54 -35 47 -46 -26 -44 -25 5 18 -8
14818 -8 -28 15 -40 31 21 -12 -13 -3 4 -17 45 7 -36 13 -18 -2 -54 16 -2 -19 -11 -10 21 -6 -37 17 16 -7 8 47 12 -15 -2
14851 -2 -24 12 -18 45 14 -43 5 -31 -21 49 24 -61 -29 -26 24 5 -15 0 0 13 -21 -4 -6 33 21 -2 -3 28 -31 35 -6 -11 -82
14884 -82 6 -3 -3 5 39 1 23 36 25 -8 32 25 -47 6 -44 -2 -9 22 -16 -2 2 8 19 -17 9 11 6 1 32 21 -39 -10 10 24 -12
14919 -12 -52 -50 -29 5 -9 33 4 -2 14 -17 20 38 32 8 10 14 -5 56 45 12 -14 10 -9 12 -8 -16 -21 41 -12 -11 24 -10 11 27
14953 27 11 -18 6 21 27 22 -12 -20 17 -11 8 0 36 3 22 -36 -16 15 -10 45 31 16 -1 4 45 26 -21 -16 15 40 15 10 -4
14986 -4 7 -32 17 -14 -24 -10 12 28 -26 17 -5 -26 37 -7 -24 -9 34 -25 -19 12 -43 31 18 49 -32 -42 21 45 18 -16 31
15017 31 -22 31 4 13 48 10 36 -32 5 41 13 57 2 11 -6 31 8 46 -27 4 -4 -2 32 2 -1 14 1 -43 20 5 16 24 -9
15050 -9 -13 -11 -36 4 12 20 -11 31 7 20 27 36 -41 8 -32 12 -29 -21 24 -29 30 26 -25 12 -3 28 26 14 -56 -20 22 25 11 18 7 -16
15086 -16 -21 45 -25 -41 -10 10 54 -43 21 17 27 30 8 7 12 -34 -2 -28 -3 4 -25 28 -28 -41 10 -31 18 -15 -4 44 7 20 7
15119 7 31 1 -25 38 31 -9 -1 -42 -38 -6 -10 -12 -12 2 20 15 -47 31 -31 9 14 30 8 -12 16 -2 56 -51 30 -42 -61 22 16 -11
15153 -11 11 -30 0 -25 -11 -42 -50 -5 16 22 -12 16 -11 -29 -20 6 11 -35 -32 -13 8 -7 -26 3 -30 23 16 -22 18 -7 -16 41 5
15186 5 10 27 25 -25 5 -9 -3 19 -49 7 -19 4 0 -23 -20 -6 17 -20 -5 -37 30 23 -14 -24 -39 -21 -27 49 37 1 34 -5 29 12
15220 12 34 16 7 -9 -4 -14 -2 3 -14 31 36 -38 57 5 -32 -15 31 -5 11 5 21 -1 -33 16 7 -12 -20 24 27 61 39 0 -28 9
15254 9 14 -5 16 36 9 -1 -19 37 -25 35 -14 -6 -35 25 13 -19 28 52 13 -2 -34 28 -22 8 -6 32 17 23 56 46 -6 -6
15286 -6 6 23 6 25 -25 -24 11 29 15 -2 43 1 -42 -10 0 37 -18 15 5 19 -26 47 -1 6 -2 23 9 36 3 22 10 52
15318 52 -4 -7 8 20 28 -29 22 16 -11 54 1 28 5 40 21 -1 19 -32 63 4 13 -35 52 -7 -44 29 52 -17 18 -21 -8 -8
15350 -8 40 40 -3 4 23 -14 -26 6 14 24 -14 7 57 -8 12 2 48 -12 3 -2 -32 -5 -14 36 -1 8 27 39 26 -7 -14 15 42 -13
15384 -13 -12 24 31 30 -4 36 3 -33 -15 25 -35 21 -18 -9 8 38 -41 35 64 -3 39 24 2 6 24 17 12 33 9 10 33 17 35 -43
15418 -43 48 46 53 -13 4 -28 11 12 -3 26 14 32 -15 -22 11 31 -11 23 -18 -27 14 21 31 3 24 -34 9 7 50 1 12 -5 -23
15451 -23 33 -5 58 4 11 -16 35 8 -14 -7 2 -11 9 4 50 -12 45 -3 -18 -7 -22 64 -10 5 8 53 44 40 -43 -7 13 46 -20
15484 -20 -6 5 -5 0 -28 37 -3 2 -26 -46 47 0 -12 -8 -21 2 -15 -24 8 35 25 -6 -12 14 -24 0 -29 -27 -18 -17 3 38 -12 -12
15518 -12 41 38 -6 -1 34 -33 -12 -69 44 -4 -6 -15 -37 9 7 -1 12 -18 -17 -15 35 15 -13 -28 11 12 -7 -52 -55 -34 54 -56 -9 -75
15552 -75 -9 -69 -4 0 -13 7 -4 42 -18 -34 -67 -12 -44 12 -15 1 -7 -13 26 -15 -20 -6 -56 -29 8 0 -18 9 -37 -5 4 -20 -2
15585 -2 18 37 7 31 -31 1 0 10 -53 40 18 -15 0 1 -38 -5 -7 -29 -22 19 -6 -3 18 31 -9 6 58 -50 7 -61 35 -25
15617 -25 5 30 -10 -8 20 1 -12 63 -11 -17 -2 -1 -23 -47 2 6 25 15 10 13 -47 18 10 -9 -25 -32 -17 -11 -27 -1 -6 4 -1 -21 -19 -34
15653 -34 27 -35 -9 -22 -5 -36 -3 1 -18 -23 -51 -25 -44 49 4 14 37 -3 4 23 -4 24 -19 -28 8 26 -26 5 18 34 38 -21
15685 -21 -9 -19 -9 47 -21 -9 38 -9 -8 -19 32 23 8 -5 -8 14 -17 31 -1 -34 0 36 4 -2 5 -7 -15 43 40 -16 -89 34 -3
15718 -3 -39 51 0 89 42 10 38 18 43 16 47 22 17 -3 25 26 -38 21 -18 25 49 35 -9 29 13 -8 27 32 4 25 38 21
15750 21 49 41 12 3 7 18 0 -6 -28 35 6 33 24 15 1 -8 29 -11 -17 28 -1 -33 57 4 -6 24 28 20 -10 14 41 20 -7 12 26
15785 26 16 -3 36 9 -11 34 -1 35 21 40 -24 -10 -27 16 14 2 19 -23 30 15 -10 27 40 -16 15 -26 25 -4 -15 12
15815 12 34 -19 32 -14 1 -11 -6 5 -36 -10 -20 8 -8 -16 3 -15 48 -12 24 33 9 52 -51 36 -12 42 7 -37 45 0 38
15846 38 -42 19 35 -34 -26 -13 -5 9 -10 59 21 -17 -47 -2 30 3 15 23 46 -3 23 -18 2 30 21 -14 -23 -4 19 -16 -3 16
15878 16 -8 1 -38 75 -31 2 -3 -15 19 -16 69 30 14 11 1 -22 -8 22 -15 6 -9 -62 -7 -11 2 3 12 -5 14 23 35 -7
15910 -7 -40 11 25 -39 32 -3 -1 -26 3 0 28 10 -4 45 -10 -9 3 25 -35 -29 60 -15 0 -56 -19 -14 -5 1 -35 25 -31 -34 8 34
15944 34 -11 9 0 9 -8 -54 -6 -8 -18 31 18 -31 -29 5 2 -32 36 69 0 23 15 9 10 8 34 5 4 45 6 -10 10 -8 32 25 -24
15979 -24 -2 -18 -4 27 -2 62 0 42 24 -35 25 -27 -55 -35 -30 -10 5 11 29 -26 -38 -10 0 -18 11 25 23 -12 70 38 -13
16010 -13 -40 -11 16 6 -3 31 11 -61 -23 -32 -2 -27 37 19 -12 25 -5 8 59 -5 -21 -15 -9 36 -5 46 27 32 -9 28 13 -18
16042 -18 17 1 23 40 3 5 -11 -30 42 -31 -21 -4 -13 24 19 24 25 43 8 22 10 16 20 16 27 11 0 5 -2 16 5 25 31 39 15 -2
16078 -2 3 7 48 -2 -13 -7 20 39 40 37 42 56 42 -2 14 32 6 -45 28 20 10 20 -38 0 14 46 29 -8 24 -13 18 21 15 12 5 39
16114 39 -4 -26 10 10 36 26 33 19 70 -14 -28 16 41 12 -17 23 -43 107 -6 27 -5 17 -7 74 1 55 -10 13 -49 -18
16144 -18 57 21 33 -24 31 36 0 2 -4 27 9 -1 71 15 75 -15 59 31 40 32 75 22 -17 1 -29 30 23 34 43 38 8 20 -17 19
16178 19 -3 -31 5 6 18 16 23 -35 17 25 -12 6 53 4 8 -30 12 14 36 37 20 -24 3 8 -13 40 16 50 -22 -7 6 38 46 26
16212 26 -42 33 34 12 32 -8 -12 17 28 -42 8 1 -2 -1 -39 59 18 -30 -36 23 -27 20 27 -38 8 -3 -34 5 -24 35 -9 -19 16
16245 16 6 6 1 -14 20 30 -36 4 -14 1 -8 33 -16 -30 -15 -16 34 -31 5 18 -22 2 8 -11 -42 -15 3 -30 -13 -32 -2 -28
16277 -28 -12 -6 -8 -28 8 20 19 20 -43 4 1 5 -2 2 -15 -46 7 -26 52 -11 -24 12 -13 -49 8 -34 7 -4 -4 -30 7 4 -16 -4 13
16312 13 -41 -5 -28 -1 -38 -61 18 -33 10 -11 -24 -37 14 -16 -38 35 -7 -46 3 -20 13 -40 -13 20 -2 -54 0 12 -16 2
16342 2 -72 -9 -21 -5 1 -15 -14 11 4 -26 6 -36 -5 58 -2 -3 -19 -9 22 -28 4 -4 -58 23 7 18 -44 -28 -18 27 24 -71 11
16375 11 5 21 33 16 37 -21 11 -23
16383b3
$$ Imaginary data points
##PAGE= N=2
##DATA TABLE= (X++(I..I)), XYDATA
0 0 0 0 0 0 0 0 0 0 0 0 0 0 0 0 0 0 0 0 0 0 0 0 0 0 0 0 0 0 0 0 0 0 0 0 0 0 0 0 0 0 0 0 0 0 0 0 0 0 0 0 0 0 0 0 0 -1 2 -2 4 -7 8 -9
62 -9 15 -14 22 -51 1018 221 448 685 709 754 658 648 591 616 656 744 885 1001 1014 906 738 497 293 5 -206
87 -206 -290 -348 -419 -324 -325 -321 -375 -574 -643 -788 -870 -858 -807 -700 -485 -228 7 156 238 279 272 268 270 292 417 537 730 834
115 834 1009 943 847 702 531 273 74 -50 -106 -139 -177 -194 -227 -276 -461 -717 -871 -992 -1136 -1117 -1026 -864 -660 -469
139 -469 -318 -246 -175 -190 -169 -143 -101 43 241 425 614 851 960 940 921 720 643 514 410 390 351 372 369 394 249
164 249 87 -48 -296 -469 -709 -760 -799 -700 -591 -487 -384 -362 -305 -403 -392 -399 -362 -257 -102 124 378 556 715 755
188 755 788 738 592 553 515 486 531 549 641 644 557 452 243 -58 -275 -479 -618 -686 -719 -641 -589 -598 -586 -618 -742 -827 -896
215 -896 -894 -886 -702 -487 -200 23 273 383 396 401 356 412 318 435 553 635 764 829 961 832 678 491 245 77
239 77 -100 -227 -261 -243 -185 -154 -221 -339 -418 -655 -759 -848 -892 -738 -652 -391 -232 -32 88 177 208 189 164 198 295 410
265 410 597 755 935 1017 985 924 799 596 356 247 164 98 41 77 58 -22 -145 -329 -529 -732 -937 -1037 -1054 -970
289 -970 -858 -730 -577 -458 -345 -341 -401 -369 -347 -242 -154 61 276 463 651 726 766 674 627 483 415 317 340 335 456
314 456 429 431 276 104 -42 -297 -460 -678 -726 -784 -666 -617 -498 -395 -439 -417 -477 -508 -589 -461 -302 -176 86 282
338 282 473 655 712 709 599 616 585 555 564 655 778 767 820 690 616 382 144 -59 -248 -373 -494 -452 -451 -410 -403 -489 -554
365 -554 -680 -773 -854 -857 -834 -714 -498 -312 -112 17 174 231 207 257 163 195 300 462 600 682 838 754 750 619 402
390 402 211 15 -76 -155 -167 -161 -180 -174 -246 -354 -486 -661 -789 -907 -951 -829 -681 -510 -337 -167 -127 -21 -8 -7 32
415 32 44 219 302 512 692 820 955 954 930 774 655 511 425 341 268 302 303 295 223 84 -141 -370 -530 -743 -809 -804
441 -804 -816 -699 -580 -476 -426 -411 -429 -410 -401 -399 -336 -209 27 210 375 536 544 605 517 536 453 337 326 345 419 402 465
468 465 448 295 160 -70 -287 -500 -573 -690 -703 -610 -602 -519 -564 -529 -566 -624 -651 -706 -602 -446 -316 -99 122 302 477
493 477 504 538 511 482 502 519 574 683 773 807 838 750 652 520 289 62 -78 -141 -217 -161 -259 -219 -196 -248 -406 -552 -706
520 -706 -789 -811 -750 -673 -449 -252 -87 5 81 122 80 127 124 192 309 449 555 751 829 800 788 613 442 309 79
545 79 22 -73 -9 -70 -79 -117 -195 -282 -505 -617 -789 -916 -868 -845 -729 -593 -468 -350 -229 -174 -203 -189 -135 -134 -27 216
571 216 369 619 794 795 814 816 696 575 504 445 376 422 465 423 427 361 187 5 -191 -382 -533 -592 -654 -574 -513 -440 -405
598 -405 -350 -372 -404 -497 -428 -397 -329 -194 7 240 442 531 555 606 530 453 412 399 392 446 516 582 580 474 423 261 -9 -172
626 -172 -410 -476 -561 -540 -557 -519 -444 -488 -535 -648 -751 -805 -793 -744 -597 -408 -238 -60 105 216 290 286 322 253 361 390
652 390 449 588 655 777 775 793 684 463 325 113 34 -61 -84 -88 -60 -84 -185 -198 -323 -467 -608 -704 -722 -682 -553 -382
678 -382 -239 -88 -1 86 62 78 50 107 203 298 487 611 691 872 822 758 679 508 352 203 144 89 152 65 69 -23 -99
705 -99 -247 -424 -584 -740 -829 -840 -794 -691 -567 -547 -440 -410 -397 -430 -392 -329 -314 -143 78 236 424 573 593 630 562
730 562 564 492 422 390 353 445 453 486 439 344 195 -25 -169 -358 -450 -524 -564 -515 -437 -394 -347 -384 -432 -458 -517 -524 -465 -381 -208
759 -208 -17 144 378 468 500 550 523 466 442 432 497 495 591 611 662 607 474 388 172 -43 -181 -298 -374 -355 -399 -396 -406
786 -406 -421 -466 -618 -699 -795 -798 -787 -639 -557 -350 -163 -62 48 88 71 170 144 192 290 400 508 587 613 662 646 554 393
813 393 294 126 40 -33 -23 -32 -69 -56 -172 -186 -383 -519 -657 -695 -669 -619 -536 -435 -294 -161 -82 -73 -59 -28 -1 31 136
840 136 242 423 602 742 770 779 812 735 554 476 375 305 295 363 247 258 171 30 -141 -295 -479 -552 -703 -673 -646
865 -646 -630 -487 -437 -422 -434 -409 -470 -455 -444 -331 -174 -1 158 260 410 472 543 495 427 406 338 343 402 504 418 445 405
892 405 297 240 21 -149 -327 -401 -456 -526 -449 -433 -389 -401 -415 -455 -499 -554 -563 -508 -407 -276 -101 105 245 337 392 431
918 431 433 399 376 449 478 599 649 686 702 666 589 459 335 156 -13 -60 -193 -124 -187 -227 -272 -337 -400 -531 -553 -649 -666
945 -666 -655 -567 -450 -346 -231 -113 -31 5 56 26 60 146 196 308 436 555 658 641 616 497 380 288 158 107 32
970 32 12 -18 -18 -22 -160 -244 -372 -548 -612 -712 -706 -643 -539 -462 -391 -298 -251 -218 -225 -156 -173 -98 13 138 302 456 640 674
998 674 678 652 634 545 456 436 424 406 402 399 436 327 165 62 -81 -281 -425 -507 -542 -522 -468 -375 -368 -350 -389 -413 -456 -416 -368
1027 -368 -365 -186 -79 73 240 302 424 389 408 412 356 376 346 406 463 444 444 409 309 197 80 -67 -228 -311 -415 -405
1053 -405 -380 -418 -466 -428 -489 -535 -580 -650 -680 -560 -536 -382 -224 -59 129 99 234 201 297 253 343 384 454 549 579 683
1079 683 676 623 575 421 334 216 118 69 -14 -7 -79 -54 -176 -199 -307 -426 -530 -594 -585 -660 -509 -405 -242 -190 -155 -63 -25
1106 -25 -32 13 78 103 199 320 443 545 560 607 614 480 468 314 293 187 105 115 124 41 -6 -85 -210 -351 -439 -574 -652
1133 -652 -663 -673 -653 -578 -453 -455 -408 -361 -371 -316 -319 -241 -156 14 210 289 427 478 565 542 544 487 407 385 355 393 401 395 436 327
1163 327 212 53 4 -205 -269 -327 -371 -339 -404 -349 -362 -339 -337 -370 -402 -423 -381 -331 -212 -65 52 183 271 359 386 405 419
1190 419 354 413 437 485 507 509 564 480 427 293 187 43 -78 -189 -243 -300 -294 -313 -352 -409 -497 -542 -601 -662 -678 -631 -501 -488
1218 -488 -343 -167 -125 -57 47 87 87 132 156 246 362 405 529 569 602 602 524 444 362 242 156 41 36 45 44 -36 -125 -146 -258
1247 -258 -388 -497 -503 -562 -529 -477 -373 -316 -252 -183 -73 -58 -63 -43 -10 99 187 332 412 520 581 601 602 567 499 408 429 331
1275 331 301 236 221 186 84 101 -71 -193 -269 -433 -514 -522 -580 -533 -510 -439 -474 -416 -404 -407 -381 -339 -300 -191 -102 31 142
1302 142 250 317 394 391 412 407 370 338 342 409 390 434 353 311 204 159 -83 -123 -220 -294 -326 -331 -342 -330 -295 -369 -390 -467 -400 -426
1332 -426 -405 -305 -258 -99 -10 152 220 242 362 323 337 362 418 461 510 487 576 559 527 530 395 297 165 115 5 -110
1358 -110 -149 -140 -193 -239 -276 -376 -443 -493 -581 -616 -640 -566 -474 -383 -274 -193 -120 -72 -41 1 11 101 146 216 317 386 516 501
1386 501 508 480 411 329 219 176 137 55 38 24 4 -82 -120 -246 -370 -433 -482 -500 -519 -550 -478 -353 -331 -278 -225 -187 -171 -136
1414 -136 -63 -12 116 219 298 449 479 556 556 535 542 479 445 379 381 320 318 366 259 183 32 -42 -191 -292 -364 -376 -416 -466
1442 -466 -378 -377 -379 -409 -394 -392 -413 -391 -343 -271 -125 -63 41 181 266 295 308 333 352 307 328 315 350 321 384 352 295 194 132
1471 132 2 -59 -154 -269 -308 -367 -406 -418 -380 -379 -423 -483 -526 -525 -489 -436 -380 -246 -149 -86 44 123 217 241 242 326 338 405 473
1500 473 482 518 559 559 532 496 355 323 186 168 60 32 -66 -100 -149 -197 -277 -319 -386 -441 -506 -568 -499 -415 -348 -264 -250 -176 -126
1529 -126 -87 -39 30 50 94 206 267 342 431 456 454 437 435 366 320 265 156 153 74 81 13 -66 -103 -242 -290 -435 -449 -511 -540 -498
1559 -498 -520 -456 -399 -360 -364 -290 -238 -250 -165 -68 8 54 171 300 341 426 519 452 421 418 456 413 396 358 337 345 259 207 124 -6
1589 -6 -42 -131 -197 -293 -318 -365 -353 -348 -334 -328 -390 -339 -335 -301 -287 -265 -146 -76 19 131 222 256 344 363 334 395 346 356 321 401 411
1620 411 375 396 296 234 99 -13 -62 -155 -229 -248 -278 -369 -371 -359 -395 -458 -454 -528 -461 -454 -476 -355 -256 -248 -93 -3 67 95 133
1649 133 222 231 286 319 417 444 443 500 472 452 424 320 311 173 139 74 22 -28 -76 -63 -189 -229 -324 -394 -395 -401 -401 -355 -340 -302 -258
1680 -258 -151 -106 -109 -70 -25 76 87 202 210 304 393 456 512 479 470 399 418 282 250 237 144 159 78 49 -63 -126 -178 -289
1708 -289 -365 -452 -444 -509 -510 -503 -440 -455 -386 -369 -309 -296 -241 -176 -167 -111 30 131 197 293 385 380 348 358 326 301 403 346 350 338 255
1739 255 251 175 108 30 -90 -169 -263 -316 -307 -294 -339 -313 -307 -322 -313 -321 -331 -283 -221 -162 -131 -26 26 161 212 277 293 342 373 390 383
1770 383 430 412 461 391 412 370 323 272 128 73 -39 -114 -172 -218 -243 -309 -312 -390 -375 -432 -508 -500 -459 -471 -387 -360 -277 -186 -137 -24
1800 -24 10 19 93 96 202 208 264 357 431 423 384 407 320 357 244 191 103 49 49 2 -42 -71 -155 -181 -249 -277 -415 -405 -418 -401 -350
1831 -350 -316 -233 -191 -161 -107 -60 -1 -9 33 154 195 256 329 441 479 543 488 425 419 411 328 284 276 250 154 149 86 12 -88 -155 -218
1862 -218 -301 -396 -412 -408 -400 -375 -393 -367 -349 -328 -322 -313 -265 -200 -151 -16 -9 151 198 238 288 304 315 276 333 296 310 302 290 285 245 187
1894 187 141 9 -61 -134 -188 -268 -274 -289 -332 -342 -314 -331 -379 -301 -352 -367 -280 -338 -181 -96 -28 76 120 257 211 287 272 254
1922 254 318 348 451 456 422 455 456 367 339 265 152 64 15 -73 -81 -111 -147 -165 -249 -238 -329 -361 -413 -452 -418 -418 -358 -289 -138 -123
1952 -123 -28 -37 -14 42 76 84 146 196 283 344 379 394 394 378 274 268 141 129 75 43 -19 -12 -34 -95 -144 -239 -325 -416 -403 -416 -460
1983 -460 -402 -383 -326 -255 -230 -190 -129 -113 -80 14 -5 67 194 253 368 386 459 456 472 389 341 294 282 283 265 263 207 225 148 42
2013 42 -75 -100 -229 -247 -368 -359 -356 -302 -347 -313 -273 -237 -271 -312 -267 -223 -181 -74 -10 90 185 222 266 281 277 286 295 220 249 290
2043 290 284 330 301 224 140 79 5 -120 -175 -242 -278 -320 -293 -333 -363 -320 -389 -453 -403 -439 -407 -356 -314 -147 -96 -27 77 84 163
2072 163 175 167 201 255 288 322 411 413 435 482 388 354 278 164 142 43 -7 -51 -69 -107 -76 -145 -238 -219 -354 -393 -351 -347 -365 -325
2102 -325 -257 -176 -104 -54 -67 20 40 35 61 102 177 274 305 386 431 395 428 310 258 192 170 117 87 38 58 22 -19 -95 -213
2131 -213 -245 -308 -417 -431 -444 -426 -402 -349 -291 -314 -275 -222 -174 -188 -139 -86 -12 83 175 240 280 354 385 400 339 312 268 319 280
2160 280 254 301 264 204 213 57 14 -95 -183 -201 -274 -269 -306 -255 -288 -226 -244 -229 -262 -280 -297 -250 -192 -77 4 81 166 234 234 286
2190 286 266 231 223 266 279 290 349 360 326 328 260 215 81 -46 -107 -153 -212 -246 -201 -260 -265 -267 -337 -358 -433 -487 -484 -404 -305 -295 -159
2221 -159 -134 -46 18 21 8 81 106 176 159 222 252 348 430 377 389 347 302 192 74 31 28 -41 12 -16 -33 -39 -165 -220 -252 -317
2251 -317 -357 -379 -319 -269 -218 -192 -131 -50 -34 13 -9 14 11 101 188 229 292 359 369 412 404 407 321 282 204 165 188 154 133 113 129
2282 129 10 -63 -166 -241 -339 -407 -413 -389 -331 -301 -243 -233 -285 -218 -201 -261 -265 -165 -165 -43 44 184 224 240 303 266 294 243 210
2311 210 225 261 218 237 280 227 196 77 28 -55 -151 -226 -248 -283 -270 -249 -218 -212 -206 -270 -256 -338 -320 -303 -222 -164 -70 47 108 198
2341 198 199 250 203 251 238 221 269 309 387 410 398 420 324 277 116 60 -34 -84 -140 -101 -155 -144 -165 -187 -213 -322 -401 -428 -424 -393
2371 -393 -363 -310 -210 -131 -71 -34 2 0 2 27 38 56 159 262 292 390 364 382 312 235 210 75 42 16 25 53 17 17 -42 -109
2401 -109 -181 -271 -303 -439 -436 -320 -325 -219 -235 -128 -97 -105 -114 -144 -64 -51 26 141 172 309 370 417 448 420 325 300 303 249 267
2430 267 230 248 247 199 233 93 29 -91 -161 -244 -340 -310 -352 -263 -274 -231 -198 -240 -222 -306 -293 -312 -243 -156 -30 33 110 175 250
2459 250 225 215 196 218 161 163 233 206 311 283 265 197 163 58 41 -145 -183 -250 -258 -304 -256 -202 -169 -254 -297 -287 -342 -350 -326 -292
2489 -292 -234 -124 -63 40 137 178 157 181 157 212 199 271 274 313 383 398 392 314 290 204 106 10 14 -35 -59 -19 -84 -28 -104 -228
2519 -228 -234 -304 -373 -378 -328 -335 -238 -161 -90 -37 -54 4 -27 -46 -59 -16 52 172 272 266 370 384 337 311 205 192 91 93 53 72
2549 72 88 57 46 -5 -156 -174 -288 -381 -396 -429 -368 -324 -272 -292 -201 -152 -155 -166 -169 -146 -174 -54 -3 68 154 304 317 315 326 324
2579 324 260 207 158 283 231 263 269 264 250 97 100 -36 -62 -157 -280 -237 -239 -206 -228 -182 -164 -268 -227 -251 -232 -296 -247 -227 -96
2608 -96 21 123 198 242 238 198 183 187 176 182 213 268 325 316 316 245 192 37 -15 -131 -124 -184 -203 -187 -187 -155 -209 -247 -258 -366 -355
2639 -355 -426 -405 -324 -280 -178 -79 -39 24 26 65 73 42 46 78 192 257 287 385 398 366 293 278 228 110 22 -16 1 -1 21 17 49
2670 49 -36 -74 -209 -290 -329 -372 -337 -315 -226 -144 -114 -33 -48 -29 -55 -46 -38 12 78 83 236 308 392 386 381 286 235 184 154 89 91 126
2702 126 127 127 150 56 33 -133 -198 -292 -365 -404 -362 -283 -200 -237 -205 -214 -197 -238 -304 -278 -239 -150 -120 37 115 235 234 277 236 207
2732 207 209 123 190 224 229 281 263 307 243 215 70 -1 -110 -247 -272 -253 -222 -171 -105 -146 -142 -246 -221 -314 -312 -314 -318 -159 -99 29
2762 29 131 174 168 231 168 184 221 144 243 191 288 325 385 391 291 225 147 77 -59 -103 -71 -115 -84 -35 -87 -187 -145 -257 -289
2791 -289 -325 -409 -421 -352 -285 -209 -162 -82 -5 39 1 -40 -52 -53 38 53 193 247 332 385 304 282 243 159 89 57 37 49 69 42
2821 42 53 29 -36 -153 -210 -309 -330 -326 -334 -295 -206 -194 -67 -67 -83 -75 -170 -83 -104 -65 24 124 243 302 374 363 380 319 263 224
2851 224 198 155 198 188 193 201 228 123 40 -62 -134 -219 -319 -324 -247 -242 -209 -192 -214 -201 -222 -275 -236 -319 -256 -207 -117 24 59 159
2881 159 213 239 208 152 166 119 162 146 198 303 316 327 220 196 132 2 -121 -161 -162 -151 -160 -131 -79 -121 -191 -215 -252 -318 -326
2910 -326 -340 -256 -247 -136 -21 122 94 192 128 112 118 117 122 176 252 322 347 398 409 334 263 218 85 14 -12 -37 -13 15 32 11
2940 11 -28 -165 -196 -291 -313 -380 -363 -345 -268 -154 -59 -29 -51 -23 -47 -61 -87 -80 -12 96 148 224 361 322 354 291 163 175
2968 175 87 74 85 81 70 79 121 19 2 -117 -221 -270 -363 -363 -391 -269 -233 -167 -81 -136 -89 -177 -187 -192 -175 -99 -42 53 163
2997 163 243 307 310 314 226 171 149 182 203 205 264 272 250 231 227 74 -23 -98 -195 -225 -248 -222 -200 -145 -111 -150 -158 -216 -245 -286 -328 -260
3029 -260 -214 -138 -13 8 188 171 165 142 48 110 77 87 167 227 286 289 295 253 209 99 -35 -107 -164 -146 -124 -118 -110 -68 -112 -183
3059 -183 -227 -314 -351 -353 -375 -303 -237 -151 -91 54 67 136 83 33 15 -5 109 131 250 287 354 374 384 355 264 195 95 40
3087 40 9 23 75 66 117 59 -6 -44 -154 -268 -279 -349 -323 -262 -209 -131 -68 -39 -21 -59 -136 -125 -95 -27 -3 85 193 203 284
3116 284 276 326 243 185 156 98 103 95 126 163 118 180 113 3 -70 -167 -250 -370 -307 -333 -275 -210 -178 -184 -193 -185 -256 -268 -249 -217 -175 -119
3148 -119 -24 116 210 236 236 229 164 122 109 106 184 217 298 298 323 206 216 83 3 -31 -152 -163 -178 -139 -70 -113 -78 -120 -166 -220
3178 -220 -240 -244 -270 -262 -184 -112 -4 71 143 148 143 76 111 49 100 95 154 323 295 330 304 331 185 119 41 9 -50 -98 -79 -69 -67
3209 -67 -102 -80 -177 -266 -324 -385 -361 -413 -332 -239 -217 -42 -53 -45 -24 -53 -71 -21 -91 1 54 210 262 284 375 327 266 175 151 81
3239 81 88 98 89 56 26 111 64 -12 -110 -156 -195 -305 -318 -263 -194 -117 -115 -37 -61 -62 -74 -122 -99 -116 -80 -47 70 159 248 287 275
3270 275 264 190 160 153 99 91 156 216 209 266 222 176 63 -38 -105 -275 -285 -261 -247 -178 -152 -112 -166 -179 -232 -291 -270 -342 -220
3299 -220 -249 -144 -2 86 165 162 161 119 89 37 11 124 138 163 240 268 293 263 179 93 38 -80 -173 -133 -162 -102 -73 -62 -96
3328 -96 -92 -165 -238 -222 -308 -280 -250 -207 -93 -36 66 75 67 114 55 68 17 111 95 178 219 361 398 321 289 262 137 76 -15 -20
3358 -20 -13 5 42 24 31 -50 -118 -235 -255 -340 -341 -315 -277 -196 -197 -149 -98 -70 -30 -117 -139 -155 -101 0 45 118 240 261 287 252 204
3389 204 175 118 26 85 50 74 150 123 168 67 22 -74 -103 -195 -300 -281 -265 -246 -187 -131 -99 -82 -48 -142 -181 -200 -156 -134 -133
3418 -133 25 125 234 204 261 272 177 186 159 103 132 182 199 265 330 256 133 110 10 -56 -135 -145 -230 -185 -160 -108 -86 -150
3446 -150 -82 -174 -246 -292 -257 -279 -248 -108 -48 60 100 116 139 54 33 -1 27 61 93 184 282 266 194 231 190 87 17 -70
3474 -70 -75 -141 -83 -97 -68 -23 -94 -86 -160 -212 -263 -350 -298 -266 -214 -154 -96 30 7 92 11 -5 -11 -36 61 114 185 214 274 351 317
3505 317 277 244 110 122 40 86 1 50 108 144 81 47 -27 -146 -193 -323 -284 -251 -214 -163 -168 -60 -56 -69 -117 -123 -107 -138 -93
3534 -93 -78 22 125 213 226 220 263 205 201 57 88 103 68 96 144 203 150 115 63 1 -97 -267 -266 -321 -232 -222 -155 -118 -101 -129
3564 -129 -171 -214 -270 -245 -231 -149 -132 22 84 185 210 205 150 146 94 63 137 93 127 252 284 308 210 201 96 44 -61 -94 -105
3593 -105 -209 -125 -41 -51 -75 -108 -132 -211 -270 -239 -291 -251 -188 -125 -24 58 107 140 72 33 31 14 57 68 145 183 230 303 276
3622 276 263 202 88 31 -77 -65 -40 -42 -33 -23 -54 -87 -96 -184 -270 -297 -349 -307 -249 -194 -155 -102 -33 -44 -33 -104 -93 -92 -76 -80 64
3653 64 139 211 272 296 253 222 178 118 54 64 69 62 155 152 145 140 49 -49 -130 -164 -200 -258 -254 -235 -98 -93 -63 -88 -68 -104 -133 -138 -185 -144
3687 -144 -72 25 134 191 228 212 230 178 125 62 84 99 97 158 153 177 173 111 42 -37 -97 -210 -220 -278 -243 -125 -136 -122 -124 -134
3717 -134 -149 -247 -237 -298 -195 -207 -136 -30 45 97 158 99 48 39 42 69 79 123 170 225 254 265 233 216 73 30 -40 -92 -96 -91
3747 -91 -73 -6 11 -55 -94 -111 -195 -245 -247 -332 -238 -176 -60 -25 19 99 88 72 58 -28 -67 22 103 207 239 268 319 292 252 151
3777 151 108 73 -24 24 -5 51 79 16 34 -70 -44 -170 -213 -264 -312 -309 -297 -118 -208 -86 -87 -104 -53 -71 -92 -110 -48 -82 17
3806 17 90 147 217 208 268 220 156 97 60 77 51 79 46 118 175 167 37 -12 -123 -143 -221 -164 -191 -133 -146 -98 -85 -60 -113 -127
3836 -127 -173 -186 -153 -136 -27 29 118 185 181 173 174 127 137 96 116 135 207 229 170 258 209 164 111 -20 24 -86 -121 -142 -119 -83
3866 -83 -90 -93 -90 -146 -176 -217 -303 -284 -243 -200 -143 -89 20 101 20 87 24 47 12 24 66 83 163 218 228 223 195 155 63 38 -19 -39
3898 -39 -51 -55 -10 -15 -22 -33 -60 -167 -211 -228 -283 -222 -229 -194 -107 -37 -8 23 68 -45 -12 17 -4 46 58 155 209 207 266 274 235 195
3930 195 122 107 70 55 4 112 78 106 49 15 -22 -77 -155 -273 -196 -196 -254 -165 -144 -114 -54 -77 -69 -182 -152 -169 -115 -72 18
3959 18 74 118 215 198 195 157 129 53 79 111 105 144 121 134 137 58 38 -53 -52 -134 -278 -216 -177 -122 -130 -95 -67 -115 -101 -143 -218 -206
3991 -206 -154 -164 -9 8 90 126 158 142 160 140 54 77 133 123 173 177 238 219 224 146 91 31 -20 -68 -69 -79 -78 -49 -29 -69 -72 -130
4023 -130 -227 -198 -246 -238 -233 -168 -109 -81 33 19 30 34 24 4 -39 -8 60 107 118 189 211 225 203 147 82 6 35 -4 -49 5 3
4054 3 -3 -14 -61 -36 -193 -219 -228 -316 -244 -209 -154 -152 -46 -65 -63 -15 -68 -59 -87 -52 -7 20 81 204 256 238 230 211 165 139 56 70
4086 70 33 111 116 76 142 75 45 15 -85 -149 -215 -209 -223 -158 -106 -115 -60 -88 -77 -140 -200 -198 -151 -118 -84 22 94 140 155 146 145 125
4118 125 145 67 56 111 60 107 147 128 158 133 85 -52 -52 -156 -175 -180 -149 -106 -84 -104 -151 -96 -180 -182 -225 -206 -188 -158 -68 -6
4148 -6 37 76 60 91 47 100 24 -1 97 75 166 235 167 214 191 168 132 50 20 -61 -29 -37 -13 -47 4 -50 -76 -86 -148 -174 -245
4179 -245 -238 -188 -148 -117 -16 -18 10 -3 2 -15 23 -10 15 98 128 143 187 223 206 186 154 100 67 3 30 -45 1 -4 3 -25 15 -65
4211 -65 -106 -189 -266 -254 -206 -214 -148 -184 -98 -85 -123 -76 -90 -93 -120 -88 -44 33 71 109 188 221 208 133 163 109 129 93 90 115 122 185
4243 185 157 92 71 -25 -77 -107 -120 -170 -155 -168 -98 -81 -79 -69 -91 -101 -171 -169 -158 -99 -81 29 74 96 122 157 170 148 98 98 79
4274 79 118 172 169 154 210 196 161 83 -9 -37 -75 -70 -100 -111 -110 -44 -89 -81 -127 -142 -173 -225 -203 -160 -150 -134 -25 39 20 53 49 -28
4306 -28 25 9 55 84 104 163 145 194 178 192 211 32 53 -9 27 -36 -40 20 -15 22 -14 -77 -113 -142 -158 -192 -178 -127 -124 -108 -50
4337 -50 -27 -23 14 -25 -13 11 -2 39 55 123 129 177 223 197 155 223 168 68 60 48 73 45 104 79 26 55 -17 -97 -111 -158 -198
4368 -198 -162 -136 -143 -78 -96 -66 -145 -132 -131 -135 -148 -111 -39 -23 3 79 159 139 115 61 97 128 69 108 69 146 114 117 81 55 78 -36
4400 -36 -88 -108 -146 -91 -111 -116 -127 -78 -79 -102 -99 -187 -169 -156 -141 -159 -66 23 61 71 62 141 67 112 75 85 97 86 118 133 226 147
4432 147 181 154 105 87 -16 -34 -29 -27 -59 -26 -20 -64 -83 -115 -78 -188 -218 -178 -122 -187 -119 -40 -17 -14 -15 66 5 20 -22 -24 28 42
4464 42 109 151 192 155 174 119 78 48 23 11 -28 -31 -26 30 -26 -52 -68 -102 -94 -145 -195 -191 -151 -188 -95 -98 -66 -83 -64 -91 -39 -41 -37 -55
4498 -55 41 89 173 178 174 170 208 186 88 151 102 102 140 64 74 91 84 90 -7 -21 -110 -126 -169 -142 -127 -142 -107 -97 -86 -148 -166 -88 -154
4531 -154 -124 -85 -52 -58 29 61 89 63 113 74 113 47 91 70 106 142 115 125 87 62 24 -34 -45 -53 -122 -73 -138 -92 -128 -85 -89
4562 -89 -106 -130 -182 -194 -203 -135 -160 -89 -54 -22 9 49 59 31 51 102 29 87 68 180 84 123 190 157 151 31 117 31 6 2 -38
4593 -38 -32 29 5 -24 -33 -58 -62 -183 -173 -177 -135 -115 -80 -106 -42 -19 19 -5 30 -2 46 17 11 64 103 149 161 145 105 137 91 79
4625 79 19 27 19 -34 36 67 1 -14 -99 -113 -102 -169 -163 -189 -193 -182 -121 -82 -89 -90 -94 -92 -95 -56 -93 -20 26 63 61 115 148 172 126 147 80
4660 80 98 79 68 124 119 111 62 139 80 21 9 -36 -85 -44 -103 -107 -120 -79 -71 -141 -69 -94 -126 -133 -80 -63 -47 -27 16 88 107 99 135
4693 135 112 103 48 88 69 141 135 131 143 87 140 73 81 -13 -36 -30 -84 -104 -100 -71 -132 -127 -118 -167 -151 -167 -176 -183 -142 -73 -113 -57 -45 -20 3
4728 3 51 8 14 22 17 76 162 137 181 150 170 117 83 89 61 51 31 39 17 -15 -18 -57 -16 4 -99 -98 -183 -145 -136 -81 -145 -74 -48 -42 -2
4763 -2 -36 33 3 48 21 7 130 120 122 102 141 121 116 140 38 82 25 50 49 64 61 11 20 -38 -80 -84 -82 -82 -110 -159 -130 -156 -120 -95
4797 -95 -64 -97 -57 -96 -106 -110 -57 -7 -7 19 65 112 91 111 82 87 79 65 107 130 94 107 97 73 87 -30 -31 -62 -55 -66 -66 -133 -117
4830 -117 -92 -127 -83 -156 -108 -133 -103 -140 -68 -44 -72 -17 39 68 30 95 107 125 50 73 106 101 69 154 121 179 168 117 79 32
4860 32 13 -3 -32 -16 -69 -22 -75 -71 -72 -100 -77 -170 -148 -148 -165 -121 -107 -10 -81 -26 -58 -40 6 -46 42 17 19 72 42 92 87 143 95
4893 95 117 90 68 40 22 28 -32 14 -3 -8 -52 -59 -78 -91 -112 -192 -152 -109 -122 -116 -87 -54 -45 -46 -17 -18 -25 14 65 72 77 127 129 149 148 135
4929 135 150 92 90 112 77 59 67 40 34 48 -3 -24 -84 -133 -104 -93 -104 -158 -83 -74 -97 -111 -92 -53 -129 -147 -69 -99 -11 -21 11 2
4961 2 51 102 65 114 37 106 75 61 102 114 112 72 59 47 47 -30 -54 -16 -38 -79 -109 -102 -76 -86 -115 -122 -66 -118 -106 -144 -141 -88 -66
4994 -66 7 -19 -1 26 19 77 97 71 76 117 109 114 161 126 137 138 81 95 66 13 13 -5 -10 20 -10 -28 -49 -68 -74 -86 -117 -90 -166 -122
5028 -122 -107 -104 -97 -41 -34 -35 11 -23 -9 55 37 35 20 84 86 95 75 110 104 106 113 38 1 53 41 35 -30 -22 4 -56 -69 -129 -78 -146 -129 -185
5064 -185 -157 -101 -81 -82 -81 -18 -32 -47 -43 -55 -35 31 50 74 131 95 111 101 146 135 126 84 86 80 74 78 61 90 39 32 -23 -18 -79 -78 -49
5099 -49 -133 -90 -111 -135 -77 -114 -76 -115 -68 -30 -43 -19 -35 -33 34 19 118 64 101 54 52 81 86 75 66 75 68 113 84 62 8 16 -25 -71
5133 -71 -71 -73 -82 -91 -88 -79 -120 -95 -134 -97 -167 -151 -100 -92 -67 -65 7 19 -28 56 60 36 64 63 32 54 102 136 171 66 143 140 42 58 35
5168 35 -37 -10 -23 -38 -25 -38 -43 -43 -64 -128 -109 -136 -128 -120 -49 -91 -88 -55 -54 0 10 -15 17 40 19 47 119 94 105 133 113 120 97 96
5202 96 71 51 22 51 31 -7 33 47 -44 -37 -107 -31 -133 -134 -167 -120 -130 -133 -95 -75 -55 -82 -86 -78 -73 -19 -106 -36 9 71 125 69 74
5235 74 30 120 63 69 54 72 71 25 107 83 29 52 12 10 -63 -76 -146 -137 -75 -89 -105 -55 -64 -59 -68 -60 -88 -69 -68 -25 -6 8 36 33 82
5270 82 86 57 51 99 84 83 117 125 93 127 98 68 60 43 49 -45 -71 -70 -106 -66 -50 -71 -76 -49 -118 -108 -101 -133 -99 -104 -77 -49 -12 3 6 44
5306 44 20 26 29 26 34 62 79 137 144 83 157 75 89 34 17 -1 2 18 21 -24 -51 -28 -39 -88 -92 -94 -139 -97 -118 -116 -142 -76 -79 -58 -5 16
5342 16 24 4 49 25 45 33 104 125 155 176 173 117 153 41 55 40 25 73 35 59 31 12 11 -25 -85 -85 -74 -130 -95 -91 -112 -124
5374 -124 -80 -39 -92 -65 -80 -46 -95 -49 3 -6 77 56 75 74 72 91 54 87 70 46 66 -6 72 65 49 68 16 50 -64 -60 -70 -113
5406 -113 -81 -109 -56 -51 -30 -106 -58 -78 -118 -87 -107 -112 -9 -7 29 30 17 61 105 64 80 78 47 97 54 125 140 136 154 135 72 15
5438 15 -9 -37 4 -79 -9 -41 -71 -51 -32 -91 -59 -91 -128 -121 -109 -33 -71 -51 -39 31 14 -1 59 22 30 -27 16 78 94 96 116 121
5470 121 79 111 63 22 4 11 -19 10 -29 -11 -17 -9 -113 -67 -79 -104 -143 -112 -131 -128 -110 -58 -62 -13 -93 -21 7 -21 -6 34 58 70
5502 70 148 90 153 129 115 59 57 27 33 55 57 28 65 94 25 -8 3 0 -106 -140 -117 -91 -106 -54 -59 -65 -47 -68 -37 -80 -61 -96 -44
5535 -44 7 29 16 31 93 29 65 50 67 73 51 38 42 96 90 33 75 93 52 -38 -91 -53 -102 -102 -108 -56 -75 -58 -67 -89 -74 -133 -167
5568 -167 -111 -66 -77 -54 -83 -24 6 22 46 66 7 34 36 50 80 82 56 113 92 63 85 106 0 12 -10 -28 6 -25 43 -18
5598 -18 -45 -51 -85 -109 -129 -162 -132 -83 -112 -27 -44 12 15 -30 34 -35 -7 -23 6 38 70 96 103 108 106 68 66 49 40 -12 -15 1 29 29 18
5633 18 3 -4 -61 -39 -106 -104 -113 -111 -140 -113 -50 -79 -48 -39 -49 -55 -59 -63 -73 -39 20 54 94 77 133 91 70 46 72 22 43 33 -1 96
5667 96 42 50 51 32 5 -16 -67 -108 -83 -93 -104 -84 -42 -20 -81 -58 -84 -103 -63 -69 -51 -69 22 66 52 98 0 79 79 42 44 1 97
5700 97 42 79 92 68 102 80 41 41 29 -42 -81 -51 -48 -71 -35 -26 -46 -103 -32 -111 -154 -175 -122 -122 -113 6 0 31 77 56 28 4 -23
5733 -23 13 37 54 56 84 117 165 101 92 44 29 20 -9 -6 -9 18 5 15 4 -22 -70 -44 -109 -113 -121 -79 -107 -65 -21 -36 25 9 -9 -27
5767 -27 24 -50 -6 5 74 88 82 127 135 107 91 54 68 49 56 69 12 40 37 36 3 11 -31 -105 -163 -127 -109 -117 -21 -82 -82 -30 -48 -63
5801 -63 -78 -39 -125 -56 -12 -25 34 78 85 85 125 97 41 62 44 35 -6 81 44 111 109 23 40 7 -45 -18 -84 -106 -90 -19 -66 -84
5833 -84 -31 -33 -84 -90 -70 -79 -94 -102 -12 -31 16 58 63 87 98 51 81 53 28 59 93 119 113 141 81 90 73 35 -37 -53 -77 -26 -96 -38
5867 -38 -43 -36 -16 -22 -123 -87 -56 -149 -88 -89 -39 -84 14 19 -22 31 -36 -13 -28 7 -11 65 89 87 106 95 117 92 44 1 64 10 16
5900 16 -25 15 43 13 1 -8 -66 -34 -131 -102 -121 -101 -51 -49 -101 9 -16 -27 -4 5 -32 -42 -12 10 31 88 123 125 131 84 52 104
5932 104 85 16 22 8 89 54 59 74 9 4 19 -32 -78 -103 -91 -142 -106 -61 -7 -18 -57 -35 -107 -125 -100 -82 -85 -24 34 38 69 135
5964 135 92 18 26 11 6 19 18 55 5 95 115 42 2 -6 -49 -79 -82 -81 -114 -82 -73 -32 7 -43 -102 -107 -46 -125 -104 -69 -42 -54 3 4
5998 4 35 46 41 34 -42 3 -4 41 44 86 141 122 103 71 45 33 -21 -7 -36 -1 -9 -32 -18 29 3 -39 -46 -87 -100 -133 -83 -83 -35 -32 9
6033 9 -17 30 12 -40 -12 -45 -19 7 -30 70 65 71 158 73 65 1 12 28 1 12 2 13 2 50 -21 0 -60 -83 -90 -96 -121 -89 -111
6066 -111 -92 -47 -40 -31 -56 -31 -33 -52 -27 -78 25 63 2 78 135 110 42 42 11 -8 -5 16 72 43 72 69 27 50 47 2 -20 -38 -106
6099 -106 -49 -64 7 -40 -15 -79 -55 -84 -94 -53 -64 -77 -82 -14 27 10 79 103 79 97 33 -5 22 19 63 107 89 107 103 86 44
6130 44 20 32 -30 -41 -44 -50 -68 -46 24 6 -33 -61 -100 -81 -118 -124 -80 -124 -6 -36 77 34 0 10 6 37 -23 21 20 84 93 107
6162 107 133 82 101 27 43 20 12 -7 11 1 42 28 -35 -27 -52 -49 -69 -103 -120 -113 -88 -34 -5 56 7 12 -10 -102 -11 -43 -60 83
6194 83 -2 44 86 152 106 156 86 49 5 50 5 48 0 65 70 44 2 -25 -44 -91 -66 -119 -95 -111 -15 -58 -44 -9 -29 -52 -85
6225 -85 -122 -89 -89 -60 -33 4 28 78 52 78 83 39 62 -2 -32 8 49 107 69 57 37 26 26 -30 -69 -85 -12 -69 -22 -25 -37 -14
6257 -14 -24 -29 -60 -80 -99 -74 -22 -78 -33 0 31 72 61 29 66 -1 27 -1 1 43 92 131 100 105 95 56 16 -14 -43 -60 -39 -33
6289 -33 -9 -25 -9 -24 -36 -117 -115 -113 -127 -103 -123 -48 -62 -30 21 14 -13 -30 3 -26 -80 -29 40 80 45 93 114 94 103 19 9 24
6321 24 30 -12 -14 50 46 47 -5 -39 -32 -85 -66 -92 -141 -89 -74 -34 -55 -11 -65 -22 -66 -38 -79 -116 -43 10 62 69 83 113 92 61 51
6354 51 33 23 28 6 3 32 89 100 42 22 21 -43 -59 -30 -143 -44 -87 -27 -7 -6 -33 -44 -48 -94 -100 -80 -130 -108 -40 28 19 58 89
6387 89 56 14 -12 51 -28 -13 35 51 52 73 90 69 47 18 -50 -27 -57 -68 -97 -45 -65 10 -8 -34 -61 -86 -97 -121 -130 -66 -71 13
6419 13 7 37 51 35 3 30 18 -39 32 19 17 79 111 136 80 104 80 -5 -6 -33 17 -7 14 25 33 38 -2 -2 -5 -99 -71 -162 -92 -102
6453 -102 -31 -23 2 12 -4 -2 -20 -46 -40 -69 -45 -3 55 89 82 97 129 83 50 32 -12 -34 -10 17 59 -18 34 39 -11 -43 -68 -75 -117
6486 -117 -91 -89 -74 -71 -28 13 -34 -26 -88 -99 -85 -83 9 -14 -7 48 112 49 82 63 62 83 54 14 39 43 93 142 129 52 72 27 -13
6519 -13 -5 -91 -110 -93 -10 -3 3 12 -14 -86 -1 -53 -56 -90 -91 -39 -21 4 12 53 78 21 37 -4 12 36 9 7 87 93 100 86 100 54 33
6554 33 13 -5 -94 -25 -55 20 19 4 15 -36 -43 -64 -70 -88 -102 -78 -59 7 -8 36 29 -33 56 44 38 0 11 66 63 99 77 113 70
6587 70 116 67 63 -18 -51 6 -3 43 14 38 2 1 -15 -95 -84 -74 -63 -75 -84 -32 14 35 6 6 -12 -8 -32 -58 -22 15 10 61 91 127
6621 127 75 96 46 53 10 -8 24 -23 59 46 49 93 26 24 -42 -86 -84 -56 -64 -83 -52 -43 6 -40 -40 -61 -83 -84 -99 -84 -60 -70 -15 10
6655 10 51 70 56 54 42 28 35 31 33 46 49 74 80 52 99 8 -3 -3 -35 -65 -61 -12 16 -23 -22 -39 6 -40 -41 -120 -107 -44 7 -3 12
6690 12 45 31 0 -45 20 15 -48 -10 -10 -3 60 94 55 48 71 34 -13 -24 -41 -5 -24 -17 19 -7 15 -27 -70 -26 -72 -153 -135 -105 -86
6723 -86 -57 -39 7 30 -1 -1 -19 11 -29 -68 -2 36 20 67 116 96 85 59 10 -23 44 -3 -16 0 34 28 46 1 3 -41 -38 -88
6755 -88 -84 -71 -71 -67 -3 -52 38 -4 -23 -36 -48 -43 -35 -11 -7 87 26 95 72 64 116 8 16 -12 24 18 -5 -6 32 67 54 54 -1 -30 -6
6790 -6 -45 -83 -94 -74 -59 -40 -17 -19 -39 -49 -60 -93 -123 -109 -72 -20 -14 45 83 53 48 92 -23 51 -49 -14 20 74 57 74 97
6821 97 21 32 15 -9 -39 -60 -24 -71 -23 -2 -8 15 26 -4 -39 -61 -56 -50 -93 -64 -26 5 65 84 17 15 -38 57 25 -18 34 24
6853 24 76 60 59 59 70 8 33 12 -28 8 -57 -22 -21 -7 24 25 41 -75 -64 -133 -54 -104 -85 -8 -18 -41 -20 20 1 -11 -46 -67
6885 -67 -8 -56 8 36 32 81 78 81 50 30 25 36 19 -11 12 52 9 35 71 56 1 -57 -63 -59 -60 -92 -45 -7 -9 -5 -52 -34 -64 -38 -60
6920 -60 -71 -54 30 6 76 74 74 42 126 40 32 41 36 23 41 65 13 83 83 99 39 -13 -8 -27 -40 -2 -25 -1 -12 -20 -37 -30 -33 -55 -59 -104
6956 -104 -57 -13 35 -11 77 47 14 70 -13 28 -8 36 57 28 9 58 87 85 74 46 -13 -18 21 18 -44 -5 4 -21 11 -42 13 -22
6988 -22 -65 -39 -52 -81 -54 -58 -54 -12 28 1 31 -20 -47 -18 -23 17 -28 48 77 79 111 78 100 37 49 37 7 22 -10 58 71 39
7020 39 6 0 24 -57 -34 -99 -75 -81 -108 -23 -12 28 -23 23 -38 -40 11 -64 16 -14 3 38 79 67 70 57 27 13 -6 19 41 -3
7052 -3 -29 36 38 62 25 51 6 -44 -85 -59 -78 -62 -24 -46 -23 -21 -28 -48 -67 -36 -91 -78 -49 -13 -23 39 15 56 87 21 67 1
7084 1 29 7 5 52 71 97 47 51 60 -13 -23 -11 -56 -46 -49 -54 -26 5 14 -41 -42 -72 -59 -97 -72 -77 -24 -28 -60 20 12 85 -18 8 -29
7119 -29 -21 -5 4 55 57 -3 48 63 60 15 -9 17 8 -10 -51 -36 -22 -13 32 -61 -29 -70 -62 -132 -79 -87 -111 -52 -91 6 13 -21 -43 4 -30
7154 -30 1 -8 6 19 11 58 28 75 71 25 17 -11 -22 1 29 12 45 56 67 79 21 -38 -47 -99 -60 -64 -76 -50 -39 -8 15 -19 -25 -60
7188 -60 -41 -64 -52 -50 -25 47 47 66 66 26 100 45 55 30 9 33 27 69 28 74 61 70 86 7 4 -44 -16 -57 -56 -20 -29 -2 -61 -3
7222 -3 -68 -34 -111 -55 -89 -48 3 -35 44 25 28 27 -19 26 -1 21 34 23 66 43 43 108 93 81 69 8 -26 -15 -24 -2 5 11 -15 16
7256 16 2 -21 8 -76 -57 -76 -62 -31 2 -7 10 -23 -6 7 -5 -35 -4 55 32 68 90 108 70 71 50 38 14 -20 60 13 20 3
7288 3 5 43 -15 3 19 -65 -22 -82 -73 -90 -63 -33 -18 24 -34 25 25 -33 -38 -34 -35 -72 -5 30 44 53 52 62 42 -3 5 -5 31 -10 54
7323 54 48 25 -21 21 12 -7 -26 -66 -36 -74 -75 -24 -46 -7 -26 4 -45 -22 -72 -82 -30 -35 9 37 20 34 15 50 39 60 52 15 42
7356 42 59 71 55 68 47 73 119 40 -5 -29 -38 6 -43 -74 -10 2 5 -17 -25 -40 -50 -28 -94 -73 -46 19 18 -3 68 25 -10 -39
$$ [...]
16383a7
##END NTUPLES=NMR FID
##END=
