##TITLE=1H_DE-80H_X3
 200.13MHz, d2o
 8 sc
 
 19ns.26.2.2025
##JCAMPDX= 6.0         $$ Bruker NMR JCAMP-DX V2.0
##DATA TYPE= NMR FID
##DATA CLASS= NTUPLES
##ORIGIN= UXNMR, Bruker Analytische Messtechnik GmbH
##OWNER= pz
$$ XWIN-NMR		Version 3.5
$$ Wed Jan 28 14:05:46 2026 Russian Standard Time (UT+4h)  Yarkov@DPX200
##.OBSERVE FREQUENCY= 200.1313
##.OBSERVE NUCLEUS= ^1H
##.DELAY= (6, 6)
##.ACQUISITION MODE= SIMULTANEOUS
##.ACQUISITION SCHEME= undefined
##.AVERAGES= 8
##.DIGITISER RES= 18
##SPECTROMETER/DATA SYSTEM= spect
##.PULSE SEQUENCE= zg30
##.SOLVENT NAME= D2O
##.SHIFT REFERENCE= (INTERNAL, D2O, 0, 14.3821)
##AUDIT TRAIL= $$ (NUMBER, WHEN, WHO, WHERE, WHAT)
$$ ##TITLE= Audit trail, XWIN-NMR		Version 3.5
$$ ##JCAMPDX= 5.01
$$ ##ORIGIN= Bruker BioSpin GmbH
$$ ##OWNER= Yarkov
$$ C:/Bruker/XWIN-NMR/data/yarkov2/nmr/H-C/1/audita.txt
$$ ##AUDIT TRAIL=  $$ (NUMBER, WHEN, WHO, WHERE, WHAT)
(   1,<2026-01-28 14:05:15.07 +0400>,<Yarkov>,<DPX200>,
      <created by zg, POWCHK disabled, PULCHK disabled
       configuration hash MD5:
       00 E9 B6 7A A2 85 ED C7 34 08 36 98 17 FE 4E 26
       data hash MD5: 16K
       EC BE 9F 44 AB C7 AB CB 47 72 1B 57 21 A4 0B 75>)
$$ ##END=
$$ 
$$ hash MD5
$$ D6 8F 14 BF 27 67 32 22 1E F7 1C 0C 05 B5 94 85
##$RELAX= 
##$RELAX= 
##$RELAX= 
##$RELAX= 
##$RELAX= 
##$RELAX= 
$$ Bruker specific parameters
$$ --------------------------
##$DU= <C:/Bruker/XWIN-NMR>
##$EXPNO= 1
##$NAME= <H-C>
##$PROCNO= 1
##$TYPE= <nmr>
##$USER= <yarkov2>
##$AMP= (0..31)
100 100 100 100 100 100 100 100 100 100 100 100 100 100 100 100 100 100 
100 100 100 100 100 100 100 100 100 100 100 100 100 100 
##$AQSEQ= 0
##$AQ_mod= 1
##$AUNM= <au_zg>
##$AUTOPOS= <>
##$BF1= 200.13
##$BF2= 200.13
##$BF3= 200.13
##$BF4= 200.13
##$BF5= 200.13
##$BF6= 200.13
##$BF7= 200.13
##$BF8= 200.13
##$BYTORDA= 1
##$CFDGTYP= 0
##$CFRGTYP= 5
##$CHEMSTR= <none>
##$CNST= (0..31)
1 1 145 1 1 1 1 1 1 1 1 1 1 1 1 1 1 1 1 1 1 1 1 1 1 1 1 1 1 1 1 1 
##$CPDPRG= <>
##$CPDPRG1= <>
##$CPDPRG2= <>
##$CPDPRG3= <>
##$CPDPRG4= <mlev>
##$CPDPRG5= <mlev>
##$CPDPRG6= <mlev>
##$CPDPRG7= <mlev>
##$CPDPRG8= <mlev>
##$CPDPRGB= <>
##$CPDPRGT= <>
##$D= (0..31)
0 0.7 0 0 0 0 0 0 0 0 0 0.03 0 0 0 0 0 0 0 0 0 0 0 0 0 0 0 0 0 0 0 0 
##$DATE= 1769594714
##$DBL= (0..7)
120 120 120 120 120 120 120 120 
##$DBP= (0..7)
150 150 150 150 150 150 150 150 
##$DBP07= 0
##$DBPNAM0= <>
##$DBPNAM1= <>
##$DBPNAM2= <>
##$DBPNAM3= <>
##$DBPNAM4= <>
##$DBPNAM5= <>
##$DBPNAM6= <>
##$DBPNAM7= <>
##$DBPOAL= (0..7)
0.5 0.5 0.5 0.5 0.5 0.5 0.5 0.5 
##$DBPOFFS= (0..7)
0 0 0 0 0 0 0 0 
##$DE= 6
##$DECBNUC= <off>
##$DECIM= 32
##$DECNUC= <off>
##$DECSTAT= 4
##$DIGMOD= 1
##$DIGTYP= 9
##$DL= (0..7)
0 120 120 120 120 120 120 120 
##$DP= (0..7)
150 150 150 150 150 150 150 150 
##$DP07= 0
##$DPNAME0= <>
##$DPNAME1= <>
##$DPNAME2= <>
##$DPNAME3= <>
##$DPNAME4= <>
##$DPNAME5= <>
##$DPNAME6= <>
##$DPNAME7= <>
##$DPOAL= (0..7)
0.5 0.5 0.5 0.5 0.5 0.5 0.5 0.5 
##$DPOFFS= (0..7)
0 0 0 0 0 0 0 0 
##$DQDMODE= 0
##$DR= 18
##$DS= 0
$$ [...]
##$SUBNAM2= <"">
##$SUBNAM3= <"">
##$SUBNAM4= <"">
##$SUBNAM5= <"">
##$SUBNAM6= <"">
##$SUBNAM7= <"">
##$SUBNAM8= <"">
##$SUBNAM9= <"">
##$SW= 18.0517328524113
##$SWIBOX= (0..15)
0 0 2 0 0 0 0 0 0 0 0 0 0 0 0 0 
##$SW_h= 3612.71676300578
##$TD= 16384
##$TD0= 1
##$TE= 0
##$TE2= 300
##$TE3= 300
##$TEG= 300
##$TL= (0..7)
0 120 120 120 120 120 120 120 
##$TP= (0..7)
150 150 150 150 150 150 150 150 
##$TP07= 0
##$TPNAME0= <>
##$TPNAME1= <>
##$TPNAME2= <>
##$TPNAME3= <>
##$TPNAME4= <>
##$TPNAME5= <>
##$TPNAME6= <>
##$TPNAME7= <>
##$TPOAL= (0..7)
0.5 0.5 0.5 0.5 0.5 0.5 0.5 0.5 
##$TPOFFS= (0..7)
0 0 0 0 0 0 0 0 
##$TUNHIN= 0
##$TUNHOUT= 0
##$TUNXOUT= 0
##$USERA1= <user>
##$USERA2= <user>
##$USERA3= <user>
##$USERA4= <user>
##$USERA5= <user>
##$V9= 5
##$VALIST= <valist>
##$VCLIST= <CCCCCCCCCCCCCCC>
##$VD= 0
##$VDLIST= <DDDDDDDDDDDDDDD>
##$VPLIST= <PPPPPPPPPPPPPPP>
##$VTLIST= <TTTTTTTTTTTTTTT>
##$WBST= 1024
##$WBSW= 4
##$XGAIN= (0..3)
0 0 0 0 
##$XL= 0
##$YL= 0
##$YMAX_a= 149742
##$YMIN_a= -149705
##$ZGOPTNS= <>
##$ZL1= 120
##$ZL2= 120
##$ZL3= 120
##$ZL4= 120
##$ABSF1= 10
##$ABSF2= 0
##$ABSG= 5
##$ABSL= 3
##$ALPHA= 0
##$AQORDER= 0
##$ASSFAC= 0
##$ASSFACI= 0
##$ASSFACX= 0
##$ASSWID= 0
##$AUNMP= <proc_1d>
##$AZFE= 0.1
##$AZFW= 0.1
##$BCFW= 1
##$BC_mod= 2
##$BYTORDP= 1
##$COROFFS= 0
##$CY= 83.5205535888672
##$DATMOD= 1
##$DC= 2
##$DFILT= <>
##$DTYPP= 0
##$F1P= 10.8118882576601
##$F2P= -7.23987719738617
##$FCOR= 0.5
##$FTSIZE= 0
##$FT_mod= 4
##$GAMMA= 1
##$GB= 0.15
##$INTBC= 1
##$INTSCL= 1
##$ISEN= 128
##$LB= 0.25
##$LEV0= 0
##$LPBIN= 0
##$MAXI= 10000
##$MC2= 0
##$MEAN= 0
##$ME_mod= 0
##$MI= 1.114404
##$NCOEF= 0
##$NC_proc= 0
##$NLEV= 6
##$NOISF1= 3.799351
##$NOISF2= 2.8
##$NSP= 1
##$NTH_PI= 0
##$NZP= 0
##$OFFSET= 14.38212
##$PC= 1
##$PHC0= -5301.097
##$PHC1= 7.62193
##$PH_mod= 1
##$PKNL= yes
##$PPARMOD= 0
##$PSCAL= 0
##$PSIGN= 0
##$REVERSE= no
##$SF= 200.129724274929
##$SI= 16384
##$SIGF1= 3
##$SIGF2= 2
##$SINO= 400
##$SIOLD= 16384
##$SREGLST= <1H.CDCl3>
##$SSB= 0
##$STSI= 0
##$STSR= 0
##$SW_p= 3205.1282051282
##$SYMM= 0
##$S_DEV= 0
##$TDeff= 0
##$TDoff= 0
##$TI= <>
##$TILT= no
##$TM1= 0
##$TM2= 0
##$TOPLEV= 0
##$USERP1= <user>
##$USERP2= <user>
##$USERP3= <user>
##$USERP4= <user>
##$USERP5= <user>
##$WDW= 1
##$XDIM= 8192
##$YMAX_p= 0
##$YMIN_p= 0
$$ End of Bruker specific parameters
$$ ---------------------------------
##NTUPLES= NMR FID
##VAR_NAME=  TIME,          FID/REAL,        FID/IMAG
##SYMBOL=    X,             R,               I
##VAR_TYPE=  INDEPENDENT,   DEPENDENT,       DEPENDENT
##VAR_FORM=  AFFN,          ASDF,            ASDF
##VAR_DIM=   8192,          8192,            8192
##UNITS=     SECONDS,       ARBITRARY UNITS, ARBITRARY UNITS
##FACTOR=    0.0002768,     1,               1
##FIRST=     0,             0,               0
##LAST=      2.2672688,     0,               0
##MIN=       0,             -149705,         0
##MAX=       2.2672688,     149742,          0
$$ Real data points
##PAGE= N=1
##DATA TABLE= (X++(R..R)), XYDATA
0@%%%%%%%%%%%%%%%%%%Mj2J6j6J6j6J9k7L2l2L9m7N2o0O9p7Q7j00J13j28J44j60
40h4J77j98K21k46K73l01L33l67M05m46M89n40N97o58P23p97Q83r78J086j209
60f37J352j524J730j984K302k708L251l986M868n843J31908m4839j19329P9614
74D4175J7927r6668j8485L9157l297L7747J1407p0239Q505Q8373k5869n1040L4051
87A5744k9965p7099N7946N6252n3055N2938J26981q2935j50118M5616O2873p0417
99d5239j3868P3970K0122j0763j2128m2981J8630P0080n2118q8509N5245N2187
111B4628n8126K3466R8021k3363n8406J7932m3621q3678N2195Q2680l0823q450
123g545N7060j3645m9543K366o050n925L8501j6575n4555N6578P7300m9313l4222
$$ y = [0, 0, 0, 0, 0, 0, 0, 0, 0, 0, 0, 0, 0, 0, 0, 0, 0, 0, 0, 4, -8, 8, -8, 8, -8, 11, -16, 16, -16, 23, -24, 28, -32, 37, -40, 47, -53, 60, -68, 76, -84, 93, -105, 116, -130, 143, -158, 175, -192, 213, -233, 256, -284, 313, -345, 378, -419, 464, -514, 572, -637, 715, -809, 921, -1063, 1239, -1469, 1782, -2204, 2664, -3179, 128729, 83890, -35439, 44175, 62102, -34566, -53051, -13894, -17191, 20556, 31963, -38276, -29771, 58602, 32733, -18307, 15744, -14221, -91320, -33374, 22878, -30177, 22761, 149742, 66807, -83311, -37695, 25178, -45239, -59107, 14863, 34985, 24222, 12094, -30887, -12257, 57823, 5705, -82804, -27559, 24628, -33498, -10032, 87989, 64626, 6220, 24152, -19469, -103147, -50952, 31728, 905, -7545, 49515, 35870, -13673, -11307, -17357, -23282, 15219, -1356, -55911, 667, 77967, 28654, -5568]
136e568N4975k6980r3801N372M2361l987L6599N4584k8537l3779J7409k5756m2870
149d9978L0424K6913j9190J8945K7089k5652L854L5701m1058n7756K2300Q868
161a9540l6748L4420O8238k42j8498Q713l5460m4430J7843J1234j2287L4093L5692
174D3028k5989j0929K2809k5484l5375J3546l401k5614K8231M3505j782R044K0975
187E2564l3668m4321L024m378j6094L5811M0088j0657m566J3266k6908l1529P307
200b0061k588j4204K3788K7617k171J3674K1752k2081l1374n934j6797j6321K6147
213a8553K8077P58J5685J5150k9803l2627L488k474j5775J7783K6953Q162J0356
226B7180R515j7263j5268m405k2883j9165J7785K0901N357J7932J5773j4847k0258
$$ y = [-5568, 49407, 22427, -71374, -66002, -23641, -27628, 8971, 63555, 35018, 1239, 18648, -7108, -49978, -19554, 7359, -11831, 7114, 34203, 8551, 12405, 48106, 7048, -50708, -28408, -19540, -56288, -21868, 46370, 46128, 27630, 36343, 883, -43547, -25704, -14470, -26757, 7336, 43028, 17039, 6110, 28919, 3435, -31940, -18394, -21795, -47409, -19178, 24327, 22545, 31589, 52564, 18896, -25425, -22401, -26779, -42873, -7062, 33026, 22369, 17803, 31069, 4161, -27368, -20061, -22649, -36853, -13065, 14552, 12381, 26055, 47807, 25726, -5648, -11582, -28379, -44700, -18553, 9524, 10282, 25967, 41117, 11314, -21313, -17825, -20299, -36074, -18291, 8662, 16824, 27180, 36695, 19432, 4164, -241, -23124, -42289, -24504, -3603, 1754, 19686, 35459, 20612, 354]
239C54o375j7761j3214J7809K2211N347J2649J5384r433j7979j3774j6317j0192
252c1291O518R463Q651K2627J5875j0250j2619o577j5987j5162N498J3380J2233
265B359J5997J2403m991j1532j1321j8612j3985K040P778J1425J7521J2730J947
278B3759n960q554j7754j2370p47O411R490J5105J3825J477o643j0665j6069j3604
292b2299m547L861J0691J4978J4310O532j221p615j4093j3701o419P34P980J2170
306A361J2635O591n41q735j3946j2199p551j116O877J3671J3509J0061K234n167
320A7684j0150j3097j0584l300L870R457J1193R781M118m337j0792j1633r944
333a7734k418K100R242J3244J1696N863j680q049j1570j1461q620k0P553J0495
$$ y = [354, -6021, -23782, -36996, -19187, 3024, 8371, 21020, 36404, 26971, 8992, -4782, -21099, -31291, -24773, -15310, -6659, 15968, 31843, 21593, 8974, 2397, -13590, -28752, -23254, -9874, 2359, 18356, 30759, 25768, 14236, 2915, -15697, -29682, -27642, -19864, -8439, 9082, 21812, 23759, 17799, 9245, -8509, -20879, -21626, -15215, -5725, 9380, 23205, 24682, 18039, 7374, -8695, -22299, -26846, -22985, -12294, 2684, 16994, 23526, 22305, 14690, 597, -13104, -19523, -18789, -10809, 1361, 13996, 20587, 20046, 11311, -2635, -14834, -22385, -23501, -16624, -2953, 10556, 20617, 22851, 17684, 7534, -5563, -16147, -19447, -15577, -6120, 5073, 14854, 18972, 14635, 3843, -7790, -17734, -20152, -18052, -8810, 4434, 16130, 21993, 20313, 12264, 694, -10767, -19387, -19407, -11854, -1359]
347a359R164P919O23o160r982r554q604j068P907J0484R158R093M841n931j2281
362D250r709r865m219K508P806J0060J2572M477o989n400n475j1627q291O552
376a3350Q418P158J0412P320l422o698p572j3428q965K564M888O140J3317R850
390A6632q85k067o495j6196q544N409K248K636J6167J1559n307m912l019j3470
404f244j0566J448k51K427J6041J0788o29L387J47j7712j2657J723l202N73J9112
419D385J1940l654J877j846j7637j0176L691m418j177J8289R750m886Q630P063
433B1831j6109j2345j406q881m158J6647J2514N41J0761J925k2635j2361M074
446i602p846k127J9730P145l074J3196M598k0884n179R293j6283j7255J6344J4972
$$ y = [-1359, 7805, 15724, 16347, 10187, 205, -9349, -17953, -19021, -11114, -630, 8528, 17621, 22462, 16531, 4250, -5459, -15324, -19543, -17035, -9229, 831, 13403, 17880, 10891, 5491, 16, -11611, -19902, -13350, -4932, 2226, 12638, 19958, 16536, 9838, 2266, -11162, -20127, -17563, -12675, -6535, 6782, 16632, 15747, 13680, 7185, -9011, -17555, -12146, -9898, -7262, 8905, 20464, 15157, 10245, 7226, -6244, -16810, -15362, -15613, -13186, 2855, 13643, 13014, 16401, 16548, -1164, -13821, -12098, -15300, -14727, 4385, 16325, 12671, 14548, 12702, -4935, -15111, -11420, -15838, -17015, 1274, 11024, 6138, 14768, 21831, 5722, -6623, -8029, -16910, -21068, -4421, 8093, 8634, 19395, 21320, -1315, -13676, -9602, -17448, -19575, 155, 7300, 4226, 17422, 22020, 1136, -4043, 5250, -11033, -28288, -11944, 3028]
460C028L5J1925P348j3778p876n495k1817p74K8899O715p489J6656P955k2171
474C161o527O448j6087p562J8256j968j0735K3797K0423j5986j1383R42j5616
487a2837j0330R336K948J1612L0398k822l1702K659J1936k6107j3693K4647O633
500B678j1376J3260R340r811Q206O541k7562j6394J4871J81k887K4541J3668q733
514A6523J011j2591l4031M539K9394j1889j3166L3473J4347k7706k564J6265j0658
527B947j0688J648j3027j10K8621O798j0780J4704L437l4321j4493J1007n180
540a9437P579L2281j667k1840J5029Q665l2131q069K4391m726j6860R893R335
553B443L365J6718k808k5955j59M833k6281k676L9139J2470j2541R821j138k8166
$$ y = [3028, 3063, 14988, 22336, 8558, 682, -4813, -26630, -27404, 1495, 8210, 721, 17377, 25332, 3161, -3366, 3082, -13005, -20567, -2311, -4279, -15014, 8783, 29206, 13220, 1837, 2779, -12837, -23167, -13831, -10883, 729, 31127, 28305, -3397, -738, 11198, -14909, -28602, -3955, 2678, -8698, 4562, 13902, 4091, 12297, 18838, -8724, -25118, -10247, -10066, -12953, 11588, 25256, 16523, 17534, 4943, -29088, -24549, 4845, -7044, -20210, 13263, 27610, -96, -2660, 13605, 2947, -7741, -6093, -19120, -19230, 9391, 16189, 5409, 20113, 23550, -10771, -25264, -14257, -19437, -11858, 20423, 18756, -3084, 11945, 20610, -11521, -19590, 4801, 75, -16785, -6892, 2443, 5808, 22526, 19718, -6237, -6396, -1563, -27844, -30520, 8619, 21089, 8548, 18369, 17231, -10935]
567a0935j709J3558j4335k960K5957n61j7371J3936J3011j2655m059k763k0982
580b1868M05K1951k464P31L0664J337l5760p514R900j4269j793K3392K054p597
594h31J3305m34j7840O584Q875j9464q164J3109j873J263K3769M227j6938J632
608G220l996k7823j350K6034K718l799J6729J094j8755J047L869j3700Q98J2009
622B195r235l535K0679M974j0054O760j411k4488n776J1895k857M550K3515K276
636A9488j5745J414j716j7410J163J3573n437j519J4420N83q161R123K077j8197
650f344m343M386q925K702K1704N156o378N380m445j9592k862Q248l551L258J5131
665I525j323p073P832L1j4319j122M384r221j371J3999M469N35R256l068j6503
$$ y = [-10935, -12644, 914, -13421, -16381, 9576, 9015, -8356, 5580, 18591, 5936, 1877, -886, -21868, -21463, 488, -1976, -1245, 29419, 30756, -5004, -12518, -2618, -16887, -18680, 4712, 6766, -831, 12474, 12040, -5800, 784, 9659, -9805, -17969, -4860, -6733, -5470, 18299, 22526, 5588, 7220, 3224, -24599, -25949, 85, 2803, -996, 15733, 16827, -1928, -881, 2988, -10712, -9814, 2195, -7040, -10575, 10104, 15078, 5024, 11784, 10373, -14115, -19891, -7996, -10853, -6303, 17212, 19488, 3743, 5157, 3441, -13969, -12806, 767, -4670, -6189, 8231, 8814, 653, 9776, 11853, -6344, -10687, -6301, -15226, -12524, 9180, 14336, 7958, 13338, 8893, -10699, -13561, -5313, -8864, -5606, 9525, 8202, 1129, 8961, 8992, -5327, -6449, -2065, -11286, -12657, 1342, 5811, 6346, 15602, 12534, -3969]
680c969l418J316q230L516J6248K536l310N586k405j1536n27J850q926J771J0717
695A219J128q93J0528J045j0237l981m030q175J750J0867K423K524Q469j346j1492
710b01k845N3o988Q43P705J190K403Q304k92o772j181l009r417j429O654K562
726b420M252Q704M26o321k214m377q056qN981J861L322P360R91m525j350l458
742A68o870j512J586J047M997P787K343k951j258m312q258j754K228J576M555
757f28O935K152j804q38m616o903k121Q66P07L976O596L331j26k12m507n757l999
774f948p16O21M048O558L195R74o12l554o067l886j188J87L759N299L646K157
790G473j12l026n330m133k106j71K617M941M483K589L31k712n036l488l028j524
$$ y = [-3969, -7387, -6071, -14301, -10785, 5463, 7999, 4689, 10275, 7870, -3666, -4193, -2343, -11269, -9498, 1219, 2347, 1454, 11982, 13027, 2790, -1191, -5221, -13396, -11646, -779, 1644, 4168, 12637, 11291, -201, -3046, -2993, -9981, -9138, -1433, -243, 2160, 10464, 10172, 3400, 2219, -790, -10207, -11636, -4982, -2420, 1832, 10536, 10962, 4641, 2427, -1950, -10006, -10014, -4033, -2172, 1150, 8510, 9501, 4976, 3626, 168, -6702, -8214, -6628, -5581, -584, 7203, 9546, 6595, 5337, 1025, -7233, -8987, -6759, -5183, -628, 6307, 8459, 6655, 5817, 1201, -5702, -7823, -6957, -6250, -2274, 4322, 7653, 7527, 7315, 2808, -2949, -6948, -7664, -7043, -2995, 3563, 6758, 7732, 7120, 3566, -2501, -6387, -7575, -7388, -3629, 1670, 5316, 7473, 7361, 4335, -995, -5128, -7234, -7405, -4788, 153, 4636, 7225, 7556, 4844, -192, -3680, -6708, -8232]
806h232K623N006L719L636Q67k061m151m580k856k085K194L497M615L475J968
821G635j727k760n507l514j092J305J891M479M393K339j033l098l373m847k091
836g000Q12K474L706L693K582J99k432m085l753l166j57L090L157M604K189J218
852G131j642l874l640m123k58J220K993M090L689P49j145k861m344l309j214R73
868e565K594M014M116J394j171j796l967m253j677P16J527L985M400J902p10j122
884D387l881m629j733K89R60L944M506J437m73l8l250m982j523j49P4K840M658
901B437K116J024Q95l953n221j565j009o37K793N909J904R86n72k435n179m12
917b919j337j997L366N085O32N83K716k213m044k339k182k886L878M569Q51K213
$$ y = [-8232, -5609, -603, 3116, 6752, 7619, 5558, 1407, -3173, -6029, -8114, -5920, -2423, 2192, 5667, 7635, 5908, 3148, -2359, -5873, -6965, -5660, -3769, 710, 5103, 7442, 6409, 3311, -62, -4909, -7000, -6188, -3714, -8, 3685, 6267, 6466, 4034, -51, -3804, -6970, -7127, -4037, -880, 3724, 5913, 7131, 5489, 1615, -2025, -6148, -6406, -5186, -2193, 1897, 5586, 6335, 5190, 2329, -2015, -5324, -6538, -5565, -2971, 1043, 5159, 6553, 5382, 3586, -381, -4634, -6311, -5595, -4068, -83, 4317, 6219, 5509, 4387, 506, -4123, -5856, -5567, -4607, -663, 3843, 5280, 4807, 4769, 1519, -3463, -4986, -5135, -5061, -2221, 2437, 4553, 5577, 6472, 2519, -2702, -4267, -5276, -5913, -3120, 2789, 4693, 5679, 5107, 2672, -2507, -2919, -4256, -6253, -2887, 2198, 2830, 3413, 6129, 3916, -128, -2467, -4649, -7535, -3657, 912, 1763, 3976]
933C976L523k904n563j733j170k182K603L644K78L005L589l389m269J180j139
948e51o169J201M104J350L522L749k639l513Q0m372n221L471N564j06J625L739
964E834j814k779K90l608m191L312K247k992L227P093q99l360J36l799n229K041
980d491J958p27N582O103m148m283J993k389m954J607K177j479L446M014k316
995B093p4M176m398p702J192J781j704L672O333p73m85P51o242n538M066J939
1011i13l133L214N501k553q56L212l220l155J111j897n048N003O859j508L38L905
1027F860m417o729M91k44j588N913M630l560pL897m022m618L079m59m257K581
1043b450L223j617L415N221m407n288J256k569m795M906N882o34J319K334m944
$$ y = [3976, 7499, 4595, -968, -2701, -3871, -6053, -3450, 194, 472, 3477, 7066, 3677, -592, 588, -551, -6720, -5519, -1415, -65, 3457, 7206, 4567, 1054, 1134, -3238, -8459, -4988, 576, 470, 2095, 5834, 4020, 1241, 1531, -2077, -6268, -2956, -709, -3701, -474, 6619, 5720, 2360, 2496, -1303, -6532, -4491, -2533, -3260, 2322, 8425, 4277, -6, 1987, -402, -5356, -3749, -1572, -3051, 395, 4409, 2093, 2019, 6195, 1797, -5905, -4713, -2932, -4636, -964, 5369, 4596, 4111, 4862, -1380, -6918, -2852, -913, -4046, -832, 4669, 2116, 1260, 4472, 1252, -1903, -792, -2689, -7737, -2734, 4125, 2617, 2955, 6860, 2443, -4286, -3795, -4039, -5627, 286, 4916, 1356, 1349, 5246, 1224, -3394, -315, -774, -5031, -2450, 773, -844, 2571, 7792, 3385, -1903, -647, -3216, -8011, -3105, 2777, 2143, 3462, 5796, 852]
1058H52l711K851j555l692M076K921l330J870N133k637k434J958l981n558L345
1073c892L719q98L695M999m578m420J365k626l153M071L290l692L535K923m104
1088B34p06L088l298m237K912P46k129L560O973l641j780R69n154l594L780J921
1104c56j222L544L161m474o27K705l251l165K505k18k575L108M871j948L34K086
1120D478m261m643J042L37j04L657L817k033p04P07l299k513K785k92k817L720
1136a23K845k295O99L133k831l358J128j963j721L647L538j317J797p1l333l018
1152c243J553q60r81L159K250j497P60K198k451k147J300j881k223K391K439m51
1168C16K717J366k921k672N18k194j225K927K202l23P77J414k233p75J8j537j597
$$ y = [852, -2859, -8, -1563, -5255, -1179, 1742, -1588, 282, 5415, 2778, 344, 2302, -1679, -7237, -3892, -173, -1071, 2624, 7623, 3045, -1375, -10, -2636, -5789, -1718, 1572, -2120, 1415, 4338, 234, -472, 2616, -682, -4919, -2007, -1261, -3390, 170, 7143, 3502, 1722, 2691, -2463, -6057, -2277, -356, -1578, 1966, 5127, 653, 26, 2731, -520, -3685, -1180, -1398, -3973, -865, 4006, 2058, 2392, 4478, 217, -4426, -3384, -3047, -3151, 506, 4323, 2290, 1586, 2293, -1006, -3519, -734, -1026, -3843, -123, 2722, 427, 1126, 4259, 1428, -1930, -802, -2765, -4486, -839, 2699, 1382, 3179, 3108, -225, -3243, -1690, -2550, -3531, -372, 1878, 381, 1141, 3339, 888, -1259, 41, -1840, -4063, -1672, 767, 316, 3033, 4399, 1478, -1194, -676, -2870, -4095, -1168, 1034, 711, 1488, 2902, 669, -106, -88, -1625, -3222]
1185c222J215J941o24K286K345j700j555l73j572k652K054J489J77K094J526k464
1201I65m82k41j690j646J449R67J14J828J476j037o43L0k074j902R23O08M27K026
1219A098J707q07q07l89k083j224P39O01K11J740J402m91J08n45j618j536n4J72
1237a776M44J668J676k89N0q52j061j344m61J41L66J594J794n70k14P48k134j540
1255a760m09M49J20J255J193J47O06j039p72q51l30j22k87K959k8M77N72n64j247
1274C69j333r57k50M38J085J034Q03N50P7j000j191p29p19J74P07J152P17Q20
1292A747j87p42o00j039j186L47O41J19J813N66j63l63j197k54q21r77R91J050
1310b55J116P42rn04l44j184q15j25J75J67R29R86L56K6r56j250q75j40J103R59
$$ y = [-3222, -2007, -66, -690, 1596, 3941, 2241, 686, 313, -1259, -3911, -1857, -368, -191, 1903, 3429, 965, 483, 242, -1448, -3094, -1645, -678, -564, 1264, 2740, 1703, 1060, 1090, -984, -2886, -1963, -1355, -928, 1098, 2805, 1998, 1191, 802, -1281, -2505, -1766, -1165, -954, 786, 2188, 1697, 1805, 1260, -358, -1894, -1948, -1776, -1332, 336, 2012, 1723, 1773, 921, -140, -1484, -1945, -1804, -1438, 156, 1950, 1380, 1166, 1914, -220, -1760, -2169, -1720, -1600, -345, 848, 995, 1601, 562, -210, -1061, -1391, -1513, -1800, 1159, 1131, 1608, 2180, 1616, 369, -964, -1921, -2171, -1733, -648, 386, 1189, 1739, 1816, 816, -375, -1104, -1823, -1649, -942, 210, 927, 1747, 1560, 818, 218, -821, -2007, -1660, -1019, -900, 913, 1479, 1316, 953, -244, -498, -1319, -2296, -1305, -255, 861, 1603, 1594, 1090, 746, -438, -1253, -1378, -1203, -1036, -107, 879, 1235, 1261, 305, -945, -1820, -1960, -857, 102]
1330A02l47J410J91N02j18j613n04j630J412n64R35Q36Q66n61K32j034j038J67
1348g56j90j67M41L90J035N70J15j297J04l38j371M97K84P72Q05N32o27J14j354
1367d41q70J86j596K369L81m93J814j037Q45o38j249n56P07j04J303P15k40m26
1385F70L00r15o59m31Q5m79J109M63K07O80j74j18j952Q12j203J222L4O20Q64
1404A135q9k59o83j094J2J37k19Q02O31k56O40L92l02o19l15p63M1L93M25M64
1424D73J3Q13N49j305j028n81O78l15J05K28J050Q12j943m67P79N31q62l41k83
1443a094J247N98K13o12J84l0j377k07M37M11j8Q42M78m15p17k20n79J21K98k41
1463f81O3P96N50mj0l72j075M88k56k6J3J123O8L91j14n09j242k4M44Q7P7N53
$$ y = [102, -245, 1165, 1356, 1858, 1740, 127, -377, -2007, -595, -1159, -224, 612, 1478, 917, 1149, 115, -923, -756, -946, -1113, -672, -282, 753, 1323, 1438, 141, 245, -93, -1464, -967, -683, 89, 894, 1426, 799, 913, -441, -1311, -1125, -2721, -352, 29, -464, 1350, 313, 1158, 520, -729, -1285, -578, -682, 621, 1336, 1096, 670, 970, 55, -604, -1035, -950, -1429, -320, 143, 350, 1030, 856, 738, -1214, -402, -1605, -383, -349, 271, 1135, 1046, 787, 104, -990, -978, -841, -1060, -258, 373, 117, 757, 1149, 847, 228, -87, -850, -809, -416, 9, 473, 486, 1299, 1848, 543, -485, -1066, -388, -703, -598, -370, 680, 1492, -451, -918, -139, 392, -470, -811, -1094, 153, 751, 964, 352, 536, 506, -871, -1078, -641, -230, -248, 594, 1072, 657, -60, -280, -859, -738, -440, -681, -618, 178, 728, 724, 714, 342, -733, -245, -501, -527, -514, 609, 677, 1068, 954, 445, -797, -821, -377, -290, -213, 340]
1485C40J00k26Q26l58r53j30M63j526M19J069M80L55K0j57j140l35N30j76l42
1504g41O53N78j20l4K41q59J55J06q64N4Q55K06j95P71K78j006k30k05j77n38
1524a072J098N8j62O46K9l47m03J87n31p1j99O84k01J269J31q33j013L05r63K16
1544a172J154o29M14M23R19p39p31L72l39ML55j068J393M35j60j11j61J90q90
1563c41n93L46J42R93p1J01k5p41J15m78k38N34N28k17K26K31l90J01O7m22p22
1584h54N79m72M74L10O77m06J50k85o03j91N24j44m5O52M6l26J00n7l29K1J05
1605g4m95K77Q22o80J80j4N85k96l57j44m57m50J960l58p54M09J77n72J02K28
1625H9j18l11L76o4J20L77l11j66k65M38r81J74O28L19j05K00J5n59k6K0j86K85
$$ y = [340, 440, 214, 1040, 682, -271, -401, 62, -1464, -1045, 24, 504, 859, 879, 722, -418, -753, -223, -399, -741, -88, 490, 370, 336, 577, -282, -127, -21, -885, -831, 24, 230, 35, 806, 1084, 78, -152, -357, -534, -1072, 26, 84, -78, 568, 597, 250, -153, 34, -497, -568, -767, -83, -284, 985, 1116, 283, -730, -425, -1388, -1172, -18, -647, -233, 190, 1109, 370, -361, 11, -328, -324, 31, -1037, 356, 791, 631, 520, 359, 549, -341, -934, -588, -446, 547, 476, 577, 552, -189, -74, -552, -790, -256, 272, 55, 281, 512, 122, 223, 290, -132, -854, -275, -747, -273, 37, 714, 308, 458, 173, -430, -621, -97, -241, -286, 366, 412, 86, 186, 129, -200, -179, -74, -569, -292, 530, -150, 30, 16, 601, 305, -52, -196, -653, -1103, 857, 499, -255, 154, 331, -241, -139, 89, -29, -340, 36, -28, 92, 469, 158, -8, -273, 165, -816, -642, -14, 305, 200, 400, 415, -144, -170, -150, -336, -51]
1647e1j8Q1m6J57J51l35K39j72n74j87O80K38J7l79K52q86J81J517j487K62K26
1668a34L32m77O53K78l72k56j76J46J0l90K24n88mJ45J066l68K5J96o07k25M07
1689a15j08J32M90n74L22l05M8L08O5j298Q29J85o17L91P5P05k58L7J50r29N01
1710C4Q3j48J91J07L8l20j6j52Q4J0L33j075J064L93m09m32l90O46n52K65M30
1731A84J28n7n0k35J70N0l97N12j92J84j60o25P61l37J87P9J23j92k04n3L75m14
1753a63J69K31l09K25m02M4m30M50M81K37j41r20K47K02K42j32k2l00L65l12J54
1774h4j24RM62K33l61j22L04r80J31M54k99J116j191L42K49j84J37l79L23p3k60
1795b97M5L06J18r2r3m27n32N75p38J146P27p33L56j26j30k18N54m83l30P61m7
$$ y = [-51, -69, 12, -34, 123, 274, -61, 178, 6, -568, -755, -75, 163, 180, -199, 53, -833, -652, 865, -622, -360, -134, 198, -279, 374, 652, 280, 24, -152, -6, 4, -386, -162, -750, -754, -609, 457, 89, 114, 310, -297, -522, -115, -223, -91, 399, -175, 147, -158, -110, 198, 263, -1035, -206, -21, -638, -247, -172, 533, 275, 312, 462, -467, 34, 117, -31, 160, 267, 305, -15, -31, -183, -99, -89, 244, -831, 233, 626, 217, -215, -605, 41, -511, -246, 184, 312, 255, 205, -30, 140, 190, -207, 305, 113, 297, 137, -488, 273, -64, 123, 202, 325, 133, -71, -124, 251, -163, 6, 237, -72, 153, -249, -205, -635, -185, 296, 533, 392, -528, -281, -79, 163, 31, 9, -291, 74, -238, -84, -208, -199, 263, 496, 135, 13, 317, -663, -532, -78, -377, 739, -452, -110, 139, -45, 92, -287, 36, -37, -297, -252, 54, 172, 80, -13, -440, -972, -397, -1135, 11, 738, 5, 361, 235, 105, -113, 441, -42, -372, 389, 342]
1816C42m55J65K65o73L98R3L63j033Q31m24J14n82J129J2q88J304q16o7L17p50
1836c55K20M44o28K0Q16j061L53J96J66Ln4J74O51o63K69n55r5P58l31j06N0P31
1858A003m26r12M44O33q81N53l24k34L6J4R03r04l76O20j043L31J06O04k91m30
1878e74J001k77j9n07O88J60n29l50J096j039P2p1M38M48o80l72P54j78j33l6
1898a08N50q53M42J64r2r50J664p76m59O53L32n57k57N73j48K75o12O44n45m46
1918e06rP90k39j76k40N84k66j76K30j14l1m5M01j14k11P00m94l62M40p52M13
1939a77K71K58k91j01j82N00n74L48k21Q4J51q6P9j65L87On09L08L36o52m14P10
1961F6j10QJ86k43j2O9O7l25K60j82N52K3M3k23o5J8k47Qn7L9J5O40l10K76Lq62
$$ y = [342, -113, 52, 317, -356, 42, 135, 498, -535, 296, -128, -14, -596, 533, 545, -343, 961, 145, 78, 395, -355, -135, 309, -319, -299, 517, -544, -191, 5, 171, 174, 120, 294, 945, 282, 551, -4, -99, 659, 328, 222, 272, 1003, 577, -335, 109, 742, -139, 414, 90, -144, -108, -94, 809, -95, -471, 149, -894, -563, -457, 147, -144, -574, 427, 150, 131, -376, 312, 472, -57, -407, 689, -350, -278, -349, 89, 537, -143, -515, 239, 61, -72, -108, 442, -411, 31, 195, 103, -847, 817, 41, -418, 235, 567, 10, -247, 326, 178, 453, -159, 485, -60, -506, -515, 275, 36, -140, -380, 204, -62, -238, -8, -122, -153, -198, 203, 89, -122, 578, 84, -278, 162, -590, -177, 94, 352, 61, -40, -222, 278, -296, 52, -169, -85, 66, -20, 59, -106, 281, 287, -222, 86, 422, -230, -644, 66, -44, -36, 150, -93, -105, -36, 31, -294, -34, -216, 336, 359, 402, 179, 114, 132, -115, -107, -164, -125, -110, 530, 220, 496, 499, -363]
1987c63M78m70j07N39m8N0j07L35k71j78J28r3m4J15P0Q0l9L4j75L24m65l18O43
2010A18l92P62j57k56N73o16k30P84o41j39l1K55n9J03P6j77J64k16J54j35J61
2031A01L5m6J01L11n66K34k83J02p7k48K61j2J15N1O8o4P1k50l0L1K6jJ42o5K24
2056B31j20J68k92n1J19j60J62j7J70j68j42J25p5qj45O6o3J37K75J5j42N3k31
2079i3L24l02k1m4O3J90J1nm6k5j19n6L31l10K49m07P53m77J54K47p21q4K24m7
2103b11J08N45l54P5k80lk0J27n9k2L00qk84l12Q76l79j81j8Q8k32J94L8M76l20
2127A44K60m71q3K66n3k47j40K63RP10q79L24Nj32L2n3j52J49L81k29j23P2O4
2150A17M95r25k44m6R3N12k68K68j41n27N63J69q5p6l75L17N06m82K43K1j89j68
$$ y = [-363, 115, -355, -462, 77, 29, 79, -28, 307, 36, -142, -14, -107, -151, -36, 34, 114, 75, 109, -66, 258, -207, -525, 118, -274, 488, 331, 75, 648, 32, -198, 586, -55, -194, -225, 30, -29, 74, 150, -27, 137, -79, 75, -60, 101, 136, 90, 191, 502, -64, 170, -113, -11, -88, -336, -75, -87, 28, 79, 147, 83, 154, -96, -126, -95, -69, -70, 72, 7, 231, 111, 279, -13, -64, 55, -105, 57, 40, 210, 42, -100, 25, -50, -58, -203, -137, -200, -63, 212, 227, 85, 138, -93, 231, -71, -92, -136, -73, 117, 128, 123, 77, 52, -67, -123, 208, -102, 147, -260, 493, 16, 170, 417, -304, -388, -164, -211, -103, 442, 88, 163, -117, -120, -140, -13, -72, -94, 206, 198, -86, -398, 478, 99, -82, -100, -12, -244, -50, -12, 464, 144, 404, -67, -150, 116, 63, -184, -324, -61, -52, 658, -221, 103, 108, -24, 8, -45, -197, -48, 333, 104, -19, 53, 117, 612, -313, -557, -603, -510, 2, -266, 2, -139, -666, -103, 66, -19, -95, -470, -153, 353, -129, 114, 135, -54, -222]
2172b22K41j76%L4M7r9J96P91r19n00K64J21J2L50N4N3p9K80k30o11J182r80N04
2195C13q60Q50K9p59R04o75K89J2J36p23L46L49j48J15oj21J9kq4l74N31J63J36
2218D40l29j23k04J60L20o68P69q2o66N09L62k43J96K97j056L69on55J154p44
2238a00J39N19r0j10j3J71n73j57L40K25o34R50q27O5M55n92r6NK83K85k96j80
2260b31N93l47q0J01j01Lj01K03nM2J72r1l0n6j71p6J5rN8K41l1n4j8o2n2k2k1
2287a30J37n82J65P29m41K83m7j01J94k27P0k9j93k24P60m18j31K1l23K21K37
2308b9J80j41o53O26N22o02oQ2l3Kl32L50j36N03k75k6K9K04J61o70M42N24q09
2331h7M93K55k45l53N39p36K5k43K74l89P61k49q5M66q39K88J15l51L74N90j79
$$ y = [-222, 19, -157, -157, -123, -76, -175, 21, 812, -107, -607, -343, -222, -210, 140, 194, 247, 168, 448, 218, -393, 789, -191, 313, -547, 303, 332, -427, 477, -198, 91, 103, 239, -484, -138, 211, 63, 178, 172, 51, 70, 68, -16, -390, 141, 304, 440, 111, -12, -216, -56, 264, -404, 365, 283, -383, 126, 488, 245, 441, 738, -318, 51, 45, -510, 644, -100, 39, 558, 468, 358, 345, 516, -57, -214, 126, 351, -283, 667, -160, -95, 360, -232, -328, -323, -40, 245, -51, -231, 362, 15, -65, 36, -65, -62, -163, 40, 35, 77, 249, 158, 128, 72, -99, -175, -160, -169, -111, 130, 99, 45, 27, -35, -87, -109, -130, 7, -575, -410, 319, -122, 161, 114, 13, 207, -20, 50, 21, -172, -396, 364, -54, -185, -164, -487, -266, -29, 151, 10, -643, -17, 505, -97, -103, -21, -54, -52, -384, -34, -170, 333, 58, 32, 61, 265, 426, -244, 198, 722, -87, 406, 661, 416, 63, 602, -134, -109, -352, -78, -467, 294, 45, -40, 426, -413, -125, -10, -361, 13, 603, 424]
2352D24n01J08R9J59o43J1l66J36K15M75l3J39N14m97o1k05J81j35J07K73j005
2373f05N66m18K80L91N84o35j7j54j61M39k92N11p28L04j81l86L57O7J66l82J35
2394a59j04O57k71J87n02L53J19p25k99M98J20Q5P9j74l42K61K36M5J3L88q24
2415c59N30l44n19R62r7N1j389J071Q33p95N35l61q38J911j521N43n24R55l03
2434C41m64M47j165N01R12J65p54n33R56J79l6r68N5j352K804l76j388J062N93
2453I79j244p36K491j695J21P9q23J331O1q57R01r57J833k50j091j113N10m4R79
2472D75N7J77k204P60L23N67J56QK04q22M22l0P43n6r97P74j56K21j179P72j43
2493G2o08R09l66J451j269Q56r94m03O45m77K97K89n13K69P62j094M74J165o95
$$ y = [424, -77, 31, 130, 289, -354, -343, -709, -573, -358, 117, 84, 223, 737, 240, 179, -26, 155, 20, 127, 400, -605, -39, -457, -177, 214, 798, 163, 146, -8, -169, 270, -22, 489, -239, 65, -116, -502, -145, -78, 88, -294, -159, -263, 394, 123, 310, -192, 161, 280, -445, -744, -246, -126, -41, 38, -136, -478, -217, 19, 64, 77, 465, -359, 171, -173, -692, 270, 173, 224, -1165, -94, 739, -56, 479, 118, -720, 1191, -330, 213, -311, 644, 341, -123, 324, -841, -340, 572, 737, -17, -550, 406, 585, 549, -419, -364, -1716, 1088, 712, -676, 386, 979, -265, -1001, 1490, -205, -84, -5, -828, 503, 564, -293, 608, -349, 1484, 1234, 143, -970, -460, -504, 475, 532, 709, -1495, -735, -412, 155, 311, 319, 523, -299, 123, 93, 836, 780, -217, 557, 401, 622, -557, 215, 72, -536, 373, 7, 1458, 189, 1045, 51, -352, 293, -184, 113, 402, -111, 158, 920, -174, 300, 1465, 770]
2512G70j176Q79p64J94J42j135K057j445O27m65J099n57L7j301P83J71M03J37
2530D56l89L85j366j29J227q0P7K94j037O24o4m70P12M18q28K99K11n00J57m28
2550d31J041n65J33r28K85O35Q1L79j38p70J78L0l6j99K64P77o98m8m38R22k48
2571B26m42N91p48K43n14J421j231J185m03q03J60J014j156K53L35l72o7M49L12
2590D53L74m4q98p3k02K05K73k85K96L63o84M40m2j7k55P9J59j44m63O81Q80j392
2612b96R4K52M59m32N80m37n48L07N10p57M82Lm73K79K0mj23N04N7n49N28j129
2634f73N34Q33j297L58N57j59o59N21j17K38m20N7J71j06L20J18q9j47Q6pj12
2655Gk9J50l52J27J76q7L33k31Q4r6j49K8j13J37J33o2J62o8k37RRP6r4N8R5o4
$$ y = [770, -406, 473, -291, -97, 45, -1090, 967, -478, 149, -316, 783, 226, 263, -1038, -255, -84, 319, 456, 67, 452, -914, -1043, 184, 104, 181, 475, -562, 62, -2, -472, 240, 658, -170, 129, 340, -160, -3, -431, 610, 45, 178, -750, -465, 170, 251, 630, 492, -278, -100, -70, -106, -305, -41, 736, 38, -10, -448, 474, 226, -216, 375, -373, -130, -644, 777, -454, 731, 328, -475, -315, 699, -457, -204, 131, -241, -308, 141, 453, 827, 783, -115, -188, -390, -185, 88, -197, 99, 462, -222, 218, 176, 159, -96, -17, 142, -2, -465, 216, 1096, -296, -202, 50, 509, 77, 657, 220, -328, -21, 489, -268, 214, 217, -256, 23, 43, 39, -84, 420, 477, -72, 456, -673, -139, 694, -603, -245, 312, 153, -506, 15, -102, 136, -284, -227, -56, -162, 158, 276, 187, 40, 126, 119, 7, -22, 128, -224, -97, 79, -8, 325, 94, 178, 82, -67, -39, -152, -15, 118, 56, 218, 150, -87, -78, -69, 7, -87, -29, 66, 2]
2681BN4P4j37N2Oj54p3J19J11j60K79P6j98Q8j12j54k3PK46n2o5K14m8P7j15k28
2707a14n10M41j94N04j79K39J0l57K36k86l8K51K05l00m2J77L83p17K36J05l6
2728A4J37n32K03n89J156p7j37k33N8J55j4q90L11n7O27KP2K01k72k76j65M57
2750A51k36M59q43P92k9k17J261j088r38L46L99L42o38J67K64J0O88p29l78j98
2770d15J104n86L62m76J16N74j047Q02r8n5p02J153j582J75J083m55R99k89j075
2789d12O06p8n08J95K112j846k32N43q3k90m57M76j93J024j838L95P60P9n55p
2809c09Q12q06N67o35M20K92L6K05Lm32m65P91l51o81J08N8Q50o2nm97K94m51
2831b58K82l25k05M46k62O34l74L18p21j03N60o51L62P84p60M84m3l62r6j31J66
$$ y = [2, 56, 130, -7, 45, 51, -103, -176, -57, 54, -106, 173, 249, 51, 139, 27, -127, -150, -143, 103, 51, -14, 200, 152, 229, 114, -114, -624, -183, -377, 127, -52, 187, 197, -160, 76, -210, -248, 3, 208, -92, -134, 43, 426, -291, -55, 50, 14, 151, -381, -178, -767, 389, 312, 175, -58, 0, 155, 141, -749, -438, -495, 132, 134, 206, 407, 135, -141, -306, 151, -85, 374, -469, 323, 294, 77, 1338, 250, -688, -342, 57, 399, -239, -72, 192, 202, 890, 161, -217, -415, 689, 103, 465, -11, 105, 679, -368, 434, 336, 281, -421, 732, -850, -675, 408, -47, 952, 663, -412, 194, 116, -392, -197, 1915, 69, -163, 380, 297, 7, -450, 26, -167, 857, -981, -586, 174, 253, -302, -309, 503, -303, 264, -371, 49, 341, 377, 582, 585, 153, -312, 479, 128, -553, -445, -387, 463, 401, 396, -101, 193, -258, 24, -301, -506, -60, -322, 312, -62, 256, -465, -568, -8, -659, -297, 487, -273, 211, 168, -194, -290, -421, -255]
2852b55M20k52J35L13L32o90K74n74J93k84L23L62N62j607J199M05j126P73m01
2871A02k75k72Q67r35J110k76m04j57O04j27p8J5Q17q80k59K14K92r96N95j61
2891b04Q9L01m80K73j6J32N4o6k35l26J077j046N59k04j93O91k97M3l23J34N96
2912E59m35L73r17M23m70P78k74K2k98n04R06k25k5l93N19J24M86j016k24O28
2932C7j49r1J82k50K20l42J093q62J62O3j69k40J20J83J41L55l41M6q45J299n81
2953C1P61o94l32J40L44J69R2r53L37r7O41l32r6O19n00l27k35P11n6q40M02r2
2975c07K1M00n9K14j87Q54p07l99P8j55o40J183n92lO88M82J32j611P04P8n44
2996c70P9l75J197j20o30J02l3k70l39K08L04K58L3r0K09J13l85J67j61J20j2
$$ y = [-255, 165, -87, 48, 361, 693, 3, 277, -297, -104, -388, -65, 297, 859, -748, 451, 856, -270, 503, 102, -173, -445, 422, -513, 597, 321, -83, -240, 364, 237, 159, 174, 991, 111, -148, 66, 358, -638, -43, -204, -115, 186, -294, -21, -37, 95, 149, 83, -152, -478, 599, -447, 112, -92, -285, 406, 109, 152, -171, -37, 559, 124, 497, -420, 3, -467, 311, 37, 59, -239, -743, 163, -62, -87, -480, 39, 163, 649, -367, -591, 37, -112, -203, -21, -271, -51, -393, 700, -162, 0, 63, -106, -346, -226, -43, 98, 453, 112, 158, -687, 612, 31, 792, 98, -234, -94, 250, 419, 511, -442, -105, -202, 439, 107, 11, 630, 130, -197, -432, 279, 223, -617, -215, -307, -286, 114, 55, 269, 82, 936, 229, -170, -92, -247, -887, 296, -296, -299, 389, 871, 1003, -608, 96, 174, -370, -291, -666, 531, 411, -219, -117, -150, -420, -759, -551, -247, 11, 44, -46, 163, 276, -109, 58, -103, 17, 5]
3017EM8J51r7K1O2o1l04M9M4pJ02K65j51j07J00j15P0J8o5k51M40m76m58R72m5
3042B10K78o74o3P13m52K17N8mm55O9j86O5L96r6O0j55L16j83J5k10J95j12l8
3065c6JQ8j01l1Q0j91L70N9m3o67N80o1j20r6K81N2K01n47L90j05k44K99L81j90
3089C50n3K48n75j88K93n9N88n28MR6M3K03q6L12o78j03O95o00j58m7L7N77j007
3112f36J326p81M26k10l98j38J32O99J63k83j28k87M4L39m49J80N45m33N46o60
3132co01L67J91N51J11q60M76m06M70M30m98L77l00m56Q9N07p58J184p21l49L96
3153A97Kj90O15q04N7Q13p52j77j72M07m8L21L64o92M20n89M2R90j60k20M33j357
3175e00Q70m52m21J332j362J020j212J291p79l64L46J83L71n65J278j197Q89l05
$$ y = [5, 53, 204, 107, 128, 190, 129, -175, -126, -82, -89, 13, 278, 127, 20, 120, 5, 75, 93, 28, -223, 217, -259, -717, 255, 210, 488, -186, -249, 464, 12, 229, 287, 283, -172, -103, -289, -224, 172, 76, 136, -19, 297, 114, 129, -81, 114, 2, -36, -35, 53, -48, -79, 1, -190, 180, 239, 196, -471, 109, 48, -72, -168, 113, 165, 366, -181, 209, 104, -140, 159, 540, 350, 297, 545, -30, -218, 75, 16, 604, 76, 80, 176, 219, 422, 336, 648, -30, -133, 562, -38, -196, -243, -206, 371, -636, 690, -91, 335, 125, -273, -411, -279, 420, 583, 300, 172, -115, -71, 268, -181, -1, 544, 111, 657, -3, -604, -237, -46, 505, 616, -244, 232, -174, 296, 726, 228, 605, 305, -151, -62, 445, -313, 871, 150, -199, 197, 199, 9, 624, -180, -123, 690, -62, -239, -411, -4, -52, 269, 633, -59, 361, -228, -186, 804, 644, 424, 857, -500, 370, -82, -503, 829, -533, 487, -725, 566, -213, -577, -231, -48, 323, -242, 1036, -161, 728, 423]
3193D23o39K00n57J095m2q88M96j07K9r8Q23p07j48k55K73K00L1m4j56K79m34
3214b26P17m45O57o82rk72K72k21K03j74R19j334J286r86K3M70J45K83j622O06
3234c90k88Q04o62J204j439R29l99N39m31O4K76j42M42j303J108l97j36J35K70
3253A84J323q26r65Q01q50q9O70k55K16K0n00M62J74l80M18O8n79J204j575Q73
3273C94j071K42k38J173P15k318J433L45j542P77m89P95m76P39p2k89p28J31N88
3292A09m46L31l34O68m59L98K71m31k89K58p36O55J98j30l08j11J043%j152J56
3312c09N20k01n66P60k52k20l0j95M11M32j112Q18l64M54n41J051p72Q2n49j3
3332e96K3J348j607J141n73J12M20L47J50r39K52Kn84M62L00j96L02J80j60o29
$$ y = [423, -216, -16, -573, 522, 480, -408, 88, -19, 10, -88, 735, 28, -120, -375, -102, 98, 129, 85, -71, 208, -226, 491, 46, 703, 21, 12, -260, 12, -209, -6, -180, 739, -595, 691, -295, -272, 198, 343, 626, -996, -390, -678, 126, -536, 668, -771, 158, -241, 298, -133, -69, 207, 65, 507, -796, 312, -85, -221, -86, 184, 1507, 681, -284, 517, -333, -422, 248, -7, 209, 229, -271, 191, 365, -15, 403, 471, -108, 1096, -479, 394, -677, -435, -673, 500, 1215, -1103, 330, 675, -867, -90, -579, 216, -260, 479, 407, 118, -610, -479, 109, -337, -6, -340, 328, -131, 267, 538, 107, -182, 76, -660, -5, 193, 63, -245, -356, 687, 687, -465, -309, 211, 10, -556, 204, -48, -268, -298, -493, -82, 350, -762, 56, -308, 146, -395, 656, -116, -34, -583, -596, -573, 775, -832, 309, -264, -152, 268, 615, 765, -174, 78, 80, -504, -42, 258, 62, 364, 544, 384, -245]
3352b45N31o33O92p35O57P72p45n19L45K97j151J282n13j79M90p30M08K37m89
3371b28K11K48pk85M24m40j4L93m23M47l34j06K58l69Q16j139P51KK24K3O8r2
3393D28j85k19MJ90Rm48P52n20K48m38j27L96j65M2N5p56N20j54J010j35j042
3414e35J376j650j99J510r32N33O39n69N74n28K8o44P84o03J48J51k01J31J2K
3434B7r2j58p0O9O56j77j43m74O80K43r17K14l26P70k68q7K72O5O6j41k00N22
3456E31p05L98m20R6j61N47l90J37k40N74J39j343N83J18J80M70o92J27K08k91
3476a34M49r5l58J31M52p77R38r27N4L07k65K5rK09m01M03o7K59k41k57M33K5
3498A54L23j277J097o37N7K79O19Km80j80L30N9m38J46j56K36o10Q96n88k34K48
$$ y = [-245, 286, -347, 345, -390, 267, 1039, 294, -225, 120, 417, -734, 548, 35, -144, 346, -384, 24, 261, -228, -17, 231, 224, -61, 363, -77, -91, 302, -121, 326, -8, -114, 144, -225, 591, -548, 203, 205, 429, 452, 520, 428, 243, 24, 28, 218, 227, -221, 531, 11, 259, -179, -306, 90, -75, -33, 22, -734, -214, -368, 642, 507, -535, 841, -809, -1008, 502, -430, 103, 742, 173, 747, 219, 247, -397, 387, -216, -68, 83, -118, 13, 25, 27, -65, -223, -293, -224, 432, 255, 112, -362, 318, 561, -356, -142, -468, 302, 34, -53, 219, 284, 350, 209, 9, 531, -174, 224, -196, -100, -261, 286, -104, 33, -207, 367, 506, -837, -254, -136, 44, 514, -178, -51, 157, -134, 315, 220, -138, -7, 445, -332, 606, -321, -267, 40, -225, -200, -209, 0, -401, 2, -65, 194, -47, -304, 129, 154, 477, -800, 297, -340, -283, -4, 615, 617, 137, -43, 287, 346, -92, 54, -102, 134, -476, 420, -168, -402, -154]
3519a54R02m16j46l48M93n41K42K3kL2L69l48q1j50Q8l67R42n26k30Q29j8j236
3541f43J9R08r69L21K73K65m60M20j25p1K79k52K21n33J71J4K15R99r67R75r78
3562H2l17j71M22K34k55J15o12O83m68M81L21o79k94P12M61j228J34Q35j12m47
3582a03l25M26j50R7N09l88q19R90n47R33m83l27K19P5o88P09n06J088k90k22
3602A98j36J64J05k76j96J76l94J179k70j189Q02L95O0j321O61K0O69q60p0j21
3622d04L65K12n19N1O63l19j20p41R65n00M72K02j028Q06k4K46q60m03J553m32
3642A85j92J14j16Q1n27J022o59M82p11P07K02p16m31M29L00L86n36n3M38n11
3662a06M60o41N42J84N5o27l56L6M09K68M24j118N31j66k84O50j031N92O38j255
$$ y = [-154, 748, 332, 186, -162, 331, -210, 32, 55, 53, 85, 454, 106, 25, -125, -37, -404, 538, 12, -218, 611, 593, -643, -624, 284, -685, -364, -91, 174, -286, 134, 9, -62, 217, -35, 186, -347, -176, -162, 53, 1052, 85, 1060, 82, -235, -406, 16, 250, -5, 110, -502, 181, -287, 194, 515, -164, -458, 254, 715, -513, -379, 456, 344, -103, -428, -2, -152, -55, 454, 66, -753, 237, -310, 623, 140, -187, 32, 107, -581, 128, -378, 710, 420, 198, 62, 226, 331, 55, -141, 35, -359, 820, 550, -639, 163, 558, 618, -703, -42, -22, 647, -213, -283, -404, -39, 173, -346, -295, 368, 49, -71, -812, 153, -347, 125, 327, -701, 105, 81, 327, -533, -936, 617, 185, -7, 107, -9, 72, -455, 567, -92, 390, -321, 386, 588, -128, -559, -130, 170, 556, 20, -33, 405, -106, 354, -287, 255, 439, 494, -133, -489, -453, -44, 224, 648, -470, 61, -105, -389, 261, -770, -178, 460, -795]
3682g95O19K42k53J03j56m3M56J63p39p10J427n33K34J99L84o34J56j25M93m3
3702D45n29n70M48L01J60j006R88J64o90r8N72o55r36J700q86Q90p78M03l63N39
3722I9o47K4M42n65K36J19P51j531N28J90o52M79N34j31r3K66j2j065J160K53
3742C85m61Q5q7L28L31r46n91J122j0J7l9r70O14K9M05j27o14N4J65M84k70m08
3764e04J131j196J06O4j34O41O12j158k63P27j95R2Q3m1J33k95J45K8J43k59o7
3785b07L28q6k80L39l74J50M39Q2o98k74J42L76Q2J77m24q9M33k64k83Q63n47
3806a15R3k2R9l12N13j46j38r8K6J08P1r8L18j26k21RK65j43R9J39k50j00J03
3829G4k40M2K82j2m9Jj63k76J61K46M41n17m45P62m14N1J97l2p4kk9q1J17m0n9
$$ y = [-795, -176, 66, -187, -84, -240, -283, 173, 336, -403, -1113, 314, -219, 15, 214, 598, -36, 120, -5, 488, 445, -84, -654, -206, 95, 255, -751, 237, 401, -289, -387, 185, -470, -1406, 294, -592, 298, -480, -77, -440, 99, -548, -524, -82, -647, -411, -292, 459, -1072, -544, -354, -1006, -527, 7, -124, -217, 49, 37, -1028, 132, 385, -76, 9, -78, 250, 581, -365, -956, 166, 156, 173, 134, -836, -222, -193, 212, 85, -529, -475, -310, 174, -96, -504, 627, -569, -463, -399, -533, 108, 720, -438, -701, 26, -169, -77, 6, -35, 98, -197, -52, -24, 119, -140, -207, 121, 35, -245, 94, -280, -130, 309, 391, -307, -581, -439, -63, 19, 196, -228, -317, 116, -148, -431, 432, -115, -22, -44, 55, -257, 256, 110, -28, -126, -100, 8, 79, -19, 299, 173, -48, -39, 226, 83, 182, 321, 71, -29, 74, -166, -124, 158, 146, 97, 98, -65, -341, -180, 66, 507, -10, -455, 307, -107, -56, 141, 109, 35, 33, 4, -77, 40, 0, -59]
3854e9L02k22q2p5J73l0k4R6n4O1n2j15O0K4j45J17L4M4l0m4Oj03R1O1j3R2n5
3881E8j32R7p4J99k49J12R4p48M25L47n2r6m7J49k17J33Ql0o2J46q5L5o0J52k81
3906a78J71l36J201o75m06M86n53M54O2l99n08P52j26m81j8K59P74J82m37M20
3926F44n51n64n47R58L89n68R58j227J026l52j1M39m51j160J308Q64j442N08k36
3945a5K54k2o52J279j267M6K24M74p0m65n6k6N36J23m36j0J075j309R46k72n12
3966a55M21M23q29K49p55J213j2k70o06r08J023K08P8j69K07m29J25%l22N13Q3
3987H8k09rj7L58m5j50j30o70L89K32j48J081r63m12N32L55r78Q15L69L73j073
4008b12Q44Om66k84j79L84l48J74l04K06K97j50O19o67k03P6K59O9Mm92L85m3
$$ y = [-59, 243, 21, -61, -136, 37, 7, -17, 79, 25, 86, 34, -81, -21, 3, -142, -25, 9, 53, 23, -21, -15, -118, -27, 34, 21, 113, 58, -74, 23, -51, 148, -101, 11, 105, -643, -218, 129, 77, -19, -66, 83, -134, -1, 7, -23, -85, 61, -24, 11, -49, 103, -178, -7, -343, 858, 183, -223, 263, -290, 164, 226, -173, -681, 71, -55, -536, -554, -295, 479, 661, 224, 644, 93, -471, -1018, -60, 329, -239, 719, -508, 518, 166, 155, 594, 143, -1017, 291, 1155, -287, 221, -15, 239, 217, -435, 844, -423, -377, -153, 321, 251, -214, -270, -296, 240, 363, -73, -83, 992, -317, 629, 357, -155, 266, 689, -140, 109, -646, 567, 555, 285, -321, -1229, -206, 2, 80, -89, 118, -311, -186, -186, -508, 5, 88, -121, -130, -147, 211, 166, 16, -114, -784, -395, -163, -311, 770, -193, -605, -73, 282, -696, 119, 488, 861, -212, 632, 638, 172, -112, -291, 93, -255, -81, -385, -179, 118, -32, 587, -80, -283, -207, 52, 121, 125, -367, 18, -25]
4030b5j87J30K42k17K18J34j98j72m3Q0n04R28J26j28o9k83n5J15nr4j55J74r7
4053h5J23m4J25k60K05j83j08P4O8J2L33k9l90J82k5Pk20N05m15K14j07J1L5M9
4077G7j70J20k7P6r1J06j97J42j4J22k91O56p68N59k31j08K55k38K37j94L9Lm96
4100d33K58K90k06J66m9N4j25L8KN1p9lN1K4l2N6o3k8Om4O1J60k45NL9K0RM18
4128D01k58O4L52k86N31j105nJ57M74q5m77J149o53j06kN65j509Q18k5q84J555
4149F71j939R70M23m15P93n82K91j60k35J43j03l09P57r28l19J167m84J88no23
4169f99O16r6J03K43m34K30l07M24k44QL08Ql20L35L9K45o32K42l46P39m69p8
4191h5k22M4J05q7J20J89j03Q3j04K4O3j53K71k02J72n20L73K1n3k59N58N71j293
$$ y = [-25, -212, -82, 160, -57, 161, 295, 97, -75, -118, -38, -542, 386, 512, 384, 315, 32, -23, 92, 87, -7, -162, 12, -85, 38, -6, 119, -141, 64, -119, -227, -153, -85, -73, 260, 231, -159, 23, -2, 5, -215, 290, -125, 89, -18, -7, 28, 77, -93, 27, 0, 76, -15, 91, -106, 36, 22, 144, -147, 509, -259, 300, 69, -39, 216, -22, 215, 21, 60, 63, -433, -175, 115, -91, 75, 26, 80, -45, -7, -5, 46, -33, -36, 15, 39, 7, 63, 0, -28, -22, -66, -5, 155, -90, -85, -46, -26, -17, 401, 143, 207, 559, 273, 804, -301, -306, -149, 325, 240, -237, 912, 259, 153, 151, 716, -793, 25, 0, -884, 671, -1268, -298, 125, -290, 503, -79, 212, 52, -183, -40, -143, -452, 305, -623, -942, 225, -259, -71, -76, -699, -83, -179, -76, 167, -267, -37, -344, 80, -164, -156, 152, 160, -160, 175, 214, 459, -173, 69, -277, 462, -7, -85, -307, -263, -158, -245, -125, 64, -39, 44, -60, -36, 27, -126, 145, -57, 115, -405, -32, -11, -64, -323, 235, 806, -487]
4214d87j64K03L39N44j79r31P94p1qj42K15%m2j38n0K30j3J70k58P4j52M65o26
4237b27J66L0k2K8J46n3q6J52j62P0j42J10m9K5J80k70P8O6k3rK46m56J22L34
4261B54j79k92K39j40K84k21K87l34L24l23K25k37J39J81p02M38J15n7N94K6n32
4282H9J75r05Q17p63n70J567m10j120J756r19J56p5J82L25j54K00k18k38M07l49
4302d7n1K09j73j20M59m20pJ90j07M43l20R4k01Lm48R24l31p8r3L24m12l30O63
4325A71k00L99k18j068J469k07j105J059o52n20J698n19r99O53j61p2J42K47m89
4344c72n48O97N92j60M9Kl49K50k36P4j48K80r1p04N06l86N91o0m9o60J138j48
4366B68o03L00mpL8O2j24Q8Or3K2O2Pj14J16j27J56o4j9J21j19MorJ08j41N6J27
$$ y = [-487, -651, -448, -109, 435, 256, -675, 119, 48, 40, -102, 113, 113, 71, -67, -117, 113, 100, 270, 12, 86, -66, 399, -227, -61, -31, -53, -25, 121, 68, -18, 134, -28, 42, -100, 10, -39, -14, 166, -104, -26, 40, 17, 8, 254, -202, -80, 254, 75, -217, 22, -118, 166, -55, 232, -102, 222, -101, 124, -113, 26, 207, -495, -57, 58, 1, 595, 621, 89, 264, -641, 176, -587, -1157, 410, 0, -1120, 636, -283, -127, -202, -20, 305, 151, 351, 133, -105, 302, -47, -98, 111, -62, -182, 277, -143, -150, 40, -67, 376, 56, 150, -51, -48, -496, 428, 97, 19, -74, 250, -162, -492, 171, -29, 370, 152, -916, 553, 346, -759, 300, -352, -872, 826, 307, -692, -39, -200, -272, -130, 117, -372, -920, -223, 369, 209, 258, 260, -89, 161, -75, -1, -149, 131, 40, -664, -158, -544, 47, -13, -62, -722, 416, 268, -335, -35, -39, -46, -8, 54, -70, 18, 24, -69, -47, 15, 22, -92, 24, -103, 53, -11, -30, 91, -28, -24, -30, -39, 69, -72, -16, 111]
4394A11p2m8J15lj39NL9m7N2M7q8M8O1j06K7j5L3j7o7P9J04j86J7J26j79M6N7
4421@j3J03q8P0j01J53p9n7q5J56j03K65j63J75r16O75L16q89P13l63J69J3o3
4444a12K18j93K25l32l2J66K90j74k32N03m06R8K10L2o28L82j9k78O06K52j144
4465e68N54L56L41l45J46l17M82j030O51m51J9N87j58R2p0j70R5k61k63M83k21
4486d8M65k20o8j81J22q8k5k1L7j48J74K2r8J4l7J66p6pp6J3K09l6j85J32L6r8
4512b2P2L8k35J74o3J67oj16k2m9p4L22k65K50j52j81j06O9K21n92L61K85p20
4535f44P74K34M45j258K37L68o09O28L30R1o75J1k54l01K42K36J35K36L73l67
4555B32K03k15P4l23j40M48n96K34l44J87L37J2j41J94k50L3J10p4J3l2p5J33
$$ y = [111, 39, -9, 106, 103, -36, -31, 8, -39, 13, 60, -28, 20, 81, -25, 2, -13, 20, 3, -64, 15, 119, -67, -50, 76, -103, -57, 0, -13, 90, 2, 72, -29, 124, 45, -12, -97, 59, -44, 221, 58, 233, -683, -8, 308, -581, 132, -231, -62, -49, -112, 106, -87, 138, -194, -226, -60, 230, 56, -176, 327, -79, 19, 229, 261, -367, 15, -4, -282, 324, 576, -568, -14, 342, 683, 338, 484, 167, 649, -381, 270, -181, -162, 425, 267, 359, 289, 119, 214, -47, -310, 173, -48, 417, 197, 129, -52, 70, -18, -43, -64, -27, -175, -1, 21, -77, -63, -100, 66, -10, -17, -93, -80, 129, 93, -92, 40, 76, -22, 50, 88, -147, 27, -36, 131, 125, 9, -13, -62, -136, 186, -79, 171, 19, -162, -268, -199, 22, -570, -209, 76, -644, 130, 364, 809, -449, -212, 156, -453, 175, 505, 596, -79, -68, -322, -623, -381, -145, -10, 226, 599, 232, 435, 220, 294, -29, -169, 279, -317, -83, -427, -240, 97, 109, -32, 162, -88, -55, 55, -19, -6, -38, -113, 20]
4577B0r8O3k4J36M3j24k29R2J72j74p1O1M87m17L44l71k6q1J40lJ38j23L8Q5m2
4602C6j10J60k19L70n20Q92n49J5J46q89K99k07M74p2L85k65k94K49J55n4P6j67
4624h9J16N5j13m5O5J6J8N2j20J61m2k96N00r72m13R51m48J215n91o71J008o54
4646b97N14M71n41p65M11L18m5j45J67j4o9J08J89k13o09j85M98J31K84r5j37
4667b4o14J77J443j427K45L52l93M87m72J63J33j8k1p9J61j51K70o03J24J11l75
4688e11K26L54l41J29J26j49K79j87L1L4j54L37K1j05J51j85L38l90R0k09K22
4709A07q6q0k7P0kj20r2L19l93O32k01l80L33l92O35p30M07N62o26p9J5O4Q4J78
4733A98k44K58l2m9j03k99Q4L61j44M22m40n05K91j00L7K65P9K06J74n98P6j39
$$ y = [20, -78, -15, -39, 97, 140, 16, -213, -121, 51, -123, -194, -133, 354, -63, 281, -90, -116, -197, -57, -60, 78, -45, -7, 78, 36, -74, 86, -133, 237, -283, 609, 60, 75, 221, -668, -369, -576, -102, -174, 211, -54, -348, -99, 56, 2, 78, -89, 27, 82, -31, -76, -11, 5, 23, 75, -45, 116, 74, -222, 278, -694, -1107, -156, -604, 611, 20, -651, 357, -297, 217, 688, 147, -618, -207, 111, 66, -79, 88, 74, 5, 113, 302, 89, -520, -705, -207, -76, 208, 113, -24, -638, -461, 982, -445, -200, 152, -241, 246, -226, -63, 70, 52, 31, -48, 113, -38, 232, -371, -247, -136, -511, -285, 69, -272, -143, -17, -166, 113, -74, -43, -9, -163, 174, 195, 90, 241, 56, 394, 4, 94, -115, 107, 21, -59, -86, -16, -18, -138, -230, 89, -304, 328, 127, -253, 80, -312, 323, -407, 0, 562, -64, -143, -128, -64, 20, 198, -46, 212, 180, 131, 28, -271, -187, 174, 30, 452, 12, -493, -202, -302, -265, 0, 79, 285, 459, -139, -63, -202]
4755b02K10k93M19J52n63Q07m90O73m60n30j12L02q9J61j71J67L36l28L8j44J54
4776C7n2n8J0l6J35kJ07m6j95K43k87J34j91RK24J37o4j01N9N2j97K40l85Q3K40
4801I6m61K51j35K85l2J25m65k61Q91Q4j393R77J92j61o82N56K47k76k22M47q67
4822h04O80M43j9m48J73m25J93N84j87n57J1J353p02o06J37N62p99J475j201M65
4842C28o20j56P81k91l23J493j070o19J156j69l98M77m63r76J313j281J185m00
4860c3N90l43l44L2L7P79k59r05M16Q23j406n0J1J213o56N06o19J93l42P23p65
4881c99N68k37P67l46L43q26J38r70j25R69O40j003M43M51m53N77r25J12K39J95
4901A58J23JK29k03n63M16j33J25l0O9l32J35l2k7K21k70L17n85J87j1m05L72
$$ y = [-202, 8, -285, 134, 286, -277, 530, 40, 713, 253, -277, -389, -87, -176, -15, -186, -19, 317, -11, 27, -117, 37, -15, -73, -63, -99, 36, 34, 141, 95, -100, 143, -144, -10, -201, -192, 32, 169, 105, 4, 63, 115, -82, 158, -227, -144, 96, -365, -114, -249, 36, 4, 129, -336, -597, 294, 378, -1015, -38, 154, -7, -689, -133, 114, -162, -384, 63, -804, -124, 319, 300, -148, 25, -400, -207, 377, 190, -367, -356, 997, 295, -311, -174, 388, -411, 1064, -137, 328, -292, -448, 333, 42, -281, 1212, 142, -477, 679, 510, 112, 589, 126, -850, 463, -818, 367, -33, 557, 214, -130, -98, -61, 718, 459, -446, -30, 793, -613, -663, -652, 561, -95, 411, -208, -15, -357, 366, -399, 169, -68, 699, 353, 696, -130, 8, -962, -1087, -118, 522, -481, -38, 413, -40, 537, -388, -276, -37, 158, 281, 282, 511, 308, -255, 161, 28, 153, 123, 192, -140, -5, -37, -64, 157, -113, 204, -381, -194, -205, -610, -238]
4923b38L13k07k17J33K68L17l18n21R3m51P68J59j53j42n14R64P8j98Q2N40j338
4944e82O97M5k62l55N20o20M65J012n05q94N92L1j70M36p87N75r2o16N99k71j05
4965b87j42M56m00Q05j966NJ286J84j099J310K20k39O56n05j320J405J24r11J016
4984E98j318O86k69N0n29J059r61J050K70j277K22q57J265O08o96jP71k85q32
5003d46P6L89k65M86k0r19MO91k03n9N91m41O25o72Q4k08L0M7m08R7M17l64P45
5026B77n65L13m01M04L41K57j16o91N57n02M13n73R08m82P2k79l99M05o92N20
5046b33J75K93n31k86P30l1j24L11j48l54j50J29K71J71m63N74q60N57J64n09
5066c14J45K1k20N77K00l05l98R38o46m10O6M47m44l39J177r10J037Pj221M59
$$ y = [-238, 75, -132, -349, -216, 52, 369, 51, -470, -377, -828, -60, 99, -54, -196, -710, 254, 332, 134, 216, 756, -582, 115, 160, -102, -457, 63, -557, -92, 920, 415, -479, 113, 144, -26, 410, -377, 198, 106, -510, 89, -182, -287, -429, 27, -373, 432, -1534, -1529, -243, -59, -1158, 152, 372, 133, 789, 284, -1036, 369, 493, -418, 598, -720, -34, -303, -253, -782, 277, -684, 366, 636, -641, -419, -1276, -11, 597, -99, -100, 671, 386, -446, -370, 19, -246, 240, 220, -699, -695, -4, -207, -266, 325, -116, 509, -163, -79, -287, -257, -210, -618, -521, -104, -468, 277, -288, 25, -376, 28, 369, 626, 510, -181, 376, -126, 287, -286, 622, 140, 212, -67, -466, -61, -753, -233, -58, 235, -296, -582, 148, 117, -7, 304, 156, -198, -348, -219, 52, 223, -240, 334, -526, 31, 195, -314, -169, -148, -368, 209, 409, 104, -294, 644, -2, -412, -346, 101, -343, -682, 495, -415, 622, 629, -592, -133]
5086a33M20L24M4j75j50k77O92p96k09p1L97l62J15K61m36L42k60L00n76P92k64
5107b2j4P8R3j48J02j73N61j35r77L74n01N11L74l64M40o37N18k74J15K91o26
5128d14j326J324N2J60j02O81m37k45N73m76J89m21Q08p12J33O56o26L08r10P34
5148e1M95j491J289J299k114L61k30J037r0n81j091N13O17M3P4J26k70l29N51
5167A58L37n85r6R8R86j523J922j793R59k79r6K92m14n69o69J054O60p56r8J41
5187b71QO00l16j80K43K62p69P6j2K091j417l28j22N17j152R29o56q6P00k13l18
5208d14l2N15l43P61m46j08l85J525j322K4N92k31m76O12k20m99K47k33R91l95
5228A63o43j12M56N80k84J48J98j24p17J60J98L11o47l4N88j117P64M60p89L87
$$ y = [-133, 287, 611, 655, 480, 330, 53, 745, -51, -260, -331, 66, -296, -181, 80, -356, -14, -274, 26, -550, 242, -22, -36, 42, 135, -13, 89, -84, 477, 342, -635, -261, -762, -251, 123, -241, 199, -438, 80, -194, -79, 212, -414, -1740, -416, -364, -204, -306, 375, -62, -307, 266, -210, -21, -442, 366, -346, -213, 443, -183, 125, -785, -51, 444, -1047, 242, 1541, -573, -212, -442, 595, 505, -76, -1167, -654, -37, 6, 80, 206, -64, -393, 158, 495, -90, -186, -88, 898, -625, 1297, -496, 463, 184, 88, 380, -34, -603, -1272, -218, 442, -314, -412, -271, -263, 337, 21, -159, 84, 346, -423, -347, -359, 1732, 315, -13, -135, 382, -770, 159, -497, -583, 117, -96, -414, -446, 69, -274, 487, 41, -67, -452, 1073, -249, -225, 367, 136, -340, 272, 52, -447, -200, -433, 558, 163, -480, -592, -136, 444, 160, 308, 506, 382, -335, -175, 23, 334, -313, -347, 241, -876, -112, 348, -441, -54]
5248e4M71p88L60J51l36J69j06J24J25o3r3K34P5r80O07R76o71N8p51O8J28J37
5270a59P6k46o60L82N80O44q56J5L1N73K86j989m20N09O35J033m8j424J12P60
5290a66q07N59Q67m22M00j28J01J86j032K16r5J60j24Q8M58n58P8j73O88j134
5310h38N72L15k27L92k14n61J191m45J21j157L50P78k61L02p69R87r92J77M9J62
5330f8N46j722K520n74o59R81j076o90J046q04Q61j474J006L88m81j34O51N07
5348H24r24q2M03o68J183L6j64n22k01o70O33P12m59k86Q7K27K1k54L26j2k33
5369b3k09n5q7L19j66K38o79N01O95j076R56m55N01r90P94o56P27j01l09L07l33
5390a01m57J35P10k94M56r45K9P85M73p19J98p6o38L33P88r85j25P17p67L78n22
$$ y = [-54, 417, -371, -11, 140, -196, -27, -133, -9, 116, 53, -40, 194, 269, -711, -104, 872, 201, 259, -492, -424, -296, -159, -83, -329, -989, -607, -27, 617, -239, -224, -193, 380, 666, -1323, -1743, -1234, -599, 434, 386, -1038, -926, -166, -973, -414, 453, 31, 431, 303, 404, 590, -442, -226, -321, -161, -285, -197, 261, -297, -219, -392, 296, -838, -266, 49, -178, 214, 0, -561, 630, 185, 306, -851, -501, 277, 16, 318, -451, 536, -456, -279, -230, -68, 478, -1244, 1276, 702, 43, 1024, -52, -742, 304, -500, 361, -1113, -107, 281, -200, -334, 317, 824, -100, -182, 221, -447, 736, 772, 608, 86, -115, -785, -152, 560, 101, -185, -98, 129, 150, -104, 222, 210, -23, -232, -287, -374, -55, -221, 17, -662, -161, 534, -542, 414, -41, 460, -530, 264, -392, 335, 234, -75, 232, -101, -558, -423, 287, -7, 449, -496, -467, 318, 791, 72, 270, 194, -444, -111, 677, -308, -433, 284, -483, -105, -627]
5411f27R24o76o50J101j7K13m19j138J556j177R30l79J27l07l46Q29o35P16p00
5430f75L57J70N62M6j075O90R62n16o68j04l99Q85n63O7P62q39o42k30J586o78
5450c02R11j552O93r9p5Q19l04j044J216p69M92k71N13m00j79o9k51Q40k59l31
5470d21L66k66M0J54l34q7O94l34j33L27K73P2Q8j066r3N74K2O74q54l94P30r6
5492f4L49j27J40J3n54Q25k38q93L42J91J44k18O1J243j754k1L65L96N13j011
5512b98q9J3K01m18O99j3j23L2L53m39p8N58j48m08J73j38J01j03K57k52J33q3
5534g0K37k61m03M53L26N88j134L49OK76j367Q56K24j10k2J54M49p63K34K2m8
5555dN1l2N2m44P99n11l53K39R9k65Q56n79n46M28l1J21O07l71J58K99q73%m9
$$ y = [-627, 297, -379, -1029, 72, 55, 268, -151, -1289, 267, -910, 20, -359, -232, -539, -885, -56, -691, 25, -675, -318, -148, 414, 460, -615, 75, 1037, 521, -147, -251, -650, 235, -328, -261, 501, -338, -980, -1210, 376, -302, 609, -943, -250, -349, -424, 395, 91, -953, 263, -506, -14, -285, 228, -172, -351, -420, -671, 169, -90, -421, -55, -321, -281, -127, -461, -548, 146, -188, -321, 6, 279, 351, 439, -627, -720, -146, -124, 550, -304, -698, 32, -64, 285, 158, 298, 311, -243, 582, 344, -549, -207, -16, 128, -90, -29, 1214, -540, -561, -196, 200, 713, -298, -387, -374, -173, -591, 108, 95, -28, 4, 357, -82, -160, 398, 250, -158, 15, -123, -22, -125, 132, -120, 13, -70, 167, -94, -497, -44, 282, 870, -264, 85, 91, 367, -1000, -144, 80, -30, -52, 102, 551, -212, 22, 44, -4, 47, 15, 67, -377, 422, -89, -442, -203, -104, -369, 487, -92, -638, -210, -241, -120, 487, 116, 274, 573, -300, -300, -349]
5578c49K67Q8Jl4j50N05m83L16m85R25r1n00l4j68j36L86j77L8N01n48M78o0n14
5601b24O11l33j44k48P00R8n12o83P84J07k89o96J270K75q49N13r8n25k60J74
5621c29Q20n82n01Q70o09P5J91j25j583J876n43O58J34J67o31L97j89oN59M14
5641A063j809M26N41M04j570J288r02l3K49l11O71L96q14J117l54l25L64J62l07
5660B56j42p3j8RM4j14K8q4J53q5k1l0N3o0J10q6J93l4o6l6Klp1J1j1M0L2j2j
5689a6Q6q3L2M8j42P5QO6j39M3J28m8j38Rj5J05OO6j08M1L3r8m9n4L12l31k2m46
5717f31R7N0M68J45k73M53l63j35J43k33K98j44k1K22J94o80J015r17K6K83k57
5738b60K90J26N60j209L70o8Q27j165L30L31J64P7j008L83j58J73j76Q66r6p39
$$ y = [-349, -82, 6, 7, -27, -177, 328, -155, 161, -324, 601, 510, 10, -24, -192, -328, 58, -119, -81, 420, -128, 350, 290, -224, 387, 54, -90, -338, 362, 460, -52, -735, 49, 156, -133, -829, 441, 716, -133, 380, 282, -243, -503, -329, 491, -91, -592, 278, -331, -256, -65, -190, -1773, 103, -440, 218, 352, 519, -112, 285, 96, 90, 649, 1063, -746, -320, 221, 625, -945, 343, -559, -592, -343, -654, 17, 413, -401, 716, 362, 37, 401, 563, 256, 114, 41, 23, 32, 76, -38, -10, -94, 59, -26, -47, -77, -24, -84, 26, -60, 133, 99, 33, -3, -1, -4, -75, -64, -75, -35, -3, -15, -16, 70, -13, 19, 67, -75, 0, 8, 74, -65, -22, 106, 58, -80, -71, -86, 19, 25, 91, -17, 24, 57, -41, -90, -144, 168, -163, -185, -631, -534, -484, -16, 129, -144, 309, -54, -189, -46, -279, 19, -125, -146, 76, 270, -410, 605, -312, -286, -3, -260, 30, 156, 716, -493, -123, -191, 636, -529, -199, 132, 296, 373, -635, -252, -410, -237, -413, 453, 357, -382]
5758c82J99l94O80n47N47l81M95k85L4j99J37j8j84N28j79J85n76J022o92j03
5778a13N0k9R2Q8j34J10m12O60n37J39l71j75P69j016J336j013m51O72J69k92
5798d58J084o87J39M5j54j49k7o16M06R43m97k11j09P08k87j23j9j16R6J06n6
5819A8kq2O51l97l90M72j41l38l34L40j57J226o49m16J97J40j91l33M69m30n50
5840h97J289m23N04o77K90K43k34o34O29k96M07m29J76j10l65M99M94r38O20k58
5860a10MK02m12N05q96J282n46J37l43L27k81m4R55q06J20L87o02K02j76M01m65
5881a59N33j24n06r8J7M47r4O2k55K12m67L42l81P24p6N9L6m78N00o67L93J35
5903A55l74M68m75l01K15K68j27l41R16j030Q19O31p46j89J81J75n01K70J41j97
$$ y = [-382, -183, -577, 103, -444, 103, -278, 217, -68, -34, -233, -96, -114, -298, 230, 51, 236, -340, 682, -10, -113, -63, -92, 0, 88, -46, 64, -348, 312, -225, -86, -457, -632, 137, -879, 457, -556, -1007, -335, -166, -458, 626, -61, 78, 123, -31, -180, -207, -823, -417, 526, 29, -182, -291, 417, 130, 7, -12, -128, -32, 74, 18, 16, -66, 585, 188, -202, 270, 129, -209, -543, -203, -360, 866, 217, -199, -2, 138, -53, -386, 83, -347, -897, 392, -31, 473, -204, 86, 329, 95, -539, 90, -206, 201, -228, -52, -162, -527, -28, 466, -472, 148, -110, -106, 96, -316, 189, -707, 575, 29, 166, -177, 150, -131, -175, 780, -26, 94, 481, -121, 81, -95, 306, -159, 374, 250, -256, -354, -337, 110, 16, 78, -177, 35, -432, -90, -471, 253, 177, 236, 272, -206, 294, -373, 20, 155, -219, 249, -226, -527, -312, -44, -171, -512, 404, -626, 193, 824, 78, -111, 70, 245, -256, 14, 155, -42]
5923d2L98l85K54p32J13j59Q5R33m41O53r17O60k16l3K91l64o18R56q39O90m29
5944a42R52q38J8n89L77O77j1n13N64m9n44m24R8Q10j182Q79M47k27o35J72j94
5965c54P72m08N47q85O53p83Q35p93M17N4o0k9R4o9Q3r2Rm8R3j00l00M11o28O13
5989C2K21k13n92P37K67j051O63j00l96P88k83P0j38k89P9N51p21K09K32l8J6
6010D4M5n86L55j88P51r02N34N68j246O47m03Q58J57q72Q9j13L66j72l55q0k04
6031g07P53L35K8r1n01M9r6K10R0l27R2j29M3j75N85j47M80m29k61K34K63p14
6053d15J25j09L60J92J45J68j49l9n79N53m37m95r6K92J71M07l3j47K92j65N3
6074I4J9j37N3j1j35M3n7K37k83K52j81K10m37K0P21n3n71j32J78m0n31R5m47
$$ y = [-42, 356, -29, 225, -507, -394, -553, -468, 465, 24, 677, -240, 420, 204, 171, 462, 98, -520, 436, -403, 287, -142, 810, -28, -10, -599, -222, 455, 444, -69, 495, 446, -98, -522, -424, 386, -796, 83, 530, 303, -332, -160, -354, 418, 10, 557, -328, 325, -458, 377, -416, 1, 55, -5, -34, 60, -9, 74, -18, -9, -57, 36, -64, -364, 47, -581, 32, 253, 40, -552, 185, 452, -599, 64, -36, -432, 356, 73, 143, 5, -284, -205, 346, -375, -166, 66, 28, 44, 89, -497, -142, -330, 421, -481, 53, 621, -625, 22, -381, 477, 634, -238, -149, -262, 104, -68, -423, -503, -707, 46, 381, 409, 318, -183, -134, -230, -20, 70, -257, -165, -294, -251, -426, 159, 12, 492, 63, -198, 36, 299, -415, -290, -399, -39, 153, 298, 466, 317, 278, -301, 252, -185, -680, -776, -484, -313, 94, 61, -86, 206, 41, 94, 113, -24, 29, 18, -117, -74, -131, 106, -177, 75, -106, 104, -333, -313, 408, 355, -216, -348, -170, -210, -741, -646, -1093]
6097a093L66M56L9O63l79n8l16O08n15M30r45P16j45j36L81m37o9J94K54K84j320
6118a022J41J320j067N45o67J72J171q36j07L19p04Q54M4L38n00l2K0J5L1jkJ7
6140D9K3O0o5j24Q7M4j00J3L9k33k5N50k11l7j77K53k5j23j68m4L59o3m6k6K63
6165B73J7k49r12L80L33K88n14M35k09K73L09K74n72m70O61o19L62m47L12J03
6185B8j76j65k36L24L41l15p95P65m6k84k0O51m79q1Q08j099N69q27L30J620j237
6206c24K54l24J000j381M13Q57j568Q93l5L38m73Q83j176l15L72Q38j465R77j46
6225c82L31J81N63l23j027J589o42n42r4M22l72K98J5J47k61K68j61k52K94k00
6245a48R4l21N58l19J94K48o57l49L95M56K51k59r6KK7q0lk3M17n82L95k18k25
$$ y = [-1093, -727, -271, -232, 431, 52, -6, -322, 286, -229, 201, -744, -28, -173, -309, 72, -365, -434, -240, 14, 298, -1022, -881, 439, -628, -83, -750, -578, 593, -243, -350, -31, -735, 119, 163, 501, 1, -31, -11, 4, 35, 34, 32, 49, 72, 132, 67, -57, 30, 74, -26, -13, 26, -207, -232, 318, 107, 70, -107, 146, 121, -2, -170, -214, 145, 82, 36, 10, 273, 290, 41, -871, -491, -158, 130, -384, 51, -158, 115, 424, 698, 126, -344, 317, -302, 60, -387, -75, 28, -148, -313, -549, -225, 116, -199, -994, -229, -275, -559, -579, 72, -407, -488, 320, -779, -210, -1037, -707, 913, -324, -70, -394, 606, -775, -362, 495, -1073, -180, -215, 123, -350, 533, -643, -958, -586, 252, -1213, -236, -382, -51, 130, 693, 370, -657, 932, 290, -252, -346, 76, -296, 2, 17, 164, -97, 171, 10, -242, 52, -148, -54, -375, 183, -136, 58, 306, -351, -700, -305, 151, 402, 143, 47, 49, 76, -4, -7, -30, 387, -195, 200, -18, -243]
6268b43m9Q88n53l56L01O68n86k21O3r9M95J80q85M04l65m6J527j262J07L78l68
6289b2n35P99j239J925n24j127J400o27j27m12j27P63m15J087q91r4l4m44P64
6308A20J40p21m87J341j326R37j11L18o27N95m05K23M01l13L76l9k50k57J8J13
6328D6j03O8M0p7M2n9k2j1R0q0J5M1J5lK8k8j13P1J66j9j28k9q2Q2m5K53k03K8
6356a7q1J61p4j03j19K07L4K0L3k12K01r1l1Q7k9J51J27j07J33k29o6L27o37m3
6380c58L43j35l61M82j50J4J65j0L6J62j028J480j002k29Q09m90M30o63O41k29
6400i3J84j19M12m48N99l12n70J10N4K20j8J93o23N33j71L7l3J25j78J21j9l1
6422b7k1J58k07J4rJ05l5M3l6M1j46pP6P8j16k0R1k3l9J23R7j00l1k7Q8L3j07
$$ y = [-243, -292, 596, 43, -313, -12, 656, 70, -151, -88, -187, 308, 488, -397, 7, -358, -404, 1123, -139, -32, 346, -22, -557, 242, -997, 928, 404, -723, 677, 50, -77, -489, -616, 147, -268, 819, -72, -166, -200, -644, 120, 260, -461, -948, 393, -933, 4, -107, 211, -416, 179, -226, -3, 398, 85, 461, 422, 172, -85, -67, 46, -57, 11, 51, -26, 16, -43, -65, -76, 14, -66, -51, -10, 5, 2, 30, 2, -111, -40, 126, 107, -21, -50, -132, -50, -95, 158, -45, -17, -98, 63, -11, -114, -233, -26, 8, 28, 61, -151, 50, -41, -72, 15, -14, 137, 264, 157, 290, 61, -5, 322, -315, -358, -15, -150, -511, -29, -179, -165, 0, -10, 26, 188, -840, 640, -362, -591, 218, -272, 158, -505, 136, -93, 91, -28, 384, -64, 535, 223, -347, -237, -183, 37, 19, 212, -411, 122, -49, -12, -45, 80, -98, 23, 4, -27, -48, 110, -97, -83, -92, 13, -22, 21, -15, 26, -120, -127, -51, 27, -89, -109, -18, -41, -80, 43, 140, 40, 9, -18, 70, 103, -4]
6449dl2l8Q6k1n6J30m5J9o1O5j37N06q93M03j6j09k37N34k64J47P7j4J2lJ4r8
6475c5K7q5P1J44j44r0l2J94J31l28J78j6l8k7k3KR8L0J53k46K99k80m73N29l9
6500@N5j27Q50r46Q19q14n52N21N36p87L28M95l37n5N4l2N7k00J54J2Oq7J21j87
6524a16O3L1m5J47p4J3K31l19j01n06P02L16k32j30J021j184k38M44M5M3m26m77
6546g92J107m56O7M5M2L0l6pj0J4K5K7j25M1L4j7l1K4M9l9ML5J09k27J71K63m79
6573a32M5KJ5L8J20j4m7M6k22J92j41k1j71K76lJ49J24o33K3N47j04n8k50Q2O11
6598D74m97L4l7O0l21J59L34K04j68j68K10j17k65R6P4j35j67K26l0NL6j57R0
6621f0k2J16q8K31j33l4L7Q6r5Rn7Q4n6J22j46J39J07n93N46k71Q2Q8j22Q2j3
$$ y = [-4, -36, -74, 12, -9, -65, 65, 20, 39, -22, 43, -94, 412, -481, -78, -94, -203, -440, 94, -170, -23, 54, 40, 52, 49, 63, -35, -8, -93, -22, 122, -22, -112, -144, 50, 181, -147, 31, 15, -23, -50, -73, -71, 27, 57, 210, -36, 263, -17, -490, 39, 0, 55, -72, 778, -168, 651, -163, -715, -194, 342, -445, -117, 378, 41, -14, 40, 8, 65, -135, 19, 31, 37, -50, 71, -116, -53, -22, -67, 80, 6, 19, 250, -69, -170, -676, 26, 342, 110, -20, 1001, -183, -421, 23, 68, 111, -315, -792, 315, -141, -74, -29, 13, 43, 7, 0, -10, 4, 29, 56, -69, -28, 6, -11, -42, -18, 31, -8, -4, 31, 140, -87, 84, 347, -132, -87, -85, -70, -32, 88, 74, 27, 73, -149, 43, -98, -119, -290, -14, -17, 132, 256, -377, -354, 193, 89, 31, -219, -137, 474, -23, 11, -26, 34, -287, -128, 206, 410, 242, 74, 284, 167, -98, -2, 72, -63, -230, -4, -34, -29, 7, -150, -60, -82, 34, -54, 177, 44, 10, 47, 133, 38, 47, -10, 74, 18, 140, -6, 133, 240, -353, 193, -78, 4, 92, -30, 52, 39]
6646C9N1m5J28k19M0j30L41l21k42J059q55J80K0o1Qkr0J70p3J00j01qj13L42
6670B18l87K24j16jl9K42q2L4k35M46j48m47k9N49j13j37J52L48m18M14n76J300
6692A199p87o05L04k76k43j62R22r54K12M88M00n32Q8j28K37q0j12P3M67l95l55
6713b39K73q4K11k1Q0p3j99l3j31P95M1k68m51k29N50k73J32r0J32j3k0j50K51
6736A91k45P0l22Q2K34jk17o4N67o02Q0K16N0m68L55M75k13o01M09j02rQ63j518
6759g70L11J222q50N23q54L15l58M75j93L91o46K09Q8n35R62l86O12K2k97n96
6779c55J475p89L27r19J94P24m96p90L8O22Kk2m9l17l7Q14n43j08J74j8J198m23
6801G02j403J076L08m61J003k069P98l19K49R05q76l70N83K45Q0n6j094J095o8
$$ y = [39, 90, 45, 173, -46, -6, -136, 205, -116, -358, 701, -154, 26, 46, -15, -7, -9, -99, 71, -2, 98, -3, -11, -124, 218, -169, 55, -61, -62, -101, 141, 59, 93, -142, 304, 156, -291, -320, 229, 116, -21, 131, 479, 61, 475, -101, 1199, 412, -193, 111, -165, -408, -570, 352, -602, -390, 98, 498, -34, 54, -74, 163, 83, -29, 44, 511, 116, -239, 34, -50, 161, 140, 220, 147, -52, -85, -216, 579, 620, 352, -99, -328, 222, -51, 81, -9, 123, 110, 90, -60, 191, -54, 16, -306, -224, 10, 9, -208, -272, 295, -307, -227, -11, 39, -429, -74, 401, 188, -413, -4, -106, -115, 748, -770, -459, 763, -87, 436, -418, -103, -461, 14, -179, 212, -434, -225, -137, -672, 290, -96, 516, 538, 241, -355, 1120, 331, 658, -261, -67, 657, 161, -629, -591, 31, 33, 11, -38, -355, -392, 422, -121, -229, -55, -73, 1125, 702, -701, 375, 683, 222, 1225, -844, -46, -365, -116, 789, -87, -457, 126, 371, 451, 395, -699, 396, 328]
6820C28J78j101P61k99o28Q74n79O25R21p42r86J604j696k55J301p02O86m45K80
6839A25n85K2J85M73M11j102Q63q36L94M79j282P24l44J491j219r53J321k41Q23
6858G49j498P23k98m18O84O2j077J233Q16j007P49j80K55q45J82m20q9L44m59
6877d94P97m64J91Q6r6O0j55j7m44O01p32N66n1k56O63p4J69p76O18J85o43P06
6899D40J70o41L71L76R1q32p24P35o15P72j36m07M96k3M46k77m95O15l52k22J12
6920a00K20r4o9K78j41k10J31r6Q5j6Q2j45r5J49m92O85k28O58O93j442n20K25
6942d42K21n07Q95O29r55O35k73m36P67q3r7K61j845J546m97p85k3P63P62r02
6962c66O96K65l00k60K09k11n5l55M90J78l33rn6L78J06j98M13o63M92q6n81J67
$$ y = [328, 506, -595, 166, -133, -761, 113, -466, 159, 1080, 338, -648, 956, -740, -995, 306, -396, 290, -155, 125, -460, -438, -253, 220, 631, -471, 392, -444, -50, 429, -853, -129, -473, 1018, -201, -1154, 167, -74, 749, -749, -26, -324, -742, -58, 4, -1073, 160, 976, -31, 718, 538, 793, -52, 130, -290, -379, -35, -494, 303, -161, 30, 116, 20, 80, -75, -92, -536, 65, -667, -101, -152, -408, 255, 181, 350, -426, 192, 377, -266, 440, 610, -31, 340, 716, 807, -25, -749, -14, -629, 143, 7, -400, 96, 73, 519, 242, -253, 362, 10, -212, -100, 120, 26, -43, 235, 94, -116, 15, -81, 4, -12, 70, -75, -170, -21, -513, 172, -56, 602, 1295, -147, -667, -442, -221, -728, 167, 796, -159, 476, 203, -233, 534, 451, 354, 615, -1230, 316, -181, -966, -989, -226, 536, -366, 330, 595, 295, 35, 244, 33, -22, -377, 113, 291, -42, -51, -107, 271, 377, 179, 592, -71, 421, 335, -246, -79]
6984g9R8R47N92j945Q13n72L99J7l19K66k68j40J316r19%l24l39J263p25J497
7004A578j337n09L74K19p78Q54l93p5J14j09J07L8j35J08r0J9N1M2j00l59L32
7025d9J03l2K14l66j35K82M94o92k7M99m40L62r9q01P51l47p1L43L19Ml46J9l76
7048c91J099n97K08n13k32L06K07O9r7J54J69m10J17k10J17lJ27j15J53m65R0
7069b17P78m47p8J6j14K02q8l39P79m76J23M8n8j59j61R6j2P5J20j58M3J97l54
7092a84J74j54j30J61K44m38R0j37Q13j109J33O8J08J74m97K61M42N76r65P34
7112C64J07j360K43P36L08j94l83k16j04L37J76q4J18n1J38P02q46k47P36n5n29
7133a04N55Q3l15p22J30N08P3l16j91J20j59K99J34J24j51j1J0M2k69J61n60P94
$$ y = [-79, 19, 966, 1558, -387, 426, -146, 253, 270, -49, 217, -51, -191, 1125, 206, 206, -118, -457, 806, 81, 1578, 241, -268, 106, 325, -453, 401, 8, -67, 47, -62, 45, 83, -52, 56, -34, -15, 36, 78, -22, -381, -49, 54, 22, 236, -130, -265, 17, 511, -181, -208, 291, -149, 213, 114, -687, 64, -283, -354, -11, 308, 312, -34, -15, -391, 708, 111, 319, -194, -426, -120, 87, 156, 59, 213, 382, -28, 89, -121, -4, -7, 120, 5, 158, -307, -217, 561, 114, 36, 52, -62, 140, 52, -287, 492, 16, 139, 187, 129, -30, -191, -95, -107, -32, 88, -70, -27, 170, -184, -10, -164, -294, -133, 111, -327, -237, -374, 439, -670, -537, -469, -361, -187, -684, -423, 19, 595, -370, 364, 471, -889, -646, 90, 398, 204, -179, -395, -499, -162, 14, -70, 48, -3, 135, 837, -9, -256, 480, 425, -104, 451, 534, 219, -503, -373, 135, 208, -108, -299, -179, -338, -39, 95, 219, 68, 57, 67, 109, -160, 1, -559, 235]
7155B35o00L80o5j257J118Q70p1j067Q61p47m80J125q32Q93k16J15J99q36p4J047
7175E98o48l83p63J373P62j449k14N89K42J53j15r16J156J33p44M93o4m39k27
7194d63P15p04N75n92Q48k47J168j281p38Q41L15k42p26O45k71L03k57J94j30
7213d7J81k00p1L96l96K11K73j26l76j71K58M96n69N80j03j03j20P5K61j220J469
7234F98j89q06o5P09l33j20P1K76P7l77J12m4n1J70j34Oj11p5L22N1k01j97N39
7257C28j40m20L61M7m66Q2m1k86O88r2l8J14j65J64PN58p09o02O49k80O01p16
7279c56J024n35J00k27M56j58k31K27m17PL39m51R11j300P89J0k49j26j81j3N59
7300A78K81j212J184m66l8j60j00O00o24k02O74k52Q46k70l97q74L56J26n2O8
$$ y = [235, -365, 15, -50, -1307, -189, 681, 610, -457, 404, -343, -823, 302, -530, 363, 147, 262, 461, -375, -449, 598, -50, -433, -1196, 177, 939, -510, -724, -135, 107, 260, 145, -771, 385, 518, -226, 267, 203, -236, -463, 252, -452, 123, -469, 379, 132, 1300, 19, -719, 122, 437, 195, -531, 114, -157, 146, -111, 83, -47, 134, -66, -137, 259, -137, 74, 347, 221, -155, -326, -68, 428, -141, 439, 336, 233, 113, 188, 449, -771, 698, 509, -297, -362, 347, 14, -106, -35, 241, 318, -59, 53, 9, -42, 128, -6, 0, -111, -186, 136, 187, -14, -211, 328, 188, -232, 129, 176, -290, -208, -249, -535, 153, 61, 23, 137, -28, 136, 143, 701, -8, -610, 39, -241, 360, -356, 668, 133, 233, 6, 462, 304, 73, 300, -117, -110, 229, -222, 689, -611, 178, 188, -61, -187, -368, -381, 178, 459, -753, 431, -35, -73, -233, -333, 267, -357, -559, 115, -137, 709, 439, 42, -832, -476, -350, -402, -334]
7320c34O80K27n21K53K1K40M55p71p71M05o99P77m81O95j44n21J80m72M60M95
7340A74n85N64N96r27J11K00J884l160R97j5k30O19k31L71j110J190K87m27j230
7359i22n3J058k75P50j433J400j640N40K68n82J425p54K57O24k172J112j195o98
7377b290J392O46M54k00m57K46l37o30J249M49r88N4k80J150j120M14m41J315
7395F26j201N35N54m23o97J08L64J61n7Q7k07j06M57j70j09L78n16m10M83P13
7415E70j008Q89k17p45M22j70N96n39K33k83M5L64j90N70n56l23K3N51j94l3L6
7436D1J41k26j93O21J84l51p38J75N75o01M21k27J09J8P5l2J39j64j5P9k6R4q1
7459A8j37O7K2J08j89J00JM1l8k1q6K57j16j06J69m1l5q6J75j38P8q1m2J23J7
$$ y = [-334, 346, 573, 52, 305, 326, 566, 1021, 250, -521, -116, -815, -38, -519, 176, 32, -489, -309, -781, -321, 174, -411, 153, 749, -178, -67, 133, 2017, -1143, -146, -161, -391, 228, -3, 368, -742, 448, 735, 308, -922, -975, 83, -192, 558, -875, 525, -1115, -575, -307, -889, 536, -218, 39, 663, -1509, -397, -1592, -2290, -898, -252, 202, 2, -455, -209, -546, -1176, 73, 522, -466, -412, -692, 458, -662, -248, -689, 626, -575, -40, 514, 91, -606, -498, -134, 27, -30, 57, -150, -256, 201, 31, -78, 300, -216, -626, -143, 570, -438, 451, 234, -511, -89, -259, 337, -202, 31, -252, -207, 157, -33, 537, -19, -342, -319, 232, 38, 5, 41, 182, -44, -237, 384, 568, 217, -521, -346, 229, -372, 49, -178, -69, -51, 24, -8, 131, -33, -48, 31, 5, 99, 18, -119, -52, -30, 78, -111, -11, -10, 31, -7, -28, -114, 143, 27, -79, 90, 49, 14, -72, 103, -35, 43, -38, -80, 43, 60]
7484F0j25O6l6N4k6l2O9n9J40k37Q8J0J28j67J01k63N53m64l92l38m8J263n63
7507b18M34k91K10k84q0k88O41l86M19n28L69j5j36J00N3M0n9L2p8P4n2l0J49
7530G6p2k9N5l9K0j33J29k9K7Po9j7J36p5K0R6r8n8K5J7K0l6J8m4K8K5o9Q0K6
7559C7p4N0l4K1k84K92j55l7J02j88J78n9M19l25m4M9J44j39L9J3J09q1j6L0j07
7584f0N9L6P0j19J06n2j15Mp1p3L47l50K33r1j2R4N7k3K4j74J55J3m1Q5j81J26
7610D7j57J53m6pm6J10m6K8l1J17k43L42l01N5l3M51k93k22j44J92K2j56N92o27
7634b43M68q02N14M72j21n84Q11r85M49J02k02L53j34j24l55J03N10k39J95J52
7654C40o27N19m39J65k68L44j21K09j62LJ22o1l2j0J19k48Q2p6K11M6K35j95q32
$$ y = [60, -65, 1, -35, 19, -7, -39, 30, -29, 111, -126, -38, -28, 100, -67, 34, -229, 324, -140, -532, -870, -918, 345, -218, 216, -75, 135, -149, -229, -517, 124, -262, 157, -371, -2, -17, -153, -53, 0, 40, -19, 13, -65, 9, -43, -73, 76, 4, -25, 30, -9, 11, -122, 7, -22, 5, 12, -57, -74, 62, -13, 7, 103, 5, -53, -28, -11, 9, -27, -9, -53, -25, 0, -69, 11, 37, -37, 13, -21, 0, -284, 8, -147, -184, -82, -270, -92, -151, 268, -57, -101, -52, 92, -47, -8, 5, 114, 33, 17, 47, -60, -1, 35, 105, -14, 92, 40, -75, -71, -142, -215, 132, -218, 15, -76, -88, 6, 63, 40, 64, -110, 45, 58, 17, 102, -79, 47, -110, 43, -3, -10, -56, 54, 8, 36, 5, 122, -121, 221, -80, -25, -58, 393, 100, -122, -266, -74, -52, -208, 384, -243, 225, -577, -63, 409, 288, -296, 515, -470, -21, 81, -121, 232, 98, -26, -381, -278, 232, -7, 188, 340, -287, 232, -207, -42, -310, 34, -87, 122, -40, -37, 85, 24, -8, -18, 101, -147, -65, -141, 70, 116, 351, 156, -676]
7677f76P62j30k65L52k55K13o8J57r2J14j28l2L10Q49j357r9M81m12N02n39N45
7698B32m06j4N6N71l82k99N01k91k1o9L29J27p41N66j15J15j36L35k99O72o01
7719A30PL00q53M18lJ3o3k6Qj7J08n49R23m97l75N09P6L05k32m4j81J00r2K68
7743B33k14N67o77N96q29L26m1J72n53J99M84o5j46j59l3j02L13j71R2n8R7M0
7765G1m2j11J54k35J99J39m65R51m28J80l79j86j94K74l47N05k07l83O62M4j51
7786E1L0j80P1M9O49r87O50l02k71L1p58J240J83o35m35J38j21J96J54J97l1J81
7808A00j69K86l13J89k39M68rl35N16o26K42k28J63k00K99k59J92j04k42J53q7
7829b03J90M41Q5j60K50m11l25N79J27M42j285J80L7K2K5o08P65P85n31j492J789
$$ y = [-676, 86, -44, -309, 43, -212, 1, -67, 90, -2, 112, -16, -48, 262, 1111, -246, -345, 136, -276, 226, -313, 232, -174, -188, -132, 439, 57, -242, 259, -32, -53, -122, 207, 334, -407, 159, 44, 159, 23, 358, 59, 731, 130, 137, 437, -416, 2, -1, 12, -51, -77, -69, -86, 22, -527, 396, -101, -476, 33, 109, 414, 182, 138, -43, 57, -35, 233, 19, 586, -91, 505, -324, 2, -39, 133, -420, -221, 263, 198, 52, -107, -140, -242, 71, -100, -8, -66, 31, 71, 29, -82, 72, -163, 36, 175, -290, 661, 233, 413, 34, -152, -346, -72, -419, 86, -121, -504, 158, 202, 51, 81, -99, -28, 21, 670, -317, 333, 31, -240, -209, -967, 273, 456, -179, -614, -476, -597, -401, -247, -50, -81, 100, -69, 217, -96, 93, -146, 322, 313, -22, 494, -132, 110, -118, 45, -155, 144, -115, 77, -27, -269, -116, -203, -13, 428, 513, 353, 603, 192, -133, 446, 573, 1015, -270, -90, -53, -31, -6, -614, 151, 936, 405, -1087, 702]
7850G02j424K71P37n10j24J68j03O5j97L31k46L65l61N53j81j80Q21j043O00l71
7870a27K87K80k66K63k40n5L14p58o44J284q10M49l54R55q63K24j1p0P2N75k06
7891B99j289O60O25j53K2j73n30L58L33k68M00k53l87Q6P11K9p29M83J6j81R10
7912I69n53p87J38O92l84O81r08L57j09n41N24n3j44k57L24q7J85q5L5l3M7j8
7934gN1j28M5qJ0j50k80J81M11l6k89r2N88l29N8j53l07L11J45K81o02M29Q5n01
7958b87O11l88J38j98J82j05J65k09J24L2P6K07q25K1M35K04Q8k6q0n73L72l9
7980g5Q1P2o3m2Nl7L5j3k7J3o2M44l43p25N12J7J04N0l9J88j04OJ07r4K3M3j47
8007g1J08K12l51r8k76M37J23M90n98O2L83k70J2m37J41n22J371p29K25j76K60
$$ y = [702, -722, -451, 286, -224, -348, -180, -283, -218, -415, -84, -330, 35, -326, 227, 46, -134, 687, -356, 244, -127, 160, 440, 174, 437, 197, 142, 456, -302, -946, 338, -472, -23, -377, 578, -285, -61, -72, -142, -70, 505, 299, -990, -330, 295, 142, 164, -9, -539, -181, 152, -116, 284, 31, -356, -270, 441, 470, -259, 224, 240, 59, 969, 416, -371, -233, 459, 75, 756, -152, 205, 96, -445, 79, 26, -118, -375, -51, -138, 47, -38, -3, -36, 11, -7, 44, -84, -39, -47, -37, -187, -467, -286, 125, 89, -200, -292, 296, -33, 25, -128, -435, -124, 21, 302, -300, 129, 214, -287, 324, -64, 74, -124, 58, -47, 118, -91, 33, 65, 141, 348, -477, -456, -21, 183, 271, 245, 165, -408, -36, -75, 6, 78, 15, -27, -22, -59, -24, -37, -64, -51, -113, 331, -12, -737, -225, -208, -104, -54, -93, 95, -9, -3, 104, 10, 33, 76, -71, 37, 249, -102, -200, -476, -39, 84, 574, -24, 38, 421, 151, 163, -274, -133, -655, 716, -13, 212, 36, 296]
8028B96j15j48J18j12q8J02k4q7L9L7j99J07J85k93P0k99M67q6k91M72q6j5jN8
8052A07j11P8j00J98QJ12k3M77j98p86J48n5M18l14N25n61j51J359p41k00l54
8073a64R96p92J67l43o35J647p05K99m72J89m63K3l8O77m38K17K93R1o12J95L09
8094D41q38n35J496q04J23l65O30Q66j111m92J23J003K6j138N54K1pO4j17J6k3
8115f7R6J18l43K06p46J137j015P72m02Q92p34L28k26J58m07K74J36j76J24n25
8135d00L78M15q25N50l4o64K72O9k00J68L0P46n05j7O0j96J98J0L24n14Q50q55
8157a40O83O73j321L36j85m66O33o42K78O10q09P12p03M20l76M66j13M40j61k71
8177F4n01K77m72Q76m70M09q4j79l2J15j25K72J206j834
$$ y = [296, 181, 33, 151, 39, -49, 53, 29, -58, -19, 18, -181, -74, 111, -182, -112, -411, 56, -30, -321, 151, 65, 50, 49, 107, -4, 74, -26, 172, 180, 292, 269, 746, 548, -238, -90, -145, 273, -41, 484, -77, -228, 1131, 390, 190, -164, 832, 40, 207, -136, -771, 876, 171, 470, -2, 187, -276, -253, -291, 386, -52, 165, 458, 549, -63, 132, 441, -397, -932, 564, -240, -117, -482, 148, 1014, -97, -589, -466, 537, 563, -575, -21, 0, -7, 57, -60, -44, -67, 29, 147, -196, 10, -736, 401, -614, 158, -244, 648, -86, 242, 16, 174, -233, 41, 177, 1, 125, -400, -22, 393, -432, 118, 84, -580, -308, -239, -439, -271, -241, 505, 0, -17, 43, -153, 45, 55, 379, -135, 715, -140, 543, 1216, -105, 231, 46, -420, 213, -429, -151, 459, -350, 362, -341, 79, -297, 169, 56, 496, 335, 64, -437, -160, -632, 244, -226, 183, 99, -80, -112, 3, -122, 150, 1356, -478]
8191d78
$$ Imaginary data points
##PAGE= N=2
##DATA TABLE= (X++(I..I)), XYDATA
0@%%%%%%%%%%%%pJ5j6J6j6K4l2L2m0M8n6P2q2R0j04J25j49J68j92K24k56K88l22
35a70L62m08M58n13N72o36P06p83Q70r63J064j176J297j429J573j732J909k103
53a102K321k564K834l144L499l909M391m965N664o536P663r183J1347j4702K0655
68A2269l4330J23056L0150k11904O4125L3401q6119j8143R4107J4163J6193P227
80D4195n8453j7159P6560k9486p6087K9890K2460m7061O2953Q0967n3189j3715
92B1875P5494r1881j55193O5498J21568m3756k1087Q1476J1810n6394k5901k5606
104d2097J1647O2868k8001p3803O3338Q0338n5822j9076P0982l9028r3746J5778
116d6622J1593m1781O5869R8247m0845n2414L4371j5161o1899J1029L0168M088
$$ y = [0, 0, 0, 0, 0, 0, 0, 0, 0, 0, 0, 0, 0, -7, 8, -8, 8, -8, 16, -16, 16, -24, 24, -32, 40, -42, 48, -56, 69, -80, 88, -104, 120, -136, 152, -170, 192, -216, 242, -271, 301, -335, 371, -412, 458, -505, 559, -617, 680, -749, 824, -908, 1001, -1102, 1219, -1345, 1489, -1655, 1844, -2065, 2326, -2639, 3025, -3511, 4152, -5031, 6316, -8386, 12269, -22061, 100995, 131145, -80759, -16634, 16767, -69352, -87495, 6612, 20775, 36968, 44195, -14258, -31417, 45143, 15657, -60430, -30540, -8080, -55141, 7812, 88779, 35590, 21875, 97369, 5488, -149705, -84207, 37361, -6395, -27482, 53994, 65804, 9410, -16491, -42097, -30450, 32418, 4417, -69386, -6048, 74290, 18468, -608, 70374, 31346, -62400, -46622, -35029, -76810, -10941, 87306, 46461, -5953, 28418, 13257, -48642, -37613, -7445, -3357]
128c357L1073K27m9307L1460O2109o2607o4986M9387K753p1077K6663Q0819K066
141C5223k261K4926m4775n6010K1925P256k3887L8229M2090k6836q513J8190l0223
154d666j7720L1142k2219m6160L8299L9933k4973J7246N4995k4808n1587Q8j2825
167b3255k4762L3573L5104j2322R667K1452l8349k8053K3498p237k6261K4649
179a2296J9838j7740J8898L7653j7712k0445P352k6479l5554J9430K4061o531
191i525K3772K9124k7184k6953R778j2645k1576K0409J8445q915J5917K2644j3905
204A9386q650J0700k2228l1344O849P071l550K5564K6075j1384p117O380k6371
217h619k7551J7643J6644o963J2446K3997l526q039j300j7342j7337K765n333
$$ y = [-3357, 27716, 27943, -21364, 10096, 72205, 9598, -55388, -6001, -3248, -74325, -47662, 33157, 35223, 32962, 57888, 13113, -42897, -20972, -13716, -37603, 626, 42716, 15880, 7367, 25557, -4666, -22386, 8756, -13463, -59623, -21324, 18609, -6364, 10882, 65877, 41069, -10518, -10430, -23255, -48017, -14444, 20660, 8338, 18005, 39457, 1108, -26945, -3447, -10684, -36945, -12296, 7542, -10198, 8700, 46353, 28641, 8196, 15548, -10931, -46485, -27055, -2994, -9525, 14247, 43371, 16187, -10766, -988, -13633, -35209, -14800, 3645, -5270, 10647, 33291, 19386, 10736, 21436, -792, -32136, -25287, -18216, -21766, 3798, 29873, 18489, 11372, 17752, -8619, -36170, -18527, -1883, -8846, 3600, 27597, 24071, 16032, 14732, -2610, -19947, -17182, -22515]
230b2515o615K3076K5244k726O53P094j9273k2355R67k25k733K0172K2243l829
244A9178k896M497j4992k0989o576k112N91J3442J4988O304J2086N542j8035j7984
258f956l690o005o288J2169J9492P849M174K257j3414j6843r085p839l132J1026
272a6285J5673J1638J1051M427q122j3504j1389j2288n713Q051J3814J0041R867
285A7261O978q260j3755j2492j1150m464N052J3473J4307J4638N848m051j0992
298A2393j3444j4131q239K115R167J3435J2320P650j266r201j4632j3527o266
311b3626J470R300J3990J5012R221O55q012j4251j4273j1507j910M688J3627J2794
325G178J1428L370o053j1338j3874j0584k963O454J1043J5107J1732M309m575
$$ y = [-22515, -29130, -6054, 19190, 16464, 17117, 24211, 4938, -17417, -16450, -16675, -19408, 764, 23007, 19178, 16282, 20779, 5787, -15202, -21778, -23890, -23299, -9857, 5131, 11435, 23521, 29063, 11028, -6956, -10646, -16651, -22939, -10770, 8722, 16571, 20745, 23002, 9588, -7255, -16340, -24179, -27311, -16285, -612, 11026, 22077, 26504, 18382, 4878, -6511, -18799, -24512, -16461, -2647, 7394, 17261, 24239, 15979, 2224, -10268, -21418, -25882, -20830, -7357, 6950, 21588, 27436, 23385, 12393, -1051, -15182, -23421, -21306, -12139, 1296, 13616, 21266, 20000, 10799, -3833, -17360, -23626, -22156, -12856, 1134, 16146, 25367, 26022, 18010, 3759, -10514, -22021, -23931, -19243, -5616, 7178, 18606, 21976, 15923, 4585, -9289, -19873, -22836, -16382, -5339, 9768, 21500, 25809, 21234]
338B1234j2485j4512j3059n732J437J0482J5147J2554O063j078q623j4003j2419
351a4994n600J030R194J4883J2955M348J5o704j4885j5767q062o42O988J2967
365d274J3366J0614M186n746j5458j2409n764m234J697J5171J5750N836J412k938
379A7209j3207j3978q280n283J072J4235J4428Q200P567P26j2675j2805q690j0257
393b1738j32J6076J2051M350R469L072j6129j5182m454p436k894J2370J1986O359
407G768J2380M636j2347r843n123j5574o798J2428J0859M980J4981O980j5616
420I711j1283m766j3238m676J4513R100K984J5556O700j3943n422K43j6583j3065
434b4169R933O330K707J7838J0518r961n239m064k2026r402J6304Q437R85J8403
$$ y = [21234, 8749, -5763, -18822, -24554, -23117, -12635, 2512, 15066, 21129, 20051, 11428, -2575, -14994, -20594, -19564, -10370, 4513, 17468, 21816, 21831, 15127, 242, -15525, -23587, -24229, -17241, -4274, 9092, 19706, 23892, 18146, 2688, -9721, -15485, -19719, -18022, -2851, 12899, 18735, 20147, 17209, 4002, -9976, -18256, -23539, -22467, -8232, 6196, 14396, 21963, 22689, 10014, -2791, -11481, -21738, -21870, -5794, 6257, 10607, 20076, 23148, 7019, -8163, -12617, -20053, -22947, -10577, 1409, 7768, 20148, 24784, 12437, 2594, -2529, -18103, -24901, -12473, -1614, 3366, 18347, 25327, 9711, -1572, -6338, -19576, -24252, -9739, -639, 2345, 17901, 24601, 10658, 5236, 5479, -11104, -24169, -14236, -7906, -5199, 12639, 23157, 13196, 7957, 3893, -18133, -27535, -11231, -2794, -1809, 16594]
448A6594P301j3988j635m42k0540q053J6742m022r770K0411J9344p868l323n68
462A0183j8010j0628M552m231P203L1070O897j9799J736L828k4474r883J5271
475f285l141m548K1043N237j4032J3206J4111k4006j9519P126k194l142J7756
488A612J0837K208J2799j0798l6756r11K1609j3524j0445L0221J2823j8668M542
501E549Q402j3192k485O389j9941j1228K4764J1283o391J4187P332k1381j0958
514g670m405j8787J0889L6748m829k0153K3417J2681l3570j0443K1616n491j4204
527a4201P461J60P83K4109M904k1981J090M058k8304r584K6190Q681J550K1447
541B6363n125l0623N775J3639k5401q270L0154K278k0261R637J4845l654L542
$$ y = [16594, 23895, 9907, 8272, 7830, -12710, -20763, -4021, -8043, -17813, 2598, 21942, 14074, 10751, 10183, -7827, -18455, -13903, -18134, -10931, 20139, 27036, 7237, 8973, 12801, -11673, -21556, -6285, -9426, -13974, 7069, 12306, -1726, 11480, 25591, 1585, -17934, -10808, -13002, -16144, 1612, 12449, 14657, 27456, 16658, -20098, -21009, 600, -12924, -23369, 6852, 19675, 1007, 5549, 13951, 759, -1726, 4663, -15278, -26506, -1742, 9541, 3150, 17337, 24669, 3288, -7670, -12075, -30862, -19973, 16775, 11946, -8207, 15210, 27891, -5679, -16122, 5494, 3, -14201, -6740, -6580, -5797, 18312, 23216, 1235, 2325, 6383, -21921, -31505, -5315, 3366, 4916, 26363, 21238, -9385, -3610, 10029, -15372, -23642, 6512, 8790, -11471, -1834, 13011, 9357, 12899]
554A2899m978k5465j291J6044j1078m23L7647R627k7616m290K349k2559r95K3039
568B910m919p119K2501K002k2244P579J4865j5828j1148M081q998L169K5841K171
582A4863r730J6101k621l8500p583K3126k074l142K2591L391j6011N361K352j7842
596i718K284J2988j4416q328J9041N647l743J4749L30k4580n102M071j5830L482
610a9125L1652N449j3816P203O76k1155j932J0752p988j015J4807l422o182J7016
624A2920M437j7459k112J586j8556j884K1560N120q00J5572k095k3217l545N023
638c450j0753K251J8212j641o082J1757J281j2918K744K829j6614m190J2672L66
652c536K414J8634K133j6282k791k261j5439M37J6377K106n4J1621k343j2677
$$ y = [12899, 7921, -17544, -18835, -2791, -13869, -14292, 23355, 32982, 5366, 1076, 3425, -19134, -20129, 2910, -2009, -9128, 13373, 15375, -6869, 710, 15575, -253, -11401, -7320, -16318, -13149, 12692, 14863, 5133, 21234, 18613, -19887, -27470, -4344, -6418, -9560, 13031, 16422, 411, 5772, 8124, -9718, -7434, 5554, -8862, -17190, 1851, 7498, 3755, 18504, 18834, -5746, -10848, -6777, -22607, -19125, 12527, 17976, 4160, 11363, 12039, -9116, -11048, -296, -8284, -9299, 5508, 2086, -4096, 12920, 17357, -102, -2214, -628, -19184, -21068, 492, 5612, 4812, 20384, 18289, -4928, -8473, -3450, -14203, -11952, 6260, 4619, -1463, 10294, 11575, -1343, 1401, 4230, -12384, -16574, -3902, -3536, -1122, 17512, 19645, 3363, 572, -1689, -17128, -16691, -314, 1792, 1738, 13359, 11016, -1661]
666a661K964J447j3410j328J0152k546o60J4919M550p231O61n089j6525j508R538
681e727j33L976J5466O81j0982o2j892j1512J63P194k875J617J2872J119n728
696D177M158k038j2746n248L836k235N491J3250K558m600K663m658j3138k619
710a1149N962j629K944R813K279k127K446k515j0590k271N93l904K515J0929M455
725G751j36L044l617j0600l642m39k516M047J0022K710l41K964k686q445l408
740e292r39l647K707P572L189K170M921k554p703m105k602l923K220P368M200
755C582K770L443k355o391l684l194l713J906N701L532K969M431m87n231m606
770a327l830l669Q59M170M065M619L880o47m241m216l716m355L37L433L595N028
$$ y = [-1661, 1303, 2750, -10660, -11988, -1836, -4382, -5042, 9877, 14427, 7196, 7857, 2768, -13757, -15265, -5727, -5860, -1884, 13582, 14263, 3281, 3219, 1327, -10185, -10022, -2828, -5703, -4086, 8786, 9905, 4177, 8335, 6297, -6449, -11697, -7861, -10096, -4605, 8645, 11203, 6603, 9266, 4608, -8530, -11149, -5187, -6816, -3872, 5941, 8220, 6093, 8539, 6024, -4566, -6837, -6244, -10148, -7633, 3296, 7751, 7615, 10659, 7042, -3558, -7200, -7639, -10155, -6108, 3914, 6624, 6283, 9247, 6561, -1884, -5292, -6231, -9878, -7171, 401, 3590, 5760, 10681, 8127, 424, -3681, -6283, -10206, -7986, -618, 3582, 6352, 9795, 7440, 1049, -2635, -5829, -9542, -7636, -1935, 1597, 4566, 8997, 8510, 3279, -1327, -5157, -8826, -7967, -3797, 268, 4887, 8767, 8120, 3879, -337, -4053, -8408, -8071, -4638, -1043, 3985]
786C985L673M20k939l491m940l777j137L156L193M494L998J160j565l650n203
801b623l412j889K056L250M231M328J513o05l234m256m653k242O13K419M725N163
817E384J857j88l298l762m745k796J423K033L936M160L282o6k037m316m086l019
833f238m59J385L441N237K458J263j072l872l927l696j830J870L299M249L074
848E182J349q71k142n051k883k290J06L315M088L303K109K63k699l914l441k542
864f118n82K583M102L372K347R92k075m163l166k494j584J813L871L199K718J992
880F807j542l902k956k911k297J284L871K928L062K427j464l485k241k739l592
895f750J131L527K214K708L442n97k546k271m265l191O68L373J610L044M859o73
$$ y = [3985, 7658, 8078, 5139, 1648, -3292, -7069, -8206, -5050, -1857, 2637, 6635, 7795, 6230, 2580, -2623, -6035, -7924, -5868, -2618, 1613, 5941, 7454, 6849, 3615, -641, -5294, -7536, -6923, -4504, 221, 5384, 7241, 7053, 3755, -7, -4752, -7548, -6125, -4092, -156, 4004, 7286, 7220, 5183, 867, -3219, -6238, -6697, -5312, -1871, 3366, 5824, 7087, 6015, 2143, -1784, -5480, -7310, -5440, -2141, 2108, 5182, 6531, 5660, 3518, -1533, -4416, -6706, -6600, -3285, 803, 4106, 6215, 6478, 3779, -135, -3576, -6118, -6700, -4117, -15, 3357, 5704, 6696, 4621, 458, -2708, -5202, -6786, -4973, -1102, 2097, 4815, 6807, 5265, 1363, -1593, -4504, -6801, -5517, -1646, 1282, 4344, 6771, 5307, 1822, -419, -3158, -6750, -5619, -2092, 122, 2830, 6272, 5675, 3129, 858, -3407, -6598, -5930, -2557, -947, 2097, 6956, 6283]
911F283k989k738k888l900J908J128J253L271N302j428k762Q11l799m239n88R89
927d386P58M589M990p56j764P56m116o306M34K535O53K925M667n40p82Q81m327
944B11n372J564J035k632K897N893J557o42R13m526n085L61m94k232N247O858
960E553q85j875J457k826m666L49n88k067M317M465k284R74N195k787o697p40
976c105r74k557L729N033M12K391K950n896o687K223M67l458K722M823q60J250
992B463K983l275k955K688l466o664L164N905l09K203M723k942m780m59l754l597
1008h072N831N046k862J517M481k634l993J351j673l139J310J428k409M661O963
1023G806l297l825J661l768o315K736M005R0M358L721n110l023L118l163m706
$$ y = [6283, 3294, 556, -2332, -6232, -4324, -3196, -1943, 1328, 6630, 5202, 2440, 3251, -548, -4787, -5375, -4386, -3628, 961, 5951, 5195, 3431, 4187, 71, -6235, -5801, -3266, -2613, 312, 4979, 4439, 3657, 4538, 211, -5161, -3597, -2562, -5194, -2297, 3596, 5153, 4511, 5424, 898, -4187, -3826, -4320, -6552, -1305, 5553, 4668, 2793, 4250, 1424, -3242, -2893, -3481, -5548, -1231, 3234, 950, 1924, 7119, 4332, -2365, -3105, -4079, -6636, -2907, 2126, 2538, 4929, 7879, 1983, -4704, -2481, -2014, -5472, -2750, 2073, 1213, 2463, 5446, 2171, -784, 1904, -1562, -8226, -5062, 843, 534, 2737, 7460, 4518, -262, -721, -4475, -8072, -2241, 2805, -57, 1460, 5941, 3307, -686, 665, -1008, -4147, -2837, -1409, -3818, 843, 7806, 4509, 684, 2345, -1423, -7738, -5002, -997, -907, 3451, 7172, 2062, -961, 2157, -1006, -5712]
1038e712L611K342l136K361M636j725l4K914n087o462K405J651k296M948O542
1053F958k431k655N34m424l866M009J403k835L803L907l442m36L840k725m838
1068c198J382r71l205M443O185j525j38K560n399n619K140J152j936M420M630
1083D921l637n7K860l900l532L829j680m224L106L613j468K428L520m367l660
1098b248O67j443l147N377L764j411J380J814n137k369K393q04k705K853K182
1113A166j816K289L757k862j853l0k976l285K866L879j372K889K957m442k052
1128h85M19k217k239M593J646j942J731K861k974j097K011k712l880K540N84n61
1144b122M313L193k761k344J460l952k943L332J604m2K461P57j396j547K025k891
$$ y = [-5712, -2101, 241, -2895, -534, 4102, 2377, 2343, 5257, 170, -6292, -3887, -2236, -4532, 416, 6958, 4527, 1872, 2406, -2018, -5884, -1875, -472, -3307, 496, 4403, 961, 525, 4365, 1640, -3198, -1816, -2787, -5992, -1549, 4636, 3111, 2973, 5533, 134, -5485, -3345, -2193, -4129, 291, 4921, 1284, 1227, 4087, 187, -3345, 484, -1196, -5420, -2314, 1299, -169, 2259, 5779, 1412, -2248, -1581, -3024, -6171, -794, 2970, 1559, 2939, 4753, -384, -2753, -360, -1164, -3869, -1016, 1166, -650, 1639, 5396, 2534, 681, 651, -2325, -5610, -2744, 1135, -237, 2652, 5609, 1167, -885, -466, -2683, -4922, -329, 1317, -625, 1106, 3967, 993, -104, 1907, -805, -4685, -2145, -1561, -2122, 2191, 5384, 2623, 279, 1739, -2213, -5156, -1824, -220, -262, 2199, 2956, 1560, 13, 2038, -853]
1160h53j986J349P8r74K821K689r03R2P32l968l205J913N59k96K944K732q51k784
1178H9J367l129j498K056j50r30K484J640q06Q26R57k961k631P65q7r70L062K393
1196B477o26M23k09k627j475M07L05r55K377J575n98Q01M39j818j671j0q71q08
1214b864K035J864J95R07O76j948j895k66q14l21J885J396lJ038L13j210j603
1231f15q88r2q72J204J185Q04J221O82j435j115p94q92r71J423L70Q23K077N39
1249B654j125j212p92j622k35J559L47M06J293J511j531j68r24j610o70L42J098
1266f79J000R20J120r08p17j036m69q81J16R38Q55P80O78J86m02r61j373p21j27
1285a681L40P75J153R49Jk43r48q70K2j050R5L65J505J454l25j88N2j612m59j046
$$ y = [-853, -2839, -1490, -1412, -2386, 435, 3124, 2221, 2313, 3045, -923, -4128, -2215, -1656, -1952, 992, 3724, 2873, 89, 1456, -1673, -3171, -1115, -1265, -2195, 289, 1929, 1123, 1949, 2906, -55, -2686, -1921, -2008, -2978, 84, 2477, 1851, 2274, 2065, -562, -2037, -1630, -1325, -2280, 97, 1672, 1074, 1875, 2314, 496, -1175, -1185, -2056, -2864, -829, 1035, 1230, 2137, 2813, 865, -1030, -1296, -2110, -2431, -546, 850, 847, 1885, 2198, 988, -615, -1503, -1595, -2467, -1263, -78, 726, 1947, 2629, 1194, 79, -715, -1607, -2578, -1155, -785, 38, 2115, 2654, 1529, 317, -475, -2097, -2332, -773, -426, -20, 1273, 2784, 1253, 1085, 161, -1449, -2119, -1777, -679, 321, 1241, 2361, 1453, 736, -300, -769, -1650, -1534, -596, 259, 1039, 1717, 1903, 1501, 540, -833, -1554, -1681, -1341, -566, 587, 1536, 1537, 1294, 346, -524, -502, -1552, -1457, -1092, 413, 1867, 1542, 1354, 1406, -206, -665, -1711]
1305a711M01R53J103l39R67p9n26j174n28l10r37J430K52J308O18l88J36r66m39
1324b29j313M23N32K74R02O59n95J055o31j498r02L37Q2j03J674N98j062N27M50
1343A180j841k98p48J410o16J349R39q7j08k99r16q91m26j030K380Q68m59m7J895
1362B255j350j614k93J081p47l64P82J073K33J67Q04k867Rr80R29j303K578k47
1380A46J389k66j100J41o64m80o40M36M65N77L51J183q57m15l39k77K8J46N03
1399C27m59M15J229o17N13o95j260q10M47J86p29K009M21q8J58m27l49m45j249
1418a423J232n39P36O84j18P08o14q61k27J34j300J627M17P53L74j295P04j220
1436b28j267K41j85Q74J81J263P66j04j517M46n60o23m06J35J026O75k39L80l24
$$ y = [-1711, -1310, -357, 746, 407, 1374, 1295, 769, -405, -933, -1243, -2180, -750, -498, 810, 1428, 1040, 1176, 210, -229, -1542, -1119, -587, -313, 589, 1248, 653, 1708, 1077, -421, -1323, -986, -904, -1007, 667, 1265, 203, 730, 1180, -661, -959, -1707, -297, -913, 436, 1375, 1288, 1180, 881, -35, -926, -1352, -2382, -2, 866, 407, 360, 2255, 905, -709, -1002, 79, -668, -1032, -250, 823, 1056, 1223, 2027, -840, -831, -1811, -882, -2185, 393, 146, 1535, 1269, 169, 310, -354, -834, -1474, -1038, -573, 4, 355, 1538, 681, 266, -73, -350, -322, -176, 327, -132, 283, 1512, 895, 1408, 713, -547, -1357, -910, -724, -1453, 556, 977, 889, 1047, 620, 271, -174, -1423, -191, -730, 6, 690, 572, 1280, 666, -195, -422, -288, -1588, 39, 456, 1209, 1583, 288, 992, -228, -1495, -1254, -1439, -565, -384, 879, 1645, 1541, 24, 470, -90, -713, -1119, -984, 42, 717, 478, 858, 534]
1455E34ro96L2q07J60J130k27J39O26P8o24n54N5p38M15M62J2J07J240j96j641
1476e02n53J484q21p78J207Pl6J172o75l06N63p80n42l0P57m89R03m6Q44p07j061
1497c89N44j139j58R35K10m7M18n9l6N03o90l69j55J79j83j18J122L12n62L9K65
1518F22q20m13J89k9j37K099K48k041M78J60o82k27M74k05o2L75M28K90j45K33
1538H35j881M41Pj83J32J006J16o66J059m43o04M91l59k36J2J17N10l93L98J59
1558E18l34j25k34l46J08J220p13M72o02O58p92K3n61O02k89O50L2l1n9k16P0
1579E1l26R4m38R7O17n5l04R65P4q44n7m0o04K45N41J66j19L94M8n49l17L71k60
1602b50P8m6K95l52N95m37L17n31M36m08N83j166M20O82N0K69m04N91P6j300K68
$$ y = [534, 525, -171, -139, -946, -786, 344, 117, 256, 882, 960, 336, -218, -163, -901, -486, -24, -12, 95, 1335, 1139, -502, -1055, 429, -392, -1170, 37, 44, 8, 1180, 505, 199, 762, -18, -560, -590, 167, -322, 581, 535, 1379, 672, -389, 155, -984, -1142, -207, 3, -44, 374, 315, 279, 782, 92, -277, -432, -253, -436, -554, 568, 880, 318, 357, 622, -198, -611, -422, -451, -588, 1511, 1759, -282, 196, 356, -326, -553, -79, -284, -346, 29, 457, 747, 602, 835, -1046, -605, -598, -781, -649, 357, 473, -193, 866, 423, -181, 310, -49, -285, -273, -156, 354, -39, 359, 518, 184, 59, -175, -521, -413, 807, 94, 566, -36, 622, -170, -147, -708, -106, -395, 255, 287, 256, 197, -19, 51, -275, -181, -619, -522, 95, 40, -264, 701, 775, -69, -126, -166, -770, -525, 16, 182, 63, 457, 505, -44, -361, 10, -250, -172, -218, 77, -275, 320, -117, 200, -331, 105, -303, 280, -886, -466, 216, 266, 535, 131, 722, 798, -502, -234]
1623b34L64k60J7L61o6l36K61j89J86l27J71m07N04K55L15o21K74j3n15j82M48
1644Fl07L40J36K06n34N62o01n24N32k26q5M95J19M3l46M28J05j73l21n00O95
1665E0J63j30p98L26K81j2k23K19o0j88L30n8L59K75J43j78j156J268R4q94N18
1686C29l11K08l41k74J140p60M24M40o91o63N12j85L26M15L62k53k77o07l16J75
1706c47k1Q12J77j98n58M06K05l25L47m05k10k6M57K98n43O80r46O82k07o06M83
1727A55o75R32l27K59K8k28k36J78m11P58m64j15k2N37o51N59K70o41J59m84N50
1748A31K99k1n49M81m56L96l52L03j94o8l23O14n15o38P02L93n06j59R61j029
1768e30N23K36q81N05O91o3m44k96rK54m15P49j02k60o2M41n61o08R86J5l50m88
$$ y = [-234, 130, -130, -113, 248, 182, -154, 107, -82, 104, -223, -52, -459, 45, 300, 615, -6, 268, 255, -260, -442, 6, -301, 39, 175, 381, -153, 409, -192, -716, -184, -410, -495, 0, 119, 162, -184, 244, 349, 176, -145, -645, 50, 213, 83, -715, -389, -108, -120, -343, -124, -184, -372, -42, -100, 259, 534, 677, 499, -657, 611, 705, -189, 329, 18, 226, -115, -389, 751, -9, 415, 855, 164, -499, 13, -172, 154, 569, 931, 678, 401, -206, -522, -347, -368, 444, 621, 423, -135, 271, 476, 151, 498, 93, -117, -143, 314, 612, 69, 749, -197, 485, 278, -328, 155, -520, 412, 85, 344, 372, 144, -92, 86, -325, 433, -31, -146, -168, 369, -282, 277, 547, -94, 65, -419, 131, 430, 409, -140, 341, -115, 281, -71, 232, 38, -30, -353, 261, -254, -892, -190, 203, -303, -462, 499, -530, -7, 229, -652, -147, 544, 481, 37, -259, -268, -14, -429, 320, 218, -42, -104, 337, -224, -832, 154, 169, -181, -669]
1790f69J229l89j77n6K60l20J82q5m58K89R98p23J30k26l51P03q0P0l68K79j19
1811A19J21l51Q42p59l64O15o33L10j80M99J6j16k26L45m1L4j32k51M06m68P49
1832E35p45n1k11K99J67l09J76M99j586J566K48m69L82N9J70j93j68o86J041j126
1852d02M63M14K00l26Q4r7r2q0J116j821J192j118J848o6j856J431j452P29r1
1871G6J6j43K1J61m84M30j2L71l91l5R6j9m07j85L66K5R54q15M38j53o77J42O
1894b19M45k6O93l01q24R42n39k09q33J318K76r10J41m08N66q8j27P31n18K38
1914C48k92j99O49k36j75j98K45J96l22L40m34k37k3L39j96N87L3n63L97o00L02
1935c9k14J93L4j54M00L28p35J9j64K16j15J68J36j47q4M65l03k0l1k19J89J70
$$ y = [-669, 560, 171, -6, -62, 198, -122, 60, -25, -483, -194, 804, 81, 211, -15, -366, 337, 257, 327, -41, 238, 119, 240, -111, 731, -28, -392, 223, -410, -100, -280, 219, 235, 119, -107, 238, 197, 231, 99, -152, 254, -214, 535, -210, -261, -472, -173, -6, -315, -139, 360, -1226, 340, 588, 119, 501, 560, 730, 537, 369, -317, 724, -402, 61, 475, 675, 349, 433, 336, 244, 164, 1280, -541, 651, -467, 1381, 1315, -541, 890, -562, 167, 76, 92, -51, -30, 131, -353, 77, 65, 436, 45, 10, 106, 87, -320, -505, -139, -114, 840, 25, 463, 310, -367, -225, -219, 226, 200, 893, 592, -232, 710, 171, -38, -871, 447, 723, -187, -46, -454, 112, 24, -103, 628, 110, 348, 56, -143, 506, 270, 95, -103, 142, 338, 16, 356, -78, -315, -338, 1, -195, 392, 425, -138, 259, -341, -39, -253, -60, -26, -180, 220, 548, -187, -168, -332, -116, -231, -63, 73, -74, -158, 307, 4, -16, -47, -266, -77, 93]
1957I3k4j36K65j88k66K02o9k98J12l20M79M58l66j7J38k24J35j17j15R7Q4M0
1979c7L8K05j38k8J16K4m25L71m40J05q6O45j22K77l69l84J97p5j7O0Q4J34q3
2002E2q5K08l28k38K06l9J46j35L01k84M15l48L24n73L84K2j15N7k9J45j37K57
2024B06j59J05j56j89o1N19n24L11J26j08L18n49K57k78r0M13l1k1n5K0n7P9j21
2047d5J7j18J41R6j50K11O2k10L40m03j02j9J0L97J56J61j92m00R9j10k55P5J78
2070f1j07PN00P1m23k77L52k11l31O24k34J50J08j38N7R4j13R5m39K52k2J17k12
2093a41P33l49K85n09o40K94J8K36N8K09PJ88m41J79k05N23q43K65R0J62k51q5
2115b17P0P17j113J52K89L20l54j28O13l3k13K03m32j43R8M9O5J73J17p92Q33
$$ y = [93, 69, -67, 198, 10, -256, -54, -123, -421, -309, -629, -150, 308, -58, -75, 63, -161, -26, -143, -258, -161, -77, -37, 1, 206, 68, 40, 156, 180, -245, 126, -314, -209, -295, 350, 228, 505, 136, -248, -51, -126, -143, -83, 1, 135, 52, -33, 175, -153, -391, -185, -224, -78, -213, 88, -196, 219, -129, 195, -378, 6, 28, -87, -30, -59, 86, -51, 206, 47, 152, -4, -193, -254, 265, -259, 52, 178, 70, 388, -161, 96, -182, -272, 141, 110, 89, 34, 54, -3, 76, -45, -28, -146, -5, 91, -59, 152, 214, 4, 344, -59, -161, -180, -170, 227, 383, 544, 352, -48, 51, -59, -314, -239, -61, -168, -161, 339, 410, -13, -290, 62, -149, -480, 144, -90, 60, 168, 30, 87, 181, 68, 163, -276, -24, -46, 71, -141, 592, 243, 528, 19, -621, -327, -309, -73, -15, 194, 201, 389, -52, 127, -78, 445, -398, -133, -43, 119, -132, -217, -147, 570, -543, -391, -102, 218, -136, -264, 349, 316, 103, 306, -126, -269, -171, -122, -57, 116, 233, -559, 274]
2136B74n13Q8j10L84l84L79K24Q2n26M86J23j033O29P4K72o83J66m16O24L59k78
2157B21p19L94j9K80J03n59J72R4J65O5q19O14l5k76J98k03K91j1N81j96k02j72
2179c3N87j45l60o5j4O0j4k29K99K76m62q13L69P49n00J92O41j16k17l81J76R2
2201I2l42O42n16j98j79O37p31K30Q8J64j89K03j67O15j66m46K81O21o39q0J92
2222A12m66L89l22J168p68J83k33P9K66j022J7J574l78l61K74p09P56o11j70M03
2242A81n61N01p9K40N23r79J57J037n96p71P56q18L00q3N98j042N16N15r6j82
2262A17l78J01m8M0K87K2J52k26n7K5k86J33L6O4Q3p3J05j3n9L9k15J11j58J09
2286h9nN17M8l32o75N27L57m83N06m79L62Q6m46n2P38n04k76L94j74m8P66j226
$$ y = [274, -239, -151, -261, 123, -261, 118, 342, 424, -102, 384, 507, -526, 103, 177, 449, -234, -68, -484, 140, 499, 221, -498, -104, -123, 157, 260, -299, -127, -33, 132, 197, -622, -8, -43, -319, -121, -324, -33, -44, 537, 341, 139, -33, 554, 409, 49, -16, -30, 30, 16, -213, 86, 362, -100, -913, -544, 205, -295, -103, 538, 422, 205, -176, 0, 92, -250, 392, -124, -322, -501, 136, -595, -365, -277, -113, -302, -99, -266, 349, 183, -263, 18, 639, 0, -80, 112, -354, 35, -287, 881, 113, 296, 63, 142, 408, -614, -597, 977, 599, 238, 512, -197, 559, -52, -222, 181, -380, 121, 42, 282, 805, -174, -17, 1020, 424, -347, 409, -409, -109, -192, 406, -636, -120, 395, 299, 117, -261, -160, -208, -168, 119, 141, 293, 67, 10, 35, -251, -118, -82, -18, 65, -8, 97, 84, 25, 64, -151, -40, -198, -89, -94, 423, 471, 139, -536, -9, 348, -135, 371, -108, 254, 340, -106, -158, 580, 76, -200, 194, 20, -28, 738, -488]
2308d88k9N33J95k46K06J0m26J41K90j11R8J03k98K63l21K89n12M05n21P14j88
2329A07m4q46J124J31p95R32q1j131N82K70k32Jj87N86m35m76J94J48k2J93j09
2350i0N9N55n52r4o0m5mK6O04k65N3J53K59m07l59k13j19Q62l95L92n09Q04o47
2373Hk01k25P00j13l45J21Q4L49M7O8m25J67p18J66K20j70N7K5O25l10l63k20
2395d53O75j98K25p1l54O86n62M15j309P86k32P75j058N54Mj07N07n3m19j86P22
2416C47n63p0QR9k42M67n57N00l11N50q14O8r1N00k82J5J255l77p96O25J12k39
2438B04N3L00j01j320P26m35n27j07P73Q77j030K031k017r02O86J717r42o06J075
2457D55j250P07L11o83J475j500k40J028n57L69O8k39k82L85R75j064J01J189
$$ y = [-488, -517, 16, 211, -35, 171, 181, -245, -104, 186, 75, 173, 276, -22, 241, -80, 209, -303, 102, -419, 295, 107, 63, -783, 341, 472, -323, 609, 528, -603, -21, 249, 17, 18, -169, 417, -18, -494, -300, -152, -174, 19, -90, -31, 524, -28, -122, -182, -227, -231, -205, 399, 134, 187, 340, 599, 192, -167, -380, -499, 363, -32, 360, -149, 655, 8, -193, -418, 282, 169, -176, -55, 29, 378, 425, 493, 68, 235, -483, -317, -97, -267, -210, -185, 440, 130, -233, -453, 222, 24, 249, 178, -176, 510, -52, 363, -946, -160, -392, 383, -675, -121, -117, -224, 283, 230, -189, -375, 347, -216, -286, -278, -179, -421, 46, -511, -11, -322, 228, -586, -518, -609, -109, -391, -376, 879, 502, -294, 331, 443, 204, 257, 557, 456, -864, -138, -573, -1100, -1207, -434, 443, -587, 1444, -573, -1475, -789, 928, -14, -620, 455, -795, -88, 223, -460, 1015, -485, -725, 303, -254, 115, 183, -56, -338, 47, 1022, -42, 59, 1248]
2475A248j048L3j12n72N72L99J30k0r18O72l48j84L83j091R20n29N84J24m27O37
2495D53l03n63O17l39O71j006K34P02j098J212p07j63p93J393o43N8K23K1Q0m18
2515c69J524q58M61j329M03Q80P22j329N03n43j411P67Q05j50n04j14K11j47O49
2534A71P3M88m40m02K25L50j136M53L98L54k32J81n7k22N9l79N41L06l25l59O97
2555G44J68j186M56J05K10n07r1j23n24Q41J58n2N6k63m6k65K01L69l38L02Oq26
2577f05J226n92j70Q92j011M59K1M78o87M4J57L84m78o33R37r31O65k66M67J34
2597D91n71N83p24P14n22l4O07l92N80j155N35l07O31M8j126Q30j90o6J127p79
2617B80n12k02k27N20L83o6p77O87O9l34M3L44j93K6j58O8l97K71O25r5J38l28
$$ y = [1248, 200, 233, 121, -451, 121, 520, 650, 630, -288, 384, 36, -148, 235, -856, 64, -465, 119, 243, -184, 453, 150, -413, 204, -135, 536, -470, -236, 466, -632, 580, -127, -290, -1083, 310, -333, -275, -52, -31, 49, -369, 1155, 297, 758, -571, -168, 712, 1434, 105, 608, 65, -1346, -579, 226, 76, -428, -542, -331, -478, 171, 244, 732, 292, -110, 115, 465, -671, -218, 180, 534, 302, 483, 426, 204, 263, -116, 425, 731, 406, 47, 744, 912, -274, 182, 287, 497, -10, -101, -224, -748, 93, 251, 199, 255, -8, -54, -319, -118, 251, -87, 215, 221, -605, 621, 29, -141, 751, -260, 199, 220, 698, 11, 55, 212, 596, 118, -515, 422, -509, 156, -110, 357, 491, -80, 503, -221, 493, -29, -63, 544, 152, 732, -423, 112, -195, 436, 484, -642, 188, -2, -68, 1059, 280, -232, -434, -661, -141, 242, 176, -601, 86, 155, -179, -136, 208, 15, 41, -117, -49, -446, -175, 450, 355, 493, 165]
2639A65m44K55L0N7k33N3K0QJ51J12k59M27k3l12p3L0L2k7K47N0k20j22M8Q0k71
2664b19K20o1j5R3P7jqj34p7O4J8n9J11NJ58j25R7n3m4n8O6j14q1J16J91k3j68
2691b4l6m1k76K57m8MJ08K31k71J93P5l9l99J55Q3m9P2O37j0k14k09l2j48j15
2715i6j50O14o79Q20k58l70R2m00O43l70rK05L52n27p51R11n45R70l30l36O36
2736D22l22J03j040P36k99P69k19r2J160r93n42M29M05lk4j256O74O07r14P79
2756C80M72j137P0L18j96K53r47R04K77j1q99Q29lJ007j674R49q11j77P95M88
2776H87M6j35o76j160J340n9L07k21m7n91P09j38j56m30M77LK05m64O2k88J97
2797a32O56n52L70J36l19M59r2p75M56j58r53L81N82m92L46R69q0l94K61n57m24
$$ y = [165, -279, -24, 6, 63, -170, -117, -97, -89, 62, 174, -85, 342, 319, 7, -66, -36, -4, -31, 216, 266, 46, -76, -28, 52, -219, 1, -60, -75, 18, 95, 94, 86, -48, -125, -61, -43, -102, 9, 14, 172, 47, 144, 91, 47, -11, 55, -59, -140, -24, 167, 144, -24, -60, -101, -377, -120, -168, -164, -56, 175, -96, 97, 172, 133, -266, -111, -28, -77, -5, 632, 622, 408, 199, 167, 19, -96, -246, 368, -311, 509, 251, -119, -27, -427, 216, -154, -163, 42, 394, -133, -884, 27, -518, 452, 122, -214, 422, 100, 203, -837, -101, -400, 369, 150, 58, 1218, 225, -317, 112, 517, 514, 490, -766, -92, 515, -399, 380, 852, -285, -215, 103, -93, 160, -787, 117, 394, 383, -516, 313, 310, 1317, -357, 592, -219, -396, 399, 887, 933, 798, 122, -1038, 302, 243, 550, 329, 282, -309, 400, 262, 106, -324, 153, 156, 361, -103, -41, -329, -132, 524, -28, 342, 478, 159, 618, 526, -249, 207, 49, -904, -523, 59, -433, -87, 882, 802, 408, 669, 112, -312]
$$ [...]
8191e34
##END NTUPLES=NMR FID
##END=
