##TITLE=1H_DE-80H_X3
 200.13MHz, d2o
 8 sc
 
 19ns.26.2.2025
##JCAMPDX= 6.0         $$ Bruker NMR JCAMP-DX V2.0
##DATA TYPE= NMR FID
##DATA CLASS= NTUPLES
##ORIGIN= UXNMR, Bruker Analytische Messtechnik GmbH
##OWNER= pz
$$ XWIN-NMR		Version 3.5
$$ Mon Feb  2 11:17:47 2026 Russian Standard Time (UT+4h)  Yarkov@DPX200
##.OBSERVE FREQUENCY= 200.1313
##.OBSERVE NUCLEUS= ^1H
##.DELAY= (6, 6)
##.ACQUISITION MODE= SIMULTANEOUS
##.ACQUISITION SCHEME= undefined
##.AVERAGES= 8
##.DIGITISER RES= 18
##SPECTROMETER/DATA SYSTEM= spect
##.PULSE SEQUENCE= zg30
##.SOLVENT NAME= D2O
##.SHIFT REFERENCE= (INTERNAL, D2O, 0, 14.3821)
##AUDIT TRAIL= $$ (NUMBER, WHEN, WHO, WHERE, WHAT)
$$ ##TITLE= Audit trail, XWIN-NMR		Version 3.5
$$ ##JCAMPDX= 5.01
$$ ##ORIGIN= Bruker BioSpin GmbH
$$ ##OWNER= Yarkov
$$ C:/Bruker/XWIN-NMR/data/yarkov2/nmr/H-C/1/audita.txt
$$ ##AUDIT TRAIL=  $$ (NUMBER, WHEN, WHO, WHERE, WHAT)
(   1,<2026-02-02 11:16:52.04 +0400>,<Yarkov>,<DPX200>,
      <created by zg, POWCHK disabled, PULCHK disabled
       configuration hash MD5:
       00 E9 B6 7A A2 85 ED C7 34 08 36 98 17 FE 4E 26
       data hash MD5: 16K
       70 BE 22 27 00 35 50 80 7A F9 4F 9E 18 22 0B 94>)
$$ ##END=
$$ 
$$ hash MD5
$$ 29 CA 99 B0 77 B7 55 74 E9 A8 E5 B3 B3 AA BE 04
##$RELAX= 
##$RELAX= 
##$RELAX= 
##$RELAX= 
##$RELAX= 
##$RELAX= 
$$ Bruker specific parameters
$$ --------------------------
##$DU= <C:/Bruker/XWIN-NMR>
##$EXPNO= 1
##$NAME= <H-C>
##$PROCNO= 1
##$TYPE= <nmr>
##$USER= <yarkov2>
##$AMP= (0..31)
100 100 100 100 100 100 100 100 100 100 100 100 100 100 100 100 100 100 
100 100 100 100 100 100 100 100 100 100 100 100 100 100 
##$AQSEQ= 0
##$AQ_mod= 1
##$AUNM= <au_zg>
##$AUTOPOS= <>
##$BF1= 200.13
##$BF2= 200.13
##$BF3= 200.13
##$BF4= 200.13
##$BF5= 200.13
##$BF6= 200.13
##$BF7= 200.13
##$BF8= 200.13
##$BYTORDA= 1
##$CFDGTYP= 0
##$CFRGTYP= 5
##$CHEMSTR= <none>
##$CNST= (0..31)
1 1 145 1 1 1 1 1 1 1 1 1 1 1 1 1 1 1 1 1 1 1 1 1 1 1 1 1 1 1 1 1 
##$CPDPRG= <>
##$CPDPRG1= <>
##$CPDPRG2= <>
##$CPDPRG3= <>
##$CPDPRG4= <mlev>
##$CPDPRG5= <mlev>
##$CPDPRG6= <mlev>
##$CPDPRG7= <mlev>
##$CPDPRG8= <mlev>
##$CPDPRGB= <>
##$CPDPRGT= <>
##$D= (0..31)
0 0.7 0 0 0 0 0 0 0 0 0 0.03 0 0 0 0 0 0 0 0 0 0 0 0 0 0 0 0 0 0 0 0 
##$DATE= 1770016611
##$DBL= (0..7)
120 120 120 120 120 120 120 120 
##$DBP= (0..7)
150 150 150 150 150 150 150 150 
##$DBP07= 0
##$DBPNAM0= <>
##$DBPNAM1= <>
##$DBPNAM2= <>
##$DBPNAM3= <>
##$DBPNAM4= <>
##$DBPNAM5= <>
##$DBPNAM6= <>
##$DBPNAM7= <>
##$DBPOAL= (0..7)
0.5 0.5 0.5 0.5 0.5 0.5 0.5 0.5 
##$DBPOFFS= (0..7)
0 0 0 0 0 0 0 0 
##$DE= 6
##$DECBNUC= <off>
##$DECIM= 32
##$DECNUC= <off>
##$DECSTAT= 4
##$DIGMOD= 1
##$DIGTYP= 9
##$DL= (0..7)
0 120 120 120 120 120 120 120 
##$DP= (0..7)
150 150 150 150 150 150 150 150 
##$DP07= 0
##$DPNAME0= <>
##$DPNAME1= <>
##$DPNAME2= <>
##$DPNAME3= <>
##$DPNAME4= <>
##$DPNAME5= <>
##$DPNAME6= <>
##$DPNAME7= <>
##$DPOAL= (0..7)
0.5 0.5 0.5 0.5 0.5 0.5 0.5 0.5 
##$DPOFFS= (0..7)
0 0 0 0 0 0 0 0 
##$DQDMODE= 0
##$DR= 18
##$DS= 0
$$ [...]
##$SUBNAM2= <"">
##$SUBNAM3= <"">
##$SUBNAM4= <"">
##$SUBNAM5= <"">
##$SUBNAM6= <"">
##$SUBNAM7= <"">
##$SUBNAM8= <"">
##$SUBNAM9= <"">
##$SW= 18.0517328524113
##$SWIBOX= (0..15)
0 0 2 0 0 0 0 0 0 0 0 0 0 0 0 0 
##$SW_h= 3612.71676300578
##$TD= 16384
##$TD0= 1
##$TE= 0
##$TE2= 300
##$TE3= 300
##$TEG= 300
##$TL= (0..7)
0 120 120 120 120 120 120 120 
##$TP= (0..7)
150 150 150 150 150 150 150 150 
##$TP07= 0
##$TPNAME0= <>
##$TPNAME1= <>
##$TPNAME2= <>
##$TPNAME3= <>
##$TPNAME4= <>
##$TPNAME5= <>
##$TPNAME6= <>
##$TPNAME7= <>
##$TPOAL= (0..7)
0.5 0.5 0.5 0.5 0.5 0.5 0.5 0.5 
##$TPOFFS= (0..7)
0 0 0 0 0 0 0 0 
##$TUNHIN= 0
##$TUNHOUT= 0
##$TUNXOUT= 0
##$USERA1= <user>
##$USERA2= <user>
##$USERA3= <user>
##$USERA4= <user>
##$USERA5= <user>
##$V9= 5
##$VALIST= <valist>
##$VCLIST= <CCCCCCCCCCCCCCC>
##$VD= 0
##$VDLIST= <DDDDDDDDDDDDDDD>
##$VPLIST= <PPPPPPPPPPPPPPP>
##$VTLIST= <TTTTTTTTTTTTTTT>
##$WBST= 1024
##$WBSW= 4
##$XGAIN= (0..3)
0 0 0 0 
##$XL= 0
##$YL= 0
##$YMAX_a= 131086
##$YMIN_a= -106423
##$ZGOPTNS= <>
##$ZL1= 120
##$ZL2= 120
##$ZL3= 120
##$ZL4= 120
##$ABSF1= 10
##$ABSF2= 0
##$ABSG= 5
##$ABSL= 3
##$ALPHA= 0
##$AQORDER= 0
##$ASSFAC= 0
##$ASSFACI= 0
##$ASSFACX= 0
##$ASSWID= 0
##$AUNMP= <proc_1d>
##$AZFE= 0.1
##$AZFW= 0.1
##$BCFW= 1
##$BC_mod= 2
##$BYTORDP= 1
##$COROFFS= 0
##$CY= 83.5205535888672
##$DATMOD= 1
##$DC= 2
##$DFILT= <>
##$DTYPP= 0
##$F1P= 10.8118882576601
##$F2P= -7.23987719738617
##$FCOR= 0.5
##$FTSIZE= 0
##$FT_mod= 4
##$GAMMA= 1
##$GB= 0.15
##$INTBC= 1
##$INTSCL= 1
##$ISEN= 128
##$LB= 0.25
##$LEV0= 0
##$LPBIN= 0
##$MAXI= 10000
##$MC2= 0
##$MEAN= 0
##$ME_mod= 0
##$MI= 1.114404
##$NCOEF= 0
##$NC_proc= 0
##$NLEV= 6
##$NOISF1= 3.799351
##$NOISF2= 2.8
##$NSP= 1
##$NTH_PI= 0
##$NZP= 0
##$OFFSET= 14.38212
##$PC= 1
##$PHC0= -5305.221
##$PHC1= 17.02193
##$PH_mod= 1
##$PKNL= yes
##$PPARMOD= 0
##$PSCAL= 0
##$PSIGN= 0
##$REVERSE= no
##$SF= 200.129724274929
##$SI= 16384
##$SIGF1= 3
##$SIGF2= 2
##$SINO= 400
##$SIOLD= 16384
##$SREGLST= <1H.CDCl3>
##$SSB= 0
##$STSI= 0
##$STSR= 0
##$SW_p= 3205.1282051282
##$SYMM= 0
##$S_DEV= 0
##$TDeff= 0
##$TDoff= 0
##$TI= <>
##$TILT= no
##$TM1= 0
##$TM2= 0
##$TOPLEV= 0
##$USERP1= <user>
##$USERP2= <user>
##$USERP3= <user>
##$USERP4= <user>
##$USERP5= <user>
##$WDW= 1
##$XDIM= 8192
##$YMAX_p= 0
##$YMIN_p= 0
$$ End of Bruker specific parameters
$$ ---------------------------------
##NTUPLES= NMR FID
##VAR_NAME=  TIME,          FID/REAL,        FID/IMAG
##SYMBOL=    X,             R,               I
##VAR_TYPE=  INDEPENDENT,   DEPENDENT,       DEPENDENT
##VAR_FORM=  AFFN,          ASDF,            ASDF
##VAR_DIM=   8192,          8192,            8192
##UNITS=     SECONDS,       ARBITRARY UNITS, ARBITRARY UNITS
##FACTOR=    0.0002768,     1,               1
##FIRST=     0,             0,               0
##LAST=      2.2672688,     0,               0
##MIN=       0,             -106423,         0
##MAX=       2.2672688,     131086,          0
$$ Real data points
##PAGE= N=1
##DATA TABLE= (X++(R..R)), XYDATA
0 0 0 0 0 0 0 0 0 0 0 0 0 0 0 0 0 0 0 0 0 0 0 -1 8 -8 8 -8 8 -8 9 -14 16 -16 17 -22 24 -26 32 -33 38 -42 47 -52 58
43 58 -63 71 -79 87 -96 106 -117 129 -142 156 -173 189 -212 233 -260 290 -328 369 -423 490 -574
64 -574 691 -860 1120 -1594 2724 -11861 10308 61044 81466 79278 47757 6044 -34438 -55057
78 -55057 -52742 -26413 9162 40914 53124 41998 8828 -31999 -66157 -78591 -64829 -27194
90 -27194 19983 61285 82046 75885 44254 1355 -37648 -59038 -55012 -28412 8843 41215 55071
103 55071 43944 11222 -31016 -66075 -80210 -66365 -27210 22436 67309 90944 85440 52273
115 52273 3528 -43115 -71444 -71977 -46481 -3506 38006 61821 59608 30458 -14370 -57171 -81423
128 -81423 -77090 -43253 7864 59588 93789 98742 70302 20650 -33832 -75036 -88863 -71397
140 -71397 -29886 18565 57685 69231 52856 12751 -32890 -69683 -81543 -60996 -17029 37075
152 37075 81970 99841 86005 43848 -11931 -63495 -90579 -88056 -56138 -7410 39870 68357
164 68357 69438 42745 -2050 -44709 -70713 -67924 -38174 8366 55064 83790 86446 60164 11728
177 11728 -39071 -77365 -90001 -72393 -33009 15057 52177 68135 56379 25066 -14221 -46211
189 -46211 -58225 -44852 -11643 28909 61625 73476 59634 24151 -20043 -59009 -77468 -71257
201 -71257 -42067 -2572 35414 56680 56017 34895 2841 -26969 -43743 -39640 -17823 13339 41747
214 41747 54467 48267 22200 -12849 -45477 -65091 -62870 -39199 -6267 27875 49619 52566 36800
227 36800 9902 -17379 -34805 -33551 -16558 8834 33371 45932 39976 17384 -14337 -43876
239 -43876 -60350 -57473 -35167 -2238 30842 51663 53061 36789 9319 -19645 -36487 -36647 -20227
252 -20227 6952 32106 46093 41368 19041 -14128 -46206 -64709 -62394 -39202 -2545 34902
264 34902 60448 65261 48255 15968 -19098 -44292 -50479 -35669 -6015 26478 48654 51195 32040
277 32040 -2497 -39717 -66397 -71338 -52261 -14683 28593 62951 76581 65080 32476 -8720
289 -8720 -44274 -61380 -54637 -27094 9916 42042 56747 47948 18323 -21040 -55726 -72209 -63774
302 -63774 -31865 12347 54308 78803 77784 52314 10685 -32685 -62365 -67647 -49678 -14815
314 -14815 23881 50363 55810 37837 3478 -33418 -60039 -64865 -45397 -8035 34078 66555
326 66555 77646 63639 29111 -13375 -49830 -67641 -61799 -35618 515 32767 49846 44795
338 44795 22034 -10025 -38675 -52447 -45781 -19495 14954 46162 64073 60034 35741 689
350 689 -34178 -56676 -58372 -42216 -13785 17813 38758 42504 29257 4248 -21291 -37086 -38038
363 -38038 -20315 6240 33383 50607 50888 33226 4313 -26024 -47936 -53758 -41857 -17319 10301
376 10301 31102 37765 28910 9087 -12994 -28297 -29863 -17322 5292 28291 43203 42341 27014
389 27014 899 -26707 -46802 -51245 -38396 -14445 12929 33052 39476 30215 9889 -13187 -29090
402 -29090 -31407 -18654 4272 28568 44466 44108 26928 400 -31267 -51754 -57407 -43602 -16279
415 -16279 15496 40513 49670 40905 17748 -10013 -32319 -40027 -29646 -6022 22010 44004 50208
428 50208 37178 8527 -26035 -52175 -64055 -54142 -27307 8912 40595 58556 55194 33480
440 33480 551 -28735 -45731 -44283 -23928 6324 35117 51029 47480 23860 -9617 -43242
452 -43242 -63586 -63561 -41555 -5997 32319 59285 66121 51268 19958 -15262 -42888 -51569 -42201
465 -42201 -15966 16122 40020 49411 37028 9209 -24072 -50514 -61176 -49693 -21292 15719
477 15719 47872 64141 59509 35910 1911 -29741 -48901 -48876 -31690 -3815 22875 40024 38126
490 38126 21801 -6336 -33545 -48432 -46410 -27345 2916 33172 53220 55907 40709 13062
502 13062 -17212 -39257 -46384 -37062 -15491 9613 27834 32930 22805 3211 -19243 -34598 -37139
515 -37139 -24618 -1609 23797 42634 47594 36925 15022 -11412 -32343 -40928 -35482 -18570 3750
528 3750 20364 27027 21298 5392 -13044 -26867 -29926 -19062 530 22987 37856 42145 30957
541 30957 10726 -13532 -33379 -40753 -34799 -16216 5208 21880 28137 22976 7049 -12318 -27346
554 -27346 -30327 -19801 -372 22844 40563 44952 34168 11016 -16468 -38364 -48129 -41672 -21951
567 -21951 4139 26357 37414 33239 15918 -7552 -27582 -36009 -29010 -8929 17187 39470 49007
580 49007 41937 19351 -10997 -38815 -54262 -52132 -33307 -4030 24780 43375 45489 30895 5269
593 5269 -20829 -37086 -38367 -22482 3061 29920 47403 48095 30736 1223 -29706 -52510 -58869
606 -58869 -45422 -18977 14578 41019 52403 44430 22780 -6345 -30646 -42089 -35831 -15048
618 -15048 12991 35866 46035 38703 16454 -13264 -40525 -54523 -50473 -29761 190 30495
630 30495 48934 51005 36335 10346 -16775 -35028 -38790 -26848 -4299 19547 34998 36565 22925
643 22925 -897 -26196 -43648 -46572 -33638 -9267 18307 39458 47599 39550 19464 -4769 -25556
656 -25556 -34626 -30028 -13618 6277 23005 28491 21924 4673 -15636 -31821 -37862 -28909 -10511
669 -10511 12458 30923 40806 35678 21216 -394 -19966 -28971 -28005 -15884 729 15829 22450
682 22450 18345 5067 -11982 -26099 -30844 -24227 -7623 12807 30160 37859 33389 18037 -2267
695 -2267 -20445 -30223 -28517 -16422 717 15985 23132 19233 6032 -11347 -25816 -31084 -24334
708 -24334 -7434 14186 32574 41096 36238 19411 -3567 -24162 -36355 -35379 -22509 -2436 16894
721 16894 26911 25835 13798 -5394 -23628 -33518 -30123 -14129 8767 31009 43497 42400 26796
734 26796 1824 -23235 -40795 -44357 -33089 -11259 12740 30500 35363 26129 6430 -15834 -32172
747 -32172 -35364 -24293 -2461 22204 40995 45850 35789 12826 -14820 -38480 -49048 -43763 -24515
760 -24515 2145 25692 38822 36886 21537 -1433 -22686 -34383 -31658 -15737 7677 29654
772 29654 41966 39702 22959 -2508 -27902 -44502 -46664 -33858 -10528 14914 33791 39639 31391
785 31391 12514 -9055 -25551 -30769 -22749 -5066 15466 30851 34875 25613 6253 -16608 -34816
798 -34816 -41843 -35132 -17251 5446 25413 35631 33365 19974 1203 -15981 -24833 -22988 -11342
811 -11342 5210 19994 26586 21929 8118 -10064 -26987 -34040 -30812 -17069 2126 19371 29784
824 29784 30414 20903 4756 -10361 -19450 -19694 -11653 2011 13481 20065 17667 6509 -8655 -22238
838 -22238 -28953 -25932 -13751 3517 19549 29238 29046 19233 3958 -11105 -20566 -20964 -12583 698
852 698 13337 20138 17750 6937 -8523 -22580 -29864 -26596 -13803 4658 22250 32892 32731 22105
866 22105 4633 -13358 -25209 -26456 -18356 -3887 12546 22293 22974 12659 -2703 -20125 -30522
879 -30522 -30442 -18728 93 20602 35972 38077 28336 10301 -10369 -27536 -32486 -28831 -12285
892 -12285 7092 22128 27534 22401 6724 -12751 -26781 -32658 -25445 -9036 13280 31958 40561
905 40561 36276 19642 -3037 -24179 -36888 -36010 -24654 -3663 15909 28429 28475 18273 -80
918 -80 -17858 -29792 -29637 -17373 1941 22262 35373 37949 26697 7284 -15240 -31724 -37595
931 -37595 -31230 -14897 4745 21502 29112 25099 11611 -5549 -20605 -26388 -20243 -5938 11300
944 11300 26101 33057 27215 12331 -6380 -24462 -33217 -32426 -20144 -3064 14094 24627 25637
957 25637 17119 2993 -10997 -19423 -19214 -10249 3679 17153 24694 23370 13288 -2274 -17709
970 -17709 -27473 -28532 -20258 -5985 9265 20150 23151 17560 6384 -5978 -14319 -15385 -8928 1000
984 1000 12560 19347 18558 10300 -2830 -16089 -24552 -25334 -17587 -4381 10012 19911 22582 17213
998 17213 6209 -5795 -13778 -15640 -10045 878 11571 18936 18027 10137 -3763 -16955 -25828 -26421
1012 -26421 -18376 -4087 10817 23565 26972 20200 9409 -6048 -16646 -20232 -15074 -3397 9676
1025 9676 19305 21221 14131 466 -14665 -25951 -28834 -21724 -7400 10468 23932 30712 26598
1038 26598 14484 -2382 -17041 -24719 -22453 -11515 4002 16141 23515 20113 8280 -8112 -22575
1051 -22575 -30371 -27403 -14635 3792 21402 32348 32908 22670 5515 -12475 -25620 -27676 -21402
1064 -21402 -6224 9363 20538 24203 16393 2387 -13924 -25331 -28081 -20468 -4880 13106 27802
1077 27802 33026 27660 12489 -4760 -20296 -28047 -26313 -15364 -277 13542 21425 19796 10048
1090 10048 -3763 -15822 -23537 -21070 -9846 5547 19396 27878 27164 17487 2086 -13591 -24205
1103 -24205 -26361 -19897 -7286 6407 16215 18885 13807 3283 -8260 -16395 -17400 -11090 372
1116 372 12607 21333 22925 16541 4571 -8932 -19276 -23200 -19339 -9665 2393 11869 16142 13277
1130 13277 5739 -4094 -11409 -13587 -8485 6 9992 17192 18908 12957 3088 -8601 -18044 -21323
1144 -21323 -17131 -8478 3235 11983 15273 13363 5762 -3220 -10553 -12742 -8969 -214 9367 16488
1158 16488 17748 12836 2550 -9378 -19327 -22738 -18770 -8773 3543 13790 18808 16652 8496 -2275
1172 -2275 -11229 -15191 -12285 -3546 7496 16663 19828 15451 5095 -8278 -19756 -25173 -22335 -12276
1186 -12276 1642 14590 22179 21961 14145 1820 -10089 -17583 -17398 -10063 1788 13402 20607 19168
1200 19168 11237 -2750 -15812 -25598 -26832 -17433 -4039 11403 22766 25657 21179 9572 -4746
1213 -4746 -16195 -20691 -16964 -6629 5879 15928 19941 15193 4406 -9041 -20337 -25268 -21557
1226 -21557 -10326 4565 18078 25629 24744 15946 2395 -10814 -19322 -20280 -13644 -2299 9223
1239 9223 16569 16820 10027 -1424 -12997 -20379 -20595 -13526 -1254 11892 21292 23897 18605 7523
1253 7523 -4987 -15115 -19440 -16548 -8103 2643 10980 14483 11293 3528 -6372 -13626 -16951 -13047
1267 -13047 -3283 7481 16246 20166 17529 9020 -1925 -11389 -16075 -15777 -9871 -279 7012 10999
1281 10999 9938 4416 -3198 -9928 -12442 -10036 -3135 5843 13537 17052 14768 7656 -1902 -10498 -15463
1296 -15463 -13964 -9012 -910 6574 10205 9651 4676 -2405 -8979 -11443 -9312 -2555 6006 13439 16788
1311 16788 14422 7062 -2756 -11823 -16807 -16300 -10276 -1357 7291 12391 12334 7147 -285 -8730 -11950
1326 -11950 -11168 -4867 4681 13219 17832 16441 9081 -1784 -12044 -18972 -19534 -13827 -3795 6822
1340 6822 14358 16587 12322 3405 -6195 -13153 -14391 -9427 -297 10087 17170 18362 13054 3361 -9704
1355 -9704 -18572 -21431 -18591 -8468 2732 13731 19230 17552 9759 -666 -10091 -15831 -13849 -6612
1369 -6612 3725 13010 17725 15963 8353 -3267 -15149 -20470 -20571 -12793 -2179 9331 18085 19724
1383 19724 15001 5656 -4999 -12912 -15329 -11326 -3111 6535 13544 15374 10973 1903 -8497 -16530
1397 -16530 -19246 -15319 -6514 4957 13451 18846 16990 9994 -55 -8685 -13545 -12507 -7343 836
1411 836 8651 11900 10373 4851 -3660 -11336 -15204 -13940 -7997 1250 10599 15157 15894 10662 2944
1426 2944 -5240 -10841 -11833 -8847 -2092 4712 8754 8419 5087 -1784 -8321 -11377 -11106 -6164 1035 8319
1442 8319 13239 13751 10592 3236 -4441 -9433 -11174 -8030 -2764 3220 7233 8214 4529 -1461 -6676
1457 -6676 -10733 -9919 -5372 1555 8449 13418 13732 9814 2297 -5138 -10715 -12229 -9409 -3401 3094
1472 3094 8310 9317 6063 6 -6699 -10525 -10926 -6586 614 7937 13741 15108 11908 3225 -4800
1487 -4800 -12090 -14645 -12442 -6228 1948 8698 11560 9583 3508 -3869 -10234 -12354 -9259 -3154 5852
1502 5852 12996 16567 13469 6839 -2811 -10691 -16048 -15889 -10231 -2047 7366 12979 12697 8842 855
1517 855 -7047 -12201 -12410 -7735 1149 9152 14861 15481 10615 1368 -7519 -14806 -16678 -14218 -6244 4153
1533 4153 10043 14076 12169 6694 -1938 -8430 -11509 -8496 -2745 4956 10874 13269 11720 4403 -3435
1548 -3435 -11369 -16223 -15034 -9209 -733 7615 12634 13634 9235 2751 -4092 -9026 -9719 -6274 -456
1563 -456 5872 10402 10408 6325 218 -7727 -12008 -13010 -9826 -2853 4149 9803 11603 10271 4922 -1668
1579 -1668 -6135 -8070 -6838 -2422 2799 6773 7801 5461 407 -5322 -9772 -10788 -8201 -2559 3778
1594 3778 8462 10943 9091 5209 -780 -5168 -7209 -6183 -2703 2239 5050 6400 5358 819 -5351
1609 -5351 -8458 -10216 -7767 -2101 3733 8909 10807 9584 4984 -1022 -5688 -7971 -7238 -3276 1440
1624 1440 5745 7137 5484 1217 -4342 -8828 -10179 -7815 -2798 3785 9576 12213 10935 6117 -534
1639 -534 -6369 -10055 -9646 -5834 38 5371 8442 7716 3562 -2354 -7954 -10785 -9920 -5020 1909 8754
1655 8754 13109 13213 8872 1835 -5597 -10879 -12294 -9507 -3481 3328 8398 9757 7307 1546 -4857
1670 -4857 -9711 -10967 -7879 -1620 5821 11623 13773 11478 5162 -2619 -9463 -13051 -12156 -7367 -340
1685 -340 5986 10073 9656 5640 -489 -6407 -9684 -9200 -4656 2168 7853 12147 11766 7629 1058 -6433
1701 -6433 -11476 -12393 -9146 -3469 2224 8201 10249 7880 3304 -2310 -6788 -8211 -6235 -1409 4303
1716 4303 9126 10422 8023 3195 -3284 -8488 -11036 -9826 -5986 -189 5541 8575 8258 5308 441
1731 441 -3807 -6555 -5322 -2725 1974 5718 7816 7196 3184 -1872 -6633 -9268 -8745 -5660 -739 4219
1747 4219 7338 7645 5419 1586 -2617 -4939 -4991 -2734 1151 4543 6174 5609 2565 -2000 -6073 -8364
1763 -8364 -8114 -5082 -510 4169 7250 7765 5490 1640 -2445 -4941 -5300 -3137 519 4100 6129 5651
1779 5651 2642 -1774 -6263 -8684 -8352 -5235 -255 4858 8324 9083 6628 2245 -2623 -6093 -6978 -4886
1795 -4886 -950 3427 6513 6919 4395 -265 -5415 -8858 -9728 -6889 -1757 4145 8854 10735 8960
1810 8960 4518 -1422 -6075 -8786 -7928 -4295 667 5426 7689 6495 2707 -2761 -7568 -9044 -8439
1825 -8439 -4108 1570 7339 10968 10563 7207 1345 -4624 -8399 -9741 -7232 -2347 3365 7352 8292
1840 8292 4574 278 -4674 -8211 -9292 -6168 -1128 4682 8658 10817 8932 4674 -1176 -7312 -10331
1855 -10331 -9357 -4535 -159 4615 7020 6589 3682 -868 -5399 -7382 -6711 -3199 1706 6534 8959
1870 8959 9203 5291 409 -5078 -7906 -9217 -6473 -2303 2086 5343 6437 5032 1252 -2520 -5206
1885 -5206 -5530 -3562 222 4245 7065 7298 5244 1218 -3261 -6678 -7810 -6411 -3258 819 4088
1900 4088 5366 4733 2115 -1078 -3658 -4355 -3038 -236 3086 5470 6091 4264 944 -2825 -5993 -7137
1916 -7137 -5931 -2931 806 3833 5513 4695 2442 -733 -3320 -4107 -3048 -224 2904 5177 5679 3927
1932 3927 748 -3015 -6037 -6959 -6129 -3687 1095 4436 6216 6011 3026 -381 -3568 -4770 -4556 -1353
1948 -1353 2143 4837 6729 5578 2065 -2934 -6124 -8095 -7291 -4258 528 4751 7293 7450 5009
1963 5009 904 -3058 -5677 -5767 -3787 227 3988 6366 6167 3664 -717 -5255 -8321 -7961 -5435 -2005
1979 -2005 3390 7544 9041 7515 3255 -1371 -5195 -6694 -5541 -2630 1692 5136 6648 5295 1795
1994 1795 -2709 -6494 -8579 -7308 -3811 1378 5820 8413 8411 5788 1423 -3016 -6465 -7158 -5017 -959
2010 -959 3078 5357 5786 3733 72 -4088 -6635 -7078 -4725 -687 3714 7025 8135 6570 2941 -1624
2026 -1624 -5085 -6723 -6006 -3134 181 3503 4846 4080 1643 -1670 -4430 -5481 -4601 -1503 2004 5248
2042 5248 6790 6132 3447 -109 -3572 -5595 -6232 -4574 -603 2167 3981 3977 2281 -433 -2828 -4232
2058 -4232 -3808 -1663 1123 3949 6077 5200 3232 259 -2703 -5693 -5370 -3978 -912 2084 3362 3312
2074 3312 2143 105 -2383 -3420 -3263 -1344 1275 3924 5153 4937 2694 -286 -3626 -5174 -5568 -4015
2090 -4015 -1325 2116 3571 4548 2833 144 -1699 -3757 -3448 -917 1429 4564 5506 5375 3419 283
2106 283 -3533 -6323 -6681 -5100 -1862 1597 4373 5365 4430 2102 -1240 -3886 -4859 -3125 -812 2796
2122 2796 4849 5498 4391 1433 -2678 -5686 -7173 -6342 -3247 336 4320 6263 5996 3704 303 -3063
2138 -3063 -4956 -4945 -2610 704 3936 5778 5618 3132 -607 -4463 -7026 -7264 -5014 -1396 2863 5937
2154 5937 6813 5570 2607 -1244 -4271 -5358 -4450 -1759 1725 4395 5398 4255 1329 -2370 -5310
2169 -5310 -6803 -5686 -2873 1019 4583 6481 6441 4110 664 -2741 -4695 -4990 -3318 -292 2486 4186
2185 4186 4203 2404 -628 -3475 -5282 -5258 -3395 -322 3051 5414 5994 4621 1942 -1169 -3661 -4560
2201 -4560 -3836 -1686 936 2901 3352 2521 405 -2097 -3911 -4256 -3060 -667 2132 4239 5062 4261
2217 4261 2061 -645 -2905 -4040 -3621 -1935 245 2097 2896 2333 587 -1500 -3022 -3502 -2535 -389
2233 -389 2077 4102 4691 3834 1751 -883 -3197 -4190 -3803 -2091 211 2116 2963 2558 839 -1364 -3054
2250 -3054 -3688 -2770 -683 2037 4128 5032 4296 2067 -923 -3560 -4853 -4586 -2760 -118 2339 3651
2266 3651 3455 1854 -545 -2839 -3980 -3511 -1446 1456 4022 5219 4917 2996 -203 -3389 -5392 -5570
2282 -5570 -4049 -1225 1953 3998 4666 3440 945 -1816 -3901 -4209 -2869 -294 2733 4957 5500 4129
2298 4129 1261 -2386 -5008 -6261 -5489 -2862 462 3548 5076 4796 2838 -94 -2847 -4263 -4007 -2105
2314 -2105 891 3630 5027 4620 2546 -554 -3732 -5688 -5884 -4110 -1074 2283 4554 5268 4220 1732
2330 1732 -1242 -3259 -4041 -3029 -956 1729 3692 4207 3178 696 -2188 -4413 -5204 -4408 -2143 932
2346 932 3491 4832 4487 2760 221 -2075 -3526 -3205 -1856 339 2335 3297 2897 1221 -1005 -3177
2362 -3177 -4294 -3839 -2085 259 2758 4111 4241 2819 827 -1350 -2777 -3045 -1995 -165 1425 2496
2378 2496 2291 1061 -763 -2687 -3415 -3357 -1752 431 2636 3923 3920 2611 711 -1366 -2759 -3129 -2034
2395 -2034 -448 1176 2553 2355 1140 -741 -2596 -3577 -3250 -1854 532 2642 4233 4295 2977 704
2411 704 -1571 -3243 -3703 -2743 -824 1199 2617 2839 1804 -90 -2112 -3510 -3608 -2268 -63 2609
2427 2609 4388 4539 3534 1278 -1428 -3626 -4485 -3753 -2009 547 2498 3350 2906 1262 -1345 -3394
2443 -3394 -4006 -3277 -1006 1897 3860 4927 4730 2654 -269 -3154 -4889 -4931 -3418 -717 1844 3784
2459 3784 3969 2619 399 -2082 -3623 -3854 -2456 158 2804 4585 4878 3538 910 -1948 -4296 -5171
2475 -5171 -4315 -2101 689 3084 4132 3701 1981 -574 -2563 -3589 -3058 -1272 1230 3335 4298 3771
2491 3771 1815 -844 -3318 -4710 -4526 -3002 -527 2045 3592 3865 2830 765 -1344 -2708 -2858 -1910
2507 -1910 44 2046 3211 3296 2017 85 -2094 -3686 -4058 -3084 -1038 1125 2910 3544 3027 1399
2523 1399 -530 -1891 -2472 -1843 -355 1174 2478 2562 1784 22 -1903 -3223 -3539 -2709 -938 1012 2700
2540 2700 3427 2797 1363 -396 -1773 -2329 -1945 -549 1058 2200 2333 1659 110 -1820 -3127 -3586 -2624
2557 -2624 -1010 1178 2956 3594 3142 1659 -385 -1914 -2760 -2386 -959 693 2121 2621 2118 509
2573 509 -1603 -3083 -3701 -3195 -1276 1161 3136 4117 3808 2309 -52 -2083 -3445 -3431 -1990 -54 1937
2590 1937 3005 2957 1432 -619 -2698 -4004 -3768 -2119 322 2711 4380 4550 3410 1078 -1552 -3458
2606 -3458 -4078 -3198 -1382 977 2800 3434 2625 766 -1602 -3312 -3794 -3079 -899 1628 3656 4574 3940
2623 3940 2019 -611 -2907 -4340 -3783 -2584 -527 2009 3251 3222 1922 -196 -2162 -3300 -3183 -1786
2639 -1786 368 2590 4004 4187 2878 612 -1798 -3523 -4193 -3293 -1454 794 2441 3076 2409 986
2655 986 -860 -2323 -2872 -2150 -445 1526 3041 3586 2804 963 -1060 -2873 -3594 -3285 -1947 -27 1652
2672 1652 2631 2488 1514 -148 -1681 -1964 -1924 -751 910 2153 2760 2064 949 -1070 -2428 -3189 -3015
2689 -3015 -1761 -60 1676 1826 2552 1837 16 -890 -1785 -1470 -971 1165 2061 2859 1815 986 -685
2706 -685 -2539 -2984 -3243 -1559 -534 1960 2840 2642 1881 40 -1032 -1537 -2504 -707 425 2521 2329
2723 2329 2947 897 -1269 -2954 -3529 -3063 -1722 -32 1912 3198 3238 2867 432 -1210 -2362 -2601 -1972
2740 -1972 -168 1438 2871 2779 1773 -106 -2096 -3505 -3775 -2805 -953 1512 3174 3895 3496 1733
2756 1733 -342 -2369 -3129 -2844 -1329 416 2196 2984 2716 1131 -1074 -2830 -3713 -3343 -1797 514
2772 514 2678 3855 3904 2677 506 -1601 -2989 -3453 -2493 -724 1311 2558 2867 1875 118 -1765 -3191
2789 -3191 -3295 -2362 -423 1745 3386 3877 3182 1579 -724 -2469 -3328 -3064 -1698 183 1770 2519 2198
2806 2198 969 -533 -2046 -2815 -2307 -995 875 2404 3278 3023 1849 -88 -1757 -2919 -2937 -2025 -544
2823 -544 1004 1959 2030 1354 -35 -1399 -2159 -1908 -1052 472 1771 2761 2651 1693 38 -1505 -2560 -2663
2841 -2663 -1925 -684 589 1703 1970 1257 171 -1071 -1731 -1770 -944 326 1851 2455 2326 1479 -32
2858 -32 -1688 -2535 -2788 -2042 -789 784 1845 2143 1459 340 -851 -1844 -1942 -1055 303 1651 2578 2406
2876 2406 1762 119 -1688 -2903 -3139 -2430 -921 831 2000 2632 1933 636 -1059 -1875 -2230 -1971 -315
2893 -315 1355 2649 3192 1415 492 -704 -2934 -3926 -3374 -1697 288 2298 3080 2837 1787 5 -1623
2910 -1623 -2542 -2536 -1265 255 1840 2837 2773 1557 -431 -2105 -3511 -3479 -2398 -536 1629 3155 3497
2927 3497 2723 1184 -738 -2368 -2841 -2145 -823 993 2182 2659 2182 539 -1360 -2675 -3295 -2784 -1218
2944 -1218 754 2524 3240 3149 1909 119 -1596 -2490 -2553 -1702 -141 1368 2186 2139 1168 -298 -1851 -2676
2962 -2676 -2476 -1555 89 1710 2798 2972 2084 612 -966 -1999 -2419 -1954 -645 555 1596 1804 1164
2979 1164 -64 -1070 -1896 -2048 -1390 -122 1225 2444 2638 2004 782 -702 -1760 -2226 -1868 -874 348
2996 348 1311 1636 1240 198 -913 -1758 -1832 -1233 -180 1219 2153 2495 1890 628 -676 -1963 -2148 -1896
3014 -1896 -932 370 1329 1804 1353 454 -744 -1650 -1820 -1325 -182 1185 2313 2641 2135 807 -762
3031 -762 -2153 -2634 -2323 -1206 203 1535 2146 1890 1013 -364 -1633 -2090 -1761 -681 827 2316 2813
3048 2813 2385 1353 -448 -1876 -2859 -2867 -1868 -379 1249 2312 2484 1847 416 -1038 -2069 -2253 -1523
3065 -1523 12 1622 2529 2758 1874 258 -1438 -2786 -3205 -2559 -1111 625 2067 2817 2372 1253 -219
3082 -219 -1610 -2244 -2087 -922 657 1943 2550 2161 1019 -597 -2126 -2962 -2797 -1807 -153 1559 2511
3099 2511 2710 1863 583 -947 -1914 -2139 -1497 -206 1100 1984 2116 1323 -27 -1263 -2413 -2705 -1895
3116 -1895 -603 813 2096 2453 2033 1074 -369 -1312 -1810 -1645 -699 460 1375 1786 1387 343 -893
3133 -893 -1766 -2103 -1777 -635 565 1805 2260 1958 1019 -70 -1195 -1683 -1517 -750 132 1009 1370 1210
3151 1210 403 -689 -1522 -1967 -1430 -558 617 1731 2162 1995 1044 -53 -1113 -1650 -1545 -861 138 1075
3169 1075 1505 1200 566 -611 -1475 -1899 -1572 -593 638 1880 2255 2049 1332 -61 -1259 -2113 -2010 -1263
3187 -1263 -71 903 1762 1504 948 -342 -1346 -2081 -1853 -1072 357 1694 2502 2501 1893 934 -757 -2176
3205 -2176 -2645 -1662 -847 538 1539 2003 1505 732 -1035 -1976 -1985 -1416 -467 1134 2192 2528 2014 976
3223 976 -662 -1917 -2585 -2516 -1441 82 1321 2262 1487 1377 396 -749 -2354 -1795 -802 217 1633
3240 1633 2811 2211 1900 309 -1176 -3018 -2476 -1937 -926 782 1470 2483 1568 782 -706 -1259 -1897
3257 -1897 -1088 -528 981 1683 2448 1607 411 -833 -1908 -2191 -1930 -973 227 1353 2013 1939 1123 49
3275 49 -985 -1423 -1281 -689 325 1258 1771 1341 616 -501 -1516 -1982 -1852 -1120 35 1050 1818 1650
3293 1650 1477 370 -703 -1128 -1196 -749 309 1059 1300 1323 565 -468 -1407 -1721 -1619 -994 78 1103
3311 1103 1647 1761 1253 276 -684 -1163 -1346 -815 75 857 1352 1271 597 -418 -1303 -1840 -1731 -895 24 1082
3331 1082 1851 2048 1399 446 -655 -1465 -1732 -1223 -236 798 1492 1492 933 12 -1063 -1932 -2098 -1409 -271
3350 -271 1015 2014 2269 1834 911 -457 -1571 -2000 -1761 -837 339 1204 1685 1465 615 -514 -1607 -2021
3368 -2021 -1692 -848 590 1780 2353 2179 1411 16 -1230 -2045 -2150 -1492 -264 855 1631 1747 1133 5
3386 5 -1066 -1901 -1942 -1309 -114 1202 2042 2291 1810 585 -728 -1874 -2275 -1918 -923 284 1359 1707
3404 1707 1558 707 -334 -1254 -1701 -1411 -581 731 1560 2069 1816 927 -317 -1336 -1964 -1887 -1250 -94
3422 -94 931 1510 1632 1090 99 -786 -1222 -1288 -685 208 1192 1626 1597 1010 -115 -1142 -1676 -1789 -1257 -343
3442 -343 577 1267 1396 996 363 -503 -988 -1043 -652 364 817 1471 1201 800 38 -812 -1620 -1685 -1263 -372
3462 -372 613 1488 1625 1176 293 -559 -904 -1274 -594 -138 870 1364 1382 810 -21 -1012 -1591 -1800 -1253 -390
3482 -390 599 1386 1834 1394 627 -289 -1066 -1469 -1128 -342 596 1217 1594 1201 205 -845 -1656 -1856 -1668 -751
3502 -751 482 1395 1912 1820 1040 32 -931 -1691 -1426 -834 205 1107 1521 1436 785 -320 -1339 -1893 -1825
3521 -1825 -1088 40 1186 1867 2048 1549 497 -606 -1515 -1750 -1351 -531 662 1386 1675 1296 206 -774
3539 -774 -1767 -1845 -1501 -453 727 1713 2117 1815 891 -257 -1289 -1853 -1708 -958 40 929 1360 1330 767
3558 767 -170 -1110 -1534 -1408 -779 293 1212 1776 1787 1253 199 -909 -1521 -1564 -1321 -319 459 1183 1381
3577 1381 1108 -132 -520 -730 -1622 -562 310 600 2124 1476 805 700 -354 -691 -1856 -1398 -613 540
3595 540 799 949 791 298 -267 -1242 -938 -699 -82 722 1282 1469 991 399 -518 -1036 -1277 -1177 -692 333
3615 333 635 829 1072 597 497 -1068 -1010 -1107 240 515 1320 1402 1144 11 -403 -1114 -1633 -1307 -625 168
3635 168 847 1397 1300 689 -173 -808 -1129 -948 -420 417 1073 1506 1366 552 -559 -1339 -1737 -1656 -1040 -68
3655 -68 965 1501 1557 1168 206 -721 -1320 -1299 -835 89 899 1410 1473 887 -103 -1130 -1574 -1857 -1263 -330 539
3676 539 1191 1733 1369 517 -312 -725 -955 -1882 -650 872 1877 1249 1100 643 -47 -1762 -2025 -1202 -1407
3695 -1407 465 1839 1698 1505 958 81 -733 -1274 -1632 -1257 -225 560 1274 1432 704 -88 -861 -1558 -1518
3714 -1518 -1503 -292 673 1710 1763 1100 544 -500 -1080 -1353 -1123 -517 310 930 1213 708 165 -483 -1101
3733 -1101 -1229 -896 -284 612 1253 1490 1305 599 -274 -858 -1214 -1089 -676 41 592 1002 700 219 -387 -675
3753 -675 -1200 -841 106 624 855 1525 1135 1161 139 -1039 -1435 -1078 -571 -358 993 614 1120 358 -260
3772 -260 -986 -1010 -1364 -126 421 1350 1757 700 70 -617 -934 -1215 -1244 -614 -373 1061 1808 754 525
3791 525 -59 -678 -1060 -968 -454 348 891 1361 1298 819 -23 -938 -1482 -1480 -1254 -309 505 1192 1328 1063 265
3812 265 -468 -1059 -1124 -911 -104 879 1541 1252 1218 501 -588 -1307 -1587 -1520 -845 -537 990 1077 1045 1014 -587
3833 -587 -708 -1120 -792 -449 687 491 1542 1032 728 -366 -568 -1205 -1868 -1140 -216 307 942 2050 816
3852 816 46 -263 -1197 -1411 -924 87 356 1110 1578 939 -238 -1408 -1526 -1493 -1087 -519 371 1135 1381
3871 1381 1283 637 -86 -832 -1073 -1014 -350 327 564 935 489 360 -569 -1220 -1435 -962 -638 218 994 1340
3891 1340 1169 770 99 -732 -811 -1295 -139 177 43 1073 656 615 -191 -839 -1090 -875 -374 397 954 1346
3911 1346 310 1193 372 -681 -993 -906 -592 -43 703 1124 839 194 -144 -846 -966 -1028 -526 161 935 1253
3931 1253 1167 792 -55 -718 -1063 -1165 -802 -222 575 977 820 528 36 -732 -1043 -1101 -811 52 778 1288
3951 1288 1416 983 270 -465 -1175 -1317 -1042 -521 284 912 1270 844 378 -504 -688 -1234 -808 -175 1048
3970 1048 1743 1266 1105 773 554 -1513 -877 -930 -765 -709 702 1505 1375 758 -147 -622 -1239 -934 -378 451
3990 451 859 1357 1336 722 225 -658 -1249 -1530 -981 -425 563 1120 1542 944 211 -437 -708 -1094 -816 53
4010 53 735 1026 1143 1027 286 -426 -1021 -1353 -1047 -647 -97 747 1028 1162 676 9 -667 -476 -955 -678
4030 -678 55 930 1065 940 845 54 -264 -1361 -1011 -721 34 968 1073 1189 681 -66 -269 -918 -790 -469
4050 -469 -7 442 858 691 581 -118 -625 -1165 -1006 -733 -38 315 837 325 1186 675 -155 -159 -694 -385 6
4071 6 713 744 1183 307 10 -789 -1016 -1066 -600 -147 558 977 1237 849 400 -404 -809 -952 -758 -271 394
4092 394 799 849 537 30 -484 -496 -922 -905 -790 702 1328 1161 972 568 -247 -1476 -415 -1523 -143
4111 -143 112 929 902 659 76 -212 -797 -1053 -1245 -434 209 917 1279 1355 776 164 -758 -1179 -1181 -896 -294
4132 -294 512 953 1076 747 76 -526 -961 -1179 -770 -196 727 1139 1335 1111 352 -463 -1032 -1279 -1084 -659
4152 -659 145 610 953 779 460 -76 -1115 -953 -1507 -80 556 1284 1121 1184 467 -348 -771 -1788 -1477
4171 -1477 47 516 743 1701 1367 620 166 -535 -1013 -655 -386 29 1035 1218 937 235 -4 -542 -988
4190 -988 -771 -1209 -449 111 796 1235 722 176 -170 -416 -892 -869 -70 488 757 672 372 -3 -273 -1012 -1023
4211 -1023 -595 -271 393 895 884 885 425 -131 -609 -688 -600 -602 376 783 898 493 258 -361 -807 -1258 -951 -281
4233 -281 256 807 940 729 284 -185 -628 -824 -718 -337 355 771 1044 951 260 -444 -846 -1248 -912 -620
4253 -620 2 809 1175 976 599 298 -520 -956 -717 -708 -129 424 1077 851 643 -121 -760 -975 -990 -798 -8
4274 -8 594 941 1216 1066 212 -531 -954 -897 -1050 -320 203 845 909 761 159 -387 -959 -1420 -938 -288 314
4295 314 1077 1303 1198 621 -111 -725 -1103 -1034 -689 -56 516 1004 974 475 -106 -213 -1018 -721 -353 -41 697
4316 697 1505 987 462 280 -38 -901 -920 -1105 -536 129 703 631 90 116 -432 -1140 -1211 -542 -86 538 766
4337 766 1056 814 362 -194 -851 -794 -925 -464 46 526 899 806 277 -156 -584 -738 -531 -273 142 659 1296
4358 1296 275 493 -128 -841 -991 -882 -636 86 462 810 593 219 -257 -356 -670 -430 -182 140 666 184
4378 184 322 283 355 -533 -1114 -671 -603 150 636 950 671 180 284 -432 -740 -654 -476 116 461 949 932 347
4400 347 60 -675 -1009 -1017 -798 -79 462 890 1056 771 214 -381 -766 -900 -624 -56 566 1017 1007 807 66
4421 66 -463 -1081 -1014 -1003 -515 380 936 1223 1021 546 -238 -733 -810 -923 -406 205 829 945 835 437 -228
4442 -228 -817 -1092 -1060 -672 118 525 1213 1305 825 84 -536 -831 -1037 -543 -244 465 1114 936 626 93 -710
4463 -710 -981 -903 -650 -203 398 1081 1133 1320 525 -169 -621 -1011 -797 -505 318 603 890 707 231 -144 -825
4484 -825 -913 -900 -176 371 737 938 786 526 -214 -661 -721 -790 -523 195 489 754 631 276 -12 -634 -564 -708
4506 -708 -373 42 857 704 1145 624 -110 -582 -759 -765 -177 222 139 571 1071 231 710 163 8 -662 -298
4527 -298 36 342 955 515 354 379 -446 -1083 -1197 -404 -628 511 1109 551 1537 260 -641 -797 -574 -314
4547 -314 131 681 2001 852 1356 65 -85 -417 -486 -1052 -232 674 329 85 937 -340 180 -792 -810
4566 -810 -65 -304 155 1203 1603 990 541 -255 -638 -1334 -863 -512 -249 654 621 963 501 333 -619 -552
4586 -552 -461 -1082 -303 536 1303 581 1095 -70 -902 -1551 -945 -822 -268 693 1069 1292 809 368 -191 -891
4606 -891 -1089 -1048 -440 -253 1476 946 396 50 -1141 -767 -1067 -699 -379 -87 627 960 1470 374 -86
4625 -86 -207 -851 -948 -183 -125 913 699 1088 373 -273 -564 -1114 -893 -344 124 676 937 1048 650 170 -168
4646 -168 -658 -825 -581 -62 302 617 747 30 -402 -506 -803 -795 -884 339 284 885 603 479 -93 -708 -432
4667 -432 -856 -576 -342 285 445 656 848 209 -484 -395 -673 -926 -345 197 606 1029 953 450 -711 -1383
4687 -1383 -1302 -630 81 -256 416 1355 228 -109 44 -398 -1527 -1130 -104 273 926 489 842 -455 177
4706 177 -233 -1151 -1256 -483 -721 473 984 866 772 257 -473 -248 -673 44 273 536 1911 193 692
4725 692 439 -550 -1301 -858 -1377 -323 218 1812 251 -21 149 -695 -501 -1350 -1805 -477 1243 1144 1264
4744 1264 1075 282 -349 -1169 -1390 -649 -672 467 234 934 1305 314 -101 -606 -1160 -1179 -178 63 762 890
4764 890 828 447 -253 -494 -1217 -1072 -648 -15 418 838 998 288 143 -240 -639 -495 -693 232 746 610
4784 610 873 386 4 -632 -675 -569 -697 -698 647 987 1000 609 1352 233 -627 -325 -322 -146 -110 790 592 504
4806 504 -127 -359 -764 -903 -683 -249 337 675 764 726 455 -124 -564 -762 -613 -245 71 357 662 515 186
4827 186 -265 -598 -858 -598 -253 410 904 601 917 683 58 -618 -859 -712 -365 301 921 616 608 -15 108
4848 108 -797 -1030 -628 -413 399 123 1071 1291 338 -120 -276 -6 -545 -861 -507 118 1166 1198 791 -350
4868 -350 -1231 -1072 -1215 -681 -162 1007 1336 798 825 78 -506 -494 -685 -711 605 554 -216 -17 -294 1167
4888 1167 716 -869 -640 -1280 -143 1173 1265 778 1196 785 -361 -1227 -186 -767 135 415 1061 998 1175
4907 1175 615 -170 -730 -677 -1110 270 -145 563 494 1273 915 -77 -1567 -1188 -1561 -379 147 -147 1400
4926 1400 322 120 -128 -933 -1211 -1261 -554 21 30 1818 891 223 -169 -438 -460 -1361 -1099 223 594 352
4946 352 644 490 -234 -1467 -770 -1080 -797 155 -53 -178 974 274 63 -474 -743 -1130 -678 -504 387
4965 387 496 926 82 434 218 -841 -490 -1790 -1 281 408 -85 377 -423 -182 -792 -1236 -673 -535
4984 -535 578 328 79 908 595 630 -924 -606 -1543 -1337 694 730 1184 957 -743 -557 482 -1001 -284
5003 -284 523 1610 -1 708 1178 -308 371 -956 -1257 283 415 267 -516 576 1130 95 -592 -498
5021 -498 -1562 -328 -917 -152 798 348 513 1610 72 -498 -234 -512 -1557 -399 -106 608 330 1030
5039 1030 327 -260 -441 -1685 -398 -1080 167 874 370 1758 1205 -549 -715 -587 -1332 -376 549 1505
5057 1505 -36 764 786 435 -1436 -971 -1360 -1026 211 99 -176 -571 1060 673 -589 -1014 -987 -345 -339
5076 -339 531 1201 525 1025 -291 -695 -1346 -808 -988 -657 59 962 1833 753 277 -104 -100 -857 -782 -1231
5096 -1231 424 767 779 329 421 -292 -775 5 -247 -145 527 199 440 1275 1255 309 -1290 -1452 -358 349
5116 349 210 726 1167 870 172 475 -570 89 -1133 -387 259 683 493 960 110 -258 -772 -1569 -987
5135 -987 -585 -74 692 34 265 947 1131 -1123 -460 -760 -214 832 670 630 1108 -122 240 -167 -1222
5154 -1222 -1256 -425 -49 465 707 1450 1175 -142 -51 -876 104 -1087 -463 119 339 904 367 704 -286 -1009
5174 -1009 -514 -658 -730 9 1304 565 716 653 59 -357 -1123 -1683 -603 -622 637 1134 1143 797 -1059 -997
5194 -997 -934 -1789 -55 815 458 783 530 485 360 40 -253 -1213 -391 284 -265 490 1110 518 970 100
5214 100 -842 -483 -559 -341 105 1901 675 1083 79 621 -773 -899 -255 -814 95 -50 106 225 -88
5233 -88 -359 -433 -631 -1215 -663 -34 345 964 1258 754 428 -85 -601 53 -561 763 964 673 491 439 -118
5254 -118 -215 -397 -1454 -318 -158 351 913 850 578 236 -1173 -128 -558 -30 -201 302 762 576 275
5273 275 -312 184 -1497 -335 176 423 596 609 778 1158 -278 133 -130 -1150 -192 -144 -662 -374 88
5292 88 1918 -323 -70 -1240 -1102 544 -718 76 405 2056 1085 341 -425 -499 -1021 -795 -817 307 232
5311 232 1538 799 150 -110 203 -559 -948 239 432 672 950 267 981 -578 -1148 -914 -1002 -689 155
5330 155 601 938 614 493 334 -45 -658 -1213 -131 210 628 982 902 230 358 -527 -763 -1088 -534 -170
5350 -170 512 570 442 943 420 244 -947 -1088 -698 -430 504 1027 979 1064 540 -684 -606 -890 -626 -443 127
5371 127 406 755 758 613 233 -451 -137 -453 -323 158 748 1202 438 269 -323 -277 -780 -167 -102 394 605
5392 605 603 502 1126 -30 -82 -283 -384 -1132 -542 1289 706 -72 504 -351 -651 -1266 -313 -495 481 -1325
5412 -1325 168 664 460 -789 -205 -877 523 -360 191 360 27 439 360 -416 -545 272 -986 -791 -203
5431 -203 759 771 878 110 545 -292 635 -1296 -241 -895 191 743 458 163 975 779 -353 -531 -693
5450 -693 275 375 533 878 687 -82 -764 -534 181 -931 -759 -324 180 1088 964 47 -295 -418 -1233 -734
5470 -734 -1005 76 1074 456 1067 566 -597 -826 -1137 -1198 -368 -652 831 1869 1080 321 -150 395 -1154
5489 -1154 -929 339 -4 -388 413 955 951 238 -735 -1667 -692 -927 -1190 142 616 1128 1268 270 -657 -448
5509 -448 -571 -352 -186 158 563 382 615 345 -63 -136 -733 -815 -379 -29 535 864 1049 578 735 -576
5529 -576 -245 -216 -116 -242 325 1407 605 823 -60 -59 -1243 -956 -273 -111 41 1049 891 872 29 -202
5549 -202 -351 -167 -354 121 -28 631 825 -566 -938 -162 -1286 -933 -709 -105 -77 612 368 815 166 234
5569 234 -420 -269 -91 -849 1405 1550 -964 918 86 -563 -994 -316 -809 37 243 523 868 -350 444
5588 444 -232 -236 -671 346 -472 238 259 590 -42 -794 -370 -305 -434 -1553 82 217 178 235 1159 567 -325
5609 -325 -719 -707 -880 -749 -460 466 1016 661 98 -395 353 -331 -357 -506 984 717 1303 1033 885 29
5629 29 312 -254 -709 -228 209 304 440 665 301 -106 -243 -461 -968 -994 284 225 714 1126 340 322 -64
5650 -64 -387 -919 -611 -25 175 753 1311 734 61 114 -490 -1027 -907 -4 223 516 602 726 -1 -136 175
5671 175 -528 -575 -239 -398 1071 -24 841 462 10 -737 -94 -349 -512 91 76 141 1239 932 -317 509
5691 509 -1053 -711 -354 -127 318 917 434 524 700 -734 -111 -733 -413 -216 532 637 296 420 238 -675
5711 -675 -469 -748 -709 -789 398 753 -45 832 314 431 -578 -1043 -893 242 76 -25 398 491 -234 65
5731 65 -449 16 37 -275 510 -270 1023 1062 -100 -25 -85 24 -788 29 251 561 254 619 749 -262 -809
5752 -809 -898 -729 -67 -659 627 -198 706 852 -366 -612 -136 -418 -71 -341 40 829 573 217 197 732
5772 732 -1144 -1705 -819 159 -378 455 918 304 -308 753 -816 -715 -422 -442 -194 393 688 -11 329
5791 329 304 -813 -873 -246 -480 -694 1039 1079 303 478 -162 -1067 -446 -438 -332 -35 829 785 217 828 196
5812 196 -76 -366 -1385 -683 519 826 572 814 734 462 13 -433 -1034 -1010 -80 -192 224 454 499 189
5832 189 -344 -685 213 -277 -212 -103 261 940 551 -167 199 -647 -780 202 -922 497 -247 643 756 643
5852 643 -313 -287 -772 -822 -296 -461 670 592 715 45 44 -500 -427 -359 -243 23 510 154 644 366 74 -610
5874 -610 -232 -582 -714 255 560 724 305 226 108 -477 -361 -632 -460 -324 249 1143 -76 460 102 -44
5894 -44 -460 -796 -213 177 311 621 272 463 426 -244 -732 -409 -562 57 382 469 1123 483 -213 109 -138
5915 -138 -854 -777 -251 749 955 794 1572 -89 -222 -527 -1623 158 -439 235 300 499 -186 506 -6
5934 -6 304 -645 -347 -61 376 710 732 835 500 -289 -511 -1024 -778 112 237 402 958 508 290 70 -70
5955 -70 118 -1237 172 222 509 520 500 685 263 -389 -289 -528 313 -1020 344 1083 1105 60 189 215
5975 215 -124 -606 -289 -534 -65 653 232 338 -135 318 -618 -420 -219 -320 405 482 702 418 350 642 -762
5996 -762 -1246 -256 -534 158 460 -58 640 -199 -100 -247 -510 -377 5 -186 334 611 814 330 348 101 -491
6017 -491 -759 -342 -284 -131 241 668 778 76 -279 -768 -367 -379 -48 356 267 263 424 162 -84 -573 -571 -335
6039 -335 196 151 473 875 629 -829 199 -316 -735 -1327 -86 686 922 248 949 74 219 -243 -736
6058 -736 -724 -431 772 314 544 115 93 52 -485 -593 -720 -360 -175 354 164 572 531 -166 -113 -885 -912 -118
6080 -118 -292 533 667 842 583 -61 -14 -1203 -712 468 607 685 252 728 770 226 -721 -388 -970 -694
6100 -694 -208 -110 659 198 746 358 133 -104 -283 -602 61 434 412 598 504 -226 -271 -665 -800 -1054 -318
6121 -318 327 -93 91 315 582 -532 -490 -378 -361 -259 213 -290 186 115 583 -203 -856 -453 -248 50 -182
6142 -182 408 352 337 425 128 -273 -235 -500 -290 -115 148 504 597 92 251 -614 -901 -362 -862 -55 134 152
6164 152 1205 -77 -160 -204 -496 -469 -779 -427 401 453 418 230 70 -179 -317 -395 -263 -54 194 462 596
6185 596 370 176 -223 -315 -480 -527 -129 -101 234 307 358 39 -224 -236 -434 -321 -121 196 467 457 369 183 -71
6208 -71 -257 -520 -429 -159 55 447 382 366 11 -81 -401 -531 -457 -124 85 344 625 539 210 -165 -321 -1056
6230 -1056 -716 -787 -300 421 781 795 376 420 -362 -667 -453 -223 66 349 500 628 395 141 -273 -424 -569
6251 -569 -544 -226 90 343 504 500 258 -96 -411 -449 -382 -115 223 369 648 503 252 133 -155 -379 -574 -441
6273 -441 17 240 504 664 134 -57 -242 -222 -232 -479 -79 438 99 320 108 -18 -146 -416 -375 -436 -152
6294 -152 162 413 447 362 146 -70 -373 -382 -212 98 47 322 275 244 41 -211 -364 -396 -394 -31 113 380 442 385
6318 385 290 129 -335 -268 -445 -160 -147 461 404 234 -302 -183 -360 -357 -359 -290 212 368 203 505 116 304 -438
6341 -438 -224 -283 -599 -126 -617 878 521 -436 -92 -369 96 -594 -14 229 -146 645 646 214 228 -571 -8
6362 -8 403 -136 166 -113 350 370 -167 -272 83 -285 -194 -498 -629 418 286 182 -148 127 461 -417 28
6383 28 102 -837 -873 -406 85 27 -359 81 87 -466 -1281 -518 -587 236 572 536 158 -24 -310 -391 -683 -211 -8
6406 -8 394 388 297 241 -80 -294 -285 -467 -224 44 392 453 441 410 -3 -150 -336 -509 -264 -238 53 181 506 336
6430 336 177 -271 -173 -259 80 -182 180 395 433 381 52 -354 -175 -193 63 -115 49 423 352 120 358 22
6452 22 -298 -332 -282 68 269 31 582 448 130 -286 -17 -473 -199 -155 226 390 233 232 307 -236 -247 -79 -353
6475 -353 107 -114 158 455 421 279 -88 -127 -237 -537 -145 166 -11 272 293 -48 -53 -83 -194 -182 -81 -268
6497 -268 65 251 185 47 74 -270 -492 -375 -169 5 133 -42 125 274 23 29 -241 -190 -58 85 402 274
6519 274 435 241 -7 -186 -369 -427 -169 -50 90 459 437 244 288 -29 -49 -192 -332 -309 39 161 397 330
6541 330 -233 -20 -229 -150 -576 -122 93 369 332 542 -15 -30 -348 -489 -76 -239 60 -25 293 439 41
6562 41 303 -1 -258 -422 -480 -27 135 515 608 289 199 44 -286 -386 -278 -186 121 289 360 216 24 136
6584 136 -246 -287 -116 -293 37 267 346 346 358 -63 -326 -143 -317 11 -63 -81 514 223 120 -298 -232 -259 -195
6607 -195 -26 48 225 344 214 168 3 -131 -283 -314 -240 -143 168 123 189 224 115 -192 -58 -131 -46 73 161 203
6631 203 207 137 -46 38 -350 -308 -196 -127 173 114 345 311 20 -79 -188 -354 -162 -98 37 231 170 305 42 -129
6655 -129 -200 -239 -155 -30 87 149 287 227 120 -159 -215 -223 -164 191 263 173 153 62 77 -80 -177 -332 -180 -265 -98
6680 -98 254 238 243 116 -135 -270 -95 -184 -160 -36 161 391 205 310 239 55 -543 -182 162 -60 484 250
6702 250 518 324 175 -76 -329 -250 -421 9 165 196 302 237 -4 -237 -526 -559 -261 -144 25 208 225 433
6724 433 204 21 -94 -74 -581 -323 237 49 157 208 111 50 -527 -280 -156 -498 -11 -170 468 479 8 76
6746 76 -610 -426 -147 118 -13 359 86 181 -148 -54 -93 -207 -65 -132 -34 -311 98 341 231 48 97 65 -76
6769 -76 -261 -147 -36 127 210 126 -65 152 128 -137 -264 131 206 107 733 329 139 -408 140 -39 -633 262
6791 262 -57 237 -132 -185 -483 360 130 -125 -481 -332 -201 428 534 227 307 397 103 -112 -216 79 292
6812 292 -188 263 467 -82 -198 -319 11 -570 268 -7 285 213 375 -321 366 168 -73 -395 -490 -142 67
6833 67 -193 -350 230 149 104 -306 26 -312 -9 -76 556 489 110 142 106 -498 -343 -312 -487 286 150 306 531
6856 531 193 -15 -68 -326 -78 -414 -168 280 422 244 235 -56 -39 -184 -143 -220 -214 586 630 -458 -90 -268 102
6879 102 -233 -490 97 566 381 -42 239 -41 -169 -698 -465 -723 -71 181 175 62 381 227 412 46 72
6900 72 -357 -156 -76 77 -69 17 188 -26 46 -309 -198 -449 -160 -141 156 -63 102 232 -19 -153 26 -345
6922 -345 123 -179 -22 -40 308 179 133 23 -80 -140 -506 -220 -116 308 106 66 90 51 -86 -136 -56 -100 228
6945 228 150 292 -20 65 -107 -87 -88 254 -52 125 422 337 -199 281 336 -338 -74 138 -290 -150 -73 -88 -48
6968 -48 344 372 80 -96 -409 -384 -210 323 327 376 -21 85 -34 -29 -27 -220 -35 573 476 436 49 274 -46 -410
6992 -410 -212 -55 106 87 468 -96 -394 -362 -228 -158 419 -439 182 347 -142 254 49 -957 -308 -731 -315
7013 -315 -687 72 -18 201 -217 -96 -118 -523 276 -820 -663 -600 -66 -189 572 -318 704 14 -308 -402 -505
7034 -505 -633 -112 187 208 327 -219 26 -515 -431 682 55 -43 380 -82 -511 469 -369 231 -271 -153 -97
7055 -97 -594 394 529 64 827 663 94 83 501 -286 269 -158 484 803 142 -204 72 189 -116 -68 -45
7076 -45 45 98 -177 479 411 -248 28 163 15 243 374 368 475 -59 -605 115 197 -545 -106 -695 460 20
7098 20 775 733 232 37 -485 -218 -122 5 -443 240 49 161 1219 265 102 -169 9 -137 -15 30 61
7119 61 227 -29 -201 -269 -89 -293 -177 -62 -37 301 95 -85 -90 -104 -92 -249 -167 29 241 4 96 159 75 -103
7143 -103 -414 -185 -112 164 637 -54 45 278 -11 -622 -276 282 -11 574 726 -436 515 66 313 454
7163 454 298 -346 -879 33 -104 107 425 720 -385 -135 -43 -533 -264 294 -342 -140 926 274 40 -574
7183 -574 -245 217 330 -863 -526 736 709 857 538 -296 -570 -161 -471 -348 47 -298 232 181 312 142
7203 142 -160 -39 -362 -29 -449 -472 210 153 91 357 148 108 -203 -108 -374 -157 29 9 62 243 263 -369 -292
7226 -292 157 17 208 -549 -52 -193 326 302 88 1 -96 146 -55 521 -250 376 -472 451 353 -847 -387
7247 -387 -376 -56 349 -300 189 70 -465 -564 330 1042 405 -623 -203 939 425 714 268 -453 -311 187
7267 187 -486 199 189 448 -135 -329 -410 -856 -558 185 115 240 -210 -120 -526 -128 258 -206 -867 -304 23
7288 23 -175 -304 482 26 382 -286 -710 -302 -476 -428 -150 18 60 732 219 81 72 -400 -764 108 -186 -117
7310 -117 -262 89 665 82 -211 535 156 263 -421 891 515 -249 219 -202 -559 -425 -612 -965 -121 160
7330 160 -411 355 -282 97 609 -388 340 -371 -434 -108 -392 -67 -61 683 249 -427 -18 -187 -603 421 383
7351 383 288 195 -156 1005 513 839 9 -511 174 -74 -262 497 183 28 -378 385 -524 151 -331 88
7371 88 -118 -205 700 281 68 295 -191 445 223 212 555 206 620 -107 8 -370 -361 783 109 268 -392
7392 -392 18 -623 -101 -366 -318 -187 -625 15 315 -367 546 -102 -252 977 379 -1077 -226 712 350 -58
7412 -58 -33 803 377 257 290 -127 -537 -54 -16 -509 -1051 -17 329 265 -177 -742 -318 -171 -320 -20 -384
7433 -384 115 445 166 -179 -429 -27 45 -314 126 -31 993 -809 80 275 -117 10 -982 204 -361
7452 -361 -306 -551 860 -1059 -894 -198 5 -952 -406 -107 824 -887 -12 -971 -800 -375 -747 -44 90
7471 90 840 1580 461 462 -424 399 54 198 -394 -1200 492 -195 -255 -777 -364 -82 -474 -403 295 178 668
7492 668 673 -249 1195 611 1071 195 -464 -459 -662 -682 565 -575 -13 -298 13 -179 294 -749 -59 5 -959
7513 -959 -413 616 -437 863 711 259 -1123 -404 323 -424 95 409 400 450 58 -977 367 -104 274
7532 274 276 -790 -233 711 -502 91 -991 -371 -505 -888 -44 410 842 -999 328 -10 108 204 164 95
7552 95 -622 -1685 -1173 171 196 260 -82 -339 514 643 -68 792 -635 844 -337 221 7 -320 -840
7571 -840 -8 -192 298 -145 -534 -470 598 524 -1284 -294 -95 215 538 -254 -214 -679 -785 564 -245 -568
7591 -568 -788 -373 619 196 -425 346 -306 -1 -609 -456 -790 -1246 511 128 -243 262 591 -1257 -476
7610 -476 -630 -116 -299 237 185 169 -25 443 -319 98 -415 -270 66 618 -107 1196 324 244 10 411 -398
7631 -398 707 -184 -565 -76 -326 -20 -406 -784 86 -255 293 -111 -853 -22 534 -142 -209 -32 -729 546
7651 546 354 47 394 -938 -259 40 22 -374 -569 -786 -355 -445 243 -109 139 468 586 1083 197 727
7671 727 -361 231 98 -223 -767 23 808 -642 131 -25 -401 -541 -34 -558 -334 648 -342 371 -15
7690 -15 319 -377 75 -820 -185 -454 -78 141 -590 365 -883 451 -107 -7 86 49 -893 90 406 444 -111
7711 -111 -638 -432 -149 -332 -643 -693 -34 -62 1210 -155 -595 -111 105 -389 613 -121 113 578 -240 -26
7731 -26 -150 13 -1041 421 -665 157 27 642 507 562 -219 -215 -308 108 5 328 3 -785 371 51
7751 51 -149 206 60 -314 -674 9 155 -316 -117 92 281 -40 -421 -361 -413 373 -585 805 244 -273 240
7772 240 32 -487 -311 -25 161 59 883 -229 -156 589 1144 426 -71 195 531 64 -425 -489 -82 376
7792 376 1230 -43 50 822 1119 -119 -350 929 785 1046 95 404 -152 -12 446 -396 369 185 1084
7811 1084 -230 91 -496 1 -717 517 442 547 901 -421 142 -48 113 -486 417 310 -141 351 -73
7830 -73 -132 256 26 399 -187 -42 -181 191 -253 28 481 -190 470 -479 279 729 563 -276 11 932 652
7851 652 594 -20 342 76 -313 327 179 155 -537 241 609 -153 838 536 -272 176 887 370 -78 99 -36
7872 -36 45 832 -589 31 -179 -30 -28 -16 308 1550 -462 -147 -165 -893 -174 -885 977 28 257 -484 -344
7893 -344 1249 -21 -179 152 -350 169 59 -60 394 -571 -602 690 -264 6 700 -183 525 464 626 -32
7913 -32 78 -178 961 395 -616 1091 297 34 -156 -137 331 -28 100 -160 -193 -169 356 427 668 1076 -244
7934 -244 -559 -857 358 364 324 860 -307 1115 817 239 -531 -111 543 -447 -67 288 406 194 -97 1188
7954 1188 -125 -463 62 -538 36 -22 17 879 25 -301 856 -233 -176 185 76 -154 -52 59 -29 -11
7974 -11 341 39 416 428 -656 268 110 305 360 91 428 19 -354 -267 82 48 59 -130 139 370 145 -148
7996 -148 -18 -284 64 -347 -126 224 -166 62 -302 316 -348 -610 -176 54 -293 -145 40 237 -165 92
8016 92 426 107 -112 182 107 -232 -57 145 19 -168 -392 -248 -60 318 257 -218 658 535 -338 -162 562
8037 562 -291 -16 -38 87 323 -223 430 558 262 -427 -46 -19 -36 -251 366 -199 -249 113 1101 19 348
8058 348 275 -183 -328 177 484 415 -213 -15 16 -249 -1165 505 -370 -95 -364 99 1388 259 -702 193
8078 193 865 -324 76 -132 -501 198 313 760 152 434 -563 459 450 -865 440 149 -1 -935 668
8097 668 80 -416 -160 -284 89 -198 552 -23 291 -88 -559 -223 -104 595 -259 560 806 364 -390 243
8117 243 -536 -13 455 -125 -124 527 470 207 60 246 209 -337 161 -129 177 480 174 -44 226 274 -78 -1488
8139 -1488 -219 416 225 20 184 201 -545 793 851 -52 702 -73 -204 -324 622 795 -852 834 648
8158 648 -198 -736 -1379 13 -572 -143 -202 111 -130 -348 1120 -780 -380 -137 341 179 1324 44 486
8177 486 -54 -104 -628 -335 185 191 250 -145 885 -910 -21 -140 147 -267
8191b67
$$ Imaginary data points
##PAGE= N=2
##DATA TABLE= (X++(I..I)), XYDATA
0 0 0 0 0 0 0 0 0 0 0 0 0 0 0 0 0 3 -8 8 -8 8 -9 16 -16 18 -24 25 -32 34 -41 48 -51 60 -68 77 -87 99 -111
37 -111 125 -140 154 -171 191 -212 235 -260 287 -318 350 -387 425 -468 514 -569 628 -693 768
56 768 -853 950 -1065 1197 -1360 1557 -1807 2138 -2591 3255 -4340 6402 -11802 60015 131086
71 131086 69025 13197 -59687 -96250 -106168 -70234 -17517 43716 79801 86123 52440 -1241
83 -1241 -60582 -97294 -101559 -65584 -6074 60551 107691 121031 93323 38493 -28748 -82735 -106423
96 -106423 -92570 -49224 8285 56709 79794 68494 29951 -21652 -65058 -83589 -69330 -27694
108 -27694 28741 76516 101515 92208 52800 -3810 -57456 -90202 -91558 -64994 -17750 30008
120 30008 60749 66126 44794 5578 -33507 -58698 -57497 -32700 8450 49664 74658 75943 50024
133 50024 7900 -38053 -70076 -77917 -61315 -26003 14923 45062 55643 44184 14912 -15612
145 -15612 -38656 -43285 -26632 4385 36561 58162 59555 38777 2560 -35760 -62790 -69729 -54895
158 -54895 -22572 14134 43253 53885 42727 16450 -13202 -35717 -39358 -24923 2350 33985
170 33985 55069 55536 35281 1214 -37269 -65199 -72742 -56561 -21338 17584 49017 61850 51668
183 51668 23111 -11763 -38703 -48499 -35673 -5904 29025 55197 60995 44190 8430 -34796
195 -34796 -68874 -81447 -67323 -31651 14632 54024 75262 69699 40676 -705 -37684 -58039
207 -58039 -53942 -26418 11895 47670 65167 58305 25468 -18381 -60058 -83883 -80727 -49497 -3572
220 -3572 45244 77265 84135 63621 22094 -23690 -57111 -68109 -51144 -15397 25149 55948
232 55948 63330 44495 7130 -36356 -70655 -81561 -63226 -23171 24967 66083 85425 77221
244 77221 44191 -1236 -43776 -66617 -64857 -39552 -511 35052 54493 51647 27289 -11290
256 -11290 -47583 -68148 -64692 -37174 4769 46462 73984 77357 56138 17811 -24119 -55034
268 -55034 -64948 -51625 -21560 13577 39873 47903 35274 7242 -24778 -48202 -53145 -37430 -6177
281 -6177 29171 56492 65516 53164 23703 -12199 -42428 -56619 -50987 -28894 577 25751 37590
294 37590 32080 12182 -13211 -33561 -39920 -29175 -4803 23909 47361 56136 44830 18918 -12589
307 -12589 -39708 -52210 -46822 -27347 355 24174 35253 31163 13136 -11002 -29416 -36190 -25965
320 -25965 -2604 25050 46866 53890 42834 16368 -16397 -44017 -57066 -51262 -28909 1528
332 1528 28597 42837 38810 19721 -7253 -30472 -40030 -32618 -9872 21260 46941 57394 48844
345 48844 22353 -14489 -46828 -64467 -61680 -38461 -4743 29534 50595 53025 35173 3778
357 3778 -27260 -45448 -45379 -25836 6818 38782 59436 59391 36797 -917 -39921 -67359 -72972 -55763
371 -55763 -19969 21050 52937 65829 55039 25946 -10676 -40455 -52896 -43180 -15595 19646
383 19646 48325 60015 47971 17899 -22292 -55728 -72356 -65295 -36139 3229 42346 65097
395 65097 66130 44879 10220 -25223 -48200 -51278 -33674 -3041 28671 49095 49482 29464 -2463
408 -2463 -36724 -59904 -63637 -45726 -11631 26354 54184 65072 53341 25907 -8009 -36005
420 -36005 -48444 -41903 -20373 8381 32320 41079 31640 8774 -19311 -42803 -50149 -41973 -16926
433 -16926 14265 41254 53837 51086 30772 1793 -24889 -40103 -39554 -23438 -1961 19171 30325
446 30325 27099 10452 -12092 -31787 -40730 -33648 -14038 12823 36123 48635 45034 27400 1342
459 1342 -23039 -37764 -37591 -24694 -2584 16505 27547 24939 10528 -9981 -28789 -37160 -30363
472 -30363 -10947 13954 37797 49064 45381 25877 -1583 -26709 -42270 -43078 -28371 -5115 18292
485 18292 31833 31113 15772 -6996 -27872 -38631 -35122 -15971 11429 37886 53552 51224 32137
498 32137 1924 -29008 -49974 -53712 -39520 -12607 16571 37541 42602 30448 5398 -22052
510 -22052 -39690 -43494 -28562 -669 30124 52834 58005 43662 13650 -20917 -50324 -62081
522 -62081 -53960 -28464 4696 33662 49420 45387 24331 -3993 -30536 -45189 -38979 -17694 13959
535 13959 41212 55489 51299 27731 -5434 -38226 -59414 -60953 -41933 -10698 20539 46106
547 46106 51479 39690 13263 -15262 -35232 -42079 -30160 -4717 23084 43308 48075 35013 7800
560 7800 -23869 -48650 -57828 -48032 -23017 8134 35543 49900 46355 27459 800 -22895 -35773
573 -35773 -33207 -16739 6554 27658 37565 32495 13942 -11428 -34877 -46993 -43534 -25811 196
586 196 25656 41810 43188 30629 9338 -12932 -27225 -29692 -18924 -1120 17019 27028 25245
599 25245 12408 -8435 -27610 -38362 -35352 -20772 1133 22739 37351 39433 28297 8724
611 8724 -11345 -24975 -28220 -18925 -2808 13705 23581 22836 10192 -7955 -26139 -35989 -33732 -19284
625 -19284 2744 25148 39018 40872 29182 8046 -13612 -29445 -32532 -23338 -5421 13498 26051
638 26051 26643 14964 -4660 -25173 -37761 -37170 -22729 1160 26278 44046 47707 35845 12340
651 12340 -14027 -34656 -41774 -33902 -14119 9108 27456 34061 26006 6400 -17549 -36529 -41430
664 -41430 -32053 -8785 19437 42345 52358 44818 23244 -5681 -33170 -47857 -46138 -29077 -3145
677 -3145 22093 37163 36588 21597 -2255 -26105 -39824 -38356 -21208 5185 32203 49114 50132
690 50132 34229 6707 -22973 -44777 -51579 -40999 -17782 9671 31615 40293 33238 13603 -10612
703 -10612 -29849 -36846 -28724 -8208 17203 37901 46015 38274 16900 -10601 -34658 -47616 -45200
716 -45200 -27808 -3035 21497 35873 36960 24055 3193 -17639 -28082 -28189 -15321 4874 23936
729 23936 34987 33749 19819 -2053 -23670 -38899 -40271 -29155 -9146 12310 28482 33062 25964
742 25964 10246 -7337 -20053 -22855 -15163 -187 15683 26096 26436 16102 -1631 -20331 -32895
755 -32895 -35088 -24654 -8434 10784 25880 30879 25070 10931 -5319 -17581 -20892 -14626 -1326
768 -1326 13420 23050 23458 13965 -2778 -20216 -32180 -33821 -24034 -6431 13598 28526 33469 27006
782 27006 11676 -6079 -20039 -24555 -18460 -4251 12047 23914 25877 16852 -487 -19666 -33963
795 -33963 -37248 -27856 -8701 13944 32259 39801 34140 17513 -4011 -22536 -31622 -28064 -13615
808 -13615 6020 22834 30261 24985 8903 -12647 -31537 -39656 -34213 -17168 7582 30044 43423
821 43423 42200 27700 4891 -18529 -34744 -37433 -25635 -6781 14482 29165 30786 20092 136
834 136 -21081 -35768 -37779 -25636 -3703 20686 39227 45132 36355 15919 -8978 -29888 -39788
847 -39788 -35370 -19187 2397 21512 30879 27528 12648 -7413 -25318 -33722 -29313 -13120 8951
860 8951 29282 40267 38276 23572 1401 -20780 -35440 -37396 -26872 -8419 10968 24472 27744
873 27744 19799 3700 -12799 -24238 -25904 -15653 387 18735 29671 31843 22730 5649 -12370
886 -12370 -28317 -32605 -27761 -13729 4430 17305 23998 20154 8969 -4728 -16302 -19775 -14551
899 -14551 -1049 12798 23232 26510 20276 5931 -10338 -23532 -29284 -25275 -13058 2875 15753
912 15753 21275 19883 9465 -2519 -13144 -17473 -13054 -1780 10730 21283 23252 17606 3845
925 3845 -12189 -23969 -29296 -24698 -12167 3352 17684 23881 21338 10693 -2423 -14515 -18717
938 -18717 -14452 -3367 10350 21416 25493 18990 5083 -11760 -25775 -31904 -27933 -14860 3109
951 3109 20528 28934 28342 17470 1429 -13895 -22970 -22072 -11967 3939 18614 26888 24709 12295
965 12295 -5703 -23414 -34128 -33882 -22201 -3184 16859 31170 34873 26743 10267 -8525 -22983
978 -22983 -27998 -21775 -6568 9836 23091 27533 20080 3772 -14768 -29443 -34758 -27976 -11626
991 -11626 9185 27118 36020 33211 19589 505 -17618 -28001 -27968 -17025 -506 15297 24287
1004 24287 23399 12431 -4481 -19835 -30038 -28645 -17509 219 18709 31242 34157 24962 8475
1017 8475 -8447 -23068 -27949 -23249 -10385 5048 17147 21301 16367 4182 -10023 -21140 -23819
1030 -23819 -18163 -4498 10750 23286 29733 23851 11735 -3018 -17133 -24407 -22879 -13926 -788
1043 -788 10625 17040 15026 7313 -4025 -14448 -18029 -14695 -4627 7961 19135 24031 21115 11095
1057 11095 -2538 -14885 -21499 -21561 -13170 -2308 8313 14554 14208 6564 -2851 -11142 -15432 -12450
1071 -12450 -3664 8120 17766 22521 18910 9659 -4311 -15901 -23333 -21140 -13736 -1481 10077
1084 10077 16592 15983 8738 -1392 -11976 -16299 -14592 -5194 7569 17759 22986 20926 10823 -3638
1098 -3638 -17460 -25785 -25643 -17227 -3614 10550 19998 21622 14977 2856 -9788 -18159 -18708 -11104
1112 -11104 1755 15163 23993 24500 16062 1164 -14792 -26637 -29938 -23581 -9607 6922 20414
1125 20414 26292 22621 11120 -3376 -15915 -21233 -18021 -6260 7450 19667 25123 20743 8137
1138 8137 -7848 -22182 -30082 -27037 -16448 -195 15810 26343 27684 19263 5410 -9941 -19734
1151 -19734 -21488 -14746 -1937 11585 20709 21798 14113 288 -14471 -24149 -27061 -20224 -6845
1164 -6845 9215 21996 27250 23446 12392 -1970 -14290 -20339 -18284 -9270 2730 13265 17928
1177 17928 14985 5571 -6788 -17621 -22474 -19605 -9667 3686 16023 22938 22403 14753 2893 -8861
1191 -8861 -16458 -17426 -11872 -2290 7133 13036 12563 6993 -2830 -12285 -17065 -15291 -9287 1537 12726
1206 12726 19121 19307 13047 4311 -6747 -14292 -16265 -11905 -3842 4501 10453 11540 5358 -2590 -10114
1221 -10114 -15136 -13160 -7132 2467 12322 18344 18618 12701 2826 -7557 -14919 -16599 -12509 -4254 4610
1236 4610 11004 11874 7459 -830 -9161 -14469 -14057 -7897 2171 12592 19547 20273 14087 3524 -8341
1251 -8341 -17249 -20152 -16111 -6764 4066 12663 15630 12064 3471 -6834 -14597 -16670 -11837 -1878
1265 -1878 10148 18618 21811 17874 7276 -6073 -17206 -22915 -21296 -11752 196 11972 17832
1278 17832 17389 10005 -8 -11144 -17274 -16010 -7615 4034 15153 21704 20741 12405 -536 -13823
1292 -13823 -22607 -24165 -17784 -6239 7518 17302 20380 16555 6647 -5087 -14079 -16954 -12878 -3249
1306 -3249 8166 17217 20104 15662 5283 -7502 -18163 -23233 -20654 -11508 1026 12584 19448
1319 19448 19073 12476 1972 -8308 -14092 -14271 -8248 864 10377 15840 14536 8101 -2322 -12490
1333 -12490 -18636 -18953 -13014 -2856 8001 15668 18042 14145 5464 -3522 -10097 -12611 -9529 -2596
1347 -2596 5244 10680 11874 7584 -19 -8673 -14203 -15321 -11236 -3191 5420 13088 15886 13116 6983
1362 6983 -732 -7808 -10773 -9448 -3462 2596 7895 9218 6428 -145 -6869 -12639 -13362 -9459 -2188
1377 -2188 6406 12226 15211 12114 6581 -1682 -8245 -11195 -9598 -4357 2600 7821 9517 6649 356
1392 356 -6919 -12412 -13702 -10031 -2280 6577 14095 16714 14509 6807 -1945 -9844 -14101 -12489 -6936
1407 -6936 1427 8705 12077 10217 3574 -4233 -11488 -15286 -12521 -5202 4506 13781 18540 16772 9853
1422 9853 586 -9419 -16024 -16362 -11110 -3182 6291 12497 13330 9314 83 -8096 -14059 -15090 -9078
1437 -9078 283 10243 17061 19304 13832 4879 -5577 -14850 -19559 -16694 -8543 1397 10311 14572 13160
1452 13160 5843 -2639 -10626 -13786 -11848 -4668 4988 13179 17690 15827 8927 -1672 -11534 -17383
1466 -17383 -17962 -12668 -3398 5787 12769 14287 10682 2992 -5694 -11056 -11910 -8147 -7 7591 13105
1481 13105 14902 9565 2690 -6125 -13942 -16425 -13680 -6678 2102 9348 12966 11614 6416 -631 -6914
1496 -6914 -9641 -7521 -3420 4021 8521 11363 9029 2945 -4487 -10803 -13433 -12313 -7198 173 7604
1511 7604 10637 10988 7094 1262 -4198 -8143 -6390 -3596 2469 6738 8605 7139 3538 -3470 -8917
1526 -8917 -12851 -10559 -6392 -378 7182 9720 10181 6783 1136 -4447 -7240 -7151 -3415 1320 6701 8141
1542 8141 7044 2847 -3331 -8986 -12173 -10525 -5778 1520 8136 12308 12262 8074 1374 -4665 -9175
1557 -9175 -9398 -5932 185 6070 8954 8914 4502 -2143 -8853 -12764 -12823 -8188 -430 7569 12930 14558
1573 14558 11448 3974 -3946 -9256 -12380 -9235 -3798 3696 8936 10657 7875 1479 -5695 -11719 -13640
1588 -13640 -10647 -3692 4925 12180 16199 14561 8035 -700 -8503 -12681 -13025 -8257 -910 6266 10996
1603 10996 10407 5848 -691 -8536 -11886 -12165 -7104 665 8830 15073 15007 10611 3322 -5420 -11239 -13755
1619 -13755 -11915 -5218 1995 8352 10653 8844 3627 -3282 -8816 -10612 -8328 -2762 4449 10496 12902
1634 12902 11496 5850 -1508 -8483 -12271 -12118 -8050 -1573 4718 8690 8956 5726 421 -4833 -7857
1649 -7857 -7505 -3906 1675 7139 10317 9824 6041 76 -6056 -10159 -11019 -8155 -2990 2653 6821 8030
1665 8030 6151 2112 -2532 -5499 -5930 -3479 758 5077 7993 7938 4969 -29 -5259 -8811 -9780 -7408
1681 -7408 -2854 2415 6317 7627 5923 2341 -1876 -4903 -5444 -3451 555 4679 7464 7152 4533
1696 4533 -331 -5751 -9112 -10372 -7654 -2939 3027 6831 8685 7239 3231 -1589 -5491 -6777 -4801
1711 -4801 -655 3797 7551 8126 5919 898 -4870 -9699 -11060 -9194 -4191 2201 7576 10225 9170
1726 9170 5368 -274 -5516 -8162 -7539 -3621 1748 6550 9077 7290 3710 -2680 -8135 -11598 -10832
1741 -10832 -6405 185 6858 11363 11899 8465 2638 -3815 -8196 -9430 -7244 -1871 3913 8086 8902
1756 8902 6189 722 -5430 -10109 -11322 -8558 -2926 4025 9805 12332 10908 5900 -550 -6430 -9772
1771 -9772 -9365 -5610 -196 5049 8069 7495 3817 -1664 -6788 -9587 -8912 -5006 975 6818 10531 10883
1787 10883 7702 2055 -3771 -8157 -9566 -7429 -3042 1957 5868 7035 5207 1146 -3443 -6772 -7615
1802 -7615 -5310 -837 4150 8142 9454 7626 3516 -1853 -6221 -8303 -7480 -4267 10 3827 5011
1817 5011 4659 2444 -1284 -4471 -5897 -4309 -933 2857 6169 7647 6083 3244 -1379 -5300 -7216
1832 -7216 -7068 -4309 -796 3133 4697 4239 1904 -1887 -3647 -4934 -4297 -615 2765 5129 6784 6080
1848 6080 2094 -1925 -5368 -7938 -7552 -4093 -814 3354 6311 4904 3374 -277 -3674 -5138 -4739
1863 -4739 -1518 2283 5975 7424 6729 3075 -1381 -6092 -8497 -8572 -5046 -940 3565 6486 7020 4953
1879 4953 877 -3102 -5796 -5959 -3817 640 4978 7660 7731 5075 -172 -5042 -8823 -9795 -7589 -2916
1895 -2916 2530 7189 8863 7618 3747 -1067 -5343 -7188 -6008 -2375 2459 6388 8126 6790 2675
1910 2675 -2716 -7452 -9854 -9021 -5328 128 5553 8936 9353 6551 1887 -3201 -6597 -7206 -4976 -854
1926 -854 3630 6562 7141 4560 72 -4613 -8183 -9046 -6672 -1816 3219 7435 9238 8083 4450 -733
1942 -733 -4108 -6663 -6481 -3498 829 4348 6003 5359 2298 -2064 -5903 -7615 -6655 -3297 989 5375
1958 5375 7893 7790 5153 1337 -3020 -5559 -6202 -4484 -1262 2013 4245 4689 2655 -372 -3701 -5384
1974 -5384 -5795 -2859 461 3712 6917 6502 4906 1388 -2038 -4686 -5157 -4688 -1671 1120 3436 3745
1990 3745 2586 -53 -2803 -4552 -4337 -2647 678 3728 5770 6215 4696 863 -2744 -4885 -5893
2005 -5893 -4528 -1787 999 3231 3810 3039 622 -2335 -4292 -4605 -2783 241 3682 6060 6529 4845
2021 4845 1480 -2476 -5401 -6666 -5434 -3076 187 3811 4878 3920 1461 -1626 -4293 -5151 -3996
2036 -3996 -865 2870 5963 7092 5803 2541 -1775 -5481 -7703 -6813 -4394 -351 3445 5490 5864
2051 5864 4013 252 -3408 -5464 -5269 -2848 813 4271 6887 6899 4316 83 -4582 -7029 -8145 -6422
2067 -6422 -2273 1469 5803 6514 5547 2915 -1438 -4432 -5654 -4619 -1659 2209 5435 6655 5481
2082 5481 2182 -2066 -5961 -7601 -7146 -4273 -88 4328 6767 6668 5157 1140 -2212 -5288 -4486 -4147
2098 -4147 -264 2891 5331 6150 3073 248 -4128 -6758 -6850 -5221 -1543 2218 5357 6468 5308 3184
2114 3184 -562 -3593 -4518 -4073 -1669 1079 3194 4275 3235 987 -2279 -4468 -5696 -4419 -1818
2129 -1818 1100 4076 5761 5190 3169 209 -2479 -3838 -3689 -2110 235 2300 3343 2672 745 -1657
2145 -1657 -3661 -4482 -3797 -1664 1236 3815 5053 4759 2920 340 -2237 -3770 -3764 -2215 -58 1973
2161 1973 3122 2709 962 -1433 -3461 -4412 -3624 -1664 1381 3977 5433 5009 3008 110 -2662 -4359
2177 -4359 -4441 -2782 -433 1981 3502 3463 1711 -959 -3256 -4667 -4287 -2189 855 3853 5802 5787 3994
2194 3994 828 -2581 -5016 -5693 -4324 -1598 1504 3842 4497 3347 738 -2294 -4424 -5005 -3519 -541
2210 -541 3007 5500 6451 5283 2327 -1559 -4690 -6401 -5862 -3531 -34 3196 4943 4899 2652 -370
2226 -370 -3209 -4824 -4448 -2286 1024 4258 6171 5815 3713 172 -3460 -6005 -6507 -4927 -1878 1700
2242 1700 4341 5371 4363 1853 -1364 -3773 -4541 -3315 -849 2209 4639 5375 4242 1619 -1790
2257 -1790 -4665 -6085 -5462 -3183 2 3107 4812 4798 3099 565 -2041 -3619 -3438 -1958 512 2897
2273 2897 4208 3709 2101 -636 -3292 -4970 -5059 -3410 -683 2025 3934 4475 3452 1342 -962 -2674
2289 -2674 -3043 -2072 -149 1853 3110 3132 1854 -337 -2605 -4120 -4343 -3176 -791 1694 3586 4184
2305 4184 3388 1525 -663 -2368 -2832 -2047 -495 1390 2566 2716 1585 -342 -2450 -3877 -3976 -2868
2321 -2868 -695 1993 3737 4284 3501 1471 -776 -2559 -3374 -2636 -906 1267 2761 3105 2040 12
2337 12 -2340 -4060 -4457 -3262 -916 1924 4164 5094 4327 2396 -532 -2885 -4144 -3693 -2081 576
2353 576 2604 3805 3141 1181 -1289 -3732 -4767 -4175 -1994 1040 3876 5500 5307 3518 543 -2498
2369 -2498 -4561 -4883 -3489 -1054 1826 3636 4048 2726 166 -2537 -4279 -4672 -3095 -471 2722 5063
2385 5063 5704 4705 1933 -1334 -4177 -5452 -4789 -2696 64 2713 4170 3751 1956 -738 -3064 -4304
2401 -4304 -3808 -1785 1158 3708 5200 4979 3112 200 -2841 -4826 -5235 -3780 -1346 1398 3282 3908
2417 3908 2919 1068 -1461 -2958 -3524 -2412 -67 2170 3872 4429 3249 946 -1827 -3844 -4419 -4124
2433 -4124 -2232 222 2365 3319 3174 1993 -234 -2197 -2431 -2595 -703 1139 2539 3037 2771 1339
2449 1339 -1185 -3248 -3886 -3617 -2042 -23 1998 3181 2902 1820 134 -1516 -2230 -1918 -779 975
2465 975 2371 2932 2320 753 -1151 -3008 -3797 -3422 -1883 328 2122 3103 3077 1890 234 -1515 -2552
2482 -2552 -2209 -975 731 2251 3008 2518 907 -1281 -3191 -4096 -3738 -2220 193 2342 3815 4023
2498 4023 2592 553 -1531 -2862 -3017 -1958 0 2018 3133 3088 1845 -459 -2900 -4296 -4446 -2968
2514 -2968 -587 2058 4071 4703 3716 1466 -955 -2966 -3758 -3209 -1296 1015 2982 3524 2814 928
2530 928 -1663 -3792 -4601 -3783 -1715 1201 3620 4930 4584 2912 207 -2327 -3923 -4064 -2668 -602
2546 -602 1840 3338 3447 2067 -122 -2518 -3948 -4012 -2632 -211 2456 4265 4755 3776 1485 -1156
2562 -1156 -3338 -4312 -3639 -1911 552 2413 3084 2727 1225 -1104 -2700 -3457 -2801 -911 1308 3246
2578 3246 4202 3721 2013 -268 -2414 -3718 -3749 -2523 -429 1460 2751 2705 1619 49 -1582 -2488 -2436
2595 -2436 -1266 634 2414 3368 3304 1976 127 -1853 -3163 -3375 -2487 -729 879 2157 2391 1803 401
2612 401 -1164 -1879 -2029 -1087 447 1893 3037 2920 1790 28 -1806 -3102 -3328 -2419 -682 1053 2309
2629 2309 2626 1762 454 -1167 -2108 -2060 -1056 424 2044 2981 2852 1811 -91 -2117 -3317 -3612 -2718
2646 -2718 -909 1073 2643 3195 2492 903 -838 -2200 -2553 -1913 -276 1692 2997 3214 2306 458
2662 458 -1780 -3338 -4102 -3484 -1650 630 2734 3672 3303 2123 -230 -1744 -2852 -2822 -1509 778 2472
2679 2472 3392 3020 1513 -905 -3000 -4194 -3943 -2615 -303 2207 3786 4069 3353 1094 -1101 -3139
2695 -3139 -3767 -2449 -667 1685 3033 3097 2036 103 -1550 -3150 -4312 -3045 -1216 1128 3302 4378
2711 4378 3640 2259 226 -2203 -3239 -3950 -1538 -80 2016 2993 2629 1804 -336 -2441 -3302 -3103 -1606
2728 -1606 940 1453 3418 3280 2601 708 -1027 -2603 -3078 -2413 -728 802 2039 2177 1687 19 -1176
2745 -1176 -2524 -2675 -1742 -175 1584 2963 3158 2841 1104 -758 -2143 -2744 -2367 -1132 290 1454
2761 1454 1925 1502 445 -913 -1825 -2142 -1411 -202 1321 2602 2968 2192 857 -904 -2057 -2787 -2440
2778 -2440 -1193 300 1508 1943 1517 479 -857 -1889 -2173 -1443 -156 1429 2656 3000 2362 947
2794 947 -1007 -2445 -3112 -2711 -1545 246 1728 2449 2152 993 -602 -1858 -2430 -1960 -676 1068 2562
2811 2562 3232 2857 1286 -659 -2426 -3410 -3395 -2208 -234 1599 2888 2997 1883 294 -1505 -2519
2827 -2519 -2497 -1574 332 2090 3280 3235 2112 61 -2016 -3421 -3977 -2960 -1165 985 2711 3441 2881
2844 2881 1390 -520 -2215 -2898 -2480 -768 937 2562 3198 2571 1070 -903 -2916 -3813 -3451 -2036
2860 -2036 36 2012 3294 3360 2296 664 -1281 -2506 -2547 -1752 -248 1558 2528 2723 1690 2 -1870
2877 -1870 -3062 -3336 -2365 -677 1303 2673 3282 2532 1520 -558 -1606 -2486 -2151 -750 575 1865
2893 1865 2197 1782 384 -1575 -2191 -2588 -2204 -746 536 2183 2927 2652 1450 20 -1567 -2032 -2117
2910 -2117 -1185 39 1213 1855 1505 492 -786 -1875 -2279 -1842 -829 787 1921 2656 2545 1339 11
2927 11 -1287 -1968 -2078 -1299 58 1144 1641 1389 528 -710 -1711 -2316 -1857 -721 719 2038 2682 2585
2945 2585 1447 -20 -1508 -2363 -2399 -1512 -23 1168 1879 1849 819 -365 -1629 -2356 -2179 -1051 463
2962 463 2032 2951 2843 1949 302 -1534 -2709 -2884 -2114 -717 866 2045 2274 1662 328 -1099 -2273
2979 -2273 -2474 -1786 -135 1605 2986 3230 2507 936 -973 -2582 -3342 -3018 -1709 293 1690 2791
2995 2791 2529 1379 -221 -1639 -2470 -2341 -1167 504 2176 3113 2948 1640 -120 -1998 -3191 -3216 -2335
3012 -2335 -712 1115 2446 2741 2157 675 -802 -1933 -2341 -1617 -259 1228 2422 2654 2026 534
3028 534 -1173 -2481 -3099 -2594 -1367 457 1826 2612 2444 1305 -5 -1309 -1865 -1727 -833 486 1642
3045 1642 2125 1870 808 -657 -1945 -2614 -2397 -1404 -19 1413 2224 2262 1576 337 -764 -1501 -1590 -947
3063 -947 108 1014 1675 1513 619 -430 -1518 -2309 -2101 -1280 -37 1257 1996 2249 1503 447 -727 -1454
3081 -1454 -1654 -1053 -20 1008 1451 1449 763 -455 -1490 -2080 -1964 -1295 89 1450 2208 2344 1810 578
3099 578 -777 -1668 -1906 -1302 -306 931 1704 1760 1121 26 -1414 -2204 -2261 -1624 -218 1349 2387 2765
3117 2765 2138 817 -661 -1824 -2272 -1985 -906 431 1731 1979 1636 480 -881 -2042 -2363 -2010 -726
3134 -726 850 2177 2852 2753 1522 -218 -1617 -2625 -2487 -1687 -272 1160 2067 2211 1357 -8 -1382
3151 -1382 -2415 -2284 -1500 112 1563 2628 2935 2167 586 -983 -2372 -2771 -2297 -1012 343 1720
3167 1720 2247 1840 868 -486 -1687 -2109 -1636 -600 922 1953 2593 2170 1152 -371 -1804 -2520 -2370
3184 -2370 -1631 -231 1150 1865 1958 1252 207 -946 -1798 -1564 -889 246 1224 2114 2031 1250 -165 -1613
3202 -1613 -2087 -2256 -1398 -568 565 1109 1502 1264 87 -441 -1354 -1163 -959 108 1047 1614 1704 1046 79
3221 79 -1119 -1848 -2067 -1473 -545 584 1455 1820 1297 411 -220 -803 -1559 -933 -338 727 1332 1856 1056
3240 1056 -28 -410 -1446 -2627 -1070 -587 244 1909 2034 1844 1047 144 -1150 -1529 -1409 -341 673
3257 673 1505 1584 1187 351 -1103 -1980 -2239 -1784 -773 654 1763 2217 1950 1196 27 -1174 -1850 -1681
3275 -1681 -890 246 1329 1802 1558 769 -659 -1738 -2330 -2191 -1265 122 1643 2384 2579 1738 368
3292 368 -1101 -1774 -2071 -1541 -291 812 1866 1905 1261 116 -1012 -2101 -2282 -1676 -487 1061 2099
3309 2099 2603 2183 1038 -400 -1609 -2245 -2007 -1191 101 1288 1746 1549 800 -318 -1505 -2032 -1865
3326 -1865 -1006 338 1488 2221 2393 1343 13 -1152 -1831 -2121 -1629 -569 632 1532 1651 1159 157
3343 157 -783 -1536 -1678 -1047 -124 982 1875 1988 1427 473 -610 -1647 -1942 -1605 -877 309 1137 1402 1266
3362 1266 356 -308 -1069 -1293 -1004 -171 767 1498 1696 1179 503 -667 -1582 -1760 -1763 -863 164 1009 1479 1154
3382 1154 575 -341 -918 -1218 -1035 -223 736 1341 1680 1226 421 -703 -1346 -1904 -1644 -772 319 1172 1544
3401 1544 1415 804 -68 -912 -1369 -1200 -444 555 1416 1727 1334 523 -523 -1423 -1995 -1821 -1001 60 1100
3420 1100 1808 1795 1123 144 -942 -1430 -1421 -881 101 1180 1542 1685 1039 -143 -1321 -2157 -2134 -1467 -407
3439 -407 881 1839 2034 1736 628 -381 -1421 -1793 -1433 -466 612 1327 1715 1420 315 -604 -1743 -2149
3457 -2149 -1828 -840 310 1541 2137 2115 1499 230 -1086 -1729 -1709 -1055 14 876 1850 1603 879 -44 -1174
3476 -1174 -1946 -1921 -1226 -111 1110 1938 2063 1599 551 -506 -1558 -1767 -1542 -571 539 1242 1431 1069
3494 1069 282 -633 -1520 -1696 -1231 -390 706 1489 1784 1631 858 -165 -1167 -1536 -1455 -890 21 889 1255
3513 1255 1130 497 -260 -982 -1279 -987 -470 457 1193 1621 1504 725 -176 -971 -1566 -1419 -1019 -79 684 1096
3533 1096 1050 579 -255 -946 -1155 -994 -408 438 1209 1577 1347 712 -61 -1028 -1484 -1514 -877 -180 546 1286
3553 1286 1104 799 49 -745 -1168 -1187 -603 379 1173 1620 1467 979 -92 -964 -1584 -1687 -1248 -294 598 1325
3573 1325 1380 1107 202 -581 -1439 -1493 -821 -61 904 1793 1895 1885 567 -908 -1700 -2204 -2128 -694 450 1433
3593 1433 1819 1408 1056 66 -945 -1823 -1546 -645 210 1454 1549 1664 783 -366 -1458 -1990 -1815 -1120 -148
3612 -148 1088 1708 1840 1206 404 -609 -1774 -1732 -1079 40 1264 1657 1228 1049 -413 -785 -1561 -1499 -1478
3631 -1478 -414 548 1356 1707 1507 736 -225 -1130 -1420 -1173 -553 250 957 1411 1110 458 -427 -1065 -1518
3650 -1518 -1464 -702 218 1120 1473 1455 1001 284 -769 -1213 -1256 -788 -108 650 1022 869 476 -247 -936 -1245
3670 -1245 -1201 -627 141 954 1343 1342 861 -91 -593 -909 -1157 -830 212 1230 830 619 943 -88 -406 -1160
3690 -1160 -524 406 -322 772 1970 1346 53 971 -830 -1797 -1600 -1278 -416 208 798 1092 990 -84
3708 -84 -907 -1001 -1208 -725 161 800 1140 1784 1030 460 -480 -1308 -1469 -1111 -570 398 959 1260 1064 306 -555
3729 -555 -1092 -1365 -1106 -250 610 1384 1689 1414 656 -318 -1213 -1588 -1652 -971 5 956 1333 1553 908 71
3749 71 -991 -1427 -1300 -673 -225 1001 1443 1462 936 -482 -955 -1722 -1613 -1560 -163 123 2020 1049 960 114
3769 114 -130 -875 -1269 -1330 -162 488 983 1541 1099 -5 -584 -1365 -2093 -1035 -980 324 1064 1404 1647
3788 1647 595 78 -661 -1063 -986 -634 190 858 1242 1112 649 -253 -932 -1437 -1328 -862 -30 630 1203 1260
3808 1260 852 391 -420 -900 -1035 -700 -5 583 944 1044 822 -85 -588 -1087 -1175 -994 -131 451 852 1741
3828 1741 149 -39 224 -51 -1029 -1033 -385 -37 832 564 520 -131 -732 -1079 -1249 -664 -180 526 931 1164
3848 1164 793 179 -985 -1044 -885 -921 -86 -89 484 970 683 -72 -558 -964 -972 -472 -215 186 1131 1438 1170
3869 1170 501 -251 -971 -1315 -1143 -447 135 832 1012 1090 359 -386 -1290 -1941 -1086 -361 265 1173 1436 1523
3889 1523 894 43 -833 -1556 -1624 -469 -434 484 1271 830 1390 278 -839 -1200 -1243 -818 -98 872 1340 1522
3909 1522 1527 257 -294 -1204 -1509 -1360 -771 180 952 1208 1370 751 -221 -832 -1191 -969 -415 443 1163 1432
3929 1432 1323 686 -189 -922 -1394 -1311 -903 -56 651 1079 1124 816 -39 -514 -1011 -929 -520 -52 681 1221 1169
3950 1169 790 45 -709 -1175 -1299 -1023 -332 509 899 1103 785 330 -372 -481 -868 -658 -229 283 739 561
3970 561 485 -428 -571 -1232 -787 -546 -263 286 1030 612 629 467 -676 -445 -615 -828 -415 157 822 1089
3990 1089 684 164 -523 -994 -1049 -978 -372 228 797 954 941 600 -158 -651 -1133 -697 -132 445 665 1104 799
4011 799 434 -383 -917 -1186 -1060 -421 303 838 1171 853 798 129 -1132 -994 -1084 -359 164 527 1229 906
4031 906 380 -349 -915 -1307 -1316 -776 139 754 1065 996 1290 271 -682 -863 -1132 -976 -320 414 1010 971 924
4052 924 91 -610 -1173 -1234 -879 -271 500 1230 1412 1238 435 -811 -1793 -1504 -1181 -688 59 995 501 1262
4072 1262 561 -376 -846 -1275 -978 -723 62 814 1443 1282 868 186 -681 -1100 -1299 -932 -338 347 789 1009
4092 1009 526 254 -501 -1111 -854 -763 -309 873 1349 1462 982 -458 -439 -617 -1274 -1063 -377 -34 448 1177
4112 1177 413 437 -145 -1032 -616 -683 -260 316 1104 890 853 348 -224 -904 -1010 -981 -519 -62 595 694 871
4133 871 449 -33 -551 -605 -651 -210 409 757 900 869 357 -322 -732 -1015 -1045 -522 -83 722 960 923 531 190
4155 190 -487 -821 -1072 143 336 390 1074 189 1243 -420 -1316 -1389 -1164 -1396 392 371 952 773 -71 255
4175 255 -813 -739 -798 -177 -231 481 619 552 868 161 -705 -1092 -1134 -1193 -320 157 823 1460 973 209 14 -741
4197 -741 -1225 -1123 -284 155 1222 1071 969 1020 -370 -931 -912 -804 -746 486 839 1312 1115 1016 92 -462
4217 -462 -1005 -1270 -663 -13 639 897 1113 616 -18 -730 -1122 -1337 -656 -244 609 1157 1303 1028 560 -220
4237 -220 -748 -1159 -926 -338 267 935 1056 729 428 -371 -800 -965 -993 -513 313 538 1165 1091 699 62 -572
4258 -572 -1084 -801 -398 -120 350 840 959 236 -40 -552 -1058 -948 -299 246 734 970 999 619 21 -597
4278 -597 -1025 -865 -675 -79 262 541 745 418 -65 -484 -765 -803 -363 278 618 907 805 611 133 -624
4298 -624 -851 -1030 -690 -103 247 768 819 635 29 -418 -748 -599 -160 -880 398 877 771 1070 -672 -650
4318 -650 -1104 -772 -924 -675 581 332 1171 977 536 -1118 -1071 -965 -730 -250 363 1042 1272 912 246 -435
4338 -435 -779 -1248 -966 -491 117 687 1021 923 625 54 -209 -988 -846 -515 265 725 1204 740 715 19 -1330
4359 -1330 -1348 -1335 -874 16 424 1173 1023 969 540 -515 -871 -863 -842 -208 679 711 1135 385 128 -465 -1076 -1095
4381 -1095 -1383 -410 399 703 962 1267 551 -152 -511 -927 -1163 -510 100 574 999 886 458 -189 -735 -1003
4401 -1003 -979 -543 68 744 1061 888 819 90 -423 -817 -860 -607 -110 233 659 719 452 -28 -533 -944 -812
4422 -812 -535 -37 595 835 946 646 223 -294 -917 -874 -579 -232 231 466 708 354 98 -430 -799 -812 -573
4443 -573 -97 598 982 909 576 284 -285 -735 -695 -641 -406 264 730 613 498 96 -463 -847 -827 -662 29
4464 29 442 926 829 886 563 -166 -450 -1049 -763 -525 241 519 945 651 299 -282 -654 -888 -754 -420 242
4485 242 836 1018 878 577 -67 -656 -997 -862 -608 -211 504 862 675 677 135 -649 -806 -965 -581 46 695
4506 695 1056 1091 652 251 -634 -1073 -1403 -1012 -151 74 681 1082 1239 595 -70 -592 -655 -797 -458 -97 962
4527 962 556 505 739 -355 -58 -1497 -807 -664 10 512 1138 325 553 586 139 -1185 -658 -230 91 1029
4547 1029 1616 759 511 274 -415 -201 -1084 -654 -249 669 963 1445 417 526 -667 -794 -967 -261 112
4566 112 704 114 1453 1166 83 -861 -1645 -1491 -985 432 191 1150 513 560 219 413 -137 -275 115
4585 115 -1196 -152 -166 604 1109 435 -678 -955 -790 -874 -189 211 965 834 1072 562 53 -760 -742 -872
4605 -872 -161 -199 527 841 549 125 -655 -566 -1193 -754 -180 138 879 699 1190 391 361 -430 -278 -676 -439
4626 -439 -237 640 662 427 423 -356 -783 -1242 -897 -312 102 807 1023 980 716 81 -393 -673 -790 -782 -350 383
4648 383 790 892 550 190 -356 -1011 -921 -76 -169 318 1562 1014 842 533 -321 -800 -1607 -1219 -771 279
4668 279 391 1114 670 384 -6 -503 -695 -749 -360 366 964 1076 1127 542 458 -814 -1030 -1467 -700 -408 11
4689 11 441 830 887 125 -286 -1080 -832 -1413 987 617 902 902 772 1356 -501 -1110 -1207 -936 -298 973 364
4710 364 1626 969 561 159 -229 -953 -1648 105 -621 1504 604 566 673 214 -898 -1636 -1480 -821 -89
4729 -89 449 930 723 591 -172 -446 -1733 -484 -51 179 924 740 -118 336 -167 -1120 -321 659 -18 311
4749 311 737 355 863 643 154 -77 -64 -467 -767 553 687 744 887 144 -340 -592 -553 -1212 -215 -12 454
4770 454 922 938 637 192 -547 -483 -704 -949 202 270 411 581 663 -197 -721 -637 -913 -982 -161 280 1216 919
4792 919 400 572 108 -1231 -1157 -416 -731 408 546 1017 663 358 -319 -834 -1016 -860 -439 283 774 1086
4812 1086 994 691 -30 -560 -879 -868 -704 -310 496 790 699 365 -91 -441 -867 -749 -523 130 468 982 1238
4833 1238 796 599 -280 -885 -922 -903 -566 382 624 1070 740 363 -429 -449 -1042 -866 356 348 938 523 1467
4854 1467 536 -171 -205 -699 -661 -1041 179 772 30 501 813 -8 -683 63 -467 -225 41 462 1110 1151
4874 1151 1112 397 -512 -399 -1375 -1330 -493 340 353 554 384 447 467 -190 31 421 273 714 1255 906 389
4895 389 -46 -201 -1158 47 -751 288 657 1487 797 104 -185 -435 -834 140 -894 237 614 542 881
4914 881 1187 162 -242 -914 -1021 -173 270 -135 638 889 1006 -142 -724 -990 -471 -600 -288 1384 404
4933 404 1063 193 387 -813 -335 -809 -892 -262 766 1281 1191 -374 988 -141 -340 -783 -1093 -722 62
4952 62 164 448 722 -839 -297 -427 -1215 -312 -538 665 583 806 1242 1070 -40 -513 -698 -100 -725 33
4972 33 1275 286 425 713 -161 -942 -1101 -1113 -991 -86 398 703 977 665 1022 -88 675 -1251 -784 -749
4992 -749 192 193 777 1175 315 -293 -131 -138 -820 282 630 333 979 953 938 184 -1217 -145 -1556 499
5012 499 153 -648 429 668 195 557 241 -492 -360 -890 -483 2329 1293 1263 295 128 -59 -1037 -1074 -200
5032 -200 454 748 899 -298 319 -469 -674 -1511 -762 -236 486 671 1372 562 1120 373 -427 -848 -1275 -606
5052 -606 -567 951 947 119 1059 759 300 -632 -472 -93 -695 1820 1388 2168 1189 1221 80 -849 -1433 -1180
5072 -1180 240 581 1176 866 1401 137 -296 -897 -957 -427 -759 341 634 1107 1486 257 -378 -353 -681
5091 -681 -742 284 -238 517 470 866 181 453 -232 -1266 -791 -319 536 655 1493 1095 1312 -303 -87 -762
5111 -762 -1369 -1056 140 -151 639 985 -532 -149 -1078 -1105 -248 -273 907 703 907 970 -311 344 -483 -540
5131 -540 -1338 173 -902 967 1971 542 1519 848 216 -440 -1579 -846 -100 -8 180 -216 415 718
5149 718 471 40 -558 -630 -677 334 739 360 1506 820 -84 -664 -495 -1192 -445 -348 617 814 369 978
5169 978 570 598 -1386 -669 157 -91 614 1425 1482 673 1172 -124 25 -626 -98 -338 1233 497 1455 881
5189 881 3 232 -371 -812 848 -206 811 1297 -109 586 -443 -206 -502 -96 -448 568 -173 1297
5207 1297 709 970 410 -445 -927 -199 -277 -408 1110 325 171 489 994 205 -795 -1123 -563 -874 -115
5226 -115 182 1033 501 991 266 -550 -127 -336 -309 -151 240 992 1273 1426 106 -318 -919 72 -994 -314
5246 -314 476 1327 716 652 687 -76 -822 -143 -497 715 910 786 186 569 604 74 -936 -201 93 -194
5266 -194 578 394 1476 406 475 181 -485 -1110 -810 -732 -68 500 1248 807 -305 267 -770 -846 -977 -159
5286 -159 -485 653 1647 582 127 904 -416 -783 -1340 -428 1 979 1291 1116 432 358 -186 -1434 -715
5305 -715 -976 -8 596 647 756 1225 688 1704 -870 -23 -1036 52 351 580 694 822 152 38 -505
5324 -505 -1198 -1155 -284 -13 -306 405 591 141 844 -418 -688 -702 -417 88 229 281 74 -167 -276 -456 -1222
5345 -1222 -74 -402 270 603 873 1146 370 178 -205 -231 -996 -54 644 805 613 859 423 -181 -326 -898
5365 -898 -145 25 718 565 543 993 916 -309 45 -57 -186 -783 265 222 708 -190 109 -753 -685 -296 -780
5386 -780 -86 -31 499 1099 1344 573 430 208 -702 -724 186 152 1534 758 1134 721 -1025 -195 -440 -1388
5406 -1388 -737 -110 -583 284 1206 802 1039 -763 -877 -1395 -754 -333 832 1528 145 1424 485 -238
5424 -238 29 -580 -659 305 643 1145 1218 60 471 294 -953 -1083 -1271 -660 -178 359 84 1148 1450 1004
5444 1004 -149 -678 -454 -210 -393 -474 791 1117 973 -338 -595 -256 252 -738 -795 209 311 915 572
5463 572 1139 -80 -651 -220 -927 -493 1281 1402 925 995 236 -15 612 -441 -288 99 -543 -123 1141
5482 1141 -291 947 -510 -371 -669 -1143 -443 738 1347 -490 507 719 189 181 340 -616 679 -341
5500 -341 560 411 890 -224 506 -1051 -348 -1309 -23 -240 626 727 374 1402 217 71 -546 -421
5518 -421 -292 -495 458 285 475 517 -394 -741 112 -1572 -135 163 525 1093 698 424 378 -133 -913 108
5538 108 -1416 -119 195 293 398 617 577 115 -863 -412 -129 -178 735 1307 1077 1198 1113 1040 -771 -154 -766
5559 -766 351 264 867 969 867 76 -376 -523 -1173 -803 -652 380 359 41 1172 1149 30 -1461 -460
5578 -460 -1212 -517 -581 1472 -57 513 325 822 -668 -849 -1035 -723 -345 528 451 992 742 522 347 -678
5598 -678 -207 -515 66 1081 917 978 824 -246 -109 -591 -1136 -1113 -15 119 57 319 412 -44 316 -521
5618 -521 -549 -1000 20 -695 -416 1902 275 204 -871 -363 -753 -874 -635 -460 98 546 273 210 117 -307
5638 -307 -527 -1089 -156 -214 528 1054 758 382 -40 -298 -900 -585 -1047 -135 89 782 555 338 215 -271
5658 -271 225 -332 -439 -307 371 212 587 684 386 -326 -305 -92 -557 248 319 382 1291 432 467 -915 -1005 -469
5680 -469 -248 -32 107 402 798 184 103 -174 -775 -1118 -479 -493 313 1086 517 894 410 23 -345 -732 -760
5701 -760 -278 -34 281 855 769 35 88 -541 -678 -1095 -795 -123 826 212 805 625 363 10 -1206 -1061
5721 -1061 74 400 -6 -108 859 243 595 285 -445 -626 -1660 88 -163 596 1067 556 123 369 -1139
5740 -1139 58 -632 150 226 550 1564 732 922 -313 -203 -466 -1402 166 676 91 647 508 389 180
5759 180 -179 -666 -1103 -137 -603 -264 -578 427 1082 21 -374 -628 393 -661 -206 357 1691 1661 1324
5778 1324 264 -403 -1002 -178 -1116 -154 2 124 716 466 -705 -194 99 583 -181 1096 534 519 1197
5797 1197 -214 451 861 -680 -567 -169 -420 798 191 925 210 -448 -697 -652 -72 -639 -22 79 551
5816 551 1356 303 -29 -536 -576 -823 -784 -214 461 527 145 279 779 -16 -339 -487 -148 151 276 110 70
5837 70 -119 308 -344 -374 -541 -847 -338 64 -69 887 245 1282 -6 -253 -316 -233 -755 609 1150 602
5857 602 932 358 -194 -380 -574 -470 -507 138 491 838 597 482 523 -38 -499 -587 -634 -62 296 533 589 300
5879 300 66 -504 -350 -696 -863 -636 -277 784 668 945 326 276 -488 -343 -413 -30 -48 690 123 1136
5899 1136 -5 -171 -475 -787 -478 -193 -92 803 283 646 985 -640 -255 -178 -599 -733 -136 877 487
5918 487 738 -276 34 -775 -121 -383 -1655 68 293 368 1210 1319 56 -731 -849 -720 352 -525 117
5937 117 711 544 -151 385 -256 -558 -371 -288 -595 -308 543 570 500 507 361 -295 -172 -194 88 -246 276 411
5959 411 20 286 -337 -270 -467 -545 -58 954 507 788 470 549 444 -491 -628 -108 -23 18 308 82 369
5980 369 -225 -475 -4 -772 -735 -231 346 699 532 385 325 60 -578 -699 -844 -275 -217 352 699 581 797
6001 797 369 -124 -262 -588 -346 -110 297 649 576 706 206 -208 -707 -494 -546 -234 43 304 450 328 232
6022 232 -436 -725 -818 -525 -309 628 395 611 937 635 -141 -505 -609 -315 -394 124 308 625 115 585 102
6043 102 -588 -216 328 292 -121 689 703 854 1349 126 -768 -262 -769 -384 -493 197 449 779 330 501
6063 501 342 -730 -426 -607 83 -120 490 242 458 27 86 71 -980 -423 894 -136 969 1226 849
6082 849 145 82 67 -194 117 -258 301 276 183 442 -369 91 -743 -1007 -477 185 -198 492 478 339 824 254
6104 254 -192 -220 -870 -33 -226 -56 -2 109 -30 -599 -432 -363 -458 -659 348 883 140 684 613 266 -324
6125 -324 -233 -133 -525 -192 -78 680 257 -177 -317 -429 -411 -737 -133 -211 397 637 691 534 316 -410 -333 -539
6147 -539 -416 -217 234 299 600 292 443 43 -468 -696 -44 -553 -132 976 37 378 350 -96 -669 -689 -937
6168 -937 -432 285 671 496 657 343 -123 -356 -445 -456 -155 115 473 706 667 251 -10 -534 -366 -699 -535
6189 -535 -16 86 457 472 602 178 -149 -504 -530 -315 -37 330 419 558 339 193 -186 -424 -509 -469 -147 65
6211 65 133 509 440 48 -118 -401 -466 -331 -217 94 294 518 523 60 -286 -229 -89 -444 -319 92 329 -108
6233 -108 746 375 -277 -339 -356 -200 509 207 63 -43 678 340 -188 -297 -532 -310 -270 49 246 254 402 331
6255 331 151 -286 -265 -325 -163 189 175 347 296 31 -94 -225 -355 -188 -197 -439 282 33 313 266 155 130 -231
6278 -231 -230 -208 -15 181 395 449 211 193 -493 -237 -310 -275 29 179 562 423 342 54 -18 -299 -381 -266 -192 113
6302 113 272 406 165 26 -222 -330 -453 -284 -141 121 434 487 489 143 72 -414 -447 -488 -292 -43 154 158 472
6325 472 238 -64 -149 -457 -253 -140 -104 144 628 519 359 8 -136 -392 -402 -242 -304 335 375 148 126 -12
6347 -12 -234 -827 -290 -542 -449 272 404 787 284 364 370 -320 -862 -539 69 -373 503 180 172 597 3 149
6369 149 -50 -155 3 137 277 716 -12 275 29 285 -255 -21 220 -54 279 -156 104 950 102 -919
6389 -919 -364 -54 67 572 162 44 355 456 72 -77 -252 -245 -294 -100 89 242 252 478 137 1 -89 -369
6411 -369 -206 -178 169 190 449 274 -59 -211 -404 -399 -101 -99 -41 292 322 445 -10 -218 -224 -295 -227 -72 233 374
6435 374 214 264 -39 -126 -258 -337 -112 -136 -10 99 431 74 222 -224 -199 -549 -188 133 285 385 473 593
6457 593 232 -51 -289 -343 -194 -200 -77 225 469 580 596 374 -337 -481 -39 -121 -166 -52 380 -168 113 61
6479 61 -500 -281 -533 -356 -262 143 355 206 482 197 -113 -469 -560 -209 -332 124 36 277 267 265 -73 -247
6501 -247 -380 -192 -215 32 178 558 339 287 242 -197 -373 -398 -221 -194 286 243 333 105 34 -120 -513 -311 -108
6524 -108 4 295 401 309 323 65 73 -486 -349 -528 -54 79 225 55 208 242 -109 39 -93 -204 126 -318
6546 -318 150 264 66 165 -244 -283 -538 -467 -351 5 126 145 243 -274 -122 -19 -275 238 -266 177 12 379
6568 379 100 135 -71 -224 -126 -179 -284 -95 -4 316 126 -147 117 -273 -306 -187 -42 -59 117 217 146 289
6590 289 -114 -307 -340 -227 -316 115 -71 11 349 291 244 -60 -246 -326 -105 -353 101 461 281 260 74 -164
6612 -164 -380 -384 -214 -71 -92 247 383 309 211 26 -287 -283 -214 -110 59 212 321 258 105 -199 -306 -492 -355
6635 -355 -318 -77 328 143 401 259 295 -421 -159 -402 -231 32 250 407 247 -92 -147 -270 -288 -422 -192
6656 -192 -175 90 104 436 314 73 -4 -278 -233 -189 -4 124 178 269 292 -120 -32 -248 -98 -411 -70 -9 278
6679 278 287 314 195 114 -104 -372 -410 -197 108 68 148 171 137 15 -450 -475 -330 51 229 348 234 127 328
6702 328 314 37 -119 -22 -39 -56 150 163 139 253 -5 -266 -203 -214 -158 185 436 93 216 52 174 -208 -229
6725 -229 -274 -52 -173 -66 -110 180 -160 -115 -136 -376 59 207 120 -78 777 530 107 -299 -246 -394 -745 -234
6747 -234 -297 19 186 349 238 342 41 -277 -366 -312 15 321 514 423 503 51 183 -310 -229 -368 -69 187
6769 187 -75 51 39 201 -162 -178 -8 -202 -13 8 224 517 77 183 -195 -456 -467 -720 -170 470 559 106
6791 106 -107 59 404 277 -375 -130 93 -64 -287 183 736 -438 304 62 -841 201 -239 -248 -104 376
6811 376 3 45 -34 167 494 -195 -145 -162 -313 177 621 -85 591 106 52 146 -358 110 299 373 431 365 482
6834 482 -108 59 -167 -159 -15 -178 308 362 257 78 234 -105 -434 -259 -515 -330 -66 542 136 292 75
6855 75 -143 37 -308 92 22 102 139 115 71 105 -166 -289 -143 -223 -16 -34 274 -234 214 210 626 171 -63 -255
6879 -255 -28 126 -411 581 317 -100 -161 302 388 -471 35 345 236 454 128 251 -82 99 -200 -245 -193
6900 -193 182 249 316 89 -84 -136 85 -508 -295 267 11 264 76 568 312 44 -93 -157 30 -233 -27
6921 -27 133 419 -123 239 -212 89 -660 -156 -217 132 -37 124 567 84 429 -25 -105 -376 -336 -94 45
6942 45 34 313 210 33 -255 -242 -96 -97 -312 46 274 666 130 163 21 -163 78 -332 -196 -281 267 169 473
6965 473 -72 -13 522 -111 501 47 -6 535 538 58 861 484 62 10 -230 -235 -338 -78 235 341 45 138 121
6988 121 315 -167 -313 121 74 479 -41 -171 -18 510 -173 48 -26 -355 -272 303 467 252 415 403 7
7009 7 234 -781 -247 507 476 376 36 -84 293 230 441 328 -243 -493 -274 452 33 246 -168 -63 -321
7030 -321 404 -318 -563 84 566 59 -464 272 -60 72 -53 135 -329 -732 317 342 410 -235 503 -243
7050 -243 -364 -14 213 777 96 -25 204 -258 305 569 -292 -537 -322 269 205 -135 57 -10 -219 -320 -187
7071 -187 -380 -185 -161 440 87 -583 140 550 261 -480 -24 22 252 81 -50 809 -452 -624 183 -618
7091 -618 554 -106 457 396 -445 103 138 -457 -392 -847 542 -518 182 -286 662 775 274 -35 -5 107
7111 107 -381 -281 123 226 -144 311 258 115 -114 -20 -149 -162 -37 98 240 199 113 162 -63 -61 38 -242 -183
7134 -183 77 109 60 227 50 72 127 40 -454 -224 248 31 237 220 152 263 204 -429 685 16 -602 531
7156 531 1486 -21 619 -97 430 -881 -263 515 -75 516 -278 -113 -166 460 -536 463 -992 -703 -12
7175 -12 -741 1139 -582 569 56 -758 175 -654 61 77 -215 460 -104 -658 907 -322 -41 131 -357
7194 -357 -252 61 429 192 -15 -139 -328 -244 -70 -387 185 -38 241 360 -129 214 248 157 188 -58 359
7215 359 261 308 176 82 96 338 -319 -364 -61 20 22 -446 68 -262 -733 -297 -324 42 -123 -231 324 -52 137
7238 137 -250 189 533 55 -469 -161 23 738 61 155 274 -186 567 -933 -563 -758 -313 -841 643 1067
7258 1067 -104 -812 318 694 -362 -574 -490 -339 111 -393 1176 -247 -193 -433 -271 -75 -90 -626 -84
7277 -84 -100 -103 606 596 571 35 -131 -41 -8 -159 336 -206 -83 416 157 -97 -413 -988 467 177 495 124
7299 124 -23 116 -346 235 -121 118 -302 -73 -141 181 110 76 -157 31 -178 -245 399 -76 -1011 355 475
7320 475 181 222 536 -135 93 -283 274 281 -655 909 552 -50 277 -206 -88 -63 641 -575 666 352
7340 352 178 441 -274 -68 -70 -170 321 74 -40 743 559 -413 301 13 -217 -291 299 -3 -47 -203 584
7361 584 187 101 240 -39 184 -178 89 192 303 601 373 -224 282 485 473 -981 55 511 180 756
7381 756 -241 -432 -285 76 -347 -474 -339 80 -244 -479 316 189 -28 620 48 -402 154 -256 217 730
7401 730 627 -76 588 -789 354 -1222 -1460 499 372 -324 14 107 356 625 378 244 364 507 471
7420 471 5 3 706 -273 -328 -572 -44 -592 30 606 629 142 -38 -216 -311 -726 -408 33 249 -482 824
7441 824 364 -858 -318 281 199 -415 -383 888 265 -302 910 235 179 -708 -786 -1233 -1197 648 -436 -343
7461 -343 150 650 814 -451 992 -594 -736 -375 676 68 -551 -103 -354 -889 326 -322 -126 -75 -588
7480 -588 243 688 1003 -459 -54 109 1187 -637 400 -790 44 483 99 495 192 -211 204 -270
7498 -270 -526 269 651 -486 1029 -405 -908 -6 -391 -203 224 1043 502 -410 277 100 341 531 454
7517 454 -645 -201 118 -1223 166 -1101 251 -871 -231 -98 -393 -246 223 41 638 964 267 113
7535 113 492 522 -1317 322 -364 -392 424 450 1815 541 1449 253 563 -621 119 -387 -1276 53 -282
7554 -282 277 577 295 -811 -556 -231 676 543 137 701 -16 -532 -1187 1134 -1173 31 246 630 -70
7573 -70 1229 19 -660 137 -587 83 80 558 -297 2 -179 4 216 373 279 299 -395 795 -824 -158
7593 -158 1402 -274 435 -263 200 -617 148 -6 -1039 895 572 243 -285 -99 33 161 531 168 156
7612 156 -47 -370 -109 -724 298 661 -860 -1199 -671 141 390 654 1298 696 474 -260 -74 -726 -25
7631 -25 384 17 -25 80 -525 552 -361 341 -1295 -38 -677 -214 256 -170 -73 1019 644 -341 -354 745
7651 745 -446 306 708 -466 -198 -277 747 292 -1083 -302 192 -377 49 740 -210 -302 -664 1152 -772
7670 -772 -22 -42 -516 -232 -421 65 -102 -722 -34 -158 -384 -700 -113 269 797 1439 -70 490 -414 474
7690 474 -395 518 -62 -348 149 -111 -144 211 -444 44 35 455 -120 185 57 161 691 448 242 -532 -131
7711 -131 -862 -556 306 14 2 -2 41 -121 -591 -245 -304 -8 159 1065 549 -155 600 95 301 -664 -690 -842
7733 -842 488 174 366 17 327 -147 108 -36 -757 334 -118 1032 605 695 363 179 310 -245 -54
7752 -54 -639 -105 190 683 290 510 300 -127 556 236 296 -524 66 776 223 351 -886 -262 -657 -1271
7772 -1271 597 -173 535 -466 83 -218 -301 908 378 1200 500 153 1421 219 368 138 -235 -450
7790 -450 284 86 -615 462 227 819 93 -457 63 -488 -495 -401 6 -762 -1017 -186 735 58 -13 -50 -284
7811 -284 -356 -225 -314 -117 -69 334 365 348 -94 577 314 672 -995 -140 91 222 334 668 207 -139 -73 -744
7833 -744 573 270 -643 -475 248 799 -585 -18 883 -708 -1379 -33 532 124 -426 640 -263 136
7851 136 595 -337 545 23 -301 -517 -389 80 524 418 -93 -447 -345 348 -685 711 -54 -1000 -214
7870 -214 805 -273 198 -897 200 268 -267 221 337 515 382 -741 -246 -706 -703 625 241 397 161
7889 161 427 258 694 100 785 106 229 -157 796 60 164 -96 -197 -261 -136 544 628 337 -402 493 131
7910 131 -207 -366 -337 323 562 503 -538 231 624 328 -467 804 -321 -610 282 -101 168 687 187 -190
7930 -190 21 9 73 46 -104 -145 174 347 -116 -400 649 912 -414 -762 123 -814 -580 426 -22 658
7950 658 41 -945 -25 -1 253 -2 379 256 250 834 400 -228 231 -166 -155 255 239 104 -134 -109 -125 51
7972 51 -298 -328 -184 -462 -506 -668 1 147 376 415 -73 -394 -428 -30 249 61 535 635 13 102 -357 -20
7994 -20 -548 -532 -233 104 134 144 28 173 -159 -332 -208 165 387 -48 -168 -12 -130 152 -434 332 -272
8015 -272 -559 327 -112 70 322 -547 91 371 465 56 -428 226 155 -256 267 203 432 -103 -1354 -520 83
8036 83 698 -144 -677 58 230 -172 -592 106 -605 -279 -355 632 185 123 -3 -74 211 215 -278 -166 -520 415
8058 415 319 195 526 29 -43 492 -792 39 -537 -931 -951 -154 73 -239 410 -1031 -672 -56 143 -538
8078 -538 1136 670 514 803 701 749 -67 -151 -238 -396 494 -861 -1097 -390 -523 117 213 168 -72 -53 172
8099 172 -212 -473 120 26 -1271 32 -289 134 -329 688 -320 440 376 99 567 -390 -274 329 -719
8118 -719 -379 38 383 -572 -403 606 800 -999 -510 575 143 3 -36 793 -198 114 137 -243 -279 -464
8138 -464 35 -810 -285 479 -287 -218 304 -572 -425 -161 785 287 191 672 -820 -612 -615 -98 -704 148 -64
8159 -64 -1145 -406 94 -1208 5 16 193 -339 -24 -234 -391 245 -577 -395 5 -4 -106 61 -526 -45
8179 -45 -559 -22 -95 576 -395 447 594 -960 -479 120 -114 -406
8191d06
##END NTUPLES=NMR FID
##END=
