##TITLE=1H_DE-80H_X3
 200.13MHz, d2o
 8 sc
 
 19ns.26.2.2025
##JCAMPDX= 6.0         $$ Bruker NMR JCAMP-DX V2.0
##DATA TYPE= NMR FID
##DATA CLASS= NTUPLES
##ORIGIN= UXNMR, Bruker Analytische Messtechnik GmbH
##OWNER= pz
$$ XWIN-NMR		Version 3.5
$$ Wed Jul 23 15:03:16 2025 Russian Standard Time (UT+4h)  Yarkov@DPX200
##.OBSERVE FREQUENCY= 200.1313
##.OBSERVE NUCLEUS= ^1H
##.DELAY= (6, 6)
##.ACQUISITION MODE= SIMULTANEOUS
##.ACQUISITION SCHEME= undefined
##.AVERAGES= 8
##.DIGITISER RES= 18
##SPECTROMETER/DATA SYSTEM= spect
##.PULSE SEQUENCE= zg30
##.SOLVENT NAME= CDCl3
##.SHIFT REFERENCE= (INTERNAL, CDCl3, 0, 14.3821)
##AUDIT TRAIL= $$ (NUMBER, WHEN, WHO, WHERE, WHAT)
$$ ##TITLE= Audit trail, XWIN-NMR		Version 3.5
$$ ##JCAMPDX= 5.01
$$ ##ORIGIN= Bruker BioSpin GmbH
$$ ##OWNER= Yarkov
$$ C:/Bruker/XWIN-NMR/data/yarkov2/nmr/H-C/1/audita.txt
$$ ##AUDIT TRAIL=  $$ (NUMBER, WHEN, WHO, WHERE, WHAT)
(   1,<2025-07-23 15:01:27.40 +0400>,<Yarkov>,<DPX200>,
      <created by zg, POWCHK disabled, PULCHK disabled
       configuration hash MD5:
       00 E9 B6 7A A2 85 ED C7 34 08 36 98 17 FE 4E 26
       data hash MD5: 16K
       D0 C2 A6 7E A8 5B C3 AA D2 A8 97 00 7C DA F8 07>)
$$ ##END=
$$ 
$$ hash MD5
$$ D9 94 05 FC 3E D1 AB B6 AB 6E 40 6E C7 5E 66 6F
##$RELAX= 
##$RELAX= 
##$RELAX= 
##$RELAX= 
##$RELAX= 
##$RELAX= 
$$ Bruker specific parameters
$$ --------------------------
##$DU= <C:/Bruker/XWIN-NMR>
##$EXPNO= 1
##$NAME= <H-C>
##$PROCNO= 1
##$TYPE= <nmr>
##$USER= <yarkov2>
##$AMP= (0..31)
100 100 100 100 100 100 100 100 100 100 100 100 100 100 100 100 100 100 
100 100 100 100 100 100 100 100 100 100 100 100 100 100 
##$AQSEQ= 0
##$AQ_mod= 1
##$AUNM= <au_zg>
##$AUTOPOS= <>
##$BF1= 200.13
##$BF2= 200.13
##$BF3= 200.13
##$BF4= 200.13
##$BF5= 200.13
##$BF6= 200.13
##$BF7= 200.13
##$BF8= 200.13
##$BYTORDA= 1
##$CFDGTYP= 0
##$CFRGTYP= 5
##$CHEMSTR= <none>
##$CNST= (0..31)
1 1 145 1 1 1 1 1 1 1 1 1 1 1 1 1 1 1 1 1 1 1 1 1 1 1 1 1 1 1 1 1 
##$CPDPRG= <>
##$CPDPRG1= <>
##$CPDPRG2= <>
##$CPDPRG3= <>
##$CPDPRG4= <mlev>
##$CPDPRG5= <mlev>
##$CPDPRG6= <mlev>
##$CPDPRG7= <mlev>
##$CPDPRG8= <mlev>
##$CPDPRGB= <>
##$CPDPRGT= <>
##$D= (0..31)
0 0.7 0 0 0 0 0 0 0 0 0 0.03 0 0 0 0 0 0 0 0 0 0 0 0 0 0 0 0 0 0 0 0 
##$DATE= 1753268486
##$DBL= (0..7)
120 120 120 120 120 120 120 120 
##$DBP= (0..7)
150 150 150 150 150 150 150 150 
##$DBP07= 0
##$DBPNAM0= <>
##$DBPNAM1= <>
##$DBPNAM2= <>
##$DBPNAM3= <>
##$DBPNAM4= <>
##$DBPNAM5= <>
##$DBPNAM6= <>
##$DBPNAM7= <>
##$DBPOAL= (0..7)
0.5 0.5 0.5 0.5 0.5 0.5 0.5 0.5 
##$DBPOFFS= (0..7)
0 0 0 0 0 0 0 0 
##$DE= 6
##$DECBNUC= <off>
##$DECIM= 32
##$DECNUC= <off>
##$DECSTAT= 4
##$DIGMOD= 1
##$DIGTYP= 9
##$DL= (0..7)
0 120 120 120 120 120 120 120 
##$DP= (0..7)
150 150 150 150 150 150 150 150 
##$DP07= 0
##$DPNAME0= <>
##$DPNAME1= <>
##$DPNAME2= <>
##$DPNAME3= <>
##$DPNAME4= <>
##$DPNAME5= <>
##$DPNAME6= <>
##$DPNAME7= <>
##$DPOAL= (0..7)
0.5 0.5 0.5 0.5 0.5 0.5 0.5 0.5 
##$DPOFFS= (0..7)
0 0 0 0 0 0 0 0 
##$DQDMODE= 0
##$DR= 18
##$DS= 0
$$ [...]
##$SUBNAM2= <"">
##$SUBNAM3= <"">
##$SUBNAM4= <"">
##$SUBNAM5= <"">
##$SUBNAM6= <"">
##$SUBNAM7= <"">
##$SUBNAM8= <"">
##$SUBNAM9= <"">
##$SW= 18.0517328524113
##$SWIBOX= (0..15)
0 0 2 0 0 0 0 0 0 0 0 0 0 0 0 0 
##$SW_h= 3612.71676300578
##$TD= 16384
##$TD0= 1
##$TE= 0
##$TE2= 300
##$TE3= 300
##$TEG= 300
##$TL= (0..7)
0 120 120 120 120 120 120 120 
##$TP= (0..7)
150 150 150 150 150 150 150 150 
##$TP07= 0
##$TPNAME0= <>
##$TPNAME1= <>
##$TPNAME2= <>
##$TPNAME3= <>
##$TPNAME4= <>
##$TPNAME5= <>
##$TPNAME6= <>
##$TPNAME7= <>
##$TPOAL= (0..7)
0.5 0.5 0.5 0.5 0.5 0.5 0.5 0.5 
##$TPOFFS= (0..7)
0 0 0 0 0 0 0 0 
##$TUNHIN= 0
##$TUNHOUT= 0
##$TUNXOUT= 0
##$USERA1= <user>
##$USERA2= <user>
##$USERA3= <user>
##$USERA4= <user>
##$USERA5= <user>
##$V9= 5
##$VALIST= <valist>
##$VCLIST= <CCCCCCCCCCCCCCC>
##$VD= 0
##$VDLIST= <DDDDDDDDDDDDDDD>
##$VPLIST= <PPPPPPPPPPPPPPP>
##$VTLIST= <TTTTTTTTTTTTTTT>
##$WBST= 1024
##$WBSW= 4
##$XGAIN= (0..3)
0 0 0 0 
##$XL= 0
##$YL= 0
##$YMAX_a= 41629
##$YMIN_a= -29949
##$ZGOPTNS= <>
##$ZL1= 120
##$ZL2= 120
##$ZL3= 120
##$ZL4= 120
##$ABSF1= 10
##$ABSF2= 0
##$ABSG= 5
##$ABSL= 3
##$ALPHA= 0
##$AQORDER= 0
##$ASSFAC= 0
##$ASSFACI= 0
##$ASSFACX= 0
##$ASSWID= 0
##$AUNMP= <proc_1d>
##$AZFE= 0.1
##$AZFW= 0.1
##$BCFW= 1
##$BC_mod= 2
##$BYTORDP= 1
##$COROFFS= 0
##$CY= 83.5205535888672
##$DATMOD= 1
##$DC= 2
##$DFILT= <>
##$DTYPP= 0
##$F1P= 10.8118882576601
##$F2P= -7.23987719738617
##$FCOR= 0.5
##$FTSIZE= 0
##$FT_mod= 4
##$GAMMA= 1
##$GB= 0.15
##$INTBC= 1
##$INTSCL= 1
##$ISEN= 128
##$LB= 0.25
##$LEV0= 0
##$LPBIN= 0
##$MAXI= 10000
##$MC2= 0
##$MEAN= 0
##$ME_mod= 0
##$MI= 1.114404
##$NCOEF= 0
##$NC_proc= 0
##$NLEV= 6
##$NOISF1= 3.799351
##$NOISF2= 2.8
##$NSP= 1
##$NTH_PI= 0
##$NZP= 0
##$OFFSET= 14.38212
##$PC= 1
##$PHC0= -1356.223
##$PHC1= 9.99091
##$PH_mod= 1
##$PKNL= yes
##$PPARMOD= 0
##$PSCAL= 0
##$PSIGN= 0
##$REVERSE= no
##$SF= 200.129724274929
##$SI= 16384
##$SIGF1= 3
##$SIGF2= 2
##$SINO= 400
##$SIOLD= 16384
##$SREGLST= <1H.CDCl3>
##$SSB= 0
##$STSI= 0
##$STSR= 0
##$SW_p= 3205.1282051282
##$SYMM= 0
##$S_DEV= 0
##$TDeff= 0
##$TDoff= 0
##$TI= <>
##$TILT= no
##$TM1= 0
##$TM2= 0
##$TOPLEV= 0
##$USERP1= <user>
##$USERP2= <user>
##$USERP3= <user>
##$USERP4= <user>
##$USERP5= <user>
##$WDW= 1
##$XDIM= 8192
##$YMAX_p= 0
##$YMIN_p= 0
$$ End of Bruker specific parameters
$$ ---------------------------------
##NTUPLES= NMR FID
##VAR_NAME=  TIME,          FID/REAL,        FID/IMAG
##SYMBOL=    X,             R,               I
##VAR_TYPE=  INDEPENDENT,   DEPENDENT,       DEPENDENT
##VAR_FORM=  AFFN,          ASDF,            ASDF
##VAR_DIM=   8192,          8192,            8192
##UNITS=     SECONDS,       ARBITRARY UNITS, ARBITRARY UNITS
##FACTOR=    0.0002768,     1,               1
##FIRST=     0,             0,               0
##LAST=      2.2672688,     0,               0
##MIN=       0,             -29949,          0
##MAX=       2.2672688,     41629,           0
$$ Real data points
##PAGE= N=1
##DATA TABLE= (X++(R..R)), XYDATA
0 0 0 0 0 0 0 0 0 0 0 0 0 0 0 0 0 0 0 0 0 0 0 0 0 0 0 0 0 0 0 0 0 0 0 -1 1 -2 2 -4 6 -8 8 -8 9 -9 10 -10 11 -15 15 -18 19
51 19 -19 22 -25 25 -30 31 -35 35 -39 43 -45 45 -43 36 -19 -33 178 -726 6041 41629 -2823 -27536 15946
74 15946 4647 -29949 -7006 6948 -19789 -11761 9006 -8405 -8938 23311 20300 4584 21613
87 21613 22683 -1623 -867 6086 -8494 -15300 -10600 -14953 -17492 -9823 -3916 -1667 3004 6794 8685
102 8685 9819 7761 6557 9015 4176 -2365 2156 819 -6386 1843 4625 -11250 -9524 5493 -2388
117 -2388 -13538 -3148 1386 -8659 -4901 6202 3069 3803 14078 8573 202 9783 10687 -3025
131 -3025 -3412 439 -8710 -13520 -7384 -5589 -7833 -3137 2035 -476 1071 9189 8662 3762 5645 6301
147 6301 1164 -2128 -531 315 -2942 -4390 -2634 -4892 -5234 937 398 -4884 -1369 2898 -360 -1076
163 -1076 4086 5727 2763 2685 3563 972 1927 3870 -2316 -5948 -1759 -3254 -7515 -4163 -766 -1552
179 -1552 -1427 477 2324 3955 6009 5459 2004 1584 3038 402 -2275 -1646 -1301 -2784 -5265 -4983 -1032
196 -1032 -177 -1702 103 789 -168 2277 3621 2098 2725 4360 2584 -1197 86 2909 -379 -3639
212 -3639 -2294 -3581 -4624 -2185 -2375 -3113 -126 1196 -429 882 4527 5367 2867 2403 2685 941
228 941 790 1002 -1995 -3075 -1745 -3557 -5411 -2947 -88 -227 -2121 -1024 1630 2033 2156 3694 3109
245 3109 2677 2624 883 -38 640 893 -1012 -4168 -3945 -1498 -2411 -3162 -1250 -362 -506 290 768 1929
263 1929 3332 3216 1723 327 1496 2754 361 -704 117 -1239 -2275 -2010 -2086 -1710 -642 -1206 -2539
280 -2539 -1883 1196 2473 700 1361 3160 1847 934 1677 1596 1081 253 -1546 -2753 -2173 -497 -828 -2679
298 -2679 -1377 738 -728 -848 1236 1869 1363 789 -12 220 1017 1548 510 -862 438 1058 -1198
315 -1198 -1110 754 12 -1289 -1404 -1410 -980 -169 593 -117 -799 1201 1966 -93 609 2572 944 -944 -796
334 -796 -412 -32 -304 -489 -959 -846 552 368 -979 268 1449 -506 -1394 -323 73 195 51 -103
352 -103 -23 504 1499 818 -226 1350 1360 -1241 -1291 191 -264 -945 -1110 -896 -769 -89 923 313 -226 1402
372 1402 1213 -1136 -434 1503 632 -731 -548 171 415 40 449 163 -168 477 -411 -1702 -258 713
390 713 -737 -1161 -231 330 565 586 917 806 538 790 -37 -703 652 539 -1416 -1420 -330 -84 -188 -64
410 -64 340 251 191 773 38 -307 956 632 -1226 -996 541 709 -481 -515 482 247 -352 176 195 59 653
431 653 -349 -1510 -111 1079 17 -746 -9 616 -245 -541 533 274 -333 169 -658 -1177 589 945
449 945 -217 -218 552 650 60 210 736 271 -167 -277 -1306 -1108 130 -231 -1116 -673 12 416 262 328 1253
470 1253 1340 484 80 196 510 807 -262 -1017 -611 -203 -484 -1198 -666 481 -479 -1211 15 385 294 875
490 875 581 123 890 1401 646 184 774 962 -975 -1379 -317 -790 -1346 -930 -1402 -1471 -243 262 70 632
510 632 1575 1346 677 893 1584 1040 447 -90 -1014 -545 -471 -1344 -1351 -821 -685 -837 -908 -413 884 741 222
531 222 545 881 1203 1112 781 676 708 343 -281 -1145 -628 94 -1494 -2265 -889 -649 -880 -295 287 417
551 417 798 1378 1093 937 1819 1511 -190 -332 367 -444 -1198 -869 -1194 -1092 -691 -703 -579 87 749 571
571 571 -187 362 1270 653 326 499 539 364 13 -360 -115 -105 -278 -819 -1421 -594 222 -660 -864 196 589
592 589 279 589 1054 995 849 611 -96 -354 389 9 -1327 -1036 -309 -587 -564 -60 214 377 519 388 196
613 196 447 989 287 -486 -95 203 -351 -470 -272 -89 200 -423 -585 -6 296 318 80 -391 147 694 250
634 250 15 420 677 56 -420 -133 100 -434 -526 -843 -894 32 155 -440 221 995 621 455 763 862 653
655 653 251 -109 -757 -819 -140 -819 -1229 -352 -130 -697 -323 273 576 749 475 293 306 542 622 105 -148
676 -148 245 50 -478 -658 -418 -111 -431 -1235 -684 -72 -294 -70 75 280 819 1037 424 669 1291 928
696 928 -189 -564 -50 -369 -1049 -834 -912 -1164 -502 -351 -525 401 951 492 281 676 926 691 366 424 78
717 78 -216 100 -394 -745 -85 -220 -714 -816 -432 -44 -114 -391 184 356 392 657 414 698 1075 643 -172
738 -172 -116 209 -78 -664 -939 -438 -650 -730 -452 -215 60 573 221 8 817 862 442 41 93 468 -193 -426
760 -426 -187 -233 -192 -142 -534 -486 112 103 -148 -251 30 314 -65 -120 386 389 225 300 -5 13 385 28 -393 -485
784 -485 -125 -42 -513 -455 180 169 -209 59 276 244 505 130 -283 -128 131 -155 -583 -311 308 -97 -288 85
806 85 199 313 226 -163 -12 306 192 -207 -389 -105 83 -365 -370 241 71 -8 106 -171 165 330 161 32
828 32 -60 174 314 -209 -53 345 114 -142 -254 -205 -192 -99 -379 -398 -396 129 82 -264 299 783 358 157 371
851 371 341 337 123 -332 -283 -304 -106 -410 -588 29 110 -363 -378 126 423 283 269 127 409 322 139 182 -85 319
875 319 102 -513 -252 100 -131 -323 -373 -431 -152 -242 -154 16 22 416 222 -163 473 619 363 3 66 88 -78
898 -78 -242 -411 -187 -342 -142 -357 -435 211 337 -123 -59 266 283 201 -9 82 173 22 -16 -154 -151 370 266 -306
922 -306 -272 57 -56 -226 -205 -59 -102 -55 -137 -46 104 515 227 -198 167 484 1 -38 -34 -36 0 -231 -267 -129 18
947 18 189 -165 -223 197 117 -196 -173 -7 -2 -17 -285 30 248 195 291 -45 87 368 183 -148 -36 -52 -203 -508
971 -508 -502 -142 -53 -187 -110 -35 78 537 229 10 269 351 259 -84 42 286 81 -230 -127 -91 -178 94 -321
994 -321 -469 -39 -86 -285 -247 9 284 82 23 429 452 411 401 39 -56 210 -109 -432 -252 -147 -335 -443 -347
1017 -347 121 79 73 169 34 269 369 -55 67 251 283 9 -146 -139 187 -102 -289 -49 -249 -121 -69 -392 -369
1040 -369 80 -96 -82 -102 343 548 331 45 242 250 3 47 -364 -133 -129 -430 -392 -287 36 219 -74 -26 243
1063 243 193 150 214 -6 69 67 -192 -116 27 190 93 -312 -49 211 137 -63 27 -60 -54 -49 -167 -51 152 221 -42
1088 -42 -133 107 418 -134 -57 162 -92 -59 -17 -219 85 260 50 14 17 312 207 -137 17 36 -131 -321 -302
1111 -302 -158 98 -66 -186 -41 272 288 199 107 160 289 -44 -122 -58 -44 -162 -213 -513 -263 -29 52 -177 -216
1134 -216 190 63 -37 -108 182 148 235 21 6 238 201 160 -121 -191 83 -19 -429 -431 65 -128 -258 -316 -39
1157 -39 351 197 259 157 304 466 226 60 160 158 -250 -346 -225 -278 -318 -347 -296 -151 -33 23 -99 -162 323 234
1181 234 54 146 293 331 254 -85 -123 15 -135 -105 -288 -287 47 -214 -422 -110 -33 45 113 88 370 324 165 247
1205 247 211 98 199 -135 -402 -124 -54 -263 -273 -304 -81 -31 -131 -7 191 96 153 -89 12 324 182 -19
1227 -19 -98 -42 151 -63 -39 -80 -25 -73 -238 -185 -214 89 -74 -167 -19 154 167 63 -67 67 171 -50 -20 -148
1251 -148 38 -43 -188 -258 64 148 28 -99 -71 312 83 51 28 -38 8 -49 -218 -136 207 28 -18 -44 96 237
1275 237 -25 16 220 211 99 -50 -174 -152 140 -7 -168 -116 -70 -54 -163 -122 100 -68 -51 -39 -26 143 318 118
1299 118 33 265 255 91 -24 72 3 -115 -353 -184 -148 -58 -105 -139 0 178 301 160 192 336 265 109 -38
1322 -38 132 191 -135 -170 -285 -151 88 -164 -67 -72 19 -44 -202 62 231 241 158 185 180 251 254 17 87 66 47 -108
1348 -108 -289 -238 -37 -274 -312 -140 -102 87 117 175 268 358 233 101 54 136 161 -138 -150 -122 -31 -59 -95 -265 -95
1373 -95 -124 -118 -47 37 250 81 -6 76 123 155 79 125 93 120 68 -177 -13 -84 -25 -103 -251 -95 -70 -4 -66 -8 78 177
1401 177 120 -5 104 117 116 -89 -152 119 -12 -174 -154 75 -34 4 -114 6 45 75 -33 -173 -5 191 31
1424 31 -204 -20 105 14 46 -79 109 144 -8 -57 -41 43 102 -125 -100 12 -47 19 -177 -38 -8 -76 -132 -16 21
1449 21 40 100 -28 15 244 138 102 118 166 79 90 -85 -162 -103 -53 -114 -203 -192 -13 -65 -50 64 111 199 -76 54
1475 54 153 186 101 -60 -34 -18 20 -106 -166 93 -55 -193 -109 -123 46 50 -72 -68 83 79 120 53 0 249 130 30
1501 30 -67 -77 125 -170 -262 -143 -177 -54 -27 -27 53 118 159 5 157 171 290 163 -50 43 5 26 -13 -82 -9 -10 -108
1528 -108 -208 -131 31 -115 -95 -18 60 -23 -33 26 60 94 50 -12 141 98 -31 -17 -84 -45 1 -109 -128 -137 -20 46 42
1555 42 -44 79 94 -24 -74 -4 43 28 -97 -89 64 -7 -10 26 -13 85 76 -39 -39 112 80 -68 -100 31 93 -90 -126 5
1583 5 129 20 138 -200 -5 152 26 -123 -127 5 -21 17 -26 12 -15 85 -60 -35 68 36 -133 -72 12 51 130
1608 130 -89 86 228 173 78 107 -22 50 63 -53 -185 -78 -75 -57 -86 -176 14 -92 -57 73 83 121 -36 -128 78
1633 78 60 37 62 -141 -3 -49 -92 -122 -108 -107 -11 -126 -180 -92 36 -47 -106 64 122 79 -31 153 184 184 -6 63 35
1660 35 -31 -43 -149 -149 -200 21 -30 -156 75 94 85 39 71 113 199 75 -17 151 -57 -8 -147 -98 98 9 -140 -90
1686 -90 -2 -34 108 -72 -207 39 78 122 -34 119 229 139 38 133 13 -59 -137 -150 -40 -43 -84 47 -56 -30 98
1711 98 -99 5 78 60 79 -99 -161 -26 46 -61 -30 -34 123 -46 -153 -6 121 -17 -69 -104 75 -10 -63 -204
1735 -204 -86 106 20 65 -30 52 23 51 -22 30 -17 116 52 -48 -99 97 82 10 -48 37 51 -121 -230 52 -104
1760 -104 12 -124 -96 89 132 39 -17 98 126 32 -54 3 23 31 -127 -55 -215 -74 -85 -106 -20 23 -14 -77 50 120
1786 120 51 66 34 -52 87 -20 12 -65 -43 -39 -137 -20 -184 -57 39 -121 -108 -36 3 55 42 106 153 117 11 82 -18
1813 -18 41 -15 -142 -124 54 -166 -202 -87 -105 84 -27 -8 72 8 37 14 -3 129 132 72 68 132 104 -60 -67 75 29
1840 29 -98 -38 -31 -107 99 -71 -73 -56 134 141 135 50 -29 110 -49 -14 126 -123 -7 -46 -118 -96 -80 75 11 -15 6
1867 6 -9 -17 10 73 35 61 -33 -101 13 15 -29 64 -99 85 107 -31 -53 -15 -49 -63 -122 -69 -73 3 -90 -117 51 88 117 -12
1897 -12 81 50 -4 -84 19 -15 -4 59 -44 12 -67 92 -128 -71 -33 47 -45 -43 -51 15 -9 -20 -37 96 60 -17 8 27 140
1926 140 1 -1 -25 20 -91 -85 13 -155 13 6 -4 -40 64 73 -35 72 -45 82 51 38 -8 -26 24 -33 -119 101 14
1953 14 -32 -18 -57 50 -90 -109 -53 40 -36 30 49 -32 35 128 50 44 -4 90 -128 -38 -36 -82 -76 -34 -6 -90 -67 -24 -115 -99
1983 -99 107 73 78 -116 27 -9 46 39 -57 66 37 83 -101 44 45 15 -86 -170 -125 -65 19 -53 -6 121 100 -28 127
2010 127 83 105 10 -6 48 -2 -107 -24 -46 25 5 56 -71 6 -10 -5 67 24 101 -22 -135 96 87 -29 124 -48 33
2037 33 26 53 -159 -11 -20 -13 -70 -84 -19 91 6 -33 -56 52 93 10 18 90 -1 -71 5 -6 25 28 13 35 -1 11 85 -7 -81
2068 -81 33 92 -65 -61 -120 3 81 -49 41 -68 99 123 5 -50 102 29 -18 -151 -53 -79 3 -91 -26 -127 27
2093 27 -80 -95 0 61 29 -11 91 61 26 98 -29 -1 172 66 -108 -30 116 60 -200 -38 -32 -152 57 -5 137
2118 137 71 62 33 20 124 48 -49 18 -69 42 -6 5 -178 49 -30 42 -83 -57 -35 29 -112 63 67 70 73 -84 69
2145 69 -7 59 76 84 32 52 -105 -62 -82 -70 0 -62 -91 88 -27 -6 18 14 138 145 -6 32 13 -61 -82 -144 40 -58 -52
2174 -52 -38 -118 -42 0 33 -77 47 67 -50 -67 -4 -9 57 3 -121 -2 61 -6 -23 38 54 39 -28 -111 -64 47 -19 -71
2202 -71 26 -44 -69 -86 -29 -86 -1 -32 84 5 40 44 27 -87 5 67 -84 75 4 -57 -55 -13 -4 -45 -123 -58 -60 31 68 17
2232 17 21 44 179 95 -38 -63 -92 123 -28 -39 -140 -52 -35 -31 -58 -76 -96 -69 -19 -75 7 -17 35 -30 -72 -97 67 60 -61
2261 -61 71 61 -19 -42 25 -23 -89 -128 -27 -44 -54 -59 -73 58 128 49 -29 74 129 -8 -46 -71 6 46 -70 13 -34 -23
2289 -23 -92 -5 -116 7 20 -22 18 -88 106 9 -44 -2 43 39 111 23 -105 63 -118 63 -149 -96 12 74 63 -66
2315 -66 94 6 57 61 -38 16 -1 9 5 5 19 -17 -53 -79 -72 -15 -124 28 59 52 63 -73 -29 -44 89 5 48 15 12 40 -19
2346 -19 -22 86 -54 -76 -29 -82 26 9 8 35 78 -66 -117 -92 26 -35 42 -9 72 -68 -65 -61 -67 -76 25 -18 50 -3 14 -38
2376 -38 -35 -68 -121 -70 -58 3 18 -26 -55 -40 -50 53 -71 -74 68 6 104 66 -66 9 -65 -22 60 -64 -87 57 27 -49
2404 -49 -29 -75 -42 -61 -30 -27 -27 38 -26 94 11 129 9 -17 30 27 138 -99 12 24 86 56 4 -65 -130 75 19 54
2432 54 103 39 98 60 89 -68 63 91 -36 -26 1 -14 -61 -100 24 -34 50 -88 33 11 30 -28 38 45 45 39 -115 24
2460 24 58 35 18 -18 63 1 -44 -6 51 20 72 -49 1 30 37 53 -66 -5 16 73 42 13 62 31 -106 -17 -50 115 12
2489 12 -40 -65 -118 69 36 -9 81 10 -34 -56 -3 51 28 108 76 -34 0 -182 67 -4 -54 -85 -103 -45 49 199 137 -24
2517 -24 35 97 -3 14 46 -13 10 15 18 30 91 -149 -90 -3 -28 5 73 131 23 60 47 -18 74 3 -34 -112 -51 24 45 52
2547 52 -58 -116 -3 2 -26 94 5 33 60 -52 -47 22 -97 -51 23 5 -4 -188 -11 31 -47 43 54 100 85 -70 15 -32
2575 -32 16 110 71 24 44 -79 41 -9 -6 96 -28 3 -44 130 -45 -122 -17 -84 -14 22 -23 44 -34 -34 88 48 -2
2602 -2 -35 -15 -91 -24 30 -42 103 -39 13 -27 -7 81 86 -3 47 -67 -34 -42 -35 -103 -14 33 -42 -20 -100 -99 87 60 28 -4 -117
2633 -117 -10 22 17 21 16 33 29 25 -22 20 31 45 -69 8 -63 10 -12 -37 -14 -8 -82 -25 59 -1 68 77 41 -86 19 -26 -54
2664 -54 69 -53 29 89 62 59 8 36 -54 -125 -4 -85 25 -30 17 146 32 -10 -9 -39 67 62 -43 -110 -43 8 -53 84
2692 84 18 -29 -126 -40 -40 -20 -31 59 -26 -28 9 34 -7 -19 40 9 -115 -66 -107 -75 45 -27 27 -41 -26 82 -32 -114 19
2721 19 2 -102 -9 61 12 -48 71 39 41 17 -17 17 29 29 -51 -78 69 -17 -70 -5 30 38 -58 -81 -9 31 52 112 115 -8
2751 -8 18 -36 -28 32 -19 71 -126 -59 56 101 144 55 40 -102 -53 11 -71 -86 125 68 -30 -98 -13 62 47 -51 57 -36 68
2780 68 -145 -34 -14 -22 -64 113 -12 -71 31 20 -20 44 32 -22 -19 -89 -69 154 -25 -51 7 -117 69 48 21 -93
2806 -93 -33 74 61 -108 47 75 99 -62 -25 -25 -76 -19 58 30 35 -91 37 49 -11 -74 -23 11 103 90 -13 46 -11 -18
2834 -18 -34 -28 50 81 97 6 50 74 -15 -35 -142 114 -94 66 -57 -66 12 87 -1 67 -62 -52 -11 -20 15 -22 15 76 61
2863 61 -9 155 -70 -40 -95 -118 149 43 -52 -17 -38 -19 -53 -9 -11 25 30 3 -56 83 -34 -30 23 -26 -67 -118 -97 -27 -95
2892 -95 23 21 20 55 37 -98 -61 -123 -41 41 26 50 -78 -8 7 14 70 87 126 -15 -110 -67 65 -90 1 -31 45 50 -12
2921 -12 -38 -33 -52 34 74 -71 76 12 -49 -5 56 24 -88 -17 -14 -38 -18 -5 -70 77 -10 35 -31 -35 54 82 75 -11 149 34
2951 34 51 -23 87 8 -5 -76 -24 120 -84 -35 -22 66 -16 -36 -14 -45 -5 -106 44 -21 35 4 -69 -104 -100 41 -38 50
2979 50 -35 -89 83 -105 -35 42 33 -91 70 -24 89 48 -66 23 1 103 -32 -125 120 -14 -35 -13 39 -74 -30
3004 -30 -13 -122 2 62 0 34 -28 16 -93 -74 -7 45 -7 -45 150 -4 -29 40 21 49 -21 34 -119 16 7 0 109
3031 109 12 48 -49 91 10 -29 50 89 41 54 -69 71 28 -50 74 -7 -90 -7 35 -87 -47 70 58 -63 -12 90
3057 90 72 53 -55 130 -27 20 -7 63 17 -36 -56 55 -3 34 -25 -1 -5 -106 -76 23 52 -52 4 12 -91 -53 -31 29
3085 29 25 79 59 -60 -53 38 64 -69 -86 -180 57 -124 -98 -18 16 14 1 44 34 113 89 6 26 9 -9 -31 -31 -17 -50 13
3115 13 54 -1 -13 -1 76 -19 -57 20 119 35 -10 9 57 -4 -17 -35 -13 -164 -151 -71 -171 170 -4 48 1 -8 -31 66 4
3144 4 14 -52 85 1 31 30 5 51 49 -78 -39 39 -8 -56 -7 61 -13 44 -59 142 -144 94 21 74 85 22 3 18 19
3173 19 -29 -38 24 89 38 25 -77 76 -35 50 98 -50 29 -12 30 -34 17 -56 7 29 -110 -35 -52 -13 1 -86 14 41
3201 41 31 -100 5 -43 117 -23 -26 -27 111 62 -95 -11 -32 -5 53 35 -55 -70 -14 3 -89 53 44 20 -33 68 -26 -70
3229 -70 69 -58 -56 8 35 0 -67 141 90 -5 -11 36 -61 11 -56 22 -50 -63 38 74 7 62 -62 81 -56 57 41
3256 41 0 47 126 3 -68 -110 68 -2 -126 -102 5 -32 28 -47 -41 51 -24 -67 -11 -84 -34 11 -74 37 16 17 63 71 -30
3285 -30 10 -105 -3 -92 -64 -31 58 8 -89 -13 42 -6 -122 26 -76 -50 17 52 29 7 45 -10 -12 -68 -71 6 94 96 23
3314 23 65 24 58 -66 -113 23 -65 23 -46 -10 -76 -7 16 23 -58 175 31 68 -69 -40 19 -21 89 72 39 -5 40 -118
3342 -118 -79 0 4 5 -19 -130 37 56 38 -9 -78 46 -42 -25 -96 -27 -77 5 54 12 78 -9 -41 52 -104 -77 16 -41 -108
3371 -108 53 12 49 -30 -39 1 -30 41 25 -19 -88 20 -39 -11 -32 35 -23 -29 -142 -53 63 19 -13 -54 136 -77 25
3398 25 -21 -8 -25 31 -35 6 -58 -51 67 -128 40 -86 103 40 -10 30 30 71 -31 -96 -47 10 31 153 -52 74 55
3425 55 -67 6 57 -82 -64 -85 -82 -43 -12 -91 1 -90 -117 -42 20 -88 -20 138 87 -51 -92 61 -81 4 95 -20 16
3452 16 -22 31 -40 -28 48 13 99 -55 -13 -43 -101 -6 67 -87 -47 -66 -73 -176 59 -19 -2 -87 -83 -33 42 -37 -17 -28 -33 20
3482 20 136 -51 45 -40 38 119 44 -35 -39 -48 -61 -56 -132 31 10 -81 -98 13 171 -52 -25 -55 -11 68 -95 4 -38 69
3510 69 36 30 49 88 -7 -68 -50 -47 51 179 14 -65 55 62 -64 7 -11 40 24 8 -76 -126 55 49 -95 7 38 17 -20
3539 -20 -31 -45 45 107 -64 -48 -33 106 -15 -41 1 26 21 -31 -40 -59 -33 15 27 16 -75 5 -84 32 -130 -30 113 -56
3567 -56 75 45 -48 -41 93 5 80 -63 26 -44 52 39 -73 -68 9 -14 1 -40 88 83 137 -55 -10 79 -11 14 34 -89
3595 -89 65 87 3 20 47 32 17 33 73 -14 -56 23 -15 -32 -37 7 -5 34 39 67 40 -32 10 58 -4 -78 -56 137 128 -18
3625 -18 130 65 151 51 -24 -88 68 -34 44 111 14 149 35 -65 87 -51 20 56 33 93 -55 100 -12 36
3649 36 100 34 -107 32 -14 -56 18 78 12 -50 93 18 117 -17 -9 -73 -31 -1 -56 -4 20 -23 -21 24 -56 44 18 21 -20
3678 -20 54 -5 55 6 48 -95 79 -11 -94 60 -24 -52 63 -39 -51 23 -107 -107 67 34 -161 6 -58 111 -10
3703 -10 35 -2 8 -70 12 -16 -28 64 -84 2 -38 -61 -25 43 -49 11 -90 -81 8 6 -33 -42 -10 137 -4 -74 54 -5 9
3732 9 138 -3 -69 26 -85 46 27 -11 29 -56 -31 -80 -13 4 42 -26 16 -15 -27 75 28 32 -9 -3 -62 -5 -53 43 -104
3761 -104 -9 -145 -33 -152 -56 6 87 -11 84 63 -5 -9 69 -178 -129 32 36 -7 10 41 78 -23 54 28 22 -20 -10 55
3789 55 30 89 -50 133 -16 -53 -94 84 103 -17 74 1 26 -68 13 78 -101 -67 154 -65 -2 2 43 -111 -49 -98
3815 -98 28 121 -52 -50 -76 68 -72 -62 106 -72 -43 15 -25 42 2 48 33 177 28 -4 -1 -71 -20 -33 -47 -17 -62
3842 -62 15 -7 39 39 -149 -50 -90 -47 42 96 -28 -21 -27 -26 46 -21 15 85 14 -20 154 -42 -4 60 -4 19 4 -18 -63 5
3872 5 132 62 -5 -7 -140 0 -48 27 -73 59 20 -39 -39 70 108 -77 97 -71 -75 4 37 -11 1 37 92 -45 -58
3899 -58 -49 -30 -2 6 3 -27 48 34 87 81 -16 58 -36 -46 68 103 -34 93 -31 67 95 -8 44 131 59 79 25 24 -66 -1
3929 -1 -75 -36 -26 35 -13 80 -77 -16 35 -171 115 -106 -107 -35 -69 88 24 24 29 -95 -37 -28 -47 -136 0 86 -13 66 29
3958 29 73 92 184 -40 122 116 0 69 30 74 -13 -52 -19 -102 -101 23 -19 53 14 -65 -46 34 37 -26 -24 21 116 43 -82 18
3988 18 -16 121 63 72 140 11 -27 -22 0 -11 -39 -41 11 3 23 -56 -20 -34 -15 -2 -16 -56 39 9 25 -35 87 56 30 97 -4
4019 -4 15 6 28 -43 95 17 134 64 18 1 -127 -32 -83 88 38 71 71 -150 98 73 -175 -18 -70 30 13 -38 -20
4046 -20 -44 -3 -2 91 -28 -28 -10 -12 0 -1 120 0 11 -37 -20 -57 -18 -27 -57 -4 -70 82 40 -37 1 -32 4 -3 7 -35 3
4077 3 -5 109 -10 66 99 55 -62 10 -62 -8 -3 23 139 -25 -25 -28 13 -77 2 -28 48 -17 -49 -77 48 -67 -66 58 30
4106 30 -56 28 52 20 2 -26 75 23 27 -108 10 -14 20 13 -45 -31 -92 27 76 -9 -68 -10 14 -122 39 -46 22 -6
4134 -6 -83 52 -53 24 28 62 76 -132 -5 -15 30 95 -61 61 -170 -79 9 -64 -40 -48 -71 -44 -108 45 8 -11 11 -36
4162 -36 48 -66 -20 9 105 6 33 32 143 172 -42 -46 99 62 5 85 91 130 -35 -79 -126 -57 54 69 4 1 -12 -15 23 -26
4192 -26 -129 -2 -10 -30 82 68 -60 3 69 22 42 87 -28 -3 -39 46 17 -110 113 -165 21 -34 -99 -35 -68 60
4218 60 -45 -59 -69 21 -44 -17 -31 23 60 2 -11 31 -41 -65 41 -89 -132 96 -83 -3 -19 12 20 -41 -30 -55 -46 -52 -79
4247 -79 20 52 7 -50 -46 -45 -8 -68 8 -46 15 45 25 106 96 -3 -11 109 -38 6 -51 -15 40 -4 -51 17 -42 -68 -11 -121
4277 -121 41 -50 54 -18 -82 71 -3 12 -13 97 -12 -75 48 -53 13 145 22 38 -17 65 30 -53 -27 -16 -29
4302 -29 11 -38 5 92 9 -49 93 -20 100 26 -24 -61 -7 11 25 -3 10 -42 -33 59 -4 54 32 -3 70 35 -84 -20 -52
4331 -52 39 -9 16 -17 147 12 -72 -18 -19 52 -74 35 30 -105 -42 8 29 -111 127 -10 6 65 64 -40 -25 54 52 -40
4359 -40 162 -23 -30 36 -82 55 -87 -166 12 38 5 -99 34 -52 -32 -40 -12 40 -13 80 13 41 -19 23 -127 -8
4385 -8 34 -21 -52 11 -46 57 21 13 -89 11 12 57 -61 20 -3 48 -12 8 -67 -194 6 63 27 -98 -27 116 41 -41
4413 -41 50 -7 37 109 24 -5 68 17 37 4 77 38 18 23 -34 19 -11 -48 -100 1 48 -15 -22 57 43 -8 -24 28 -51 1 56
4444 56 -51 -4 -34 17 39 -45 -168 -15 123 -77 6 74 26 -46 -72 -5 -10 -3 -14 34 -9 -9 -25 -75 54 98 -38 -69
4472 -69 46 -8 -150 -106 -7 4 21 -42 29 -59 103 2 61 46 -158 54 -16 -6 -77 -51 44 66 108 -7 -133 46
4498 46 -173 -88 17 31 79 -23 -15 -22 43 54 1 26 114 -25 38 90 38 -10 18 36 43 -9 -46 -62 -33 -38 32 -36 51 -71
4528 -71 45 19 5 -30 -44 132 -41 49 -7 96 -62 -15 42 -3 31 112 75 -47 -16 -4 11 -12 113 -16 46 -50
4554 -50 -59 -1 -24 41 51 76 -95 41 105 -56 -8 15 -78 -53 20 45 -38 56 -11 15 84 16 44 7 15 45 -50 33 27 -41
4584 -41 58 -32 4 -13 5 44 -32 83 108 -120 47 29 -53 76 62 20 -15 -100 -20 -85 -13 -14 -44 65 -9 -106 30 -23
4612 -23 6 -56 -16 92 -109 -46 -29 -52 -7 146 43 23 -133 0 36 7 116 -40 6 -102 -104 40 -51 39 -59 16
4638 16 2 47 -16 -67 -70 -39 -15 -94 82 69 41 -46 -65 -115 -105 -89 55 -39 30 -1 -62 -69 96 17 3 -9 -30 -86 -44 3
4668 3 25 38 -2 87 -80 -29 9 -30 43 -15 -34 88 -10 -22 -26 -3 -60 76 7 -51 5 -53 22 114 61 42 78 -33 -57
4697 -57 69 22 -63 39 -16 63 11 104 47 -68 -45 -35 -7 94 -25 -150 -18 86 10 26 -150 -20 -56 -103 116
4722 116 47 33 37 -38 24 -27 24 -16 58 -80 -8 -161 -17 -16 -26 -29 -63 -26 -16 -26 123 47 93 17 -37 72 -75 112
4750 112 97 81 6 -185 5 67 21 -30 -51 -21 -86 -17 -14 -6 -12 6 107 44 -26 26 -130 68 -8 -1 6 25 -2 -32 42 31
4780 31 -85 -29 -3 -18 38 55 -12 -32 -23 -25 28 40 55 129 6 -79 40 69 6 -25 28 76 76 -84 20 -53 -44 -69 -111 -16
4810 -16 -103 -36 -133 -128 -44 -27 13 34 58 -5 67 -34 48 -25 -30 -7 48 -20 -20 -30 -110 -19 -50 13 42 -15 0 40 -47 35 33 -35
4842 -35 -6 44 -55 51 -98 -46 -125 77 68 -115 -65 75 -61 -36 2 41 -32 -74 -39 4 52 25 137 13 107 23 24
4869 24 35 6 91 -29 -7 -5 -12 45 64 6 -44 10 35 -13 101 -33 -12 46 94 45 -1 -128 15 30 8 41 1 39 -24
4898 -24 19 -65 -29 46 49 47 -73 -57 -43 7 -56 -54 129 49 -73 -20 -62 -16 -16 1 -157 37 30 -43 -45 -59 15 -11 15 48 -41
4929 -41 124 44 -106 -66 -38 -30 17 46 23 63 -6 94 10 -16 132 84 -75 22 24 36 0 -9 54 -11 46 2 61 132 65
4958 65 93 -40 -151 -52 111 -102 98 -46 -65 -34 -67 10 -6 -145 20 31 -76 107 -162 -57 -2 -97 3 26
4982 26 -59 -11 -29 -28 56 -6 -41 15 1 42 -25 103 89 -47 138 13 128 -27 75 -39 56 1 39 23 -31 -9 -70
5009 -70 -44 12 -30 -40 121 -53 99 54 -3 -36 93 -13 98 142 -6 -112 -49 70 -99 66 -24 33 -12 -48 113
5034 113 -63 -56 -4 9 -1 24 -25 75 -1 -42 -19 2 -37 -8 -118 53 -40 23 7 26 -33 5 -103 114 12 -95
5060 -95 75 -6 36 30 60 -18 -59 77 -57 85 87 3 -16 -7 57 -31 -50 -80 3 38 26 16 -111 0 84 36 70 40 16
5089 16 -31 -2 -17 131 -2 41 70 112 31 21 92 -12 -2 -105 66 78 -26 -67 -84 35 109 43 55 -21 -17 74 -152
5116 -152 -104 -44 44 -131 81 -4 -54 -2 -17 86 58 -7 -79 106 -10 29 69 29 1 -5 39 -92 -10 7 -75 -34 -43 89
5144 89 10 44 -70 4 -84 17 -130 -75 -14 58 23 19 -2 -3 -43 -9 65 -54 -3 13 107 -73 -70 -49 13 -54 -111 35 5
5173 5 50 70 -20 79 37 102 -4 12 28 -13 71 -26 35 65 96 7 -120 1 -18 -19 -13 -29 -42 -20 -3 19 29 -52 76 -34
5203 -34 -93 15 -11 -18 31 123 -145 43 62 -94 -18 -29 32 -24 28 -23 120 34 8 25 -33 56 69 14 32 1 -46 -23
5231 -23 25 -32 78 -25 -89 -10 104 36 20 42 -52 -50 -16 29 40 -72 32 62 -28 57 52 -24 -82 -24 27 -60 -18 -48 -12
5260 -12 59 27 -45 122 5 -23 32 55 23 -47 57 7 31 69 -10 39 8 21 38 -2 57 7 -31 -9 -111 -51 -30 -101
5288 -101 -37 -16 58 54 51 27 -21 93 -65 11 52 -10 -43 39 68 133 -68 0 31 -16 14 0 44 -13 -96 39 55 55 -30
5317 -30 84 92 -12 23 71 -12 130 -41 -52 25 30 15 -31 92 86 -89 63 66 59 7 100 52 151 112 -71 -64 -76 105 88
5346 88 -33 47 3 -2 -54 -53 9 -50 21 -8 90 -55 -18 79 -35 55 -21 17 -134 44 76 80 -32 22 16 -94 -59 90
5374 90 -9 1 65 -62 115 11 -77 40 117 -30 9 91 -92 -37 -46 -90 -99 -10 26 18 -36 87 6 -46 36 -27 94 57
5402 57 -79 -46 -18 65 -39 -33 68 105 12 -12 -24 13 28 -32 -105 33 -55 44 30 -9 7 68 34 -3 53 12 66 -86
5430 -86 20 4 -49 -12 -65 58 78 -65 23 -103 -15 -23 -78 -73 40 30 0 -107 -9 30 32 -77 -82 82 81 -3 -104 10
5458 10 -126 18 -45 44 98 38 61 20 26 42 -42 105 54 25 -25 -80 -42 -11 -28 -58 29 -134 5 -15 107 51 -6 6
5486 6 -5 -27 -94 -41 31 -1 15 -11 -72 -29 26 64 -145 46 26 -6 15 -22 18 -46 -10 -69 123 -24 -81 -70 -38 106
5514 106 47 23 -149 93 -2 17 23 -18 -113 52 26 53 39 55 58 86 119 -98 -9 -8 -42 9 -8 -30 30 85 26 9 118
5543 118 -25 4 -14 0 -46 85 -54 40 -15 -51 108 -1 86 -33 -9 -35 -55 -52 -49 38 64 -86 -13 48 49 -96 -35
5570 -35 -7 15 -70 106 75 42 -70 -57 100 -136 -95 141 57 15 -9 -20 -29 91 10 30 -20 56 35 -149 87 5 38
5597 38 58 57 68 -17 -2 102 42 55 57 127 46 -26 15 31 -16 -78 -10 -84 -10 49 -49 -31 55 44 26 37 38 6 97 29 -53
5628 -53 12 -66 -84 90 -16 -12 61 6 129 -38 62 5 -10 29 26 -82 -12 -128 90 96 8 74 -36 6 -38 18 25 -143
5656 -143 113 11 26 94 52 -3 -53 29 -133 110 -16 -33 39 -26 -56 -54 -14 -135 84 -1 36 103 52 3 -52 -15 -50
5683 -50 14 57 4 48 -144 57 86 61 80 -18 4 183 46 -42 157 5 15 71 -44 73 -35 62 58 -62 -33 30
5709 30 65 -12 57 64 -16 52 -50 -102 5 41 -26 -66 70 76 -127 -78 -38 7 -18 -86 63 -30 -105 5 -18 -52 34 16
5737 16 -48 -92 -103 -83 31 -118 -36 -73 51 46 80 80 24 55 37 47 54 44 64 -95 1 -88 -47 -26 -11 -28 19 -26 165
5766 165 -12 -83 24 -35 4 11 81 -17 -22 32 -27 -18 -38 -31 -32 -2 -15 -8 -90 -4 41 72 -12 34 27 -11 -46 -14 -75 48 -26 77
5798 77 -64 14 100 105 -38 18 1 -3 -4 115 -43 70 -90 49 136 -7 26 -40 -18 -143 19 -15 50 -34 47 -139
5824 -139 41 58 -82 -63 -33 0 60 32 -113 -26 79 -37 -125 60 -37 -44 11 44 -38 -17 21 -14 -82 -45 13 -28 -100
5851 -100 -12 46 24 -19 -40 -9 -29 -37 -55 1 -54 -149 -42 15 -36 24 0 75 -123 35 16 -36 57 83 -52 98 8 66
5879 66 62 56 1 24 -16 112 79 -74 38 17 -50 41 46 -7 -13 -63 90 9 3 83 56 99 43 -58 -2 18 58 -72 50
5908 50 68 -47 -66 49 3 -30 37 31 91 30 7 26 25 44 -4 57 -66 34 53 1 34 -137 77 23 -110 -37 144
5935 144 158 52 9 4 44 -54 -14 62 -17 29 39 -2 -44 13 -38 63 -81 45 44 7 -86 -68 -46 -10 37 -67 135 -4
5963 -4 -21 -69 11 0 -22 11 4 31 -86 37 -31 -87 12 14 -60 63 -86 73 26 104 -79 -21 76 -88 16 -1 -29 115
5991 115 -45 -90 48 -38 38 42 18 46 -6 -49 54 31 59 33 44 29 28 52 -28 -26 73 25 -4 36 91 -43 40 -61 -126
6020 -126 -32 -25 -31 56 17 68 -12 -55 9 26 90 65 -40 -68 96 -67 11 -98 -97 86 -74 2 53 -64 159 -77 -54
6047 -54 29 -118 -32 -18 -20 58 20 -7 -54 7 -30 54 14 34 -45 -33 -41 -75 69 -19 45 -16 -22 91 -28 -54 -62 -35 -104 -8
6077 -8 -6 24 70 33 -32 37 -69 -60 -51 110 -4 164 58 6 -22 35 -44 -72 -123 4 76 -38 -77 -75 12 -29 -113 -109 -54 15
6107 15 79 75 3 -38 -62 -20 0 11 -29 -134 31 -2 -10 -26 42 38 51 -52 53 120 -90 -105 174 -36 -42 70 94 12
6135 12 -13 36 55 -85 -16 17 -58 71 60 -27 -71 83 6 61 -1 6 64 -81 -40 -33 -55 94 10 28 -74 -20 44 28
6163 28 57 -15 -32 -59 45 39 45 -2 -2 51 -14 59 80 46 83 -26 9 56 -25 -66 -35 -67 -58 3 28 6 48 8 131 -11
6193 -11 -29 -79 23 144 -4 1 -36 -42 -32 -50 23 -82 26 -135 38 13 50 -5 45 107 5 66 -16 -81 -40 171 -4
6220 -4 44 60 -105 -122 -84 -50 -38 150 1 72 87 -35 82 -28 -92 35 51 -31 47 -8 -1 -110 19 -99 27 56
6246 56 13 -28 32 -49 -42 4 41 -45 -67 -15 224 -19 113 -55 6 86 -26 87 -8 -119 9 -80 -8 -30 21 -37 51
6273 51 22 -15 -80 17 10 40 5 -78 16 29 66 -30 67 -79 -25 -73 25 -33 2 -126 -8 29 -54 20 131 -12 123 -86
6301 -86 26 34 95 -16 -4 -38 34 81 -96 38 -24 56 100 -19 -9 -5 -48 -67 -55 -12 -11 -18 38 15 -109 34 -9 -37 -134
6330 -134 -45 -9 -94 22 45 -15 -8 -94 10 11 20 -74 -51 47 9 -52 36 26 -162 -123 -85 76 62 -5 -50 -18 -103 -79 8
6359 8 -70 63 -28 -67 -84 -64 20 -14 -116 -43 26 46 20 5 -105 -37 75 -104 -47 153 -111 -2 67 -63 29 52
6385 52 10 82 -28 46 60 21 3 -121 -77 -58 -53 23 -65 9 -1 9 -4 -15 -72 37 88 -67 75 21 -30 -93 -19 -24 81
6414 81 -81 -73 -135 74 -49 -108 -72 53 64 -82 93 -7 -6 -71 16 141 39 99 12 -31 1 -68 -52 -15 -52 -10 -33
6441 -33 45 -15 78 -43 -6 -66 -88 -56 -49 -48 36 57 -47 35 11 8 -93 81 10 -14 27 11 -41 -6 -13 -52 -16 -138 39
6470 39 27 -40 35 17 -24 110 81 -74 -70 19 -93 33 -6 89 6 159 71 77 -20 91 15 -93 -15 -114 -78 -59 -39 80
6498 80 49 48 -28 125 -113 66 77 62 33 47 82 -122 -42 -48 56 -14 -88 40 -1 -129 15 -98 -3 71 73 -123 -6
6525 -6 4 -46 -38 36 35 -101 -18 -93 0 -95 74 -37 15 -87 3 -62 -40 21 31 -8 23 109 -48 29 21 40 112 -89 47
6554 47 -43 44 -87 -44 21 -82 -11 72 -53 -34 -61 -51 71 -76 96 -91 6 -27 44 -23 26 39 -64 -2 -2 38 -31
6581 -31 85 18 -64 -63 -9 2 11 2 -17 28 92 -3 -11 40 24 88 -89 -81 47 -27 71 19 43 -103 15 -8 2 -28 -59 5
6611 5 -115 -20 26 -19 83 18 -9 72 -6 50 43 -41 -124 -2 -143 6 -50 -54 -57 18 -101 65 16 -39 -32 -75 26 -44 10
6640 10 22 -69 -113 26 -49 41 -3 -81 -129 -25 43 -19 -15 43 23 -35 25 -8 -41 126 -99 54 103 -22 10 -1 -61 13
6668 13 16 -122 17 -32 -36 -80 -64 -21 -5 55 -56 -64 39 27 50 81 -28 -76 57 -41 132 15 46 18 69 -51 -67
6695 -67 62 11 -60 -45 51 -64 -33 41 -35 -67 5 83 39 -31 21 36 -11 46 151 -63 38 12 -32 -8 -7 15 -104 -28
6723 -28 38 50 96 41 78 -31 -143 -22 23 -62 36 -71 -52 37 -93 0 -24 -6 -34 124 62 -2 59 -56 -44 -33 75
6750 75 9 5 -27 -29 14 95 -36 5 -8 -69 -7 12 76 54 44 -60 9 17 49 -9 21 134 -80 28 -75 -67 -13 5 63
6779 63 -40 -12 71 -135 -42 -24 37 30 -145 -12 -54 -64 26 9 -37 2 -33 8 -27 71 -31 -110 71 -14 33 -5 2 91
6807 91 19 65 -17 36 -38 -77 -31 -33 -75 22 -72 15 -54 -83 -8 54 -10 67 96 0 3 -84 -9 2 32 -62 -43 22 48 -95 112
6838 112 -93 -71 99 -21 123 60 -109 59 -111 -55 17 -12 -47 -20 -19 52 64 4 -105 66 -41 15 25 21 24 -38
6864 -38 114 -52 29 107 34 22 -48 -19 -50 -56 23 82 33 -3 -23 176 -7 -52 -40 -44 43 -30 6 -136 112 -26 -16 -3
6892 -3 -35 14 -27 -18 -13 9 -10 -144 62 -45 89 -33 -22 70 -19 58 78 -58 97 56 131 43 -40 -12 8 -47 -27 38
6920 38 34 -30 -31 14 -127 31 69 -58 0 -6 -34 119 50 -42 30 -87 -5 -33 57 71 102 33 41 37 41 -10 16 56 38 19 -25
6951 -25 -97 -20 65 -20 20 33 -1 1 -17 8 61 28 -11 8 -13 4 69 18 -114 89 39 10 -6 31 -8 -15 -126 26 -16
6980 -16 -57 -20 40 61 43 -37 -58 49 -19 35 -90 -76 -105 -75 -82 -34 20 -50 62 186 -32 -1 50 131 21 -66 2 22
7008 22 15 -2 -98 43 -9 71 58 38 22 0 151 142 -5 20 43 60 -39 -10 -38 -63 -39 16 -63 -55 80 -67 -26 35 -113
7037 -113 20 18 -146 13 30 116 58 -16 -69 -18 42 15 38 99 100 11 2 87 4 25 -102 38 12 -91 22 34 -40 -31
7065 -31 -53 95 -19 33 71 92 21 -21 167 28 -25 -26 -50 2 -49 61 -80 -73 10 -149 -12 49 1 3 -68 81 23
7092 23 50 52 -85 25 44 -23 19 78 62 8 17 -52 51 61 -32 20 -71 26 -14 33 89 -51 -3 54 -77 0 -31 -87 16
7121 16 -119 -79 52 59 64 89 -118 -82 -32 -37 -14 -94 2 -99 0 -39 95 17 -115 68 51 -27 27 167 6 -85 -113
7148 -113 -19 -24 92 32 0 11 -57 -3 -38 -39 -48 16 -3 -114 -103 42 24 31 -18 -46 -91 58 -81 -112 -5 -67 -27 26 66
7177 66 16 59 -68 -33 -2 21 -168 26 -88 41 43 39 -56 88 -29 -48 -18 55 10 -76 33 -5 86 -9 95 7 -17
7204 -17 43 -8 39 -12 93 -100 -28 -114 6 -51 115 7 33 94 35 195 -62 -51 -1 1 34 52 40 85 14 -17 -37
7231 -37 13 0 33 -18 97 20 66 75 -106 4 -36 80 -5 69 41 -18 -111 32 28 -71 65 76 -27 5 -6 74 -85
7258 -85 28 118 -56 -45 84 20 3 136 71 59 51 71 -8 -6 -90 54 -42 -77 38 61 44 -21 -105 60 45 11 44 -45
7286 -45 1 -12 36 71 47 -80 25 69 -15 -70 -21 -52 43 42 -8 -26 70 54 -8 82 -99 -12 -64 53 9 -11 -119 -19
7314 -19 -94 28 17 -11 52 -67 -91 6 24 29 113 38 -35 36 10 -29 -22 71 52 -70 50 -66 -102 -32 102 -30 5 -94
7342 -94 -8 12 -23 48 88 -27 16 103 -37 -78 36 -28 -88 31 -65 3 38 4 -76 17 -46 -59 44 28 3 -79 -72 12
7370 12 -20 59 24 23 -7 27 28 -43 17 74 164 134 -18 14 150 112 -70 1 22 75 12 -21 -81 125 -53 -13 41 32 -29
7399 -29 -41 42 -74 -45 75 -33 -110 112 -92 106 -96 -39 -3 -85 6 -57 -110 23 75 -67 127 -98 -52 -124 29
7424 29 32 86 2 52 -93 22 -84 -43 69 -4 -115 -41 -36 47 -85 -70 11 -125 -43 -56 52 -10 10 34 61 -77 31
7451 31 116 0 57 40 18 -6 31 63 76 -84 -72 -39 43 -70 -67 72 87 123 -4 -3 33 -15 108 -91 38 -87 28
7478 28 37 59 28 62 -52 12 -12 40 -21 -125 -32 -30 45 45 2 -28 -61 -69 -26 81 25 -90 102 -2 -70 -15 -62 -15 99
7507 99 -41 -60 54 -20 57 -39 51 75 86 -43 -42 -57 4 -16 11 13 -10 65 -38 50 -2 -19 -2 144 -94 37 -29 -67
7535 -67 49 42 -29 47 -37 27 115 -45 -52 15 0 -154 3 170 -62 32 -20 -67 98 -7 -9 27 -17 -38 -77 -30 2 -39
7563 -39 -130 6 -19 -39 -65 100 49 65 49 -128 19 -90 20 -65 157 79 82 7 19 47 99 80 17 122 49 -35 -81
7590 -81 12 -30 0 15 35 -40 34 -34 -11 -25 11 38 9 -51 106 -72 -155 -53 28 53 -59 78 29 36 89 71 6 18
7618 18 -48 20 16 0 22 -56 -81 59 6 34 43 51 19 -59 -97 -14 12 -180 -54 -45 67 -9 46 3 133 -18 58 -102 -7
7647 -7 -14 37 11 -48 -27 25 29 27 0 -90 -83 -19 -61 70 -22 -29 -22 -40 21 -41 74 -136 22 29 33 28 14 -80 75 -80 -9 39
7679 39 -76 2 105 -104 -74 1 46 31 -124 41 73 11 -172 61 32 -15 30 59 -64 37 56 -43 70 76 51 11
7705 11 -23 -76 -30 -58 -56 44 9 48 -105 89 9 -12 163 -46 -19 -88 89 -10 86 -136 3 -123 -38 97 -83
7730 -83 33 130 -15 -30 14 -44 69 -59 -4 -78 -32 -135 -54 132 2 91 73 -133 -54 45 -55 4 50 -53 -1
7755 -1 16 45 8 62 -54 71 -101 39 -21 67 3 -110 -31 134 -11 -4 13 22 37 -50 -28 88 59 -4 -92 55 -110
7782 -110 -16 -132 -17 76 8 -7 18 -27 -18 -54 3 -73 -133 43 147 36 145 -22 31 -51 -13 17 41 17 25 -7 -95
7809 -95 -82 39 36 114 80 20 -2 -46 -48 -22 -10 -87 -20 -58 -2 35 41 79 40 113 -133 -24 -38 26 -86 14 159 31
7837 31 76 -87 76 -16 40 -27 -50 63 60 156 54 6 53 -11 49 -21 -104 67 2 -73 -27 -127 15 33 -19 -77 -79 8
7865 8 8 2 -9 -14 89 16 -37 46 3 -24 -145 73 -26 14 70 -58 -98 2 -25 -6 137 -41 8 20 -49 -36 57 -58
7893 -58 -6 8 66 -26 -51 20 22 -58 -47 125 -47 54 0 43 98 94 -6 1 133 -58 -108 30 -19 -73 -49 -90 -31 10
7921 10 132 69 -36 27 20 -160 -14 126 -2 7 -53 32 114 -30 -99 -32 67 17 17 -20 26 36 104 36 -1 -80 26 27
7949 27 41 -21 44 -24 -50 26 36 38 19 -21 104 -48 -122 29 29 -102 -17 -14 16 57 1 -143 95 52 75 -37 -41 -25 62
7978 62 -17 72 -124 -32 -14 17 46 15 -30 -98 -41 0 26 -76 15 -83 -52 -63 -84 -15 -54 -110 113 -7 -27 86 62 11
8006 11 32 -57 92 -29 69 102 -132 -62 54 47 -16 -43 5 18 62 53 47 -4 -12 78 25 53 -59 73 -51 79 33 -41
8034 -41 7 -16 -42 27 -109 -76 -87 -73 -46 29 -38 23 68 30 11 55 13 -47 33 -35 -52 2 75 -88 -129 -34 -69 -43 11
8063 11 38 9 -64 49 -129 -33 -8 -25 -37 4 25 -103 -8 -12 -4 48 -3 -73 -40 46 9 -7 24 -87 -49 -87 36 100 -46
8092 -46 -15 31 0 -56 73 11 -15 -31 85 2 -74 67 -34 73 -17 -40 29 -110 -66 46 -97 3 69 35 64 -16
8118 -16 -64 -59 -45 18 41 152 7 -61 -97 -56 7 -117 -7 -13 48 -8 53 -15 100 10 82 5 16 -89 -33 -88 -27 39
8146 39 81 42 42 62 -8 81 61 17 6 -37 61 10 4 73 -18 -11 -43 -11 135 -61 -25 14 43 -9 16 -24 -38 74 -112 -36
8176 -36 -28 82 15 -35 -56 127 19 -109 -101 -37 -44 -115 34 49 -41
8191d1
$$ Imaginary data points
##PAGE= N=2
##DATA TABLE= (X++(I..I)), XYDATA
0 0 0 0 0 0 0 0 0 0 0 0 0 0 0 0 0 0 0 8 -8 8 -8 8 -16 16 -16 17 -24 24 -32 32 -40 48 -51 56 -64 73 -84 96 -104
39 -104 118 -129 144 -160 177 -198 217 -240 264 -292 320 -352 391 -430 476 -524 580 -644 717
58 717 -802 903 -1027 1172 -1361 1605 -1936 2423 -3198 4635 -8206 38979 33970 -21967 25370
73 25370 17821 -25186 -16376 6203 -26156 -27800 -3917 -12732 -20854 11826 14215 -5809 7113
86 7113 18815 -2518 -682 14981 6081 -2751 6077 3832 -1954 1775 3439 -2261 -4941 -6492 -8904
101 -8904 -10409 -10571 -9785 -4012 -1719 -2381 6210 12811 8495 13702 18086 2939 -1076 11209 1873
116 1873 -15390 -9146 -3145 -14450 -14035 -1333 -2348 -5057 5081 4759 -2935 6993 13221 1209
130 1209 370 8424 2222 -3782 2356 3754 -2239 -2614 -512 -5206 -7447 -1646 -1788 -7277 -4232 810
146 810 -602 -57 5358 8438 6411 4531 5831 3717 304 2306 -215 -8396 -7562 -3161 -6252 -7343
162 -7343 -1472 1495 -659 521 4131 4113 4603 6865 2684 -1562 2723 2330 -3491 -2124 637 -2435
178 -2435 -4507 -3462 -2109 -1328 -477 -504 -2017 -977 2875 2765 1455 3641 4710 2846 736 199 2189
195 2189 1348 -3182 -3885 -3579 -5152 -3636 -1692 -2599 -1439 1659 1840 491 3186 6955 4532 828
211 828 2254 2146 -840 -44 -905 -3704 -2833 -2414 -4512 -3974 -443 496 -1480 -1157 1560 2254 2923 4494
229 4494 2847 1622 3245 1725 -971 228 1200 -1244 -4627 -4608 -2261 -2130 -2802 -1134 -730 -593 995
246 995 1453 1750 3558 4175 2670 437 652 2682 1104 -1592 -979 -1276 -3132 -3004 -2731 -2217 -1022 -986
264 -986 -1394 -1113 1148 3490 2456 1465 3128 2674 961 1426 1087 119 -198 -1734 -3321 -2927 -843 -376
282 -376 -2233 -2178 263 36 -692 1273 2003 1643 1414 518 257 1503 2329 1504 -1009 -825 627 -1245
300 -1245 -2482 -763 -464 -1695 -1961 -1715 -647 860 1598 1167 220 1352 2656 515 -9 1710 697
317 697 -1236 -1373 -1006 -833 -253 -70 -950 -1374 270 1270 -759 -642 1491 263 -1619 -477 631
334 631 999 953 380 258 418 1109 827 -835 -194 804 -1265 -2266 -482 106 -135 -356 -352 38 582 1098
354 1098 641 -385 529 957 -1077 -1155 1013 755 -411 -225 119 327 449 839 62 -1047 -136 196 -2054
373 -2054 -1327 1061 324 -1151 -368 842 1234 819 832 724 113 237 -77 -1275 -171 747 -827 -1568
391 -1568 -469 451 167 -31 222 150 -77 202 -171 -559 636 780 -767 -675 804 940 320 44 96 8
411 8 -361 -226 -516 -977 185 88 -1442 -693 1180 1140 -30 -107 709 565 -431 -22 236 -351 -180 -478 -1342
432 -1342 -29 1401 225 -682 127 967 138 -407 559 502 -773 -579 -688 -1131 200 902 -518 -749
450 -749 350 573 196 156 818 474 -207 18 -277 -206 1013 652 -924 -535 27 -9 -514 -848 -164 -71 -841
471 -841 -799 102 537 1024 652 57 863 1397 871 146 176 744 -447 -1969 -819 -448 -1097 -905 -655 -1005
491 -1005 -130 1008 574 395 1365 1652 363 -92 1418 1014 -290 -309 -502 -1061 -424 -324 -1190 -1073 -374
510 -374 -436 -1073 -429 762 759 323 661 698 1241 1777 869 284 645 298 -775 -1127 -1124 -640 -1085 -1878 -1471 -658
532 -658 -48 289 339 837 1383 1302 1207 770 957 1587 43 -1173 -242 -11 -1144 -1141 -844 -955 -769 -523 -418
553 -418 -242 495 815 -236 77 1567 1326 477 765 696 432 238 -172 -640 -691 -685 -1216 -1622 -1149 -48 -379
574 -379 -558 306 759 936 970 891 1076 931 520 -100 -742 -253 139 -812 -1545 -387 -206 -644 -354 194 409
595 409 189 253 239 159 903 877 -365 -187 924 233 -319 68 -28 -454 -501 -688 -648 -300 114 -48 -678 246
617 246 944 529 384 654 635 332 -164 -649 -285 -156 -651 -759 -918 -273 391 138 27 634 1033 502 99
638 99 300 792 78 -413 -462 -642 -224 34 -743 -650 362 -191 -471 -21 552 209 182 125 167 383 955 654
660 654 -127 545 374 -478 -609 -319 -540 -607 -818 -931 -486 6 389 377 295 975 1118 745 535 610 743 48
682 48 -896 -723 -185 -624 -932 -841 -781 -408 61 -152 121 747 872 306 125 912 892 286 187 215 -144 -168 -280
705 -280 -789 -460 -109 -831 -1279 -547 -218 -113 -92 326 704 574 999 921 599 1016 732 -189 -645 -364 -193
726 -193 -796 -1126 -890 -471 -574 -70 -111 102 790 555 -11 410 938 766 14 -186 338 180 -317 -250 -113
747 -113 -320 -212 -483 -849 -232 165 -279 -343 -58 529 401 127 626 729 450 480 16 -184 222 -125 -647
768 -647 -704 -394 -122 -361 -391 142 356 -8 308 234 265 590 203 -263 -269 240 115 -366 -422 190 140 -289 72
791 72 144 66 109 -169 -322 65 313 164 -251 17 373 43 -329 198 205 111 4 -341 -252 116 11 -182 -263
814 -263 210 444 71 -67 419 315 -81 -219 -408 -318 13 -364 -433 -119 25 321 -95 206 750 454 -43
835 -43 184 142 197 122 -274 -401 -320 -89 -208 -482 -159 369 -95 -460 135 246 181 59 109 221 442 363 163
858 163 -125 191 408 -466 -565 -80 -133 -330 -613 -449 -176 -38 24 55 336 567 576 98 204 586 289 -57
880 -57 -164 -338 -181 -287 -472 -315 -157 -44 -135 -420 -49 456 122 -100 104 230 277 196 74 266 277 -26
902 -26 -228 -164 201 268 -331 -566 -238 -121 -274 -281 -3 155 137 104 186 179 511 401 -156 -97 264 150 -245 -242 -90
927 -90 -14 -213 -197 -85 56 213 -21 -312 57 185 -40 -156 13 161 62 -35 42 358 340 291 -89 -260 243
950 243 162 -355 -424 -117 -177 -187 -399 -7 124 -28 2 104 64 459 363 -159 96 258 100 -79 -113 132 164
973 164 -68 -205 -33 -166 -19 -200 -535 -196 50 -124 -226 60 495 281 135 341 489 250 199 -58 -351
994 -351 -109 10 -498 -529 -89 -137 -247 -367 126 233 47 129 -22 -77 388 76 -124 107 317 99 -124 -101
1016 -101 38 85 -344 -255 -276 -283 -60 -389 -310 69 88 222 137 457 518 333 -59 140 0 -48 -62 -384 -308 -129
1040 -129 -287 -282 -166 189 341 -71 -157 281 263 94 146 -7 98 271 -4 17 241 327 139 -154 -330 5
1062 5 -103 -350 -207 -193 -174 -27 -84 11 261 309 221 -49 -9 330 59 -221 -164 -208 -161 -170 -142 65 262 168 -20
1087 -20 -129 119 321 -105 -255 95 -90 -176 -169 -222 117 138 20 -21 46 248 267 -146 -44 199 -39 -185 -59
1110 -59 23 69 16 -251 -91 -28 119 -110 -208 -119 274 -22 -21 225 290 221 142 80 120 250 141 -12 -264 -107 -186
1135 -186 -420 -327 -136 73 -26 -16 57 220 354 315 106 75 268 248 -64 42 89 -85 -303 -282 -70 -62 -72 -355
1159 -355 -146 -109 172 81 -38 134 409 211 165 378 255 256 30 -90 -87 -89 -255 -313 -422 -199 -127 -417 -210 194
1183 194 283 248 46 221 423 458 221 32 -3 173 -30 -356 -243 -68 -226 -287 -383 -246 52 4 44 -20 139
1206 139 217 64 48 173 264 217 -36 -150 190 62 -233 -166 -71 -261 -100 -193 -204 108 70 -4 47 255 274 230
1230 230 23 72 79 -60 -110 -204 -181 -29 -177 -281 -67 172 80 -2 12 82 155 45 -1 -64 -4 180 -154 -234 252
1255 252 237 20 -142 -7 170 66 -164 -8 65 -24 15 -170 -67 208 95 -7 -40 24 -12 -147 -129 3 131
1278 131 -27 -54 24 -31 115 239 24 38 81 28 -70 -66 68 -112 -207 -167 -208 -45 79 9 -49 151 387 161 99
1303 99 109 222 112 -225 42 94 -2 -40 -185 -150 -89 -152 -157 -205 -50 46 -162 -117 192 262 245 248 190 135 302 83
1329 83 -88 -62 -155 -154 -351 -190 -88 -91 -156 -37 -26 3 200 169 191 262 278 -1 -73 -23 193 22 -102 -123 2 -16
1355 -16 -18 -168 -124 -95 2 -102 9 60 81 79 11 292 334 153 70 -60 15 -10 -260 -245 -181 -54 -22 -306 -104 148
1381 148 93 -26 91 130 188 76 146 82 55 -69 118 -254 -19 77 -60 -306 64 -73 74 44 -62 75 -34
1404 -34 41 -206 17 12 169 -74 2 95 52 55 70 -49 15 -13 -135 -140 -29 110 -50 -127 20 235 71 40 35 -36
1430 -36 -87 17 -205 -31 -18 132 176 0 83 184 46 -18 -96 70 -59 -13 -174 -43 -61 -10 -179 -157 61 116
1454 116 -100 49 46 112 66 36 47 236 -5 21 -39 -123 38 -39 -103 -42 21 -167 -81 -170 -84 3 30 91 -20 214
1480 214 243 76 -9 222 147 52 -81 -187 -30 -179 -261 -92 9 -108 -117 -53 -19 218 165 -7 68 126 94 137 -78
1505 -78 -2 31 8 -45 -59 -15 33 -98 -197 -174 -3 0 -119 -52 189 222 62 224 102 117 235 142 -95 45 -33 -209
1531 -209 -186 -172 10 6 -114 -79 118 50 -10 -26 123 191 45 -46 -120 -58 122 14 -195 -1 105 87 -17 -102 -29
1556 -29 61 -67 -238 -69 6 99 18 -74 87 141 -68 27 -46 -81 24 -40 -133 46 -22 -93 -58 -46 60 -23 -22 100
1582 100 39 9 11 -124 1 72 -120 -79 -19 -48 158 -28 105 138 90 25 35 -106 -107 72 -131 -200 -68 -51 -13 -65
1608 -65 -133 73 -63 -48 9 16 111 102 9 23 120 70 7 -57 -35 42 -155 -82 -123 -109 -64 -92 -189 -31 40 143 -33 59
1636 59 137 206 44 24 173 17 -111 -86 -74 -157 -120 -174 -182 -123 -15 -34 -73 7 141 60 -9 27 112 23 20 23 -20 -81 24
1665 24 60 -84 -36 28 -143 -200 -89 -55 17 -36 2 126 107 121 101 78 132 68 -24 83 -19 -51 10 -269 -184 32
1691 32 -42 -42 -40 15 34 11 -26 -21 65 -12 -2 -34 -48 69 52 53 -65 -64 26 -27 -119 -26 -49 -19 -73 -66 18 52 -106 50 147
1722 147 79 -84 52 -46 41 63 -87 -16 -38 52 68 -132 11 54 -87 -43 -1 19 117 8 -77 1 46 -83 -33 10
1748 10 0 133 -86 140 127 52 58 -19 -163 -23 37 -95 -23 -45 46 -75 -109 -6 90 25 -27 -31 -139 223 95 59
1774 59 127 -4 28 -62 -2 -16 -47 -39 73 -209 -204 -98 -58 -149 -24 21 -1 -49 0 93 159 33 102 72 134 18 -91
1801 -91 -246 -11 -129 6 -1 -71 92 -85 0 -68 12 -50 229 56 17 133 135 25 57 61 116 -20 -40 -5 -22 -128
1827 -128 -175 -80 -121 31 -86 25 36 85 73 91 56 209 145 -53 -75 25 -46 -63 -139 -36 -97 -21 120 -178 -12
1852 -12 64 0 -58 72 63 36 124 -28 70 97 -26 68 -79 -1 -71 -80 36 1 -34 54 -74 -44 91 1 -95 43 -51
1879 -51 61 139 -12 -94 143 26 -10 9 -78 40 17 -19 44 24 39 -66 -10 50 124 -37 -96 -103 24 -16 -21 -92 43
1906 43 30 -40 49 -70 -21 5 -10 38 38 43 24 -95 -12 33 -28 -22 158 53 94 19 69 -153 198 -66 27 19 62 57 -20
1935 -20 -66 -126 156 -90 2 -41 -70 -57 -15 -51 -15 42 94 68 25 80 92 -15 35 -8 17 -109 -75 -164 136 -56 -71
1962 -71 -34 -6 5 12 11 6 22 40 37 -7 115 44 83 -65 11 -18 100 -10 -53 -64 -110 -12 2 -24 71 67 37 36 26 49 121
1993 121 98 9 40 31 29 -100 -111 -55 -39 -123 -40 29 32 43 -64 -112 136 21 23 36 -148 194 76 40 79 -34 100
2020 100 37 65 148 42 -70 -124 9 -55 -73 71 -59 107 86 -72 27 50 48 11 -8 75 9 -78 -25 -11 31 88 10
2047 10 -20 -105 47 -132 -35 -18 -38 12 -102 49 5 28 174 36 -22 18 -61 -125 4 -23 38 -44 -47 -34 -1 -69 64
2074 64 13 -158 18 -37 -3 -40 -29 4 36 21 197 76 109 189 96 125 54 -28 12 -72 -87 -104 -7 -53 -121 -38 -32 31 -22
2103 -22 -83 153 60 -59 63 -27 -14 48 -11 100 -66 -65 -94 -125 -112 -19 -127 -45 -33 -55 86 -82 -33 26 33 -59 -43
2130 -43 107 18 153 -92 -113 27 -85 -84 -129 -55 -110 -47 -1 -39 38 84 26 87 180 109 72 83 -2 150 6 -75 -77 -1
2158 -1 -6 -105 1 -53 102 -11 47 -43 -37 18 -56 105 103 -20 11 -17 58 3 -97 -45 11 65 -74 -66 19 38 137 13 52
2187 52 89 118 108 -19 65 2 31 57 -53 -35 -111 96 -60 -36 63 25 -34 -12 -164 -41 57 -25 -77 -1 -3 14 42 -61
2215 -61 7 -86 51 -27 105 55 0 34 -11 -5 -50 24 -53 27 4 -105 -86 -139 5 41 57 -41 -23 104 40 -32 -42 -62
2243 -62 85 -45 -145 -60 62 7 17 -121 -104 76 -58 20 -53 8 46 -47 29 35 124 100 -1 100 30 91 1 -64
2269 -64 -162 -40 -22 -83 97 83 -93 -34 3 -42 -26 -37 -4 64 31 25 160 20 40 12 49 -68 -54 90 -17 -61 -102
2296 -102 -60 -49 -27 18 -57 89 82 -31 -24 67 -17 124 -71 23 60 -34 14 25 130 36 -19 -152 -39 66 99 -133
2322 -133 46 -41 0 71 -1 -3 74 -52 -73 -61 -60 -16 -23 -28 -18 5 137 2 -9 89 44 20 -7 -58 -31 69 -58 -23 55
2351 55 92 34 51 -39 12 113 -24 -53 -13 36 -69 55 50 9 18 49 77 -53 35 -93 -2 48 0 33 -92 -127 -5
2378 -5 52 -13 -76 67 -145 31 -69 -83 -48 69 -74 -6 0 81 85 55 92 81 65 11 54 23 -3 -135 -47 109 -53
2405 -53 43 -25 -96 -45 -34 -66 -108 -49 75 -76 -62 -75 162 5 -136 88 9 105 -23 33 -87 27 47 49 -78 -25
2431 -25 18 2 -78 100 32 -47 82 14 109 19 52 101 28 -26 2 25 57 52 -41 -94 -51 -127 81 -121 -145 -17 50 -12
2459 -12 -27 -1 90 136 -6 70 -51 -173 33 107 -33 4 -138 -54 -83 12 -27 103 -31 25 -26 12 -54 -36 -17 55
2485 55 15 -13 26 -110 63 14 16 -19 -77 -27 151 26 3 -135 -33 -20 23 7 97 65 -73 -30 100 6 -3 -75 -22
2512 -22 0 73 10 -91 29 -31 -48 -37 -60 -101 -99 -61 37 -158 63 34 -67 -27 102 110 -85 -4 78 64 -84 81 -63
2539 -63 -26 6 45 -33 -42 -35 41 -55 35 91 44 -54 -26 -22 -53 -114 113 -2 -18 -78 15 89 -47 16 25 -49 -70 44 4 113
2569 113 -36 -76 33 39 44 -86 19 -25 -18 76 20 -156 27 -71 -35 -26 -67 -70 -87 0 -4 -7 -49 -42 99 -28 32 48 65 104
2599 104 65 -10 80 51 -7 -2 3 36 150 -39 -97 9 -76 -54 -3 -74 -36 76 16 -139 45 -22 -79 7 -41 19 16 41
2627 41 35 -67 -42 72 89 -12 20 102 -19 -32 78 -23 28 132 22 146 -84 57 28 -43 84 111 -46 -22
2651 -22 -25 -16 104 -105 2 25 67 -218 38 61 -8 -64 -128 -79 114 -75 9 123 13 61 58 102 19 -46 31 -86 -122
2678 -122 41 -53 127 -35 12 62 -59 -49 149 -104 -10 81 -48 -5 -45 26 -62 4 75 -106 -25 -50 -45 31 -113 -58
2704 -58 -76 45 -49 89 -33 -17 -84 -13 -31 -45 77 39 -46 -31 -45 -57 115 86 -42 -104 -88 70 1 -63 4 -5 88
2731 88 -5 42 25 17 -23 -29 45 6 -94 -86 31 -117 -111 -76 20 36 -133 -101 74 28 1 20 -43 126 16 -26 118 103
2759 103 -24 88 19 2 39 11 -81 -7 -37 51 33 -50 9 69 -57 32 -52 -60 61 93 33 -44 -35 5 -69 75 91 -17
2787 -17 -47 -48 -129 27 130 85 69 89 86 21 7 7 71 -82 55 7 -30 16 40 -3 -36 -29 -81 -28 138 -127 -46 10 66
2816 66 -17 5 9 46 -60 -1 61 17 -47 -86 5 -128 31 11 -57 -81 -49 5 55 -51 -20 -47 5 71 -20 29 14 5 16
2845 16 45 12 -11 5 11 31 50 -62 4 113 -51 -92 -27 -70 30 -135 -64 4 9 43 9 89 45 106 -8 46 -109 10
2873 10 91 -92 -58 16 7 64 -2 -95 94 -26 44 -8 24 74 -91 59 85 -50 -1 2 -44 -68 1 21 -73 -23 -22 -37 16
2902 16 17 -39 -6 58 -3 -72 31 95 52 -36 14 29 -9 -23 19 -72 -29 25 30 -22 -40 81 47 -13 -3 -6 78 70 80 49 45 10
2934 10 27 80 -37 -13 -26 71 58 47 3 -3 -30 -61 -81 -13 43 -52 90 40 12 37 0 37 57 -55 125 -16 -114 -111 1
2963 1 -18 -120 -39 -4 85 -101 5 0 -133 39 -125 31 40 -63 24 40 81 77 -43 57 129 -16 -54 107 93 -30
2989 -30 3 17 78 -134 -63 40 37 -7 -67 14 -87 37 80 -39 -8 -11 71 -3 96 38 13 14 39 83 -42 44 14 -33 -29
3018 -29 20 -50 1 34 24 -10 -79 -106 -21 -118 103 -7 -75 -100 0 -72 -39 15 -44 -8 -10 6 -85 -53 64 -92 16 134
3046 134 -11 -26 -10 100 39 -55 14 -105 60 -72 41 57 -25 -72 -9 -5 -38 -31 5 75 30 76 6 -152 -68 -23 -40
3073 -40 -98 139 29 -62 -114 5 -48 -42 56 -93 48 47 26 -48 -29 -35 86 9 -108 59 18 -130 -12 119 19 -62
3099 -62 -19 -69 26 -9 -43 -91 17 71 20 6 -47 66 41 32 -87 -88 -30 -89 22 -80 2 -60 -21 -58 2 94 85 4 10 -6
3129 -6 -56 51 -71 33 114 48 -22 -75 -86 110 -45 14 -35 -24 38 -100 -80 85 -15 -16 99 20 -36 94 -19 -107
3155 -107 52 52 -66 -2 32 52 17 -21 -87 -10 -54 73 -27 -39 95 -122 -55 23 -59 -5 37 83 -74 156 -87 -105
3181 -105 125 79 -63 -31 -118 35 -32 -137 -98 2 46 -134 -65 99 17 -43 -131 -58 54 64 -26 -14 89 25 132
3206 132 -35 -63 -28 115 13 26 8 -141 11 10 -67 11 -14 -5 60 47 119 95 183 32 -4 7 20 86 79 52 24 -80
3234 -80 -159 -12 60 -86 29 -9 121 107 66 0 -38 -26 -7 -13 -32 -14 -2 -51 40 67 -65 -36 -19 -63 3 69 -99 117
3262 117 -8 -144 -14 -33 64 84 7 61 -9 -26 -49 102 -25 -34 4 45 6 -138 -27 98 18 0 39 31 -4 -11 60
3289 60 -58 -95 32 -89 -2 -84 16 -51 -9 -45 -7 -10 -86 69 55 -83 -40 43 0 95 28 34 15 -15 -47 78 53 -43
3317 -43 53 39 -24 -60 34 51 -14 -47 59 3 -44 -18 -7 -39 -10 -27 71 -47 -93 2 67 28 -86 32 -58 -117 1 9
3345 9 -18 -46 75 94 -3 86 95 12 -159 46 46 -12 43 -5 19 -54 -129 -20 6 75 -10 -1 -75 105 -86 -74 9 -21 53
3374 53 -23 38 -38 -84 70 -22 -35 128 68 12 -134 -10 84 -70 -53 10 59 55 -46 -22 -50 -122 88 -55 -67 61
3400 61 -1 74 -50 -44 0 -4 -59 -137 -28 -54 5 -38 22 -41 55 8 -53 -58 163 50 6 16 -70 -64 22 -81 53 2 -66
3429 -66 -79 66 -56 -101 102 52 -80 -19 -51 -19 -12 -105 99 -32 35 29 12 2 72 29 0 -71 -29 -2 -27 -159 61
3456 61 -108 87 32 -53 -71 -71 -56 -22 -38 -22 -40 -14 233 -83 39 -48 -81 -39 152 176 39 -87 46 -94 -28 -32
3482 -32 -47 -17 0 -91 -51 -13 -22 -143 -6 52 -83 59 52 -5 -58 26 -42 54 -137 23 24 -25 -64 -20 41 -5 64 35 -48
3511 -48 88 38 -5 -56 85 -24 -21 52 28 98 28 88 -74 -10 3 -38 -97 45 -80 28 -68 1 -24 40 27 58 24
3538 24 -84 -69 -74 -33 -34 -43 -51 8 -74 -105 10 -49 -76 -35 3 75 -81 19 -13 -82 45 86 47 -18 -97 23 4 -14 -141
3567 -141 -93 27 -19 -35 22 15 -9 21 61 -23 47 100 -14 -21 25 -88 -83 -13 -47 -53 -39 10 153 74 -27 98 12 53 -46
3596 -46 -32 -50 14 70 22 46 -123 -1 -66 94 120 136 86 18 -25 -3 -72 -111 -8 17 -25 -75 -62 -52 -67 40 -48 -30
3624 -30 -176 -9 3 52 6 -31 35 -22 -84 5 22 85 -16 75 -26 -108 6 -7 -13 -18 -19 -61 -13 -105 15 93 -61 33
3652 33 -8 208 -36 71 4 -4 -18 3 137 -53 -25 66 -20 58 -28 -47 -72 17 20 45 -12 -81 -70 -104 -20 -17 -49 -88 93
3681 93 20 -44 -76 -98 -38 -110 -57 -16 -38 -58 3 33 -18 11 -103 91 -49 -25 94 67 12 -11 -5 122 -70 -14 -52 -73
3709 -73 -96 83 2 -27 -35 -111 -14 62 103 -122 -40 53 100 60 20 57 4 14 75 -46 5 -71 32 -18 -36 -85 25 107
3737 107 37 -7 35 30 -103 -36 -103 29 6 66 68 14 14 -21 -78 -113 -68 -43 -24 -58 34 20 71 -104 28 63 -41 50 41
3766 41 -78 69 -66 -74 74 55 12 9 33 -27 -41 -49 -10 58 50 -113 -9 -50 19 -30 33 -23 -9 48 -36 -82 -74 7 22 8
3796 8 -49 -57 -26 -75 51 32 32 10 -21 -3 54 15 -11 90 -11 -72 91 -23 4 1 -124 -118 -44 12 39 104 19 -60 -114 -29
3826 -29 10 -59 1 -46 -23 -41 10 -61 -74 38 28 -43 -77 -74 7 -11 45 48 -34 -93 -11 -140 0 -68 57 67 -49 6 -14
3855 -14 47 -27 15 -12 -17 28 -56 49 23 -135 37 58 9 -10 -54 23 -78 73 -73 120 68 -28 134 -45 42 -59
3881 -59 -54 14 41 -16 48 15 18 35 -27 -62 -106 22 -50 -20 68 -24 -35 -17 78 3 -62 55 35 -105 -75 -32 -59 23 -59 -73
3911 -73 56 43 5 124 -38 -36 125 105 18 1 37 -22 -15 81 88 -86 65 3 -33 69 3 -58 68 -45 -86 111 -127
3938 -127 -84 30 6 -19 50 59 47 45 56 83 -15 66 50 -41 -63 62 -22 -49 -30 24 -6 100 28 -60 71 -44 -93 90
3966 90 -8 -57 -63 55 102 26 5 49 7 -75 -15 -74 -85 19 -36 10 30 9 -50 -56 22 -17 -139 4 -6 80 12 -14 -99
3995 -99 -100 109 -31 48 -75 -2 29 14 20 -27 -49 -94 33 194 -35 -11 55 11 33 -22 -42 -75 50 -76 21 -82 -6
4022 -6 107 5 48 -6 54 -14 -61 -100 59 19 85 89 -84 -24 -48 43 14 24 -82 -1 56 -21 2 -47 -71 -70 -26 -17 11 -97
4052 -97 39 -119 -45 22 -21 -95 -18 -94 -16 -58 -96 46 -69 2 34 28 -44 23 20 -29 -26 -86 -9 -7 22 -24 14 3 41 96
4082 96 23 -15 -16 -2 28 38 57 -68 0 -16 65 91 9 58 -111 68 63 -64 -13 -12 -57 5 -31 102 -7 -10 44 0 25
4111 25 68 -23 30 -8 45 73 22 24 -23 24 34 -35 -87 -67 -5 -7 -60 -47 46 -161 -86 -107 4 55 -35 15 -9 85 63 78
4141 78 -21 -46 -84 82 83 -47 -24 75 -9 45 33 19 28 -15 23 -24 0 -14 25 91 11 105 24 -92 62 34 27 7 18 14
4171 14 36 -1 -20 -33 -141 -33 89 65 2 -54 -1 23 -107 83 135 20 53 -41 51 189 83 6 11 -93 92 -170
4197 -170 128 -86 2 47 -86 50 59 -104 -15 -43 21 94 49 60 -64 -59 -61 -46 5 32 34 -3 -23 78 11 -6 12 34
4225 34 -36 8 53 42 41 81 -11 25 105 97 -44 -83 76 -91 -132 31 -126 134 52 -29 -24 -113 -25 -102 -48 13 37 44 -53
4254 -53 -27 23 22 66 148 -44 21 28 63 -121 40 -57 -49 38 34 37 38 50 26 19 -117 17 -54 -26 -49 -121 -55 15 91 -55 -76
4285 -76 1 15 -11 -82 -7 -42 37 49 -14 -22 -44 35 7 -127 -7 -79 -80 46 -57 -18 -65 32 -15 12 19 -54 -71 85 -51
4314 -51 -54 71 107 -5 -60 8 114 25 49 -55 11 74 -66 111 25 -54 32 -29 50 -60 -37 -56 -46 -57 28 9 -66
4341 -66 25 -108 18 -15 -21 0 30 -25 -27 66 6 -32 28 42 -48 -1 -14 -72 -9 -68 -36 65 21 34 -39 -24 -81 10 -19 6
4371 6 33 10 -60 -133 14 140 89 -62 29 -98 109 127 4 -81 -53 -57 -2 65 -17 134 67 100 53 -18 35 42 -72 65
4399 65 -30 119 21 58 -55 -48 -52 -55 -71 22 -65 20 31 -147 -64 -50 -39 3 -13 31 18 26 27 -73 -22 1 5 105 -49 -14
4429 -14 -5 -50 -43 -70 -63 -53 49 -64 -119 -9 -114 55 24 77 119 -27 52 -31 111 76 -3 6 -123 -72 -20 -6 10 35
4457 35 -25 -142 2 -23 -9 1 74 10 -41 -13 3 55 65 -70 38 -112 -88 -17 49 -27 -2 -70 40 -91 52 -19
4483 -19 48 -73 -23 10 -71 -14 -19 12 -47 -100 -70 43 16 -9 -21 -135 64 35 16 -58 -14 -23 51 49 -11 22 -6 -8 71 41
4513 41 68 64 -46 17 31 29 -16 -79 80 108 -36 -77 76 31 106 38 -30 24 16 114 8 -3 5 20 38 78 -67 -10 -2 33
4543 33 -29 59 -25 -70 -17 -114 -79 12 53 -28 -75 -53 81 -57 6 9 55 -172 30 61 29 92 17 -10 -43 -17 53 1 26
4572 26 23 78 65 -4 56 -94 25 41 20 32 -20 2 -33 4 -34 3 -13 17 33 -81 -167 41 -11 66 1 122 -44 37
4600 37 -14 -31 74 64 47 47 43 -50 27 -78 -8 -3 50 95 -74 -31 66 33 6 10 -16 -52 104 17 33 -59 -87 -119 -33 -10
4630 -10 69 -79 -39 28 75 -8 -56 -32 14 -44 19 47 23 -47 10 6 83 -102 -21 -34 44 100 -87 -25 31 2 -21 3 -15
4659 -15 130 -39 52 62 -140 -126 -15 -131 -54 117 -122 109 -46 -164 -30 -26 34 -90 3 -127 5 -129 32
4682 32 8 66 -115 23 -40 -18 -21 -109 -81 42 -7 -120 -11 -101 39 67 107 19 -56 10 -59 -60 23 34 -85 34 30 -84
4710 -84 -55 70 12 -37 -78 -18 144 80 143 -136 18 -33 19 -18 53 142 -2 -6 13 64 -91 -30 14 77 -27 17 13 -28
4738 -28 -11 48 -32 -8 -26 40 73 -44 -13 -50 15 36 102 -44 -115 70 93 3 13 -81 -27 37 -6 25 36 -44 -92 86
4766 86 -37 -86 -114 37 74 8 -57 -21 -65 12 8 -66 -73 -3 -13 32 7 -23 -32 -24 7 55 17 9 -109 -44 32 -76 66 -59
4796 -59 -38 -38 -6 26 -63 23 -2 -85 -79 -47 8 -91 -52 54 38 12 137 31 48 15 -80 -93 55 38 -87 -49 0 -31 25
4825 25 -120 66 30 -41 -63 -27 -8 -67 -100 -60 -17 -101 -46 -5 86 -9 95 -28 147 33 42 20 130 95 -16 43 -125
4852 -125 14 18 5 -6 -77 -40 -46 -9 -65 -18 15 35 90 53 66 159 -7 17 -150 -72 -21 -57 -41 -29 -25 -52 -48 3 -54 -37
4882 -37 30 -62 -19 -102 -38 -4 -44 -9 26 0 -85 -16 -94 -1 27 -45 70 37 -45 -8 -6 22 -9 -15 18 4 102 69 -29 45 33
4913 33 27 28 5 76 -7 25 -32 -42 -115 -37 8 61 13 -107 -102 -41 -41 23 7 -125 -26 71 50 79 -93 31 25 -1 71 -60
4943 -60 13 -55 21 13 -9 -21 -2 128 12 -64 -6 90 73 19 -147 -22 -22 -4 -55 58 -41 -25 47 7 71 -84 10 -49
4971 -49 -97 38 111 -14 -29 78 -36 -42 31 -81 20 82 -87 8 -1 -9 -10 -77 -43 17 -99 -15 -5 20 -39 -64 -66 10 -70
5000 -70 -11 168 -10 83 22 -13 -1 -11 -22 83 -15 -8 46 -14 -6 17 10 2 -32 -137 75 -76 -68 66 10 -153 18 -64
5028 -64 -33 61 29 -55 -17 56 -76 42 29 -62 9 -36 -12 102 40 24 -60 -50 39 29 -24 76 -39 -57 -36 -145 -34
5055 -34 -23 16 -166 68 16 104 -76 17 41 24 -13 -89 -12 11 96 -15 23 101 106 -47 74 104 13 -35 -10 -31 -64 74
5083 74 11 -125 38 13 23 -39 -77 -35 -86 -118 -15 -73 -32 104 -59 25 -74 -17 -132 -24 25 -15 -2 -14 -22 -13 -37 12
5111 12 12 -24 -89 73 9 -2 -65 90 87 86 10 57 4 -27 13 50 66 -14 -5 6 -26 49 -37 -23 -189 -43 60 130 88 14
5141 14 17 -141 -81 -35 26 30 46 36 -43 -48 39 -38 33 52 40 -118 -30 -7 10 -67 81 -28 16 -42 -67 18 -39 -157 1
5170 1 14 33 70 -42 -3 40 -39 -30 70 24 0 40 86 -15 84 -19 41 -27 -60 -20 -36 -52 -11 -153 -89 56 60 67 118
5199 118 38 1 154 36 22 -25 8 42 70 -60 74 84 24 55 -28 22 4 -44 55 -31 130 56 41 66 -26 -68 -62 -63
5227 -63 -23 97 -54 10 -96 -30 -21 -22 77 38 -2 -75 5 -18 76 20 53 66 -19 91 -58 -75 -86 -29 80 -60 -50 62
5255 62 -6 -4 -122 85 17 -2 48 -47 -76 31 58 -54 42 -37 62 100 -105 -7 -71 34 17 -47 -18 78 30 -47 43 -114
5283 -114 29 -50 15 -16 27 -166 40 61 -4 -69 -38 21 5 43 14 -48 -9 -34 50 -23 -1 10 -15 14 -76 73 42 -23
5311 -23 -127 -51 -47 -27 46 67 15 -30 39 12 94 32 21 115 -16 56 -21 -53 45 -166 -60 45 -36 39 -115 -43 92
5338 92 -71 28 -3 -85 -21 17 1 -40 -59 -24 -36 0 -29 -10 56 72 33 -18 -111 127 68 64 50 -3 -74 -26 -80 50 7
5367 7 -99 -3 54 38 -66 80 -78 -12 14 52 22 -28 -85 -129 -68 -119 -5 104 -11 -133 -52 -78 -5 -29 -76 -30 -13
5394 -13 28 -25 -23 -15 -10 39 117 72 27 -39 -20 75 -20 43 7 -85 -39 130 -20 19 30 -84 56 22 21 -84 4 -130 -22
5423 -22 -17 -49 36 -32 -8 42 -76 37 84 -59 -168 58 -92 -26 13 40 27 47 62 -109 40 -15 8 56 -117 9
5449 9 77 -65 -22 70 -102 196 -20 -22 122 -80 41 -36 -41 56 -73 16 -63 -27 39 -12 -42 -43 22 36 -45 -98 -21 56
5477 56 18 21 138 -87 -4 -17 -135 -103 90 -7 32 -12 18 68 26 -1 5 -28 135 -44 68 125 35 -27 -12 48 -22 -51
5505 -51 -80 46 -6 49 38 22 -52 -20 -29 -48 156 94 -33 69 -49 9 -58 46 -24 -66 13 -70 73 -8 6 102 -78
5532 -78 -19 73 -38 21 -7 -60 49 14 -23 -124 43 -84 13 -7 -25 16 44 -49 -72 -21 -38 -9 -30 11 -23 5 -25 -85
5560 -85 28 -83 24 70 34 15 -62 16 -129 -10 28 55 43 -21 29 94 -46 68 -35 -90 87 -125 -55 113 -48
5585 -48 -26 6 40 51 36 91 79 19 38 35 -23 -52 -53 60 -19 -4 -41 -43 24 -3 -26 -83 30 -25 3 -71 41 -16 44 29
5615 29 54 41 3 102 92 -81 -47 61 -18 -4 126 108 33 -38 107 -46 52 48 27 15 -116 -28 -120 -65 -106 65 65 9
5643 9 -76 15 79 10 -32 51 -66 -49 -66 -41 90 12 -7 -30 8 71 -27 54 -46 -39 -165 -92 -62 20 2 42 38 18 22 -73
5673 -73 0 17 -42 7 -158 -42 1 107 -74 -5 -8 -20 46 -16 64 41 138 33 19 21 1 34 35 -108 8 42 -50 -86
5701 -86 -32 -1 39 56 1 11 51 146 -88 65 95 23 28 -23 -37 -33 -30 -106 10 30 -105 116 -18 -50 -14 -35 -43 30 56
5730 56 105 -54 -113 130 -130 -8 -75 85 43 30 -13 65 102 -99 3 -16 -124 120 -40 -101 57 28 -50 124
5754 124 -54 -31 -27 -44 -38 -122 38 -133 -59 26 9 28 -26 -39 -117 -116 -3 114 -6 -14 -74 18 142 -17 -22 80 -114
5781 -114 63 33 63 -18 11 -47 -23 74 46 -4 35 43 112 79 7 34 28 174 -135 -219 44 -8 -15 -113 5 -2 -85 -9 -34
5810 -34 44 -86 -31 -50 58 -23 70 21 35 56 14 -6 0 -48 -3 30 -15 42 68 -23 -44 113 90 78 -123 -4 9 -81
5838 -81 130 -91 109 -85 -110 8 6 71 44 -1 -4 91 37 143 -23 124 86 49 -15 43 49 49 78 29 20 -34 66 78
5866 78 0 11 29 -64 65 -157 55 85 -31 -19 68 11 96 18 -127 60 7 -55 -28 -76 -64 -169 81 -54 67
5891 67 56 -70 20 64 59 -41 81 -146 -32 -111 35 42 153 32 -143 38 -69 -19 50 -16 -15 -38 72 -69 -31
5916 -31 63 79 -91 51 -149 23 -36 -63 -42 -7 -17 54 70 20 47 -10 -6 -64 -25 -83 84 -74 50 -113 -74 36
5942 36 -59 22 60 -20 70 2 7 50 -38 -134 30 -65 60 -38 61 -51 -53 -61 -46 -17 35 40 1 5 5 -42 -30 50 -28 -57 -11 43
5974 43 -91 -21 -92 80 -61 -19 -85 -88 38 -15 71 55 71 -34 11 9 0 -74 -21 -116 92 -73 -57 -15 50 13 -16 -54
6002 -54 9 -19 -106 -30 15 45 64 73 4 10 -90 17 -58 -13 -32 -48 38 18 53 -48 140 -38 23 17 -29 102 -18 -32
6030 -32 -21 -2 -122 3 18 41 50 -84 -85 -9 -19 97 7 -52 -99 -60 94 2 -62 -21 -17 -60 27 -24 -53 61 65 -26 -19 57
6060 57 -80 -67 32 -3 46 -45 102 -24 -58 -43 76 21 -45 58 28 -47 -17 -10 -67 -54 98 -15 -40 0 -52 -107 79
6087 79 31 36 68 130 72 -100 66 -97 12 -84 95 -75 -219 32 -25 46 66 -14 105 1 52 65 57 44 19 16 -34
6114 -34 53 93 17 89 4 -5 -65 0 -56 33 136 81 166 -26 69 -4 59 70 -3 -47 -34 -139 -39 25 57 -27 -49 28 -55
6143 -55 -47 131 -98 -97 -17 -36 113 -37 8 -1 13 19 -74 49 -40 8 -30 41 127 -61 5 18 4 -4 14 -40 103 -51 54
6172 54 -19 34 -57 78 -10 -27 -4 7 24 -8 -68 -31 -22 54 108 -45 -42 2 -42 -48 -19 -12 -59 -15 55 -66 57 -88 20
6201 20 -8 -145 -55 73 98 27 115 -69 14 -82 2 0 -12 -46 16 -105 20 -36 85 -9 -91 80 -40 15 8 26 -122
6228 -122 16 -46 18 141 20 30 56 81 46 -15 -17 47 129 -93 7 -48 -44 11 85 18 -110 10 25 -7 15 29 1
6255 1 39 3 -20 14 -24 -10 -25 89 117 -56 50 -12 -82 -147 42 39 75 21 3 -98 -21 -30 100 62 -34 -13 -96 78
6283 78 10 -22 -67 -58 140 63 18 43 -50 -108 22 19 44 -74 -134 129 -29 -25 13 -92 46 4 -94 36 81 65 -37
6310 -37 -91 -34 60 -63 -16 -54 -47 154 30 -46 47 -5 53 83 -48 40 -52 27 76 15 47 60 31 101 -65 47 -17 27
6338 27 -61 27 45 116 18 -34 11 -61 2 -30 22 -159 -46 -45 -48 -2 -102 59 -8 -50 -81 115 26 -104 -105 -22 38 20 57
6367 57 104 -80 0 45 125 43 -8 -50 -42 -11 -105 -31 94 31 -37 -10 -10 53 27 17 -2 -43 -93 114 92 26 19 38 28 -30
6397 -30 8 123 -28 34 43 82 112 63 -49 -111 18 16 54 45 58 6 130 105 -67 -40 -13 20 1 21 30 87 -9 -58 4
6426 4 -79 41 10 42 79 -96 -122 14 43 59 -62 19 -39 38 -3 -72 8 -27 -61 87 -88 -22 44 -124 -52 77 100
6453 100 4 6 -117 7 73 -14 -22 79 89 112 14 -26 36 -30 -59 -73 34 112 -99 11 48 65 0 -62 -53 39 25 8
6481 8 -92 63 -16 -67 -48 88 23 5 -37 -58 -5 4 -2 122 -21 76 -54 -3 -6 -18 99 16 -72 69 108 1 6 -108
6509 -108 5 -65 -2 -50 14 63 50 -20 50 54 -16 -18 -42 3 -72 -130 53 25 29 -62 -125 26 -41 -104 -2 5 36 -24 38 -75
6539 -75 71 89 49 106 -59 -124 -19 13 -45 -38 72 -36 -1 7 -75 33 72 -30 2 23 4 -28 -23 50 -53 4 70 -12
6567 -12 10 81 -59 42 -58 85 67 18 -58 37 -10 -52 26 49 18 -36 61 -16 69 -3 -33 33 46 0 -54 -60 55 1
6595 1 -9 42 -38 75 5 -107 56 -29 86 59 -78 -53 44 114 40 -41 -48 -2 0 -105 19 89 -28 -160 41 68 -29
6622 -29 63 33 131 -13 16 -34 -13 47 125 3 25 -25 -94 -29 -56 -22 -28 -35 -104 -72 3 84 67 -94 -26 -74 -47 -122 -27 2
6652 2 3 161 -50 -52 -50 -16 -11 31 18 -141 133 8 -60 30 -36 -43 -6 -5 104 24 -65 -37 -118 -21 -56 -17 -69 -10 31 -81
6682 -81 -40 -13 33 -80 -36 34 -20 8 -63 54 -29 72 49 -33 -57 120 5 31 -24 21 -13 30 -7 6 -47 -5 25 -8
6710 -8 -13 41 -14 56 -70 36 33 -66 38 -14 108 43 -22 3 67 -130 -122 0 -12 1 91 -13 21 2 55 36 2 76 27
6739 27 -9 33 51 -51 20 77 29 11 75 2 -60 4 50 -138 38 145 -9 41 77 -15 -8 -24 15 -81 47 -76 -100
6766 -100 -34 -7 -51 81 60 -30 -104 42 20 64 44 -117 159 -31 -132 34 -60 -14 14 -59 90 7 59 38 6 -40
6792 -40 61 25 57 -66 26 55 -6 -3 26 -34 6 56 -60 -14 -1 -27 -33 92 5 65 -32 24 5 51 -20 -12 -22 52 61 139
6822 139 -20 73 37 12 27 -22 -13 -1 13 -37 -74 -18 24 -122 14 43 13 -24 21 71 -34 -28 -6 -50 -42 -4 94 -44 38
6851 38 110 -3 98 23 62 -55 -69 -87 20 -4 -34 9 -41 -8 7 -49 -39 -12 -9 60 34 10 -110 -30 64 -88 75
6878 75 6 -40 68 65 -44 -94 12 25 -48 -27 -50 -43 -51 -76 -28 -141 23 9 -66 -58 -27 65 -4 23 -23 -9 78 -23 16
6907 16 13 76 -28 -12 -15 -88 -42 -128 18 -89 56 38 46 -42 75 -47 -65 99 -35 -1 -57 -151 -50 -14 1 39 -2
6934 -2 -4 -94 -40 24 60 -18 -27 24 -60 28 26 -40 -129 -26 46 44 -21 59 56 105 34 -79 53 73 92 -56 26 1 19 4 -33
6965 -33 -56 -53 15 66 -6 62 47 82 58 46 -97 -31 -19 21 -41 28 -30 45 43 89 -13 -37 130 87 -86 106 89 81 -21
6994 -21 36 85 105 104 49 48 42 29 -40 77 -46 32 -48 1 -61 -1 -13 -80 42 -57 -35 -6 20 -58 60 98 -66 28 -6
7023 -6 20 31 -108 41 -6 30 -4 -58 -20 105 65 21 -29 164 70 -60 21 -90 119 105 7 27 130 46 -143 63
7049 63 23 75 -108 -26 -39 121 57 2 -64 -62 33 -36 1 57 -21 -2 -16 121 74 65 25 -76 22 -47 23 22 96 -87 48
7078 48 48 25 88 30 38 194 94 -34 65 -116 -51 18 35 -24 -16 44 64 119 3 -136 -102 114 114 -36 -112 72 33 3
7106 3 17 -38 28 50 -45 133 38 9 -53 -8 -21 69 -122 12 -33 -3 2 -55 -89 66 44 -53 17 4 36 54 4 129 -45
7135 -45 61 24 -24 103 -128 9 -29 -15 6 -21 7 40 9 -44 -171 87 -38 -77 101 63 -14 20 11 14 -23 -20 61 -105
7163 -105 32 -105 55 -100 -25 73 79 62 26 -84 -1 107 -80 -14 17 22 -32 44 -60 -6 72 72 -4 150 -24 136
7189 136 79 -82 -40 12 5 -29 -2 -116 -18 91 63 -46 -36 -40 10 101 60 4 34 11 52 34 70 -61 97 29 -8 -61
7217 -61 -76 -10 -86 -74 -16 35 81 -19 44 109 -80 16 33 -38 -20 -10 -43 104 -93 38 -104 36 67 12 24 32 81
7244 81 50 46 64 13 1 77 39 99 33 6 -86 -29 -10 -14 62 35 6 35 114 76 -44 -66 86 84 -47 -52 37 10 69 -4 -41
7275 -41 -35 44 76 71 -10 -29 -60 130 40 -52 -46 -60 -37 -81 72 40 -17 52 60 -35 81 31 23 -19 -1 -102 135 58 -27 -4
7305 -4 -106 -49 37 -14 30 63 -12 -53 -100 -84 -6 -28 -82 -31 -19 -21 20 31 -18 -44 5 124 -32 53 18 42 12 58 68 -12
7335 -12 -2 51 -6 6 -106 -32 -51 170 24 -95 37 4 120 14 42 -52 79 7 38 -16 -68 -23 2 -165 1
7360 1 -31 -3 181 -1 -25 -15 53 50 -12 -16 27 18 65 -6 -5 12 70 82 -18 58 50 -140 -16 39 76 2 53 -43 -76 -81 -9
7391 -9 -58 3 5 -33 -28 60 47 -15 15 46 -38 91 19 45 29 -27 59 13 -136 -174 57 -17 121 36 8 -36 15 -21 99
7420 99 -43 2 -31 -28 69 23 82 33 49 -54 -98 54 -55 -11 1 10 29 1 -103 -14 119 73 5 -9 17 18 41 111 -11
7449 -11 -87 89 -16 108 -38 -9 -39 16 -15 -13 -125 -2 15 22 73 -63 91 12 -41 -122 -41 91 -104 -46 2 -28
7475 -28 -97 15 -2 37 -53 -17 -99 -18 -45 -17 60 8 -11 37 -15 -2 -9 60 19 -46 33 15 -55 -4 -61 35 36 15 22 81 -7
7506 -7 -34 -34 101 134 -25 -14 -82 41 -47 -32 3 -13 -176 -30 -62 27 -93 -2 -18 -18 -86 -28 13 -62 -62 112 23 71 102
7535 102 -30 -99 7 -55 -19 -61 79 -51 26 17 23 -36 8 50 -1 -93 34 71 -34 5 -22 -91 13 48 -20 -16 131
7562 131 -49 34 70 -17 71 -15 25 56 173 87 -109 35 9 55 -53 100 -91 -9 -30 88 162 57 53 -8 -39 18
7588 18 -26 88 82 -3 143 -60 -12 15 -63 -57 -51 -33 10 -35 62 -64 79 -25 20 18 7 -95 -42 -62 -33 16 -138 -75
7616 -75 -59 -24 -96 24 -16 40 -32 65 58 43 -6 -182 -31 -50 -97 -77 -22 -53 -69 -61 -26 20 23 68 -15 59 14 -30 -101 -8
7646 -8 34 13 -51 -1 -91 -118 -96 -20 -6 -2 -18 81 110 -41 -29 -26 38 86 -76 61 -8 30 56 -80 -7 174 39 30 -96
7675 -96 -39 -22 1 3 20 9 -9 -56 23 34 -24 -14 -5 29 -18 -32 -41 -33 118 10 4 -38 -22 6 55 109 -71 45 -15 -25 -37
7706 -37 3 -90 148 -30 77 -51 25 -112 19 63 -63 -10 -20 40 0 51 -6 17 -60 -6 -6 12 45 -171 -12 21
7732 21 61 43 -93 79 37 10 86 2 -46 -8 -26 -36 7 -52 -7 -93 10 -9 -28 -14 26 22 5 3 10 85 -34 -160 -9
7761 -9 2 -39 32 -9 19 -70 163 25 7 34 -5 -58 -35 -67 -94 29 -11 99 -32 -18 31 6 20 -46 -49 67 -26 31
7789 31 -50 46 -9 -29 52 21 32 -79 26 51 -78 67 58 -19 -117 105 62 48 71 -10 23 39 42 -54 10 3 -2 41 14 -62
7819 -62 36 -50 24 7 -17 39 9 -38 -79 -19 50 141 60 -42 -69 -3 -7 14 73 -5 25 -52 -27 -48 -52 92 -65 53 36
7848 36 -23 112 -35 -61 18 11 -46 154 75 16 -72 -29 78 -77 -16 5 -54 1 12 16 54 -35 -14 24 75 71 25 -15 25
7877 25 67 6 -59 65 74 70 45 -47 76 7 -146 59 -1 -46 5 38 61 63 -87 25 27 22 -33 64 61 43 16 99 -22 -111
7907 -111 -10 -46 -66 -6 -21 5 2 8 51 -29 -79 62 47 25 18 -62 28 -28 -5 -97 122 37 37 31 6 6 144 -18 18 9 3
7938 3 104 -45 -25 -117 -14 -41 26 -11 -39 -24 30 -31 53 0 -39 29 23 26 54 56 -26 18 34 -37 38 41 -249 62 0 24
7968 24 -6 -27 -12 -68 -116 -56 -46 6 81 -21 50 -78 -35 -57 114 11 23 -70 -77 104 13 -14 52 20 45 -37 61 6
7996 6 13 -67 90 -47 65 -11 74 25 17 24 8 -2 -20 -130 14 13 -30 69 -33 27 -38 -59 -21 0 0 8 74 50 -6 -78 -117
8027 -117 48 85 0 8 -75 16 78 -30 0 31 5 2 -17 -68 110 24 18 -25 101 65 43 -19 19 -5 -3 -17 62 54 11 -21
8057 -21 -34 -13 32 17 -20 -113 -15 -55 -77 29 -39 17 42 -10 24 2 -54 -2 -26 0 -35 23 13 50 42 76 27 -12 30 95
8087 95 54 62 32 -24 -45 96 -78 -105 4 48 -135 91 -8 -13 66 63 -19 58 52 26 -61 21 191 -2 34 -62 8 -88 -48
8116 -48 42 49 45 3 -3 58 15 6 37 -108 28 2 -76 41 -80 87 21 106 142 -23 -66 109 66 20 67 37 -22 -23 -34
8145 -34 -35 -43 35 119 -34 -91 -31 9 -4 -10 21 -20 2 -85 60 72 -28 -90 39 -141 84 -51 26 74 42 40 -13 -42 5
8174 5 79 96 -29 -58 82 33 -56 23 71 -148 3 -12 56 66 21 -79 37
8191C7
##END NTUPLES=NMR FID
##END=
