##TITLE=1H_DE-80H_X3
 200.13MHz, d2o
 8 sc
 
 19ns.26.2.2025
##JCAMPDX= 6.0         $$ Bruker NMR JCAMP-DX V2.0
##DATA TYPE= NMR FID
##DATA CLASS= NTUPLES
##ORIGIN= UXNMR, Bruker Analytische Messtechnik GmbH
##OWNER= pz
$$ XWIN-NMR		Version 3.5
$$ Wed Jul 23 15:57:45 2025 Russian Standard Time (UT+4h)  Yarkov@DPX200
##.OBSERVE FREQUENCY= 200.1313
##.OBSERVE NUCLEUS= ^1H
##.DELAY= (6, 6)
##.ACQUISITION MODE= SIMULTANEOUS
##.ACQUISITION SCHEME= undefined
##.AVERAGES= 8
##.DIGITISER RES= 18
##SPECTROMETER/DATA SYSTEM= spect
##.PULSE SEQUENCE= zg30
##.SOLVENT NAME= CDCl3
##.SHIFT REFERENCE= (INTERNAL, CDCl3, 0, 14.3821)
##AUDIT TRAIL= $$ (NUMBER, WHEN, WHO, WHERE, WHAT)
$$ ##TITLE= Audit trail, XWIN-NMR		Version 3.5
$$ ##JCAMPDX= 5.01
$$ ##ORIGIN= Bruker BioSpin GmbH
$$ ##OWNER= Yarkov
$$ C:/Bruker/XWIN-NMR/data/yarkov2/nmr/H-C/1/audita.txt
$$ ##AUDIT TRAIL=  $$ (NUMBER, WHEN, WHO, WHERE, WHAT)
(   1,<2025-07-23 15:57:00.62 +0400>,<Yarkov>,<DPX200>,
      <created by zg, POWCHK disabled, PULCHK disabled
       configuration hash MD5:
       00 E9 B6 7A A2 85 ED C7 34 08 36 98 17 FE 4E 26
       data hash MD5: 16K
       EE 0F CA 0E 91 EE 0C 37 16 46 9F F9 D5 86 10 93>)
$$ ##END=
$$ 
$$ hash MD5
$$ 6A 7C 54 DA 84 BC CE E8 FB FF B8 E0 AA CC BD F5
##$RELAX= 
##$RELAX= 
##$RELAX= 
##$RELAX= 
##$RELAX= 
##$RELAX= 
$$ Bruker specific parameters
$$ --------------------------
##$DU= <C:/Bruker/XWIN-NMR>
##$EXPNO= 1
##$NAME= <H-C>
##$PROCNO= 1
##$TYPE= <nmr>
##$USER= <yarkov2>
##$AMP= (0..31)
100 100 100 100 100 100 100 100 100 100 100 100 100 100 100 100 100 100 
100 100 100 100 100 100 100 100 100 100 100 100 100 100 
##$AQSEQ= 0
##$AQ_mod= 1
##$AUNM= <au_zg>
##$AUTOPOS= <>
##$BF1= 200.13
##$BF2= 200.13
##$BF3= 200.13
##$BF4= 200.13
##$BF5= 200.13
##$BF6= 200.13
##$BF7= 200.13
##$BF8= 200.13
##$BYTORDA= 1
##$CFDGTYP= 0
##$CFRGTYP= 5
##$CHEMSTR= <none>
##$CNST= (0..31)
1 1 145 1 1 1 1 1 1 1 1 1 1 1 1 1 1 1 1 1 1 1 1 1 1 1 1 1 1 1 1 1 
##$CPDPRG= <>
##$CPDPRG1= <>
##$CPDPRG2= <>
##$CPDPRG3= <>
##$CPDPRG4= <mlev>
##$CPDPRG5= <mlev>
##$CPDPRG6= <mlev>
##$CPDPRG7= <mlev>
##$CPDPRG8= <mlev>
##$CPDPRGB= <>
##$CPDPRGT= <>
##$D= (0..31)
0 0.7 0 0 0 0 0 0 0 0 0 0.03 0 0 0 0 0 0 0 0 0 0 0 0 0 0 0 0 0 0 0 0 
##$DATE= 1753271820
##$DBL= (0..7)
120 120 120 120 120 120 120 120 
##$DBP= (0..7)
150 150 150 150 150 150 150 150 
##$DBP07= 0
##$DBPNAM0= <>
##$DBPNAM1= <>
##$DBPNAM2= <>
##$DBPNAM3= <>
##$DBPNAM4= <>
##$DBPNAM5= <>
##$DBPNAM6= <>
##$DBPNAM7= <>
##$DBPOAL= (0..7)
0.5 0.5 0.5 0.5 0.5 0.5 0.5 0.5 
##$DBPOFFS= (0..7)
0 0 0 0 0 0 0 0 
##$DE= 6
##$DECBNUC= <off>
##$DECIM= 32
##$DECNUC= <off>
##$DECSTAT= 4
##$DIGMOD= 1
##$DIGTYP= 9
##$DL= (0..7)
0 120 120 120 120 120 120 120 
##$DP= (0..7)
150 150 150 150 150 150 150 150 
##$DP07= 0
##$DPNAME0= <>
##$DPNAME1= <>
##$DPNAME2= <>
##$DPNAME3= <>
##$DPNAME4= <>
##$DPNAME5= <>
##$DPNAME6= <>
##$DPNAME7= <>
##$DPOAL= (0..7)
0.5 0.5 0.5 0.5 0.5 0.5 0.5 0.5 
##$DPOFFS= (0..7)
0 0 0 0 0 0 0 0 
##$DQDMODE= 0
##$DR= 18
##$DS= 0
$$ [...]
##$SUBNAM2= <"">
##$SUBNAM3= <"">
##$SUBNAM4= <"">
##$SUBNAM5= <"">
##$SUBNAM6= <"">
##$SUBNAM7= <"">
##$SUBNAM8= <"">
##$SUBNAM9= <"">
##$SW= 18.0517328524113
##$SWIBOX= (0..15)
0 0 2 0 0 0 0 0 0 0 0 0 0 0 0 0 
##$SW_h= 3612.71676300578
##$TD= 16384
##$TD0= 1
##$TE= 0
##$TE2= 300
##$TE3= 300
##$TEG= 300
##$TL= (0..7)
0 120 120 120 120 120 120 120 
##$TP= (0..7)
150 150 150 150 150 150 150 150 
##$TP07= 0
##$TPNAME0= <>
##$TPNAME1= <>
##$TPNAME2= <>
##$TPNAME3= <>
##$TPNAME4= <>
##$TPNAME5= <>
##$TPNAME6= <>
##$TPNAME7= <>
##$TPOAL= (0..7)
0.5 0.5 0.5 0.5 0.5 0.5 0.5 0.5 
##$TPOFFS= (0..7)
0 0 0 0 0 0 0 0 
##$TUNHIN= 0
##$TUNHOUT= 0
##$TUNXOUT= 0
##$USERA1= <user>
##$USERA2= <user>
##$USERA3= <user>
##$USERA4= <user>
##$USERA5= <user>
##$V9= 5
##$VALIST= <valist>
##$VCLIST= <CCCCCCCCCCCCCCC>
##$VD= 0
##$VDLIST= <DDDDDDDDDDDDDDD>
##$VPLIST= <PPPPPPPPPPPPPPP>
##$VTLIST= <TTTTTTTTTTTTTTT>
##$WBST= 1024
##$WBSW= 4
##$XGAIN= (0..3)
0 0 0 0 
##$XL= 0
##$YL= 0
##$YMAX_a= 65240
##$YMIN_a= -53749
##$ZGOPTNS= <>
##$ZL1= 120
##$ZL2= 120
##$ZL3= 120
##$ZL4= 120
##$ABSF1= 10
##$ABSF2= 0
##$ABSG= 5
##$ABSL= 3
##$ALPHA= 0
##$AQORDER= 0
##$ASSFAC= 0
##$ASSFACI= 0
##$ASSFACX= 0
##$ASSWID= 0
##$AUNMP= <proc_1d>
##$AZFE= 0.1
##$AZFW= 0.1
##$BCFW= 1
##$BC_mod= 2
##$BYTORDP= 1
##$COROFFS= 0
##$CY= 83.5205535888672
##$DATMOD= 1
##$DC= 2
##$DFILT= <>
##$DTYPP= 0
##$F1P= 10.8118882576601
##$F2P= -7.23987719738617
##$FCOR= 0.5
##$FTSIZE= 0
##$FT_mod= 4
##$GAMMA= 1
##$GB= 0.15
##$INTBC= 1
##$INTSCL= 1
##$ISEN= 128
##$LB= 0.25
##$LEV0= 0
##$LPBIN= 0
##$MAXI= 10000
##$MC2= 0
##$MEAN= 0
##$ME_mod= 0
##$MI= 1.114404
##$NCOEF= 0
##$NC_proc= 0
##$NLEV= 6
##$NOISF1= 3.799351
##$NOISF2= 2.8
##$NSP= 1
##$NTH_PI= 0
##$NZP= 0
##$OFFSET= 14.38212
##$PC= 1
##$PHC0= -1356.223
##$PHC1= 9.99091
##$PH_mod= 1
##$PKNL= yes
##$PPARMOD= 0
##$PSCAL= 0
##$PSIGN= 0
##$REVERSE= no
##$SF= 200.129724274929
##$SI= 16384
##$SIGF1= 3
##$SIGF2= 2
##$SINO= 400
##$SIOLD= 16384
##$SREGLST= <1H.CDCl3>
##$SSB= 0
##$STSI= 0
##$STSR= 0
##$SW_p= 3205.1282051282
##$SYMM= 0
##$S_DEV= 0
##$TDeff= 0
##$TDoff= 0
##$TI= <>
##$TILT= no
##$TM1= 0
##$TM2= 0
##$TOPLEV= 0
##$USERP1= <user>
##$USERP2= <user>
##$USERP3= <user>
##$USERP4= <user>
##$USERP5= <user>
##$WDW= 1
##$XDIM= 8192
##$YMAX_p= 0
##$YMIN_p= 0
$$ End of Bruker specific parameters
$$ ---------------------------------
##NTUPLES= NMR FID
##VAR_NAME=  TIME,          FID/REAL,        FID/IMAG
##SYMBOL=    X,             R,               I
##VAR_TYPE=  INDEPENDENT,   DEPENDENT,       DEPENDENT
##VAR_FORM=  AFFN,          ASDF,            ASDF
##VAR_DIM=   8192,          8192,            8192
##UNITS=     SECONDS,       ARBITRARY UNITS, ARBITRARY UNITS
##FACTOR=    0.0002768,     1,               1
##FIRST=     0,             0,               0
##LAST=      2.2672688,     0,               0
##MIN=       0,             -53749,          0
##MAX=       2.2672688,     65240,           0
$$ Real data points
##PAGE= N=1
##DATA TABLE= (X++(R..R)), XYDATA
0 0 0 0 0 0 0 0 0 0 0 0 0 0 0 0 0 0 0 0 0 0 0 0 0 0 0 0 0 0 0 0 0 0 0 0 1 -1 2 -4 4 -4 6 -7 7 -8 8 -9 9 -9 13 -13 15 -16
52 -16 18 -19 22 -22 26 -28 30 -32 37 -38 43 -45 49 -48 33 16 -242 2865 21393 -6846 -45830 -37011 -11898
75 -11898 -11326 -32491 -37658 -13954 12156 12236 -2713 6751 43490 51304 21123 10172 28350 30678
89 30678 3345 -24856 -27602 -17457 -22184 -39652 -45311 -25509 1817 2514 -9346 7953 38694
102 38694 40422 20450 13248 24540 27312 7273 -14047 -17562 -7985 -5802 -24531 -36655 -15936
115 -15936 3496 -8053 -20863 -7051 15224 17066 3449 2848 18496 29361 21638 3538 2035
128 2035 18334 13842 -14815 -26619 -13819 -8332 -23346 -35611 -23345 -1886 4307 -442 2277
141 2277 21170 39035 29920 10529 13259 24417 12615 -14240 -24991 -14708 -11289 -24486 -31797
154 -31797 -20955 -2069 6397 -2102 -3334 17141 30080 16572 1834 8821 21093 12401 -6751
167 -6751 -9636 133 3013 -7359 -20779 -17139 -1240 -2921 -19281 -19258 89 10890 2136 -3054
181 -3054 11738 26498 23452 11797 6960 13314 15473 -2590 -22096 -19650 -9829 -15735 -30123 -26488
195 -26488 -5221 5489 1224 2153 14869 27886 27201 12889 5914 13850 13964 -4315 -19744 -14235
209 -14235 -3765 -10693 -22545 -17295 -2893 2895 -2103 -7151 1351 15244 13098 656 978 14767
223 14767 19059 5160 -3399 5198 10387 608 -12344 -15786 -8905 -6257 -16633 -23182 -11726 3937
237 3937 4787 -2123 5063 23040 25974 14377 8493 11646 12914 2780 -13685 -18810 -11264 -9421
251 -9421 -19044 -23325 -9890 5503 3224 -2412 5714 17232 18318 9401 2305 6563 11734 4249
265 4249 -8165 -9116 871 2188 -10263 -14967 -4647 1140 -5125 -11540 -7886 2723 6708 762
279 762 -1177 8642 18514 14198 2960 4161 12502 7012 -7738 -14069 -10134 -7182 -12902 -19619 -14311
294 -14311 -778 5537 1984 1291 13448 22671 14593 4201 5902 9779 4045 -8142 -14162 -9143
308 -9143 -4346 -8584 -14127 -9880 2518 6030 -2379 -3059 7521 11884 5204 -860 2436 9189 7915
323 7915 -100 -3543 1624 5988 -1154 -11613 -9392 -1207 -4352 -12714 -12027 -2185 4411 2147 209
338 209 6853 15721 16256 7886 2477 7209 8409 -3822 -14320 -12002 -6652 -8927 -14903 -12519 -1831
353 -1831 5117 4034 1898 6515 15359 14210 3352 217 6022 5898 -3196 -9692 -6052 -430 -2951
368 -2951 -8554 -8540 -2160 2626 -1802 -7582 -1740 6983 5224 -757 1035 9127 11727 5490 986 3401
384 3401 6023 1745 -7609 -11964 -6532 -4304 -11095 -14206 -6284 3230 3943 911 4964 13215 14834
399 14834 9190 3313 3319 6278 890 -9926 -11698 -5435 -3856 -9271 -10965 -3278 4004 2627 -486
414 -486 1291 6845 9426 3743 -1605 2556 7551 3658 -3540 -3132 2877 2699 -4586 -7682 -4294 -1324
430 -1324 -3476 -8330 -7453 505 4546 772 -114 6694 12867 9316 2785 3165 5983 2676 -4780 -10015
446 -10015 -8281 -4366 -6679 -11171 -7674 1443 5203 1720 1230 8292 11839 6966 1588 909 3393
461 3393 2544 -4224 -8341 -4227 157 -2671 -7359 -4853 2364 2522 -2750 -3124 1742 4906 2874 -956
477 -956 678 6503 6991 1530 -1267 2388 4794 -1210 -7738 -6308 -2624 -4035 -7674 -7814 -2100 3937
493 3937 3315 1052 4487 10570 10701 3787 523 3583 3049 -3598 -8630 -7713 -4208 -3693 -6871 -6675 -184
510 -184 4972 3352 -39 2692 8317 6527 344 -578 2653 3562 -306 -4269 -2791 1219 425 -4472
526 -4472 -6079 -1671 1206 -2932 -6078 -1975 3111 3005 549 1280 6191 8644 5260 1035 1441 3644
542 3644 924 -6351 -8615 -4438 -3388 -6851 -7641 -3068 2642 3975 2129 3081 7263 9168 4981 -100
558 -100 855 3420 -174 -6177 -6235 -2409 -1122 -3778 -5270 -1914 2202 1910 -1299 -1617 2898 5288 1103
575 1103 -1306 2236 5445 3528 -403 -644 2218 2107 -2416 -5722 -4452 -1706 -2668 -6588 -5245 928
591 928 3396 1237 1105 5074 8280 6244 2027 913 2271 1444 -3354 -7480 -5470 -1911 -3503 -6122
607 -6122 -3507 1806 3712 1530 630 3622 5936 3866 -88 -958 2149 2528 -2129 -4267 -862 1641
623 1641 -731 -4003 -3086 485 524 -2434 -3537 -618 2904 2192 -772 942 5421 5594 1805 -243
639 -243 1823 2639 -1189 -5143 -5087 -2787 -2382 -4406 -5216 -619 3496 2738 995 3086 6655 5880 1686
656 1686 -466 904 1131 -1898 -5126 -4859 -1416 -703 -3436 -3591 499 3144 1316 -1051 685 3717
672 3717 2964 48 -755 1484 3444 1443 -1900 -884 1847 902 -3164 -4344 -1782 -405 -2901 -4283
688 -4283 -1694 1634 2778 1167 1125 4606 6423 3457 156 376 2033 -285 -4744 -5431 -3017 -1954
704 -1954 -3088 -4037 -1683 2481 3322 1047 1061 4030 5062 1979 -1044 237 1789 85 -2666 -3047
720 -3047 -891 586 -1459 -3464 -1646 1118 508 -2294 -2130 1386 2645 584 -345 1873 4106 3437
736 3437 628 -233 1543 1534 -1911 -4627 -3541 -1352 -2217 -4416 -2936 909 2564 1602 1232 3117 5172
753 5172 3917 615 -524 995 790 -2632 -4731 -2562 -613 -1424 -2860 -1844 1081 2355 727 -544
769 -544 1195 3026 1917 -797 -783 2010 2166 -520 -1518 142 1356 -121 -2555 -2680 -578 -189 -2245
786 -2245 -3321 -736 2244 1524 -92 1431 4102 3835 1483 -185 607 1116 -1210 -3857 -3958 -1706
802 -1706 -969 -2810 -2867 449 2743 2028 806 1567 3481 3170 641 -1000 -98 1000 -635 -3045 -2443
819 -2443 233 228 -1909 -2027 127 1444 187 -1431 -410 1544 1852 266 -517 1575 3321 1441 -749
836 -749 -71 1273 287 -2433 -3360 -1916 -743 -1841 -2754 -1362 1607 2522 1081 1044 3405 4108 1928
853 1928 -254 -194 712 -589 -2962 -3419 -1895 -531 -1238 -2434 -838 1998 2022 133 170 2017 2569 757
871 757 -854 1 1364 1005 -913 -1639 126 1045 -921 -2611 -1482 82 -464 -2088 -1724 668 1864
888 1864 977 329 1569 3417 3042 460 -364 948 613 -1930 -3577 -2651 -884 -1449 -2554 -1595 932
905 932 2245 1343 505 1708 3334 2040 -206 -762 641 599 -1335 -2552 -1107 48 -248 -1511 -1346
922 -1346 609 1223 -414 -1232 234 1692 1016 -555 44 1846 1848 532 -447 143 974 -85 -2354 -2424
940 -2424 -914 -575 -1910 -2323 -238 1711 1367 623 1340 2735 2882 1026 -598 -3 536 -940 -2948
957 -2948 -2585 -767 -383 -1650 -1593 504 1883 1333 126 412 1940 1762 57 -1108 38 1182 74
974 74 -1680 -820 680 312 -1084 -1709 -666 404 -331 -1651 -798 1047 1568 256 14 1852 2609 1214
992 1214 -191 -117 395 -146 -2115 -2814 -1596 -545 -1077 -1864 -641 1663 1949 741 739 2218 2478 1130
1010 1130 -459 -402 397 -129 -1831 -2172 -832 195 -614 -1669 -535 1150 910 -228 -483 754 1578
1027 1578 550 -510 280 1650 1356 -237 -753 519 671 -990 -2127 -1659 -523 -628 -1577 -1357 444
1044 444 1721 1163 576 1457 2723 2007 56 -411 397 104 -1420 -2543 -1849 -585 -585 -1313 -1069 650
1062 650 1731 693 21 992 1899 1154 -297 -425 544 720 -467 -1166 -487 415 17 -1235 -1445 95
1080 95 441 -796 -1154 -108 1053 952 0 344 1602 2026 759 -280 -22 667 -446 -2032 -1904 -981
1098 -981 -464 -1242 -1381 190 1412 1221 556 835 1802 1915 413 -722 -45 252 -526 -1811 -1555 -182
1116 -182 42 -680 -1004 53 1157 624 -492 -60 1157 1155 -79 -536 364 1221 469 -598 -289 420 122
1135 122 -927 -1565 -961 -2 -566 -1376 -688 905 1391 509 465 1367 1981 992 -321 -367 91 -78 -1561
1154 -1561 -2120 -1167 -316 -663 -1013 -243 1297 1224 580 455 1089 1483 700 -621 -549 493 286 -923 -1254
1173 -1254 -229 561 -417 -1027 -503 341 292 -526 -762 362 1126 584 -53 604 1588 1249 -38 -419 58
1192 58 191 -775 -1714 -1401 -574 -410 -1058 -952 458 1430 953 500 1066 1780 1273 90 -559 54 80 -756
1212 -756 -1695 -1109 -95 -137 -928 -580 547 1098 255 -182 439 1001 838 -199 -364 484 880 4 -535
1231 -535 -230 578 -25 -1137 -1216 -325 -62 -677 -1049 -145 850 925 130 452 1424 1664 414 -395 -63 260
1251 260 -557 -1530 -1532 -695 -169 -581 -888 176 1083 830 405 363 1186 1109 -34 -605 -165 195 -152 -859 -883
1272 -883 6 226 -388 -764 -164 508 125 -750 -312 773 786 135 -181 555 1285 541 -287 -379 250 71
1292 71 -1018 -1471 -630 -16 -431 -861 -359 916 1124 636 434 1112 1236 650 -477 -591 25 -224 -1221
1311 -1221 -1359 -541 -20 -233 -527 -67 724 949 198 -100 398 962 263 -553 -157 521 277 -395 -623 -107
1331 -107 247 -297 -892 -733 -25 107 -549 -705 371 911 603 121 676 1116 1018 22 -445 -197 31 -688
1351 -688 -1554 -1083 -159 -272 -624 -394 512 1103 807 273 636 1146 720 -127 -764 -159 268 -456 -1149 -652
1371 -652 229 105 -547 -485 122 501 -81 -414 61 667 632 -55 -60 692 855 272 -249 -136 254 -230 -955
1392 -955 -1046 -514 -65 -418 -734 -14 923 772 374 375 1083 1041 175 -420 -292 25 -460 -1008 -934 -342 58 -343
1414 -343 -571 239 744 558 12 76 680 651 -52 -354 -51 415 168 -551 -473 80 197 -335 -627 -279 261
1435 261 -136 -556 -280 373 717 372 118 542 972 470 -298 -355 -8 -95 -728 -1135 -607 -134 -176 -415 -65
1456 -65 611 948 392 114 511 893 386 -453 -393 143 -23 -722 -818 -206 123 -25 -372 -177 339 343 -66 -302
1478 -302 185 652 125 -163 -17 389 349 -48 -412 -6 105 -331 -828 -843 -72 29 -512 -312 220 690 600
1499 600 248 547 809 651 -63 -528 -238 -127 -542 -1042 -591 -63 -62 -186 -262 444 794 469 86 168 612
1520 612 394 -150 -511 -41 366 -263 -608 -247 11 -42 -436 -514 -54 85 -33 -445 -76 540 545 48 140 624
1542 624 659 256 -230 -217 74 -136 -782 -773 -372 -43 -241 -333 101 698 589 253 198 530 628 95 -416 -221
1564 -221 59 -241 -622 -602 -35 234 -212 -391 17 475 198 -115 -69 325 258 26 -297 -7 347 149 -293
1585 -293 -257 42 143 -369 -579 -233 63 -72 -292 -33 296 604 277 60 426 624 218 -290 -338 -127 -215
1606 -215 -620 -716 -399 34 -66 -175 -64 509 655 180 16 146 491 157 -348 -296 2 95 -262 -437 -147
1627 -147 80 -8 -371 -200 229 269 -48 -271 162 563 269 -47 81 313 379 -34 -290 -88 57 -196 -620
1648 -620 -528 -63 -51 -206 -292 267 480 618 199 248 604 430 -136 -350 -137 -46 -352 -597 -403 -79 146 -295
1670 -295 -43 150 457 190 -19 77 389 228 -104 -225 117 261 -18 -108 -230 20 47 -449 -431 -6 53 -57
1692 -57 -325 12 530 480 198 109 336 516 141 -237 -211 -29 -221 -503 -557 -229 98 -64 -52 241 507 479
1714 479 216 142 179 366 56 -255 -303 -5 24 -463 -323 37 230 -86 -236 -76 313 89 -157 -49 192
1735 192 397 125 -68 88 400 176 -143 -300 -45 -33 -223 -528 -319 48 4 -155 -119 183 490 189 149
1756 149 276 266 164 -183 -350 -160 -100 -269 -450 -140 140 23 -49 44 342 345 47 -60 137 235 143 -205 -117
1779 -117 -6 305 -183 -230 -74 89 -68 -185 -164 121 209 -13 -105 79 434 217 38 51 277 197 -137 -225
1801 -225 -112 -168 -79 -537 -279 -94 42 -124 -81 118 281 421 -15 39 343 115 -162 -269 -159 53 -144
1822 -144 -266 -185 -63 104 -87 -188 -74 230 185 -224 -95 149 224 15 -47 80 256 87 -196 -163 2 51
1844 51 -187 -436 -142 181 -29 -216 41 296 407 90 74 199 200 18 -266 -215 -151 -128 -298 -462 -153 17
1866 17 -65 -96 -5 313 257 54 122 140 249 105 -98 -40 83 79 -137 -206 84 157 -52 -255 -194 184 44 -42 -80
1891 -80 182 365 183 -68 89 173 61 45 -227 -54 59 -237 -443 -165 108 46 -10 -43 159 340 170 106
1913 106 204 153 149 -194 -153 -102 -75 -141 -218 -78 44 89 -42 15 156 266 139 -123 20 187 185 -104 -110 66 162
1938 162 -35 -148 -84 43 -36 -252 -116 -35 96 -57 -111 107 380 158 71 -44 204 96 -23 -173 -294 -73
1960 -73 -94 -267 -243 -15 177 -48 -107 100 278 173 151 -14 117 139 62 -115 -113 -65 21 -233 -85 61 72 -164
1984 -164 -199 -50 92 148 -57 3 137 236 30 50 52 166 89 -46 -179 32 -57 -172 -216 -175 -25 118 -137 114
2008 114 211 191 93 4 194 204 31 -308 -97 -25 -114 -248 -115 -48 98 99 -30 49 194 160 -13 -78 86 117 -46
2033 -46 -67 61 36 34 -69 -123 34 12 -1 -181 -68 66 95 12 -89 23 272 15 -13 5 129 140 -91 -198
2057 -198 -193 -9 -129 -212 -155 53 89 -17 -33 131 180 94 45 3 75 41 -58 -50 -19 100 -23 -89 -66 6 63 -70 -15
2084 -15 22 117 91 -44 98 163 58 7 -113 62 57 128 -116 -29 16 -17 -197 -255 82 142 5 -77 -11 172 330
2109 330 82 66 85 120 -73 -155 -88 -26 -54 -148 -291 -7 -24 -62 -48 81 165 219 18 -3 79 26 -109 20 -95
2134 -95 107 51 -121 -179 43 101 -4 -79 -91 105 26 57 3 22 179 134 -27 63 49 13 -86 -90 0 -64 -131 -270 -2
2161 -2 62 23 32 -47 238 270 56 18 59 99 71 -42 16 -111 -9 12 -10 6 164 63 36 11 82 215 47 87 -10
2188 -10 108 103 -15 -42 27 108 -89 -176 7 83 -86 -164 -95 15 -12 53 -34 84 121 96 -97 -11 47 83 -56 -138
2214 -138 -79 -26 -31 -199 -11 58 28 -31 -61 133 181 89 92 -69 41 -35 -109 -160 4 -117 111 -57 83 114 -10
2239 -10 9 -121 65 117 -75 -10 27 44 192 -21 -59 -25 72 -43 -125 -133 121 17 -82 -32 45 -5 2 -8 30 50 146
2266 146 84 31 -16 -25 -105 -81 -59 -20 2 -105 -105 -108 -7 38 -31 85 110 84 34 -103 29 52 116 -84 3 44 -1 -58
2294 -58 -85 44 133 -2 -134 -28 17 102 -77 -26 165 107 27 -17 154 167 71 -73 -101 -127 28 -190 -85 -106 -56
2319 -56 35 61 -88 107 124 123 -110 -31 7 -104 -62 5 1 -4 -174 -59 -29 22 25 -54 83 -45 15 9 -4 -5 34 101 -45
2348 -45 90 -14 -42 -3 -35 -35 12 -1 -182 -124 47 55 -34 62 97 123 140 3 -32 61 -15 79 -143 -69 -82 -127 -119 -80 28
2377 28 76 2 -45 149 77 -7 -25 8 106 61 -50 86 -79 -44 -16 -20 24 117 -28 -20 -131 -15 76 37 -137 8 76
2404 76 16 -99 29 14 139 15 -90 -108 -106 59 -101 -20 61 -35 91 55 9 36 128 9 -115 11 41 67 -9
2429 -9 -78 -114 -76 -12 -142 -102 53 47 -48 -9 -26 109 59 -105 -23 46 60 82 -61 5 -104 -6 -21 -29 56 -63 -82 -69
2457 -69 35 42 -30 55 108 108 22 66 31 -16 -47 -63 -205 35 4 -10 -2 19 91 59 25 34 -17 105 33 -62 104 10 17 -34
2487 -34 -111 -50 23 -3 -110 -44 13 41 -96 -116 34 64 115 74 48 75 53 105 -11 27 -36 89 -130 -71 -5 89 -35
2514 -35 1 54 72 0 48 53 6 113 -19 3 -87 -15 -76 -76 -140 -44 -137 6 47 25 116 61 47 39 100 1 -65 -35 30 -71
2544 -71 29 -120 -45 13 -54 -71 23 48 64 -105 -14 -26 58 -90 -7 -57 58 11 10 -136 -24 -29 -30 -139 -124 2 30
2571 30 36 -110 -67 5 35 -18 18 24 37 53 -63 15 -1 16 -79 74 44 -37 -47 10 -23 11 145 90 35 100 134 -31 10
2600 10 71 23 8 80 23 116 11 -39 8 -49 -61 131 28 -14 117 -76 174 -31 -56 1 58 -37 116 -11 -29 -34
2626 -34 -46 -112 -26 -47 -72 -100 32 69 -79 -22 59 118 -53 -12 -36 49 85 17 -100 -18 46 115 -32 -19 -31 -1 -82 -31
2654 -31 -12 -1 -1 77 51 14 -33 -96 -80 25 -21 129 -40 24 49 70 -71 -125 -7 -29 12 1 -43 4 73 51 76 44
2682 44 46 -6 -92 -25 102 -12 -27 -21 35 -40 13 -10 -113 22 -41 23 74 -95 -71 4 -76 -114 -39 -44 -24 42 75 -12 -140
2711 -140 -19 11 -129 -84 46 38 26 80 -107 110 40 6 42 39 -70 -19 -35 21 -80 -35 86 -38 -31 -112 151 46
2737 46 -77 -56 -25 15 -48 -57 -38 -69 -4 36 -54 118 -38 23 90 -78 17 85 -39 -22 -60 -45 -43 45 -90 -85 -6 6 7
2766 7 15 -66 -10 64 -74 65 -76 -89 -13 21 12 2 68 -8 -70 24 35 -42 16 -37 67 -119 29 -2 25 79 -27 16
2794 16 6 -122 104 61 -82 5 8 -44 44 -28 -110 -10 -24 49 -46 -70 77 48 10 -2 3 -40 34 85 -76 -61 83 43
2822 43 -103 -60 -23 -39 0 48 -30 -47 48 56 -22 -37 -55 21 101 -25 -38 18 97 -42 -23 63 -71 230 -77 114 5
2849 5 -59 28 -20 21 32 74 15 3 9 33 -53 -13 -17 32 -33 31 26 10 85 -10 36 68 64 2 -111 -20 204 6 -5 -109 -64
2880 -64 24 136 21 133 89 31 90 -28 -18 72 42 47 -19 -80 -58 33 6 1 99 -25 7 4 79 57 74 -63 40 12
2908 12 73 0 62 18 -5 20 -16 92 81 -18 -51 -28 -50 126 -16 -28 50 -17 40 90 -4 55 143 23 -55 -101 94 11
2936 11 3 -69 -54 34 -63 -145 8 32 -67 83 -44 125 59 132 27 46 -43 -52 4 117 32 -13 -47 16 -101 49 -54
2963 -54 131 -82 -19 139 24 140 -19 5 -45 -19 -45 26 9 -6 -66 -100 76 -15 -24 152 0 -5 59 45 59 0 -33
2990 -33 21 -88 -7 -96 -129 -71 7 16 -52 -36 21 6 -113 -35 3 68 87 40 138 19 65 -57 112 8 -36 63 -20 40
3018 40 120 43 -32 -53 -59 -9 -73 -58 -119 -40 5 -33 47 -92 52 23 -7 35 -46 76 92 0 102 82 -45 15 1 7 4
3047 4 4 -25 -4 5 -46 -87 19 118 -101 -31 -21 -103 -23 -70 -42 -26 48 -39 5 52 88 57 151 -18 24 5 -36 38 -157 -59
3077 -59 4 -15 -53 -119 -53 39 98 -45 -55 121 93 -35 4 -88 -96 -96 -58 -12 -33 9 -41 -43 -33 45 111 72 47 -18 -42 33
3107 33 39 -37 -56 -21 10 17 18 -66 -92 -4 -1 -127 -2 -41 5 -14 -28 -4 -1 -41 -17 -33 -25 91 -5 19 31 8 23 -110 -103 -16
3139 -16 5 26 -85 23 159 128 60 97 18 38 -78 -118 -29 25 -132 -48 49 -76 54 -64 80 68 -86 43 25
3164 25 34 9 1 -57 44 -43 101 45 -27 73 103 31 99 -130 -212 -29 5 132 -61 -98 36 -59 -23 -36 71 9 -59
3191 -59 -32 -60 7 83 -93 -9 -36 1 34 -33 6 65 -30 18 16 86 -4 40 19 6 -65 -63 168 -71 -39 44 -139 -37 -40
3220 -40 88 22 72 -53 -111 -67 8 -21 -76 30 41 18 26 19 126 26 -16 7 26 70 103 55 -96 153 141 -16 -135
3247 -135 2 -2 -13 19 -50 126 -16 75 -35 -52 17 -58 -9 -30 11 104 39 -1 -29 -40 -14 24 47 6 18 16 -41 -28 37
3276 37 41 -9 21 16 -86 -73 -102 47 46 100 -179 -45 -74 -28 -120 -42 7 124 -35 44 26 76 50 -137 -17 64 69 117
3304 117 -20 -73 58 -103 30 -17 -12 -70 39 -23 -17 -68 -85 93 84 36 -27 -130 -64 -143 118 50 17 36 58 -47 -23
3331 -23 91 2 106 -58 101 22 68 -21 47 10 -27 6 -27 2 -72 27 -22 -45 34 -14 100 3 -57 33 -130 123 24
3358 24 58 -83 87 0 49 -72 23 38 30 -65 -4 -20 49 42 13 2 -41 34 46 66 43 40 2 2 -95 -63 -6 66 -33 104
3388 104 -48 113 13 -19 11 33 -6 -4 -24 -20 80 70 -134 29 99 62 -76 -129 -18 24 10 -124 45 -34 114
3413 114 -59 -26 44 5 -24 8 1 -50 20 39 60 -9 3 147 -13 7 -43 -103 -73 -57 -8 67 -32 -14 80 -36 -1 31
3441 31 -48 -61 13 -8 -72 -41 62 -121 -84 112 65 -33 19 38 -12 -92 80 -112 97 70 70 67 32 -86 -60 63 -93
3468 -93 -57 91 -134 21 41 132 2 -24 -5 38 25 -38 24 -27 -47 57 3 -21 -13 32 -48 -10 -60 142 -48 65 14
3495 14 22 -93 -54 -29 13 28 -71 -57 26 39 -2 68 -103 52 70 -10 8 14 44 24 -70 12 47 -42 -16 38 95 -164 -60
3524 -60 10 -52 -25 -23 -63 -7 -6 -76 -79 83 39 -20 -105 14 -7 48 -28 -17 8 24 88 -49 82 101 36 -8 -64 65 36
3553 36 4 60 72 31 -78 -9 26 -63 70 -46 -25 -34 -83 43 -160 77 -31 25 123 -18 117 9 -19 -106 46
3578 46 49 -48 61 -71 -76 4 -45 24 9 3 70 -34 32 57 8 60 -94 58 -62 -18 -80 -32 -68 24 -36 5 6 -87 -52
3607 -52 121 -22 54 87 83 -11 -47 -28 -41 -12 -34 21 -32 98 18 32 12 -96 30 25 -27 77 -25 3 50 1 -20 -53
3635 -53 48 -82 -69 -29 100 -104 -32 -43 32 34 116 46 -93 -81 26 -5 -69 9 49 53 72 56 -68 86 -86 7 -57
3662 -57 -12 8 -55 -49 2 21 -86 -29 30 -10 -72 70 -10 88 46 85 88 -65 -107 36 111 -85 6 -28 -9 64 92 61 -68
3691 -68 31 5 -25 2 40 -14 32 27 -138 22 -23 -51 21 28 -22 -9 -122 -68 1 -46 79 -88 35 -5 -24 121 -15
3718 -15 155 -16 95 -70 -10 27 -59 15 -183 20 19 37 -18 -14 -66 71 -58 -18 -40 -22 14 -12 -55 -43 -37 58 74 46
3746 46 -37 40 44 -13 -45 1 -26 -1 77 -15 15 -9 -1 -56 -110 -83 -39 17 -78 70 -20 78 20 67 35 -34 -20 -57 55 128
3776 128 -33 3 -11 16 -30 -83 -11 -128 107 -19 -2 31 -3 92 16 -20 4 -54 2 -25 -196 122 -3 -53 30 5
3802 5 30 -73 13 -29 -30 22 -2 -105 -18 -14 73 -12 79 -108 -3 -40 106 -102 -12 -7 -19 39 -83 -79 -29 62 40 -5 33
3831 33 -88 48 -50 27 41 -31 -108 -64 -15 -64 -45 -1 -16 -21 -18 42 -83 -176 84 62 12 -29 -86 65 79 81 -70 65
3859 65 196 -74 14 -34 -38 -18 -98 -17 -55 -79 50 17 13 -32 -58 -81 -60 -17 0 94 -8 33 -39 -64 -5 52 68 114 174
3888 174 -60 59 -36 82 81 -87 67 45 148 -9 -191 -25 -4 77 23 -63 16 -88 -78 46 48 54 -120 69 -18
3913 -18 22 4 -43 143 -35 -23 -68 -18 15 -9 129 132 69 40 2 39 82 -57 -58 1 -88 7 89 72 53 -9 104 -14
3941 -14 -20 12 14 50 169 -14 7 -70 75 80 -133 46 -6 76 -20 -39 -51 10 57 109 9 87 38 -23 34 45 90 90 58
3970 58 82 -11 -2 -1 -75 37 -79 -9 -15 47 51 -25 40 23 17 15 20 -18 68 2 33 94 -35 -8 35 -26 -23 -96 -7 34 -76 117
4002 117 7 76 -32 45 7 -36 82 68 -52 -32 113 -4 -82 -23 15 60 -19 -1 49 42 85 39 -42 -13 -47 37 11
4029 11 -93 -25 -27 -2 1 -5 -106 15 -17 50 8 -13 26 -62 11 0 -71 -7 -2 -151 43 -73 -19 8 -4 -61 83 -4 -24
4058 -24 28 35 69 -141 -18 7 -133 -145 -119 54 -36 -47 42 14 -100 -107 -63 37 -55 -65 73 8 -48 85 13 24 -6
4085 -6 33 21 63 27 -47 -22 53 68 104 33 -54 32 -48 62 64 -64 -69 13 36 30 -30 28 130 -39 -68 -73 12 -107 1 -20
4115 -20 46 60 -32 53 -67 -62 58 28 -19 12 16 21 -40 6 109 -33 12 -62 -24 -40 -30 -67 -78 96 7 -17 -45 -63 40
4144 40 14 -24 -41 90 -93 -52 52 -46 -51 39 -34 20 151 -1 -28 -19 -64 11 73 -24 -127 47 -21 108 8 -14 27
4171 27 48 51 -24 41 40 56 165 -75 95 17 61 35 -41 -75 -66 65 -3 -4 -36 32 -10 -124 -65 -43 -3 14 47 77 -1 125
4201 125 63 7 -4 28 -10 90 -34 9 -56 9 -1 -66 19 21 32 52 -58 5 68 -15 -34 78 25 -68 54 15 74 37
4229 37 6 -16 -31 -3 39 -24 -91 -6 38 -21 -13 -38 -39 -53 -12 65 101 103 -17 82 64 -49 42 -4 3 12 79 32 48 101 -92
4260 -92 -78 21 23 133 60 -9 43 165 25 40 1 62 -41 52 20 18 12 0 9 94 -79 95 4 14 -42 45 4 -12 99
4289 99 -7 -17 46 -47 167 -128 21 89 -1 26 -2 72 34 80 -14 105 68 -31 39 28 -150 -21 -27 -70 118 -18
4315 -18 43 78 -93 36 -74 107 -8 38 11 5 10 109 30 68 52 -96 -64 55 187 -87 -17 -46 111 -1 -62 22
4341 22 3 101 75 107 91 95 52 -14 -19 6 -67 101 -15 74 -73 3 72 -60 -49 -7 4 26 -18 67 86 50 36 -28 60
4370 60 33 -4 73 94 29 47 0 -20 14 25 -105 30 -21 56 -21 96 34 30 81 -109 55 -25 37 -60 5 -16 -84 -53
4398 -53 0 59 -132 -17 34 -79 -5 -65 -22 -40 -12 40 -46 50 80 -45 -11 45 -35 -105 -44 -8 -34 -1 7 -27 57 37 33
4427 33 42 -1 14 -83 -23 -36 -3 -39 -58 54 -44 26 121 85 29 -36 -47 171 -104 14 38 -17 -75 -36 -79 32 -15 61
4455 61 172 -25 37 105 -11 51 20 31 21 2 82 49 -72 -60 -24 33 -24 9 82 13 -30 -36 32 -98 29 11 25 -17
4483 -17 -76 81 24 -45 0 83 17 -56 -43 -87 -14 -26 -25 89 10 -35 58 -40 63 -11 -10 -19 -11 -12 -79 -35 11 -91 28 9
4513 9 -23 62 -15 54 -99 99 -10 -18 50 -1 107 64 3 -11 -78 -21 -55 -3 -71 -2 120 -40 27 121 -13 58 -19 -37
4541 -37 -13 -71 -25 -45 203 96 11 -16 33 -80 59 -59 -100 49 61 -2 -77 -72 -71 21 -60 29 -48 26 69 -9 -106 -28
4569 -28 98 42 100 -51 -30 40 -3 -67 -27 10 29 -79 15 81 27 14 8 -50 39 2 115 128 25 -16 8 -152 -3
4596 -3 12 15 -70 17 -27 57 131 -8 87 -98 -113 -77 74 -43 -46 -78 -17 73 63 -109 60 38 -113 -96 26 -59 63
4623 63 -22 4 179 107 26 29 43 65 -48 -176 47 -64 -24 45 -29 -49 -68 -26 71 -81 25 -7 74 -132 -52 -58 -27
4650 -27 70 5 -43 27 -61 -142 28 -13 75 21 131 35 -31 115 50 7 48 9 41 -20 34 -125 -81 55 -80 62 23
4677 23 -78 -71 -2 -2 -25 -4 32 68 -64 -23 -81 -75 11 139 -142 -1 -81 -108 -27 -106 44 59 21 11 -63 60 18 27 45
4706 45 23 -32 97 -93 50 -58 39 97 -5 -174 51 101 76 -5 -90 13 -136 1 111 -56 -47 16 -52 50
4730 50 -80 69 -53 -34 63 40 -57 11 -96 24 -39 68 18 -37 -55 78 14 102 -17 64 -68 -38 -27 -43 107
4755 107 87 16 -23 87 5 89 -45 -83 -36 71 -87 8 -17 -9 -25 -95 -17 -111 13 43 -169 -42 46 -5 45 -10 27
4782 27 -4 -38 -31 50 8 -26 58 2 49 -50 12 33 -129 -10 25 -55 -34 43 -43 -5 -3 -9 -12 -43 45 34 26 -5 -10 29 18 13 66
4815 66 -16 -60 -64 52 83 4 -17 -84 -25 56 25 -48 14 -16 38 -33 -70 25 -44 -105 17 -56 3 -14 86 -60 10 80 18
4844 18 -49 -50 50 19 39 50 -4 -67 2 -47 -49 -78 -5 -95 24 52 46 57 36 -5 -107 33 124 -47 93 -14 38 73
4872 73 42 84 15 53 -47 -47 -21 124 -40 -60 50 -81 -17 -124 -6 -71 203 18 -31 59 -4 25 26 -5 37 70 -37
4899 -37 113 50 103 51 -134 -4 36 28 57 112 9 -23 15 8 2 -7 35 -35 14 9 10 11 68 -32 116 4 18 38 64 53
4929 53 -46 -47 -9 13 18 115 143 20 22 31 -41 -84 2 38 69 -37 -30 -40 58 57 -31 65 84 -32 -51 -65 73 27 -16 22 70
4960 70 10 -10 -39 58 -5 28 -69 -89 5 78 -7 -41 -36 7 51 87 2 -28 9 103 -39 -134 -72 -13 73 -26 -46 -55 43 -41 24
4991 24 68 -37 -138 3 -14 13 -59 77 -23 -27 29 3 13 167 33 -11 -15 74 -138 -18 -19 -40 -47 11 -67 -36 25 4
5019 4 54 48 70 24 35 -83 87 -39 -29 -55 -67 -38 32 36 33 -35 42 108 -94 -4 58 18 31 -40 58 -8 35 0 -45 -36 95
5050 95 -28 -81 -77 -38 4 -5 28 42 -54 -84 34 21 -91 70 4 -117 90 -58 34 17 11 38 35 -78 -55 35 52 24
5078 24 -16 6 -2 3 42 8 -14 65 -62 20 -54 59 -36 -39 71 25 31 18 -73 48 -57 -105 -57 16 -57 52 37 62 24
5107 24 19 77 69 21 12 -83 -143 33 12 94 4 104 34 108 41 19 26 39 137 -7 1 57 -65 -65 2 82 -88 -29 78 -21
5137 -21 -60 -50 52 -61 137 -70 -13 -20 49 119 -25 95 98 -19 -53 38 -55 -54 48 5 -44 -48 -9 5 14 -108 -1 14
5165 14 1 -17 -23 34 38 69 32 -71 -61 -42 30 -44 -5 119 50 1 -96 -35 -28 6 -2 60 16 -12 2 -43 43 55 -58 15 -12
5196 -12 -97 -10 -75 30 -6 -11 -13 78 21 -23 -23 32 45 -65 9 165 -42 7 -78 -75 64 21 -50 -42 -11 -50 -40 -80 81 56
5226 56 41 29 76 36 20 -72 59 32 -47 -27 30 94 41 -2 63 86 -15 -52 21 -41 14 -51 -47 -24 -4 7 57 -60 48
5255 48 -30 96 -75 6 21 30 60 -39 80 -65 67 39 -59 35 -72 -62 40 53 107 34 81 -38 23 29 -19 61 24
5282 24 -19 -79 18 36 -28 26 -2 -106 17 96 -54 8 -23 99 87 60 149 -8 33 19 -32 33 -39 21 67 -138 45
5309 45 62 -91 12 -58 -35 -45 -43 -26 71 -70 -59 -64 41 -132 119 -11 72 -27 23 28 28 54 -87 107 33 58 -14 -61
5337 -61 -62 75 3 -16 0 87 -79 -9 115 -24 -29 -113 27 54 63 82 25 86 17 -12 -3 -42 -163 9 117 20 37 24
5365 24 -39 -63 -26 19 46 47 -20 86 54 -85 -34 67 8 -11 -77 -14 54 48 52 28 -4 -6 -101 58 -5 -34 113 32 1 -12
5395 -12 -3 -28 45 -15 17 100 -21 -40 -45 5 63 -98 37 -12 26 -52 -57 -43 -38 77 -79 57 28 93 12 -53 134 70 29
5424 29 100 7 -104 -70 64 -32 -12 28 33 0 -100 -106 -60 -11 -6 61 70 -142 11 16 52 -26 -19 76 71 -55 -127 44 -28 107
5454 107 -184 69 -76 68 -32 -113 -4 4 8 -26 45 121 19 -77 114 138 74 -82 -49 13 55 21 -78 -17 67 54
5480 54 21 -26 -44 87 26 82 44 -90 -16 60 0 -20 29 84 -62 15 -96 115 15 134 22 -25 -23 12 -117 -22
5506 -22 65 57 54 -3 -102 -89 -2 16 -117 -90 11 39 -51 -16 -25 -9 15 97 65 -60 12 -2 73 10 -41 62 5 -56 -8 -67
5536 -67 58 -78 64 41 46 -117 16 174 -52 0 -111 43 26 106 -48 3 21 32 54 -106 98 50 -60 -73
5560 -73 85 73 -56 22 26 -10 -10 -17 -7 -76 -54 73 18 36 0 7 -39 118 77 -49 13 -69 -50 136 97 66 67 40 -9 8
5590 8 15 63 -68 3 -91 -6 -62 30 -33 -26 -50 31 -35 -38 105 -65 49 -10 38 3 -47 -71 -24 101 -70 39 -10 103
5618 103 -34 18 73 -62 55 -114 -24 5 47 0 143 85 -81 41 -4 70 14 59 120 61 33 -29 42 31 61 129
5644 129 -33 29 70 43 -42 -31 98 94 10 62 -7 19 60 22 -151 115 -55 -96 11 -54 4 -55 67 -40 -73 -76 58
5671 58 1 21 -19 -64 76 -22 -2 103 5 -48 61 -30 42 43 -40 49 79 46 -91 -53 -7 33 45 38 -17 -62 1 -32 -161
5700 -161 -76 8 -26 -91 20 74 12 76 -60 123 44 -79 86 15 10 86 61 37 63 -20 -71 -10 -10 -25 -46 -14 -20 34 110
5729 110 -123 -93 22 -17 -156 71 -2 -38 101 60 -62 -102 -82 37 -56 29 86 10 -40 -94 10 69 78 -7 -3 55 47
5756 47 -75 -142 11 -104 25 149 133 43 103 64 24 -2 -43 -106 5 8 44 -55 -5 45 50 -51 -9 17 26 7 -69 -22
5784 -22 77 19 14 184 -113 29 11 13 -14 -33 29 -102 -13 54 45 32 -36 -63 28 41 -46 3 -10 2 160 -23 5 11 1
5813 1 184 68 -25 94 30 -42 -75 -46 -38 -75 -107 27 -7 35 -14 70 20 -17 -45 34 219 -94 -55 19 28 -25 -150 39
5841 39 17 58 9 -46 31 24 -128 -94 -98 8 29 -57 33 62 25 48 -25 -80 16 -37 102 31 116 7 50 -128 -37 28 43
5870 43 -55 -137 21 22 129 100 -48 108 -12 40 17 -24 103 66 -170 27 51 42 69 9 -59 7 60 47 -39 80 -13
5897 -13 72 47 -15 -78 -24 -7 -48 30 -41 -42 33 59 -19 -44 87 35 6 -17 92 -34 104 9 -32 22 -33 -6 -24 74 -75
5926 -75 -70 59 -101 -31 -50 -15 69 -40 44 35 -74 19 -19 -7 -101 4 15 -52 85 -24 45 6 14 165 -86 -24 50
5953 50 -22 -10 -44 -24 22 -41 71 -12 -22 13 17 36 59 -40 -15 -139 -32 21 32 64 72 48 101 30 -72 36 -75 76
5981 76 -24 -143 57 -100 -83 24 24 -28 -53 18 -91 17 -28 82 23 -50 -3 17 -33 7 -34 63 80 -37 1 -37
6007 -37 -77 42 -20 -24 -42 30 -10 -62 39 15 -12 95 32 -74 69 3 19 -79 -54 -26 -32 -27 -36 -53 -77 9 66 -20 113
6036 113 90 -61 -32 12 -44 78 43 72 -94 49 -3 25 -30 -141 14 27 63 -65 -85 -57 45 -54 102 15 102
6061 102 -81 30 18 -69 13 25 -11 -80 -72 -76 41 -41 -47 9 -38 57 92 -11 4 36 -24 -7 -88 37 37 84 34 96 199
6090 199 -90 -91 -25 -51 -106 88 -12 30 18 -17 -4 18 28 -51 -74 170 -10 -52 70 7 68 -63 79 70 -8 70 -41
6117 -41 31 15 32 -79 4 94 -40 -6 66 -82 -6 54 11 33 28 -73 65 118 -96 80 -23 -141 84 -40 6
6142 6 -64 -66 -111 -11 12 -51 -136 -58 6 48 5 -26 23 -35 94 -75 -42 51 17 79 56 -55 -23 -11 18 113 -73 4 -13
6171 -13 -118 -116 92 -108 58 -75 -58 -66 -75 179 -34 -32 64 -63 48 12 -27 -11 10 31 -74 -30 -31 -11 -68 -6 -15 -50
6199 -50 84 -64 -77 -22 62 25 56 1 1 -73 -6 -37 54 -4 12 63 4 149 -72 12 -86 27 -23 -52 -2 -5 -16 43 -24
6228 -24 35 -41 -93 -13 -38 47 -139 -38 -9 127 -22 -55 -6 111 112 19 40 52 51 62 11 0 -48 -51 33 -12 107 30 37
6257 37 29 -111 -79 -53 -27 -19 31 -7 -22 -65 72 -30 -80 -14 -83 -27 68 106 35 60 -2 -37 12 -51 -22 -41 94 24 -34
6286 -34 -31 39 -37 49 -60 -130 0 -16 45 14 -119 -18 76 -6 18 -8 -116 -85 -26 -103 8 122 -132 -55 40 32 -6
6313 -6 47 -62 6 29 -44 -22 -24 -38 -63 31 -25 -25 -51 12 -83 98 -6 38 -72 66 -28 3 -51 -58 -2 -62 2 -42 -44 20
6343 20 -26 -66 -19 128 88 -26 31 34 16 13 52 27 1 42 -37 109 31 -45 29 -93 29 23 -46 31 -35 81 -39 62
6371 62 4 136 2 66 10 37 32 53 63 -35 6 90 -46 -20 -78 -17 70 59 1 50 48 -87 -22 -38 25 -98 12 44
6399 44 26 25 -8 -54 -76 17 -18 -49 65 -104 -26 53 20 95 -100 68 -36 23 29 6 -95 23 -7 -108 9 -59 -32
6426 -32 -15 -74 35 -89 2 70 120 -16 18 -71 -46 26 -13 -7 -5 46 43 -23 16 -23 127 -17 -41 -44 24 56 101 35 -30 19
6456 19 -41 10 -40 -2 49 27 73 -124 22 5 -11 171 12 79 0 24 40 -61 -33 -135 -10 -67 -38 -65 30 -25 56
6483 56 -73 30 -37 2 56 30 -93 21 -9 101 187 -37 3 32 134 66 -65 -23 -29 -39 13 -82 -54 65 20 -4
6509 -4 3 -68 -151 0 85 71 -1 -59 57 -115 53 -27 7 -86 -5 -9 -38 66 56 76 -51 108 -59 23 11 82 51 -19
6537 -19 31 185 -13 -9 -112 -62 -63 -10 -122 -31 59 100 72 117 -43 35 52 56 -20 14 30 -52 -51 -56 -64 -21 96 61 -1 6 73
6568 73 -44 -54 16 17 26 -28 82 -1 -44 -38 32 33 -2 -29 -67 -19 132 -75 29 59 56 56 -32 -65 45 18 106 13 -35 -27 27
6599 27 3 54 -28 -65 17 -53 12 -25 32 60 -5 29 -11 126 88 79 27 -6 -48 -42 50 -95 130 -57 10 92 -33 -29 21
6628 21 75 -15 -82 -31 -36 25 30 -36 53 57 112 33 50 30 -74 -26 -81 31 16 -23 -26 63 -36 -62 71 -23 105 14 9 -182
6658 -182 -38 -24 -7 -51 -70 14 6 -65 -71 -12 3 -15 28 -48 -3 -14 29 -71 -39 18 -3 -75 21 -7 -59 -62 -38 -11 -118 56
6688 56 -26 83 74 -26 23 -123 -91 42 65 32 -71 74 -44 -1 82 -61 77 68 104 -47 11 -46 -31 8 -72 32
6714 32 -121 -13 -3 49 44 49 -8 28 10 56 18 28 -46 -8 -37 29 86 76 -96 -72 -27 -1 10 9 -37 13 36 -49 29 65
6744 65 -53 4 -106 -29 75 -21 -5 13 -50 16 -36 -56 67 -22 -10 -85 -62 -4 130 33 -99 -18 -61 -67 -43 -43 5 13 76
6773 76 -43 88 -26 -5 32 -13 -77 27 -36 -35 -7 68 39 -53 61 21 -33 -52 19 -31 2 109 66 15 -40 32 -25 4
6801 4 -43 35 -5 -72 78 2 12 -100 69 -13 -28 -21 -20 62 51 -15 -71 86 -30 0 102 33 51 -16 83 -6 -16 23 24
6830 24 76 -35 -5 55 -17 -148 -38 -54 61 99 -40 46 -16 -106 18 -67 -60 6 12 40 -42 -68 -87 -124 74 -80 -44
6857 -44 152 23 16 -41 -9 -96 -82 99 -22 11 -8 -27 -66 79 39 -45 144 -34 89 7 32 12 -29 -45 96 39
6883 39 -8 30 -38 -22 23 29 -143 -39 84 -99 14 -3 31 13 23 -107 -66 55 73 -27 -41 73 142 -12 -26 62
6909 62 -10 3 74 -26 46 23 -13 -43 -49 28 29 -2 -132 100 80 29 80 57 -62 57 11 18 -8 -58 16 -54 -149 -7 18
6938 18 -113 67 -43 6 -49 100 45 39 -5 30 4 69 -11 -134 -37 28 -57 89 69 85 27 -77 19 -6 44 65 -12
6965 -12 59 25 -53 -42 24 21 34 -51 -15 67 36 -73 -26 -139 41 -5 -85 0 18 20 156 -77 43 -4 -145 -24 -18 -63
6993 -63 -36 -93 -27 72 98 -20 1 37 9 -26 66 97 -11 -55 38 -9 42 71 -16 -19 93 -21 -24 43 29 -24 80 42 22
7022 22 -40 -47 58 149 -148 -58 16 -133 52 6 11 28 -36 24 -59 16 61 5 44 -71 34 90 -111 -28 -15 -165 1
7049 1 97 -17 24 26 79 -58 -5 69 8 69 6 69 89 32 -23 -2 -21 -27 12 13 43 34 125 65 -99 -48 4 48 35 -40 -11
7080 -11 38 1 -160 132 112 4 -167 -87 -5 58 58 -29 -23 -1 -3 217 11 19 16 -58 17 72 43 51 -5 34 -36 60 18 38
7110 38 2 -149 -69 62 45 105 0 133 6 87 142 65 -91 -28 26 6 30 0 -46 -65 41 -52 26 -26 -10 25 72
7137 72 -33 -50 -9 -10 81 -70 75 52 26 126 -40 -26 -121 16 109 70 37 -11 -15 -53 -137 68 79 43 -66 5 3 -83
7165 -83 -30 -44 -59 31 -83 78 6 -39 22 41 -8 24 56 57 5 -164 75 72 69 -19 -45 1 16 -6 -29 -72 96 -55 -117
7194 -117 -184 -25 42 14 -57 33 -41 86 0 -80 -53 -16 24 -4 68 58 6 -23 -36 -45 15 -57 6 -27 70 59 -108 -25 -76
7223 -76 -38 -15 -18 -37 -70 25 -2 -55 25 23 -79 89 18 -21 18 -74 -26 -37 102 -18 10 -16 61 50 41 134 5 -17 61
7252 61 -5 14 -78 -26 -6 103 58 -101 -98 1 99 -76 -24 86 50 102 -49 -58 10 -44 -57 -151 -16 -11 82 32 -9 71 24
7281 24 -83 -118 -11 70 0 71 -4 75 50 2 29 -34 -45 -30 -83 -52 86 38 -15 21 77 -85 29 -56 -20 -6 1 -29
7309 -29 -147 -107 -34 -122 51 18 -110 36 74 47 10 -13 15 -21 -24 3 13 -25 -38 -10 -150 67 25 68 81 -100 -7
7336 -7 -20 -20 52 53 66 8 -3 -53 -18 -24 -29 55 -46 109 0 -89 -13 -45 -44 -117 73 43 38 0 18 40 -12 -54 37 -49 -45 13
7368 13 64 -43 31 -72 -44 -112 57 9 74 32 -57 -33 -125 -93 -6 -56 -94 7 124 26 -19 -83 -38 -7 -51 -37 -12 -17
7396 -17 26 -69 4 -3 -11 16 10 43 -22 77 40 29 -24 -70 46 -45 33 16 -27 -14 15 11 43 -64 -54 1 -66 64 -24 20 -23
7427 -23 -126 -15 37 -54 92 -38 72 9 27 29 141 -60 -29 37 -52 -64 -9 95 -124 15 51 5 43 -27 -89 11
7453 11 -4 -49 45 42 29 11 128 200 62 -33 23 -172 -48 66 26 -61 4 91 -32 50 29 27 59 -9 -36 -81 64 87
7481 87 41 -50 -82 61 -61 -65 -115 -35 119 -92 -84 42 -1 -105 25 79 87 23 130 62 -29 53 -39 0 -40 -32 14 55
7509 55 -118 52 -46 48 99 -14 87 72 -44 88 -67 25 -27 -25 -11 -8 -7 21 47 -98 40 -49 -104 -26 102 -101
7535 -101 75 26 -120 23 121 -19 113 53 -123 37 -28 100 -130 -173 46 20 -33 -81 -15 -211 -67 -59 47 -48
7559 -48 -23 35 -99 67 -120 -15 -43 -76 2 38 -20 33 108 80 -179 20 107 104 7 56 -55 66 -94 106 85 -6
7585 -6 -175 23 10 -91 75 6 -49 -99 9 22 -66 69 -18 -57 -30 28 34 46 -21 -79 -61 24 -75 26 111 -23 19
7612 19 11 -28 -11 -3 -33 -21 -85 -16 70 87 44 4 -32 39 69 2 -112 118 28 -10 -44 21 7 -24 -109 -2 59 56 37 -67
7642 -67 51 -39 -83 43 3 39 26 -67 -57 71 -42 -119 8 -89 -49 -25 -7 12 -45 47 12 81 74 44 109 47 78 32
7670 32 -36 23 7 19 16 17 -75 -8 60 -45 -77 -80 81 4 90 -67 85 -93 52 -24 -9 -47 16 -27 -10 -37 37 199
7698 199 -51 54 26 -136 75 -53 -26 22 35 11 96 -16 -34 56 -2 -1 -68 -52 -146 20 -52 100 17 -130 67
7723 67 10 12 -31 16 -43 18 -66 -43 -52 -43 6 2 -89 -16 -1 57 5 87 7 25 -45 58 17 22 20 51 -82 38 11 -23 -1 -147
7755 -147 -38 -16 29 125 -37 75 39 101 -91 -30 12 22 99 -37 89 -32 102 108 -36 -124 35 4 -105 -12 -6
7780 -6 -6 -61 15 0 88 -57 3 43 22 161 53 -143 -41 18 -54 86 0 23 -127 -5 69 -4 93 41 -62 -8 -50
7807 -50 122 -46 -32 -10 -16 -5 -90 38 -92 -34 12 -20 -16 90 -20 143 -24 -33 -11 92 170 114 2 -19 31 -31 74
7834 74 -24 -6 -61 12 9 -40 15 -64 40 23 -9 74 -109 4 -55 -8 7 0 25 -2 94 -159 -21 -197 -44 -3 67 -163
7862 -163 58 112 -32 -58 -17 39 0 2 -41 4 -42 30 85 -13 -55 40 122 -66 -92 11 -73 -62 -52 -42 107 -53 -61 -67
7890 -67 -3 2 -25 -41 -59 62 19 -32 -59 6 8 19 43 14 -50 102 44 119 -77 -90 16 95 -12 -5 -14 -41 92 150 -15
7919 -15 35 -37 20 117 -59 -70 1 88 7 -117 -5 143 -85 5 -89 -44 -68 -37 48 24 -24 -28 -10 -45 -1 -55 -63 4 -106
7948 -106 -37 19 -29 -39 67 43 -77 35 -82 17 7 78 -124 156 -4 35 -7 21 -22 19 24 68 18 -38 24 -65 -58
7975 -58 0 -107 94 -45 39 -40 97 -130 -146 -108 11 -82 70 0 12 1 -34 63 -46 126 151 7 -53 105 49
8000 49 -56 -60 -101 -51 67 -31 -30 6 -9 109 -50 20 4 -31 -53 24 -40 -36 25 62 -51 26 35 -140 26 -58 6 -70 32
8029 32 -29 32 -33 84 42 -87 19 -3 -76 38 -13 -153 12 18 35 59 70 25 -46 -40 -12 -41 -14 -29 18 4 -33 8
8057 8 24 -41 -57 -146 -2 50 72 -24 -35 -7 48 -10 -244 90 23 -49 50 81 -9 -32 31 34 -59 -62 52 -53 -18 68 -3
8086 -3 -45 38 -29 -117 -11 63 33 -19 -110 109 -65 65 29 40 29 -100 -106 10 -110 81 136 28 -120 -81 4 76
8112 76 43 26 47 -40 29 71 11 98 31 40 -93 -13 44 22 -66 32 -38 -34 105 5 5 43 10 -3 147 90 46 59 -11 5
8142 5 73 81 -25 28 32 -23 13 23 4 59 -42 11 69 -72 44 80 -36 21 82 44 -20 75 25 51 73 -129 -18 -15 21
8171 21 6 -119 -12 26 -57 0 27 -93 -8 90 30 -76 -33 -74 -96 20 7 13 18 43
8191D3
$$ Imaginary data points
##PAGE= N=2
##DATA TABLE= (X++(I..I)), XYDATA
0 0 0 0 0 0 0 0 0 0 0 0 0 0 0 0 0 0 -3 8 -8 8 -8 8 -16 16 -16 24 -24 26 -32 39 -40 48 -56 63 -71 80 -88 98
38 98 -109 122 -137 152 -168 186 -206 227 -251 276 -303 335 -369 407 -449 494 -547 605 -673 748
58 748 -838 943 -1072 1226 -1423 1681 -2034 2550 -3382 4949 -8951 44520 65240 5798 17073
73 17073 23320 4101 -40479 -53749 -41250 -24135 -33525 -42836 -27290 14264 25918 4420 2497
86 2497 33267 40807 17705 -1874 6028 19546 13135 -7477 -13177 -872 10362 -4450 -28647
99 -28647 -23631 -2669 -9960 -31519 -29418 -4590 11106 6337 4218 20855 40733 43675 25084
112 25084 8545 16533 19014 -11656 -40173 -35904 -22580 -27750 -40137 -31552 -3897 15252 16281
125 16281 12283 22012 42247 39375 11092 -489 10808 9501 -13301 -29689 -20937 -5927 -9059
138 -9059 -20086 -18161 -1850 11065 2254 -11845 -1006 18604 14479 -1930 -84 18897 24914
151 24914 9468 -697 5336 11063 2624 -17944 -28668 -16718 -9470 -23943 -31699 -12828 10496
164 10496 12782 5577 15306 33535 36169 22184 7196 4784 9547 -2996 -28167 -32836 -17637
177 -17637 -11683 -22257 -24353 -4719 13673 12212 5560 9273 20867 24918 10799 -3543 2794
190 2794 12596 3195 -13692 -13383 1111 2332 -12554 -18002 -8616 -918 -4402 -14049 -12517 4713
204 4713 13779 5429 1710 15702 28949 20450 4342 4283 10041 2330 -14585 -25641 -22243 -12873
218 -12873 -15936 -24325 -15962 5359 15559 8844 7780 22387 29809 18207 4751 1975 5210 1689
232 1689 -13095 -22664 -14145 -3950 -8477 -17548 -10970 6011 8159 -2521 -2991 7621 13626 8804
246 8804 28 2176 13158 14033 2236 -4884 2343 7959 -4146 -18209 -14845 -6451 -8842 -16153
260 -16153 -15691 -3385 8930 8813 4592 11131 23529 23681 9044 792 6410 5252 -9313 -20118
274 -20118 -18287 -10730 -9349 -14968 -13596 -16 11246 9140 2279 7477 18987 15219 1503 -1427
288 -1427 4490 5542 -2742 -11002 -7940 363 -186 -9042 -11987 -2686 4151 -3667 -10786 -2391 7735
303 7735 6984 1376 2606 11696 16247 9245 855 914 5445 767 -13534 -18205 -9634 -6251 -12714 -14137
319 -14137 -4574 7175 9797 6016 7797 15591 18652 10246 -1054 -823 4202 -2841 -14774 -15052 -6883
334 -6883 -3532 -7981 -9937 -2246 6617 6663 858 29 8010 12127 3416 -3083 2817 8798 4243 -3892
350 -3892 -4179 1842 1875 -5823 -11521 -8666 -2373 -3367 -10620 -8245 3845 8827 4510 3541 10874 16622
366 16622 11774 3004 284 2039 145 -8875 -16769 -12925 -5172 -6993 -11692 -6117 5138 9540 5614
381 5614 4226 9956 13279 8965 759 -2294 2386 2717 -6239 -11051 -4887 565 -3091 -8644 -5951
396 -5951 1683 2318 -2516 -4199 848 7160 6071 42 2155 10217 10546 2608 -1745 1860 3408 -3762
412 -3762 -11308 -10757 -6532 -4936 -8459 -9436 -923 8070 6996 3429 7011 13640 12495 3544 -859 1195
428 1195 764 -4909 -11185 -10941 -4549 -2232 -6688 -6818 1110 6969 4097 -495 2812 8242 6437 555
444 555 -1159 1992 5101 1379 -4754 -3302 2247 1195 -6026 -8441 -2791 186 -4312 -6951 -2592
459 -2592 3792 5638 2933 2303 8037 11530 6429 -491 -494 2600 -1189 -9708 -11168 -6256 -3726 -5425
475 -5425 -6727 -2089 5569 7842 3861 3245 8097 10141 3970 -2603 -1136 1838 -1611 -6931 -7388 -3153
491 -3153 -16 -2374 -5517 -2257 3361 3140 -1828 -2314 3733 6139 1356 -803 2737 6189 4875 -368
507 -368 -2274 764 1543 -3921 -9126 -7057 -1833 -3051 -6944 -4017 3123 6361 4619 3324 6304 10095
523 10095 7359 716 -2132 -112 -125 -6189 -10556 -6621 -2135 -3115 -5114 -2544 3140 6010 3490 1269
539 1269 3691 6918 4779 -866 -1968 2436 2699 -2700 -4646 -1781 900 -1115 -4857 -4923 -1027 527
555 527 -2322 -4432 -316 5305 4176 670 3008 7435 7146 2482 -1018 -78 928 -2722 -7814 -8433
571 -8433 -4258 -2092 -4903 -5375 914 5982 4889 2563 4077 7412 6621 1552 -1806 -736 701 -1991
587 -1991 -6501 -5926 -904 -89 -3517 -3716 472 3441 1576 -1279 70 3506 3935 956 -1035 2046
603 2046 5224 2238 -2044 -1086 1697 187 -4263 -6109 -3350 -1154 -2723 -4318 -2228 2979 5201
618 5201 2471 1764 5808 7439 3377 -934 -997 575 -1375 -5866 -6914 -4049 -1154 -1907 -3796 -1035
634 -1035 4323 4877 1573 1049 3992 5064 1392 -1853 -1015 1199 403 -2670 -3743 -803 1629 -1215
650 -1215 -4028 -2011 1126 593 -2483 -2125 1704 3432 1978 457 1993 5007 4385 66 -1817 397
666 397 487 -3481 -6471 -4853 -1566 -1807 -3480 -2049 2109 4976 3811 1757 3456 5973 3982 -665
682 -665 -2253 -285 -123 -3819 -5638 -3173 -499 -591 -2313 -1821 1679 3602 1260 -905 1091 3778
698 3778 2457 -815 -702 2309 2480 -106 -1869 -1120 906 -539 -4092 -4304 -1504 -192 -2369 -3352
714 -3352 192 3748 3164 1519 2437 4685 4828 1684 -1416 -826 277 -2131 -5529 -5385 -2006 -642
730 -642 -2642 -2439 1097 3698 3219 1309 1531 3652 3690 273 -1885 -540 1230 -559 -3472 -2511 475
747 475 367 -1792 -2613 -834 1274 256 -1982 -1113 1884 2813 850 -219 2540 4125 1937 -742
763 -742 -763 446 -282 -3162 -4779 -2872 -943 -1505 -2760 -1115 2860 3955 1708 1351 3563 4111 1741
780 1741 -1143 -1544 -103 -780 -3225 -4261 -1891 447 -670 -2285 -220 2634 2441 221 -342 1437
796 1437 2565 789 -1141 -468 1561 1692 -928 -2070 183 1135 -1265 -3061 -2070 -158 -147 -1851 -1688
813 -1688 1005 2874 2112 723 1715 3985 2982 -309 -1452 -347 -270 -2576 -4355 -3302 -961 -558
829 -558 -1640 -1151 1725 3697 2323 604 1856 3257 1862 -952 -1797 -189 127 -1642 -2919 -1751
845 -1751 181 390 -1695 -1694 801 1530 -221 -1255 203 2175 1632 85 303 1881 2573 730 -1336
862 -1336 -884 541 -848 -3535 -3431 -1383 -520 -1492 -1958 516 2764 2704 1511 1469 2947 3274 540 -1617
880 -1617 -917 -112 -1594 -3551 -3150 -838 27 -1141 -1166 463 2302 2069 16 127 1994 2033 -72 -1126
898 -1126 201 1443 205 -1480 -1082 253 389 -1313 -2517 -1297 343 -386 -1916 -813 1665 2304
914 2304 938 530 2152 2987 1530 -366 -989 -161 -303 -2540 -3632 -2002 -293 -792 -1571 -232 2234
931 2234 2395 1247 848 1722 2268 1001 -1299 -1285 144 11 -1780 -2312 -441 762 -389 -1559 -559
948 -559 1047 1039 -255 -954 556 1826 870 -500 298 1968 1650 -341 -1155 113 315 -1275 -2599 -2106
966 -2106 -556 -184 -1360 -995 1017 2594 1834 569 1446 2687 1654 -427 -1166 -651 -406 -1696 -2923
983 -2923 -2120 -154 113 -838 -707 1218 2329 968 79 968 1712 1018 -557 -1011 198 860 -393 -1478
1001 -1478 -853 656 211 -1581 -1742 -67 412 -557 -1021 -2 1652 1795 531 526 1839 2254 549 -1161
1019 -1161 -657 6 -1016 -2601 -2550 -1094 -269 -792 -923 434 2219 2087 758 644 2084 1945 -13
1036 -13 -1158 -597 -19 -703 -1879 -1795 -296 221 -587 -1185 -11 1219 799 -559 -170 1379 1351 433 -315
1055 -315 520 1551 721 -629 -913 4 12 -1414 -2383 -1179 -20 -431 -1287 -390 1415 1960 1004 671 1507
1074 1507 2135 1305 -647 -1076 -226 -511 -1928 -2359 -1130 84 -247 -811 11 1346 1672 749 42 859
1092 859 1533 565 -871 -570 523 283 -782 -1158 -137 511 -178 -1222 -911 104 471 -723 -980 554
1110 554 1521 770 82 631 1567 1554 -137 -728 -311 -102 -1029 -2242 -1726 -216 71 -853 -589 986 1989
1129 1989 1268 466 853 1427 1085 -361 -1148 -636 37 -936 -1815 -1093 155 358 -518 -534 655 1286 389
1148 389 -272 66 954 949 -241 -562 625 957 -110 -867 -568 343 -288 -1381 -1482 -553 133 -440 -803
1167 -803 79 1610 1550 652 573 1457 1586 144 -1018 -624 -283 -829 -1798 -1775 -596 331 -260 -608 421
1186 421 1670 1384 235 327 1029 957 -57 -775 -403 158 -58 -1110 -1061 25 555 -464 -1026 -344 584
1205 584 80 -521 -259 797 1249 559 43 611 1367 688 -473 -700 -83 -108 -1199 -1870 -1028 -259 -281 -607
1225 -607 -79 1041 1574 858 297 930 1349 548 -690 -818 -105 -254 -1273 -1429 -660 227 95 -691 -213
1244 -213 818 1121 67 -425 422 979 393 -465 -153 579 590 -90 -755 -285 329 -388 -1276 -1019 -28 157
1264 157 -528 -479 556 1250 907 312 487 1139 936 -206 -870 -486 -247 -888 -1606 -1150 -108 43 -362
1283 -362 -298 686 1392 877 141 329 786 589 -431 -1018 -266 268 -478 -910 -544 253 231 -308 -624 218
1303 218 677 121 -438 -114 884 931 89 28 633 952 128 -598 -524 -17 -356 -1087 -1247 -578 154 -86 -465
1324 -465 289 1259 1175 522 391 865 997 39 -834 -681 -263 -425 -1245 -1274 -238 306 -102 -245 257 1066
1344 1066 859 79 -110 390 636 114 -457 -115 647 178 -543 -721 -11 94 -518 -1034 -506 212 94 -332
1364 -332 -102 615 1182 601 74 502 1035 507 -575 -638 -335 -395 -989 -1291 -754 44 12 -237 -22 936 1163
1385 1163 556 206 587 852 295 -608 -454 -39 -90 -572 -880 -285 393 127 -572 -271 412 527 -89 -311
1405 -311 301 839 407 -36 103 699 556 -178 -594 -203 98 -491 -1055 -785 9 80 -246 -272 475 992 925
1426 925 206 284 828 632 -323 -786 -409 -182 -528 -971 -595 26 269 -75 -178 418 920 602 -165 41
1446 41 442 383 -212 -576 14 165 -139 -598 -360 32 211 -501 -650 -148 217 -19 -313 37 741 822 94
1467 94 313 529 615 149 -484 -581 -230 -351 -887 -937 -205 237 -17 -164 276 887 839 412 139 534 539 -206
1489 -206 -647 -613 -91 -122 -776 -709 -106 149 -56 -141 52 564 549 -128 -151 426 520 209 -239 24 530 281
1511 281 -498 -291 -173 -63 -436 -790 -400 2 61 -159 -23 644 969 531 142 388 567 296 -369 -510
1531 -510 -182 -209 -605 -776 -458 228 138 -233 -57 572 807 287 -70 220 433 169 -374 -344 165 147 -204
1552 -204 -529 -123 107 -51 -391 -356 149 202 -111 -209 258 640 581 -19 65 552 483 -136 -433 -231 -20 -412
1574 -412 -728 -595 -46 134 -109 -187 374 808 531 116 140 471 266 -275 -559 -219 35 -357 -665 -430 30
1595 30 223 -56 -210 211 549 176 -200 -69 428 307 -36 -251 82 271 149 -350 -447 130 45 -456 -484
1616 -484 -47 320 -41 -112 3 626 499 229 135 282 473 -13 -459 -472 -216 -151 -635 -558 -119 264 162 -2
1638 -2 230 534 601 145 9 135 327 -95 -425 -277 -57 1 -474 -386 2 253 -40 -190 -64 229 133 -121
1660 -121 -39 177 537 272 -1 100 466 119 -282 -392 -209 -63 -371 -560 -251 130 177 -62 -44 442 729
1681 729 367 141 279 261 83 -378 -480 -138 -27 -233 -535 -261 189 123 -106 -27 309 407 167 5 17 314
1703 314 257 -242 -148 29 168 -93 -363 -160 -29 -64 -308 -379 -37 185 -36 -60 102 541 466 81 128 364
1725 364 354 -243 -351 -259 -134 -291 -515 -479 -8 200 15 -162 259 543 338 39 28 328 195 -190 -301
1746 -301 -189 209 -133 -271 -175 -141 240 -90 -148 -44 202 94 -90 -103 182 319 123 -95 80 229 46
1767 46 -287 -200 48 -128 -326 -353 -110 123 63 -62 81 269 414 222 -25 149 178 19 -375 -170 -84 -46
1789 -46 -367 -273 70 153 135 -112 57 274 428 123 -110 155 142 -12 -293 -240 -43 4 -158 -309 -9 131
1811 131 -59 -178 -99 109 151 44 -139 195 192 255 -138 39 243 78 -231 -420 -151 -105 -406 -380 -317 64 165
1834 165 33 -11 268 480 239 -95 15 153 -62 -233 -555 -122 -9 -122 -340 -135 132 215 -43 -95 60
1855 60 166 88 -108 2 246 140 -10 -213 57 73 -62 -194 -161 -25 -5 -359 -247 24 287 -18 -126 134
1877 134 361 361 -30 70 178 115 -46 -255 -222 -44 -101 -403 -214 223 175 -14 -45 115 326 249 -5 68 14
1900 14 200 -29 -244 -147 43 4 -242 -112 51 23 -170 -159 -55 3 71 -71 -86 225 326 61 -114 148 181
1923 181 30 -158 -135 -27 -15 -200 -369 -100 99 156 -66 21 248 396 68 -50 106 124 3 -268 -236 -190
1945 -190 -147 -74 -244 -5 215 -48 6 -29 244 99 74 -22 -10 169 135 -131 -72 126 122 -119 -100 3 -16 -22 -371
1970 -371 -108 129 113 64 11 168 227 141 -5 82 74 39 -194 -267 -231 -67 -234 -266 -58 -34 87 -20 88 204
1994 204 133 165 -6 -67 194 181 -204 -98 -24 116 -12 -258 -143 76 112 -57 -136 14 99 38 -30 133 200 122
2018 122 54 -22 61 128 -64 -251 -250 -26 11 -282 -246 61 163 99 84 163 274 65 23 -75 73 110 -94 -258 -95
2043 -95 -2 -56 -244 -78 62 19 152 115 -49 38 55 -10 -118 142 75 -3 -61 3 47 -31 -58 -100 45 -87 -45 -177
2069 -177 -81 169 35 53 76 126 217 104 51 -129 23 13 -169 -189 -71 -58 -70 -277 -17 182 130 62 9 212
2093 212 177 94 -166 36 46 76 -191 -92 -3 -9 -44 -122 -48 32 15 25 -124 28 41 47 7 -3 23 67 -119 51 71
2120 71 36 -36 -223 11 175 15 -95 -8 60 46 -92 -44 104 215 86 -65 -67 68 -32 -160 -170 -126 -80 -41
2144 -41 -38 -38 87 143 4 99 -14 108 -27 -206 -90 109 117 10 -174 -63 65 -101 -92 -52 104 -39 -50 -99 93
2169 93 31 -33 -28 58 193 121 58 6 119 -68 -23 -89 -82 -9 -6 108 -129 -7 5 126 77 63 90 148 66 -74 10 60
2197 60 -55 -221 -57 24 -29 -44 -65 74 87 177 65 -94 170 89 9 -17 69 -12 -73 -18 -90 30 100 -37 -169
2222 -169 -69 70 -83 -208 -21 72 72 -42 58 53 153 97 12 -41 62 63 -82 -12 -133 -74 -4 -43 -208 -18 62
2247 62 209 -96 84 174 91 -19 34 39 15 -20 -94 -85 14 1 -37 20 81 18 -108 -8 178 43 85 -127 50 79
2273 79 49 -151 13 83 125 -125 -108 -75 49 36 -104 -160 -28 263 40 -63 80 150 48 -84 -72 49 -36 -67
2297 -67 -285 -106 -120 -8 -81 26 87 -47 -50 11 29 126 94 8 12 -43 50 -76 -110 3 103 -73 -46 -104 -107 20 -82
2324 -82 -94 13 18 102 86 20 69 54 -6 -40 20 -47 -73 -136 -38 -37 13 -26 -39 14 60 106 -35 -55 158 108 8 -76 59
2353 59 35 -70 -138 -62 97 105 -37 -67 65 56 -30 30 85 66 24 -35 -22 43 77 77 -42 -4 70 47 -100 -84 87 54
2381 54 -50 -3 23 8 37 32 58 152 138 9 43 25 96 -51 -96 -10 76 -159 -45 -122 38 19 -4 93 63 66 65 87 27
2410 27 4 -27 10 -112 -144 -44 46 9 -29 37 -21 -8 -22 -45 11 5 102 -16 43 0 -39 -32 -24 5 8 -74 -153 -49 -57 -74 20
2441 20 -62 52 1 -83 104 54 59 34 4 -75 34 52 -191 -20 -39 0 -16 27 -25 175 69 -26 65 -26 86 12 23
2468 23 -77 -28 14 -33 -85 -37 56 -41 -32 -101 46 -11 -109 -42 10 31 129 42 5 67 36 38 10 14 -66 -52 -74 -32 -40 -35 10 -107
2500 -107 56 34 31 -24 -59 135 85 17 -60 -62 30 -10 -81 -69 15 37 -45 -57 27 24 -8 93 7 34 17 2 -72 -81 -9 -51
2530 -51 -18 -71 -26 -82 -57 -177 -74 33 55 -53 13 -35 47 15 -57 50 81 26 -131 -24 25 10 -90 -96 -33 71
2556 71 6 -26 5 93 78 27 63 2 5 41 -16 -91 19 -66 18 -1 -54 3 35 -43 -102 -2 -31 -31 -77 38 -51 -3 -50 -53
2586 -53 -8 13 -56 10 -23 18 -8 -82 -27 40 82 -61 -22 60 93 57 -17 -46 -9 47 -18 -44 -71 -87 -80 -51 -45 6 -53 -128 -37
2617 -37 38 4 -19 -130 4 2 175 12 -20 -24 -35 -28 -21 20 -35 18 -96 -172 56 44 -61 -11 19 14 18 103 -16 108 85
2646 85 44 9 -144 -78 19 -54 -35 -113 -97 50 -26 -39 85 9 -118 -53 64 48 108 -62 -102 -51 17 -68 -113 6 -3
2673 -3 -86 0 -38 11 -38 -54 -9 58 30 46 -25 -17 48 132 -86 -97 76 -164 -70 65 82 -112 86 15 -129 -28 57
2700 57 -22 -83 42 113 120 -61 14 8 55 -18 -70 7 10 63 -18 -48 185 11 19 -4 -22 31 17 57 -14 -65 29 -73 67
2729 67 -25 38 -77 -31 13 -73 -10 118 41 54 90 2 113 -67 -41 -49 51 -103 -27 -2 40 -48 10 18 34 52 -76 -11
2757 -11 -64 -26 103 93 144 13 18 -146 1 27 36 12 -5 -32 -21 35 -41 90 -13 -40 -125 -20 -42 -21 27 -63 -65 -67 -98
2786 -98 -63 -56 -6 16 -9 14 -55 -89 -24 24 65 -45 39 61 -42 77 116 101 1 -26 -32 47 -69 27 -64 -13 -14 -48 -73
2815 -73 -36 26 -32 -103 54 -10 83 75 -64 44 41 100 8 21 1 -39 8 -6 53 16 -45 42 171 99 22 -21 9 20 69
2844 69 -29 -134 27 -15 41 54 -49 71 -39 106 15 -4 54 -115 0 -9 -1 -58 -21 -23 73 -2 12 13 -32 83 152 142
2872 142 -49 8 -36 34 -35 63 -15 -11 -27 -8 21 -55 -23 45 -78 -19 -103 -110 -58 -41 99 0 -42 55 91 81 30 -3 -69
2901 -69 -36 98 -44 40 10 -152 -37 -43 -20 -67 119 57 106 -41 -63 101 43 13 76 52 -49 -16 68 26 44 -28 24
2928 24 -7 -9 81 -29 47 -2 95 -55 -64 -60 0 35 12 -2 -39 -49 -73 53 34 1 39 -110 -43 -27 -36 65 24 58 -33 51
2958 51 171 148 28 28 52 58 -45 -150 -89 -110 -128 76 -68 -134 138 61 -90 39 -33 -43 3 74 66 -8 20 -19 -6
2985 -6 120 -31 9 46 -4 -28 0 -65 -56 58 -120 30 -10 -32 -122 -4 -26 -27 52 22 -10 70 91 -48 -77 74 5 41
3013 41 20 129 41 81 96 -39 6 -60 -11 -28 116 -114 5 29 -1 -15 33 70 9 55 -79 1 105 -28 -4 -39
3039 -39 -48 -79 64 24 80 45 -37 -63 -48 -15 41 76 15 148 -22 41 -17 66 16 47 22 -13 29 26 50 56 -17 5 77 76 70
3070 70 116 73 -86 -21 -118 23 56 -53 103 70 55 40 49 45 -95 -46 -8 -85 -36 69 32 78 -88 -64 -6 -34 -70 39
3098 39 0 0 -15 -30 -18 11 52 27 -11 12 53 -112 -17 159 125 12 10 -34 30 101 6 40 -65 84 15 -50 -35 63 134
3127 134 75 -131 6 -16 125 -67 -86 -51 133 52 -92 17 -54 86 -48 -4 -84 57 78 -25 69 66 57 5 -30
3152 -30 5 -22 63 -19 -73 23 -26 -64 -23 8 -139 -19 -68 72 -19 -5 61 -4 64 123 40 -7 116 68 30 -68 8 13 15
3181 15 12 45 50 -1 63 -94 88 57 20 76 67 98 -70 -62 -26 122 -10 -104 -55 -83 -52 15 65 -84 11 101 84 -37 100
3210 100 6 -74 -90 -50 66 -40 16 126 -46 56 -101 58 51 -8 -64 -43 -17 -24 44 4 63 87 -30 107 28 4
3236 4 -71 55 -131 -24 -15 11 86 -41 45 -75 4 33 -84 -18 16 115 90 26 109 65 61 59 26 82 -20 80 -43 -23
3264 -23 17 34 -13 14 -4 -88 93 -8 40 -72 51 -134 3 2 -50 -60 -86 -28 185 84 -51 62 8 21 -39 -32
3290 -32 -112 0 -26 44 -24 21 112 -37 -94 70 54 102 -114 -64 4 -32 7 -6 -5 83 10 -26 84 1 10 -72 -64 -104 -31
3319 -31 -28 -61 11 -22 50 -80 -20 -84 11 48 34 -59 32 -83 -1 24 -1 -21 -90 43 -75 -66 51 -80 107 -17 41
3346 41 11 61 32 -25 92 7 -35 2 -98 -69 -109 -96 79 61 -8 -108 -26 24 44 -30 -25 116 -65 -98 -43 -21 -103 67
3374 67 -42 -144 27 64 64 111 -61 -44 97 38 -12 68 -79 -34 -65 -13 -67 -17 -68 -16 -88 7 -44 18 102 48 64 14
3402 14 16 29 49 -17 25 -23 137 57 -38 -61 56 141 24 53 -38 139 6 -24 34 -33 69 -33 20 -78 84 125 -52
3429 -52 14 33 44 -54 -17 -93 -7 -54 -110 22 -31 -75 51 75 -79 9 74 82 -83 115 -80 19 -11 -29 -10 -40 -14 2
3457 2 -15 59 94 88 113 -109 -73 -27 79 41 22 29 -16 -46 124 -15 50 32 -64 25 -62 43 -43 46 59 97 -50 15 134
3486 134 79 -61 34 43 0 105 -80 82 49 3 -45 -88 -48 -50 -45 17 33 41 36 -20 -63 71 87 14 -92 0 137 -7
3514 -7 23 -8 -47 99 105 -79 -68 -15 2 2 66 36 -69 18 67 -166 6 -41 1 -10 28 -14 133 -29 -61 -74 64 -26
3542 -26 101 3 47 -86 -95 59 -16 -17 -103 -9 -36 98 -75 -100 59 37 -45 -43 74 35 -2 -68 -75 67 19 -57 50 -89
3570 -89 42 -54 17 -24 -60 58 -46 -34 6 -76 88 -12 -36 -40 89 94 110 71 4 106 93 -2 77 -22 -94 -70 75
3597 75 6 17 47 -205 -85 58 15 -16 6 -10 -8 -1 -35 -40 -36 48 3 7 -13 14 67 71 -75 -8 68 7 -87 -19 -2 55 -60
3628 -60 -78 27 22 -36 -4 116 103 116 11 37 -134 5 33 -39 -47 114 -70 15 14 15 -43 -13 95 -138 44 -101 -175
3655 -175 14 -24 -34 23 11 -77 -66 3 7 -4 -57 -45 39 80 -36 -71 47 68 14 -48 33 63 113 -42 63 -69 -69 74
3683 74 -34 59 58 122 62 92 49 -132 -60 -33 51 -9 -90 79 59 -14 -66 -59 -71 -13 5 -74 -84 -23 65 118 30 -36 -12 27
3713 27 -10 43 101 -31 60 -1 -65 75 -75 -28 -68 45 35 51 -22 -106 -47 -19 -5 -14 54 -72 95 65 -37 -28 -88 23
3741 23 9 8 55 -19 -100 -43 80 61 20 -137 85 -70 -42 50 99 -47 158 -133 -84 35 -18 -144 37 47 18 -147
3767 -147 1 -16 -51 3 -1 51 -3 -88 -35 17 48 -5 -47 -88 -5 4 -60 43 -9 -22 91 124 7 155 77 51 -99 -34
3795 -34 -93 23 144 41 74 -66 36 7 101 31 -146 -63 -73 36 -17 -39 -2 -25 4 12 -101 -126 -49 17 -38 -39 34
3822 34 -6 -28 5 -88 42 67 -24 -36 36 36 28 10 -11 -80 15 -25 81 -77 20 -132 88 44 -35 85 97 0 -58 83
3850 83 39 -95 9 73 -55 106 -55 -131 27 -62 -30 14 -40 -77 5 -100 49 68 -57 0 13 115 -12 48 -74
3875 -74 46 101 89 -73 13 129 6 -90 -51 14 69 -32 -58 59 -41 -18 -53 -110 8 55 50 -28 73 -55 -106 71
3901 71 -38 -74 -111 -3 83 -9 -33 84 -35 -96 28 -46 30 99 -37 38 43 -42 -21 97 -47 84 -92 -33 -30 -42
3927 -42 26 -2 -10 -58 121 -54 107 67 23 -31 -47 -87 -23 20 73 -77 -68 -57 -21 -64 -61 -126 80 29 13 -19 66 -54 -30
3956 -30 -103 -20 47 55 55 51 75 -13 -60 -45 42 96 38 6 -34 -85 38 39 -31 -54 -94 -87 78 36 -28 -63 32 -38 47 -28 -55 -118
3988 -118 -49 -57 -113 -31 5 32 -19 91 -52 -12 -104 60 60 111 -32 86 3 19 12 45 95 14 30 -28 38 -21 54 -13 60
4017 60 -17 8 111 -13 -52 -55 -68 -80 44 -46 98 -10 92 -36 -58 62 52 32 77 -32 -15 51 -48 4 -80 -18
4043 -18 -27 3 41 -18 -44 65 18 -42 -50 32 60 52 7 -15 -73 -83 -77 -38 -18 -116 -43 -39 67 28 0 20 28 123 48 57 -87 -56
4075 -56 -51 -134 83 16 -39 -47 -98 68 95 -111 -52 10 -43 -30 34 -73 52 -62 100 -76 -8 70 -42 -29 -78 30
4101 30 10 -58 116 38 -32 -72 -39 -176 -29 53 89 -33 1 88 -122 -117 26 125 37 27 13 -61 130 19 -80 21
4127 21 27 16 65 88 -55 36 77 73 -13 -33 101 -5 40 61 -101 157 -94 84 -28 6 -45 1 22 -76 91 -85
4153 -85 25 88 -18 23 56 9 -78 15 79 -84 19 92 70 -4 -17 3 -2 -27 -43 54 -26 79 -71 -112 -4 -8 38 9
4181 9 75 157 157 57 49 -48 -31 -52 -78 32 -15 -93 -16 -17 5 -17 9 -100 -13 16 31 -68 -35 174 21 15 44 18 36 -75
4211 -75 -94 -11 148 28 -101 -143 44 79 -48 57 -151 -91 -9 -104 -62 53 -47 5 -58 -39 11 123 35 4 -25
4236 -25 36 128 64 -54 -17 53 -86 30 -65 20 -94 135 4 17 34 40 -50 30 -14 -17 -66 55 46 -25 -16 7 14 49 -58
4265 -58 115 69 -70 10 61 45 -108 18 -18 -110 -25 -45 -127 -96 39 -63 74 -35 30 49 22 -57 -57 -32 48 139 18
4292 18 -2 27 -38 -27 33 76 19 26 39 -24 68 23 21 16 84 10 -76 29 14 9 28 21 52 12 106 -2 33 44 114 1 1 -63
4324 -63 121 61 11 87 -7 71 41 99 -12 -20 45 -33 -39 -31 48 90 -94 17 4 0 -10 -37 13 37 46 22 111 -54 41 -94
4354 -94 24 21 35 -70 18 30 -30 15 63 66 48 127 40 180 19 28 4 38 -23 -114 -111 17 18 -87 36 53 31 5 87
4383 87 67 19 -11 -29 0 -61 -56 35 68 -27 0 7 -9 -26 52 9 20 37 -66 18 -24 56 -59 -3 -4 -69 60 -75 47
4412 47 -3 60 66 -23 -21 -39 65 -56 81 45 -54 0 50 69 -65 31 -104 86 38 42 -32 105 -22 -79 -72 -23 -94 23
4440 23 -79 -57 31 -9 -20 -9 70 -9 29 71 -32 -15 7 109 45 87 87 -24 -82 70 -34 37 82 53 1 16 23 84
4468 84 31 -7 -30 8 105 30 -5 -65 -22 59 -1 61 105 -68 35 -29 -45 -39 -62 -98 84 40 -2 31 13 -18 21 -18 32
4497 32 0 17 -78 134 48 -17 26 50 -59 -17 26 24 27 51 -90 87 -109 25 -54 -25 41 -125 14 11 9 132 58 -34
4525 -34 -49 -83 -11 30 -30 -8 19 45 47 83 -62 12 84 -53 54 12 62 99 118 -28 -33 -38 88 12 -74 -8 -26 13 -95
4554 -95 -40 11 -42 -61 19 15 119 -49 -4 -119 39 -13 -12 -71 77 60 38 -159 -77 -121 -89 -126 -89 -129 -83 26 39 39
4582 39 92 40 -78 13 47 -36 6 -50 8 49 50 -71 14 33 -39 8 19 -51 117 27 15 -5 -42 -10 -47 35 -53 -11 43
4611 43 50 -106 -29 -148 -25 39 5 4 -58 -40 -54 102 -24 -97 -22 25 21 9 -30 -21 -6 51 -49 -44 -40 -96 -18 140 82 53
4641 53 -13 -106 21 -50 95 -71 70 -7 9 46 -11 57 -27 -36 -36 -75 24 -59 -35 69 81 -116 21 15 -45 -67 -4 -41
4669 -41 -39 81 79 -138 -30 -45 -42 63 84 25 -80 -7 7 30 57 -160 -119 -47 -41 12 29 40 -54 183 26 44 -27 124
4697 124 103 -17 -15 129 28 -60 -13 -33 1 19 37 -31 -58 17 139 75 106 -69 24 18 -61 23 10 -4 69 -22 -63 -20
4725 -20 18 41 -24 114 -41 -35 -129 -67 4 55 26 29 -20 31 13 -45 -7 36 51 26 -8 -13 40 85 21 97 -8 10 -57 -107
4755 -107 56 17 -17 64 -35 -110 43 0 28 -29 -3 -61 -49 43 4 47 167 12 -30 114 45 -19 26 103 -122 -10
4781 -10 21 -139 3 63 49 -3 33 -69 -24 35 91 87 49 84 16 30 -160 -28 53 32 102 -3 72 -121 -63 11 -168
4808 -168 41 30 -7 -39 -27 -7 -11 -11 -77 -67 -6 -81 60 107 -105 -37 -16 44 -39 -70 -5 77 -87 4 -49 29 30 99 63
4837 63 23 -50 77 15 54 131 79 -1 64 23 -8 -53 -57 32 -25 -4 1 63 90 22 -57 -3 -46 -4 58 -12 66 -58 -12 146
4867 146 -91 119 -92 -76 24 22 72 17 24 7 92 -49 109 13 -28 -35 -52 13 38 -53 -76 18 35 23 84 -90 41
4894 41 9 11 17 17 -46 -129 -68 102 48 -11 -20 -42 -126 7 -90 34 0 -103 84 112 120 27 33 47 75 -49 104 -60 -34
4923 -34 13 140 17 -84 103 128 -84 -33 -14 -22 -34 2 -5 36 -97 -60 -41 3 33 -43 10 -84 -45 -119 41 54 -23 52
4951 52 56 70 -15 -54 -18 -13 94 -41 -63 31 150 -68 -33 -3 -38 -65 -121 58 -13 6 32 15 -118 53 -31 -42 -39 35
4979 35 43 26 -63 104 -32 111 5 -33 -61 40 53 129 14 -82 -56 -121 57 2 -54 40 16 11 -3 17 66 19 16 92
5007 92 43 -80 27 48 -51 197 -25 30 -106 27 95 77 59 -16 49 -141 48 -53 -14 20 -50 126 -83 75
5031 75 143 -166 11 65 20 -103 -39 71 -95 40 82 179 27 50 -30 1 81 32 -21 -97 -17 4 -105 -1 -4 16
5057 16 -3 50 -6 -98 -55 -56 130 -55 -31 63 46 -59 -118 -59 119 -1 -55 -57 95 -34 -133 -22 -25 79 -62 121
5083 121 44 53 122 35 73 46 61 30 63 -20 15 2 -17 43 -10 -114 39 23 -105 -26 -75 -53 98 3 -17 119 59 -7
5111 -7 10 -87 -36 -13 -39 5 -99 -63 -8 -35 75 -62 -24 113 68 -52 -115 -5 -37 66 97 45 -95 -32 115 12
5137 12 40 -35 61 11 -86 -36 -204 20 80 -1 -4 -59 25 44 -4 31 86 8 -18 52 46 74 110 80 10 72 -52 55 91
5166 91 -121 -12 -11 -31 -77 -48 -66 -61 50 -129 23 114 73 55 78 61 56 -50 -43 -109 -16 76 1 10 23 -58 -49 -29 57 -8
5196 -8 -18 -5 -52 4 15 78 22 117 42 -130 9 -79 -17 -10 53 15 114 -49 -5 35 112 29 -26 -121 23 -59 -22 -38 69
5225 69 8 138 22 16 24 -19 -24 -92 -4 24 -40 -67 26 37 -18 -86 24 64 7 -35 -103 -114 -60 -71 -9 -40 -30 11 16 -43 121
5256 121 62 55 4 68 10 -65 31 64 69 27 -5 -30 -139 -47 -4 10 15 -84 -7 -36 -42 -40 91 -56 77 38 -32 89 5 31
5286 31 -62 7 90 78 29 -48 -30 1 122 72 31 36 -11 3 -5 82 156 139 22 48 -33 -51 90 16 80 13 -57 41 1 -105
5316 -105 12 -52 51 35 74 -64 28 -24 64 65 42 49 -42 43 71 68 104 45 32 26 62 16 -27 75 -25 -66 -37 -27 -42
5345 -42 8 134 14 -68 -111 53 9 -21 31 88 37 -24 50 84 -3 61 -4 98 52 -65 40 -30 57 -4 38 -3 51
5372 51 -33 32 145 60 35 110 -43 36 34 65 -94 25 22 -58 -37 -76 77 87 -1 54 22 36 -106 -34 -42 28 40 -25 56
5401 56 -10 31 -53 45 -80 -117 72 -25 43 -128 15 50 -5 80 79 26 20 -38 1 66 45 -34 64 -68 48 12 -41 -6
5429 -6 15 37 66 -85 -99 24 25 -38 23 -23 100 97 -5 36 -41 -25 -11 19 -73 4 30 51 -11 -8 -50 14 -6 27 9 -23
5459 -23 5 59 -21 -29 -58 -28 -107 95 22 -60 -38 14 0 -1 -67 -48 14 -7 -14 -69 -80 -27 23 -68 28 37 107 37 1 76 -72
5490 -72 -17 -70 21 5 -10 -39 76 81 34 -44 53 -108 54 11 -28 39 -80 -10 -41 -45 14 -88 -52 -123 16 -112 -77 21
5518 21 9 -34 18 14 -6 71 39 27 -1 -30 5 27 -2 -50 33 -78 51 -168 -74 -62 -15 124 -9 89 96 -60 -7 3
5546 3 -84 22 -16 -68 -95 160 -93 -46 -28 -34 151 99 -22 100 -60 -5 -24 34 -25 60 61 -8 116 -52 -9 136 25
5573 25 18 66 100 -56 -28 -2 37 -39 -65 -39 43 -40 146 55 58 28 73 49 -47 46 84 -41 -69 -55 -6 -11 81 -5 -94 4
5603 4 32 -2 17 10 -16 -81 -16 35 24 -30 -62 22 -55 13 73 -53 -28 -34 56 87 -6 -61 12 87 72 -99 -5 -83 -55 33 -82
5634 -82 24 -58 160 -25 117 42 -34 31 -101 -16 -58 3 -35 1 39 -149 -35 -88 -3 88 42 3 39 -37 -18 -47 -30
5661 -30 18 -66 -80 68 52 9 9 61 21 55 -15 45 -5 37 71 45 8 23 -49 31 120 17 34 4 -1 51 16 -32 13 58
5691 58 -115 22 -4 -19 69 107 -109 80 45 -51 -64 -59 -40 -18 -22 91 -6 32 79 58 41 50 -11 15 -15 -16 -41 -21 -20 -21 35
5722 35 -50 47 86 -24 -37 -56 -25 27 0 90 -23 -2 -91 111 20 -36 84 -24 50 64 82 21 137 -96 94 251
5748 251 -6 -3 -27 125 -72 -22 4 14 59 42 -5 -16 -39 -39 21 -81 17 -63 4 29 74 5 42 -65 -29 71 61 -37
5776 -37 2 56 -75 -43 -54 92 -66 98 -50 71 108 -167 -45 72 15 -57 70 135 -51 -65 -45 39 23 -117
5800 -117 -90 -98 -9 -70 0 65 53 -54 37 -66 -28 -96 5 -14 11 -82 56 52 30 25 37 -93 63 143 48 21 -31 136
5828 136 -52 65 68 0 -33 -139 85 36 17 -10 -69 -60 102 194 6 108 -69 96 76 162 -58 -57 20 -49 -9 9
5854 9 34 -70 76 56 136 37 18 62 -42 -26 -10 -3 -29 -48 74 14 11 57 17 -28 -37 -33 -25 179 14 55 -58 8 14 91
5884 91 114 49 32 -33 3 2 -23 -71 139 -53 -14 -78 20 -2 41 28 17 -109 -28 34 -2 -37 56 61 54 -130 -12 22 6
5913 6 -105 23 128 -14 -36 20 -12 65 -28 17 -123 -14 78 -30 -42 53 -5 9 74 -23 5 48 100 -4 -15 -81 10
5940 10 -110 59 -24 -92 -48 -38 122 61 61 17 127 82 -34 29 36 83 76 -48 10 -20 -8 -103 49 92 -2 128 -4
5967 -4 -17 -27 0 3 -110 33 47 -127 76 22 111 -40 -45 -74 15 -31 -2 -21 47 37 67 25 -46 38 2 27 -49 -29 27
5996 27 -48 13 45 85 -8 25 -31 61 -99 26 49 -56 -17 -15 -24 86 -27 7 1 66 91 43 26 80 67 35 -59 54 110
6025 110 0 -19 46 -34 61 60 -44 -95 -94 -22 -74 -51 -19 22 -23 65 -31 -10 54 79 20 -82 -53 14 -13 -129 76 40
6053 40 -51 0 69 51 79 47 -146 47 0 128 42 67 -82 19 -45 66 -12 18 14 -68 -161 32 -52 -53 21 125 63
6080 63 -10 60 65 -67 61 -24 52 3 -156 18 21 59 92 -6 49 -66 -80 29 -85 3 -53 28 58 -46 -98 -44 -72
6107 -72 -103 -70 77 44 71 20 21 59 18 -11 -48 7 9 -91 26 51 -81 -55 11 -23 -6 106 -12 51 73 -14 -32 11
6135 11 35 162 -52 -24 -79 54 -22 -17 -15 39 94 25 -147 -45 79 92 -45 8 99 37 -11 -54 13 -22 -53 111 69
6162 69 17 8 -65 23 137 -10 29 38 54 -14 -3 60 -123 -29 -14 -56 -78 163 56 13 -82 -6 -23 46 -24 52 -46 10 -61
6191 -61 -147 -8 -18 -43 125 58 -10 131 85 -21 -34 62 25 15 -46 83 67 -62 33 22 75 41 16 5 -37 -11 20
6218 20 2 -18 -31 103 -5 -103 -14 -30 28 -91 -50 13 -21 57 -39 -7 -98 8 -46 3 108 77 -29 95 -30 -132
6244 -132 -14 -83 68 93 34 -8 13 -47 85 82 -4 16 39 8 11 11 -75 42 2 72 61 23 -112 -13 -49 13 -107 18
6272 18 47 -46 63 4 116 -14 31 -84 17 25 -13 -1 -40 5 -70 -17 71 1 42 -1 100 -4 -96 16 -69 -10 -81
6299 -81 -39 -44 -1 136 36 -61 -96 -68 46 32 -16 55 0 -83 38 19 129 -58 -6 -35 -39 81 -18 -43 3 10 -77 5
6327 5 20 -26 -73 -31 -66 13 42 12 -74 35 118 13 -28 -56 -73 -10 -4 102 111 2 -53 -104 132 -72 -77 27 71 -15 47
6356 47 11 -33 -8 11 -18 73 -120 -4 -78 -100 -79 -27 -35 46 43 15 -1 3 67 -83 -155 -61 -9 11 137 -129 26 48 -57
6385 -57 -58 -7 39 -41 90 24 -71 37 21 -92 -35 28 -60 -28 -46 60 64 36 21 3 14 11 -22 77 5 -35 -31 103 -64
6414 -64 -121 84 32 2 30 82 96 63 55 4 -45 -58 -14 34 12 94 -28 -38 -5 8 36 -18 39 64 29 42 -154 -25 0
6443 0 -15 -39 -146 -73 -73 46 -10 -53 -34 247 18 28 32 -51 -4 8 8 -58 -12 50 91 -20 -29 92 11 30 -92 -30 -75
6472 -75 -77 1 -61 -32 15 94 46 7 40 58 -31 48 -74 -13 85 -106 -69 -36 -61 9 -58 -6 22 -1 -72 45 46 23 91 -44
6502 -44 40 -54 -78 117 -10 8 2 22 -6 -25 10 33 -19 -55 32 -84 45 47 24 37 14 -70 79 78 -35 89 42 23
6530 23 -32 44 -95 89 -118 -87 16 -39 -41 -7 -41 57 -14 -20 130 -24 29 -21 -45 74 -14 -44 -46 -10 8 -28 31 -29
6558 -29 -20 28 -84 -85 133 -9 -60 19 -59 -58 38 -108 -8 -23 -34 54 -66 68 63 -27 -92 -32 53 87 42 15 35 57 -51
6587 -51 119 -2 3 -49 -8 -36 75 -66 -27 11 25 -31 -44 5 -42 76 -69 33 10 -22 -79 61 104 -3 43 37 -108
6614 -108 48 5 -63 41 -51 -30 13 32 -22 -85 64 -110 99 104 -20 24 -15 106 20 61 -127 31 -34 -29 -67 -41
6640 -41 6 9 37 21 38 -78 77 -7 -3 63 -17 27 -70 -80 88 8 16 16 20 33 36 82 -58 83 55 172 -7 65 30 0
6670 0 60 32 13 9 0 0 33 -68 71 45 -12 -9 19 -87 8 29 -16 9 64 -95 -54 -25 23 10 -135 -61 110 18 7 104
6700 104 2 -13 -53 -44 64 34 -92 71 74 8 -4 72 42 78 -64 29 22 -29 41 -28 -42 13 -35 -15 33 21 -30 94
6728 94 94 87 -26 67 93 27 6 -38 61 -44 26 12 -45 -51 -29 -35 102 33 44 51 27 7 43 -87 102 107 49 54 -46 129
6758 129 56 8 90 -28 8 -42 -41 127 95 32 -2 -62 -58 4 -20 109 -23 -52 28 8 -152 -48 72 -60 87 144
6784 144 38 -101 -57 52 90 -71 -112 -36 72 5 -10 61 28 126 -31 -73 -93 28 -1 -86 -22 40 -49 -4 -7 23 8
6811 8 80 -30 93 -60 -19 45 1 25 79 32 -7 -83 -101 115 -102 -3 -18 64 -13 6 79 97 -44 -29 -40 -39 -3 5 100
6840 100 -59 -93 -51 54 61 -38 11 18 -77 -6 -66 -83 65 3 -117 24 18 -31 0 104 15 26 18 86 126 -31 -79 -5
6868 -5 152 -4 -18 -27 -92 11 48 -33 26 -20 105 -1 -11 59 49 -36 28 137 5 -135 -12 -30 -19 13 -137 -78
6894 -78 12 -80 21 62 -62 -12 -54 -31 -96 -33 -22 -63 -55 44 54 -17 -55 12 44 47 8 -8 34 35 4 64 24 88 3 29 -18
6925 -18 -45 36 65 19 -65 -28 -70 -54 66 -114 22 -48 -36 -57 -54 -29 31 -39 7 81 56 76 -29 -95 10 -64 -52 -25
6953 -25 17 69 -103 -14 3 29 71 -103 126 -57 54 -34 -37 85 9 -48 1 40 55 -34 -62 -20 -45 -41 -53 -74 -45 40
6981 40 -60 31 5 32 91 -74 8 -101 -4 20 -43 -57 -83 60 -86 -101 19 47 -137 -14 -61 102 21 -97 -42
7006 -42 52 16 -93 52 -34 21 -16 52 20 45 77 -35 -57 117 -74 43 -13 39 14 78 -22 50 134 -33 34 -13
7032 -13 8 0 -41 24 123 32 -11 53 -24 -32 30 28 50 -25 -46 12 -100 139 107 -42 -47 -42 -45 38 -11 34 20 -76 16 109 -10
7063 -10 -75 12 -25 37 48 -109 51 52 -10 92 -11 41 -77 -72 15 19 0 19 78 -14 -59 79 60 -76 -8 56 -58 3
7091 3 -63 -24 -41 -16 54 38 103 32 10 -5 -43 -164 8 -23 23 -65 -36 60 -96 -29 76 -20 -23 34 30 -7 17 -86 34
7120 34 141 -46 -80 -20 31 82 25 -73 98 -15 -26 -8 -136 -36 169 -14 45 -95 47 166 -93 -137 25 93
7144 93 147 -116 -50 -58 -4 -110 79 23 27 50 -64 3 1 53 -62 52 -15 44 24 75 63 145 8 39 -74 92 -80
7171 -80 -90 -31 99 -45 66 49 45 -145 -40 -4 -43 -39 32 -36 0 10 102 -38 -32 -3 -59 93 -94 -29 113 1 52
7198 52 -29 -4 71 -73 54 9 -4 29 62 10 23 -74 43 -58 -13 -59 -23 89 -4 42 -46 -3 17 14 32 1 -46 -21
7226 -21 90 47 -114 102 21 14 114 -18 -99 -66 -29 -20 -1 -40 16 5 29 -21 84 29 78 0 -5 -7 -109 90 -128 26
7254 26 -83 -79 54 -57 22 -12 -24 9 -17 6 16 -38 -14 -144 12 -22 -9 -56 29 29 -179 31 -51 -79 23 11 13 64
7282 64 41 -20 39 41 59 -70 28 87 -54 -121 54 -99 -56 -20 -29 36 -25 -16 64 6 29 -24 19 -19 -9 58 16 58 -140
7311 -140 91 43 78 39 47 49 -68 -14 -29 -20 -43 149 130 -2 -46 -25 45 23 -17 48 -30 60 8 36 -50 -58 29 13 -50 -123
7341 -123 -49 -156 -25 -85 7 -24 119 -75 -48 8 -63 -41 51 -3 -65 34 54 -32 19 15 -1 -38 31 -63 58 -10 -40 70
7369 70 12 84 84 -38 -36 -49 -23 16 5 58 -41 79 -46 -7 3 30 97 -51 82 47 61 35 -15 175 16 15 10 -89 79
7398 79 99 -33 -13 -34 -28 71 8 51 -3 -5 -31 36 12 47 15 -119 82 -89 -53 -34 -40 -55 -15 75 33 -36 42 -31 -74 30
7428 30 33 31 6 -103 47 -21 1 -21 -122 10 60 39 12 -104 42 63 50 -39 -29 -48 99 11 130 -10 21 66 -83
7455 -83 -76 -32 -36 0 -37 82 -26 -83 45 -70 39 49 66 -71 21 -32 115 16 0 14 51 -10 -28 -61 124 -21 -25
7482 -25 87 58 95 83 -60 0 65 3 -34 -39 78 -70 155 -1 79 -14 -64 20 193 46 96 1 32 -27 7 -5 -51
7509 -51 19 21 -126 -71 16 -53 -14 -47 77 -118 84 -46 52 42 37 110 15 0 72 6 -34 64 -145 73 71 50 -42 6
7537 6 9 36 -103 37 76 -39 -3 40 -104 45 -14 55 96 78 -45 85 22 -150 18 -26 -66 69 25 64 -79 93
7563 93 -7 -51 15 -71 50 -66 -15 11 -71 -77 -27 50 -66 12 -15 -108 85 -91 -37 11 19 59 12 29 -91 -54 90
7590 90 39 57 102 70 9 90 -57 20 -28 -38 6 70 94 -27 12 52 -15 10 27 -12 -102 -63 15 104 58 -97 -7 -9 -12 -4
7620 -4 55 35 -14 -99 155 -23 22 -5 79 82 -89 78 -14 -59 45 -20 -55 3 35 18 -131 -91 13 -47 -83 19 0
7647 0 -62 -58 11 -26 7 28 2 5 -39 -4 -35 -8 -68 -20 -74 -43 -23 28 32 2 112 -24 9 89 14 -8 -3 9 -14 -105 -71 124
7679 124 -36 52 -38 38 -15 -58 -10 81 11 -34 4 30 13 80 -32 -3 -6 -35 53 119 45 13 11 97 -50 24 -39 -36 89
7708 89 -50 -12 60 -111 -48 28 34 95 -13 133 -105 -23 18 41 -48 57 -30 52 34 -55 -11 75 -4 -110 0 64 37
7735 37 69 22 -19 -102 116 61 -19 -22 67 -27 -91 79 -21 9 -95 50 -2 -34 -37 42 34 -66 14 48 -39 -37 -90 19 -44
7764 -44 -58 75 9 44 -40 -43 1 -62 89 -69 -1 -37 -137 -27 -71 74 -5 -56 -72 47 -117 -41 -58 4 -133 23
7790 23 24 -15 41 -37 -55 -184 3 76 9 27 -1 23 -145 79 28 -66 -26 3 100 21 40 58 -73 60 2 -18 20 160
7818 160 21 78 35 -35 70 26 -18 -3 -54 -33 2 59 -75 4 3 -8 26 -55 -22 -9 19 7 42 87 109 81 -53 35
7846 35 -77 -10 -46 49 -54 -70 -17 5 20 -30 -18 -95 -65 -101 5 -119 90 86 127 3 -58 11 25 -95 35 -85
7872 -85 -7 129 25 -34 40 48 2 77 -3 -87 -32 7 26 -11 19 73 71 98 -51 121 35 -6 17 -27 -72 -151 75 88 -66
7901 -66 97 0 -21 10 -150 14 67 -5 -86 -48 -3 20 13 -84 27 88 -21 10 3 5 10 -33 22 45 59 -5 -28 19 -84
7930 -84 -34 -18 -28 -41 53 34 14 44 51 -53 -86 -39 -117 -16 25 39 -7 -72 -40 41 -128 50 -63 16 29 -40 62 -7
7958 -7 -26 -60 28 14 71 90 6 15 -38 51 -22 -54 -11 33 -136 -97 36 -51 -96 -78 -95 -13 -68 -40 -71 119 27 68 71 -15
7988 -15 77 -63 5 -13 40 -17 -60 120 -46 -10 -1 -3 -22 28 46 9 -13 19 -5 -28 -22 -17 -13 -106 31 -163 83 94 85 48
8018 48 -17 56 -88 -32 33 75 8 15 31 22 -74 -77 0 111 81 -1 -57 -39 62 -27 -69 2 -28 2 74 2 -49 58 73 -9
8048 -9 -32 2 -47 132 31 -43 -53 54 -42 56 23 -36 94 89 -80 -86 -92 -84 11 74 -38 30 -8 -110 53 -47 -57 146
8076 146 1 -48 -108 -43 -28 52 -161 28 98 -70 -41 47 -44 -87 31 22 115 -65 -28 -69 -20 -23 10 23 -12 -65 27 106
8104 106 -5 24 -25 -50 -44 -72 -27 24 42 -81 -37 -31 -5 -66 -5 -19 -134 60 121 -4 25 12 0 -39 79 27 62 -39
8132 -39 -61 -96 -155 -29 25 -44 -43 -80 12 35 -32 -39 -16 42 15 -8 134 -55 94 -69 -7 -51 -14 -50 34 -60 92 -38
8160 -38 -44 22 18 -86 -43 14 19 0 1 -44 78 1 110 -15 -72 52 22 -51 -3 -8 96 48 -25 -86 -67 -38 12 -54 -93 -17
8190a7j
8191a8
##END NTUPLES=NMR FID
##END=
