##TITLE=1H_DE-80H_X3
 200.13MHz, d2o
 8 sc
 
 19ns.26.2.2025
##JCAMPDX= 6.0         $$ Bruker NMR JCAMP-DX V2.0
##DATA TYPE= NMR FID
##DATA CLASS= NTUPLES
##ORIGIN= UXNMR, Bruker Analytische Messtechnik GmbH
##OWNER= pz
$$ XWIN-NMR		Version 3.5
$$ Mon Jul 21 14:50:29 2025 Russian Standard Time (UT+4h)  Yarkov@DPX200
##.OBSERVE FREQUENCY= 200.1313
##.OBSERVE NUCLEUS= ^1H
##.DELAY= (6, 6)
##.ACQUISITION MODE= SIMULTANEOUS
##.ACQUISITION SCHEME= undefined
##.AVERAGES= 8
##.DIGITISER RES= 18
##SPECTROMETER/DATA SYSTEM= spect
##.PULSE SEQUENCE= zg30
##.SOLVENT NAME= CDCl3
##.SHIFT REFERENCE= (INTERNAL, CDCl3, 0, 14.3821)
##AUDIT TRAIL= $$ (NUMBER, WHEN, WHO, WHERE, WHAT)
$$ ##TITLE= Audit trail, XWIN-NMR		Version 3.5
$$ ##JCAMPDX= 5.01
$$ ##ORIGIN= Bruker BioSpin GmbH
$$ ##OWNER= Yarkov
$$ C:/Bruker/XWIN-NMR/data/yarkov2/nmr/H-C/1/audita.txt
$$ ##AUDIT TRAIL=  $$ (NUMBER, WHEN, WHO, WHERE, WHAT)
(   1,<2025-07-21 14:49:37.53 +0400>,<Yarkov>,<DPX200>,
      <created by zg, POWCHK disabled, PULCHK disabled
       configuration hash MD5:
       00 E9 B6 7A A2 85 ED C7 34 08 36 98 17 FE 4E 26
       data hash MD5: 16K
       86 90 40 D2 D6 8D 6B 4A 72 0C D9 00 D5 67 23 6A>)
$$ ##END=
$$ 
$$ hash MD5
$$ 95 17 BC 3E EE 94 30 58 8E FA B1 24 8E 3C 8E 33
##$RELAX= 
##$RELAX= 
##$RELAX= 
##$RELAX= 
##$RELAX= 
##$RELAX= 
$$ Bruker specific parameters
$$ --------------------------
##$DU= <C:/Bruker/XWIN-NMR>
##$EXPNO= 1
##$NAME= <H-C>
##$PROCNO= 1
##$TYPE= <nmr>
##$USER= <yarkov2>
##$AMP= (0..31)
100 100 100 100 100 100 100 100 100 100 100 100 100 100 100 100 100 100 
100 100 100 100 100 100 100 100 100 100 100 100 100 100 
##$AQSEQ= 0
##$AQ_mod= 1
##$AUNM= <au_zg>
##$AUTOPOS= <>
##$BF1= 200.13
##$BF2= 200.13
##$BF3= 200.13
##$BF4= 200.13
##$BF5= 200.13
##$BF6= 200.13
##$BF7= 200.13
##$BF8= 200.13
##$BYTORDA= 1
##$CFDGTYP= 0
##$CFRGTYP= 5
##$CHEMSTR= <none>
##$CNST= (0..31)
1 1 145 1 1 1 1 1 1 1 1 1 1 1 1 1 1 1 1 1 1 1 1 1 1 1 1 1 1 1 1 1 
##$CPDPRG= <>
##$CPDPRG1= <>
##$CPDPRG2= <>
##$CPDPRG3= <>
##$CPDPRG4= <mlev>
##$CPDPRG5= <mlev>
##$CPDPRG6= <mlev>
##$CPDPRG7= <mlev>
##$CPDPRG8= <mlev>
##$CPDPRGB= <>
##$CPDPRGT= <>
##$D= (0..31)
0 0.7 0 0 0 0 0 0 0 0 0 0.03 0 0 0 0 0 0 0 0 0 0 0 0 0 0 0 0 0 0 0 0 
##$DATE= 1753094977
##$DBL= (0..7)
120 120 120 120 120 120 120 120 
##$DBP= (0..7)
150 150 150 150 150 150 150 150 
##$DBP07= 0
##$DBPNAM0= <>
##$DBPNAM1= <>
##$DBPNAM2= <>
##$DBPNAM3= <>
##$DBPNAM4= <>
##$DBPNAM5= <>
##$DBPNAM6= <>
##$DBPNAM7= <>
##$DBPOAL= (0..7)
0.5 0.5 0.5 0.5 0.5 0.5 0.5 0.5 
##$DBPOFFS= (0..7)
0 0 0 0 0 0 0 0 
##$DE= 6
##$DECBNUC= <off>
##$DECIM= 32
##$DECNUC= <off>
##$DECSTAT= 4
##$DIGMOD= 1
##$DIGTYP= 9
##$DL= (0..7)
0 120 120 120 120 120 120 120 
##$DP= (0..7)
150 150 150 150 150 150 150 150 
##$DP07= 0
##$DPNAME0= <>
##$DPNAME1= <>
##$DPNAME2= <>
##$DPNAME3= <>
##$DPNAME4= <>
##$DPNAME5= <>
##$DPNAME6= <>
##$DPNAME7= <>
##$DPOAL= (0..7)
0.5 0.5 0.5 0.5 0.5 0.5 0.5 0.5 
##$DPOFFS= (0..7)
0 0 0 0 0 0 0 0 
##$DQDMODE= 0
##$DR= 18
##$DS= 0
$$ [...]
##$SUBNAM2= <"">
##$SUBNAM3= <"">
##$SUBNAM4= <"">
##$SUBNAM5= <"">
##$SUBNAM6= <"">
##$SUBNAM7= <"">
##$SUBNAM8= <"">
##$SUBNAM9= <"">
##$SW= 18.0517328524113
##$SWIBOX= (0..15)
0 0 2 0 0 0 0 0 0 0 0 0 0 0 0 0 
##$SW_h= 3612.71676300578
##$TD= 16384
##$TD0= 1
##$TE= 0
##$TE2= 300
##$TE3= 300
##$TEG= 300
##$TL= (0..7)
0 120 120 120 120 120 120 120 
##$TP= (0..7)
150 150 150 150 150 150 150 150 
##$TP07= 0
##$TPNAME0= <>
##$TPNAME1= <>
##$TPNAME2= <>
##$TPNAME3= <>
##$TPNAME4= <>
##$TPNAME5= <>
##$TPNAME6= <>
##$TPNAME7= <>
##$TPOAL= (0..7)
0.5 0.5 0.5 0.5 0.5 0.5 0.5 0.5 
##$TPOFFS= (0..7)
0 0 0 0 0 0 0 0 
##$TUNHIN= 0
##$TUNHOUT= 0
##$TUNXOUT= 0
##$USERA1= <user>
##$USERA2= <user>
##$USERA3= <user>
##$USERA4= <user>
##$USERA5= <user>
##$V9= 5
##$VALIST= <valist>
##$VCLIST= <CCCCCCCCCCCCCCC>
##$VD= 0
##$VDLIST= <DDDDDDDDDDDDDDD>
##$VPLIST= <PPPPPPPPPPPPPPP>
##$VTLIST= <TTTTTTTTTTTTTTT>
##$WBST= 1024
##$WBSW= 4
##$XGAIN= (0..3)
0 0 0 0 
##$XL= 0
##$YL= 0
##$YMAX_a= 62634
##$YMIN_a= -55853
##$ZGOPTNS= <>
##$ZL1= 120
##$ZL2= 120
##$ZL3= 120
##$ZL4= 120
##$ABSF1= 10
##$ABSF2= 0
##$ABSG= 5
##$ABSL= 3
##$ALPHA= 0
##$AQORDER= 0
##$ASSFAC= 0
##$ASSFACI= 0
##$ASSFACX= 0
##$ASSWID= 0
##$AUNMP= <proc_1d>
##$AZFE= 0.1
##$AZFW= 0.1
##$BCFW= 1
##$BC_mod= 2
##$BYTORDP= 1
##$COROFFS= 0
##$CY= 83.5205535888672
##$DATMOD= 1
##$DC= 2
##$DFILT= <>
##$DTYPP= 0
##$F1P= 10.8118882576601
##$F2P= -7.23987719738617
##$FCOR= 0.5
##$FTSIZE= 0
##$FT_mod= 4
##$GAMMA= 1
##$GB= 0.15
##$INTBC= 1
##$INTSCL= 1
##$ISEN= 128
##$LB= 0.25
##$LEV0= 0
##$LPBIN= 0
##$MAXI= 10000
##$MC2= 0
##$MEAN= 0
##$ME_mod= 0
##$MI= 1.114404
##$NCOEF= 0
##$NC_proc= 0
##$NLEV= 6
##$NOISF1= 3.799351
##$NOISF2= 2.8
##$NSP= 1
##$NTH_PI= 0
##$NZP= 0
##$OFFSET= 14.38212
##$PC= 1
##$PHC0= -1355.343
##$PHC1= 7.190909
##$PH_mod= 1
##$PKNL= yes
##$PPARMOD= 0
##$PSCAL= 0
##$PSIGN= 0
##$REVERSE= no
##$SF= 200.129724274929
##$SI= 16384
##$SIGF1= 3
##$SIGF2= 2
##$SINO= 400
##$SIOLD= 16384
##$SREGLST= <1H.CDCl3>
##$SSB= 0
##$STSI= 0
##$STSR= 0
##$SW_p= 3205.1282051282
##$SYMM= 0
##$S_DEV= 0
##$TDeff= 0
##$TDoff= 0
##$TI= <>
##$TILT= no
##$TM1= 0
##$TM2= 0
##$TOPLEV= 0
##$USERP1= <user>
##$USERP2= <user>
##$USERP3= <user>
##$USERP4= <user>
##$USERP5= <user>
##$WDW= 1
##$XDIM= 8192
##$YMAX_p= 0
##$YMIN_p= 0
$$ End of Bruker specific parameters
$$ ---------------------------------
##NTUPLES= NMR FID
##VAR_NAME=  TIME,          FID/REAL,        FID/IMAG
##SYMBOL=    X,             R,               I
##VAR_TYPE=  INDEPENDENT,   DEPENDENT,       DEPENDENT
##VAR_FORM=  AFFN,          ASDF,            ASDF
##VAR_DIM=   8192,          8192,            8192
##UNITS=     SECONDS,       ARBITRARY UNITS, ARBITRARY UNITS
##FACTOR=    0.0002768,     1,               1
##FIRST=     0,             0,               0
##LAST=      2.2672688,     0,               0
##MIN=       0,             -55853,          0
##MAX=       2.2672688,     62634,           0
$$ Real data points
##PAGE= N=1
##DATA TABLE= (X++(R..R)), XYDATA
$$ [...]
976f35P44k45j41l6J65M79J26n17l13Q55P67m63r25L70J140n58j109o63N32M64
$$ -635 109 -136 -277 -313 -148 331 457 -60 -373 482 1249 786 -139 231 1371 813 -296 -959 -427 37
996C7j058r66Q20J238l3q94N44K009J93j429p7Q79J62r28j219o1P30l21r96r7
$$ 37 -1021 -1987 -1167 71 38 -856 -312 1697 1890 461 384 1263 1425 497 -722 -783 -53 -374 -1370 -1467
1016a467Q13O09k60k50O24Q09k21l20j85L28M90l66p53RP09J99p62r01N42M34
$$ -1467 -654 -45 -305 -555 69 878 657 337 152 480 970 604 -149 -140 569 768 6 -895 -353 81
1036H1n01q06n7P79N63o65L1J104P84k89p30L22J090k93j665o23O28K69j076n87
$$ 81 -420 -1226 -1283 -504 59 -606 -575 529 1313 1024 294 616 1706 1413 -252 -875 -247 22 -1054 -1641
1056a641M27Q41j0j05L79P37M44l89n08M75M97n55r07k70O10J97m32l63j76N67
$$ -1641 -1214 -373 -383 -488 -109 628 1072 683 175 650 1147 592 -315 -585 25 222 -210 -573 -749 -182
1076a82O16o53p65R09O62q10m64O83Q57k04o51O8P34L83o20j246J54Q74l69j246
$$ -182 434 -219 -984 -75 587 -223 -687 -4 853 649 -2 66 800 1183 563 -683 -529 345 -24 -1270
1096a270k1Q85L22m97P1R66L56N9k27l44N48K25j034r94O27K22l96n56K69M66
$$ -1270 -1291 -406 -84 -581 -510 456 812 871 644 300 848 1073 39 -955 -328 -106 -502 -1058 -789 -323
1116c23L41J04j65J46N70M37j080l61R80R4q97l45K69O19k03o59k90N75N67n42
$$ -323 18 122 -43 103 673 1110 30 -331 649 743 -154 -499 -230 389 186 -473 -763 -188 379 -163
1136a63j074P31J121n61p18P00J013k40m83j03N12J13m22r20l66N92N3q42k84
$$ -163 -1237 -506 615 54 -664 36 1049 809 326 223 735 848 426 -494 -860 -268 -215 -1057 -1341
1155a341P41M71oK40R1O04K37o7m99k59M73j49j062k63N52J35n10m26M46Q22m6
$$ -1341 -600 -129 -135 105 196 800 1037 970 471 212 685 536 -526 -789 -237 -102 -612 -1038 -592 230 184
1176A84o06q2Q63N10q28n12Q20R00p70o70K99P00j66r37l63O31p8m95n09L21O38
$$ 184 -422 -504 359 869 41 -471 349 1249 479 -191 108 808 642 -295 -658 -27 -105 -600 -1109 -788 -150
1197a50L2k62L77P27K15j15j79K5K02k61n28n64j26J74J38o65k42P33O98k12m30
$$ -150 -118 -380 -3 724 939 824 645 670 872 611 83 -481 -607 -433 -295 -960 -1202 -469 229 17 -413
1218d13L73R99k72p42R7N25J78p94m58N72N99o87o52K63Q75k00j033K4Q72M5m35
$$ -413 -40 959 687 -55 42 567 745 -49 -507 65 664 -23 -675 -412 463 263 -770 -746 126 171 -264
1239b64j94N48N79q3l06J62J54J23m50n39L5L6m30J3j04R8N30J96k09P4N90O01
$$ -264 -458 90 669 586 280 442 596 719 269 -270 -235 -199 -629 -616 -720 -622 -92 104 -105 -31 559 1160
1261A160o54n08L43L95o56p86J3N10L14o18m21R35O62n04o55L84Q60l19q64J30
$$ 1160 506 -2 341 736 80 -706 -693 -183 131 -487 -908 27 689 185 -470 -86 774 455 -409 -279
1281b79P14l1m32j80K51M78m32n43J04L52J5m99l33N94L51k06J2J49L97K32j83
$$ -279 435 404 -28 -208 43 521 89 -454 -350 2 17 -482 -815 -221 130 -76 -64 85 482 714 531
1302E31j84k22J78J09o34n68K78J92j96l40K72P51L12m25j55P99M11m58q45J43
$$ 531 347 125 303 412 -222 -790 -512 -320 -516 -856 -584 167 479 54 -101 698 1109 651 -194 -51
1322e1P43l42r80M1N45J91p30j81N73L59k64l53K22L88K33m12l5M96K38k82k91
$$ -51 692 350 -630 -589 -44 147 -583 -764 -191 168 -96 -449 -227 161 394 -18 -53 443 681 399 108
1343A08J77K20j63l39l72p4J7Q9l56k26M80O05l3j37L24M00K67n00m40K73J86
$$ 108 285 505 342 3 -369 -443 -426 -337 -693 -919 -439 166 133 -4 320 720 987 487 47 320 506
1364E06n21p58J60N82p6q24L03R20K2n24k17N71N97n82l36K53L98N2n99j40M98
$$ 506 -15 -773 -613 -31 -107 -931 -628 292 314 -210 -427 144 741 159 -177 76 474 526 -73 -213 285
1385B85K48o47k59J52O4J7k90n3J25K81J64k44J69M65J77k55j66oJ69k51n38k99
$$ 285 533 -114 -373 -221 -157 -140 -430 -483 -358 -77 87 -157 12 477 654 399 233 227 396 145 -393 -692
1407f92L37K55l60m59N78P67k04m05K06N67N8n33k31L94O7m29l28N6M35J2m63
$$ -692 -355 -100 -460 -919 -341 426 222 -183 23 590 648 115 -116 278 345 -84 -412 -356 79 91 -372
1428c72N6N02R5l90j24J60K25k8j01q7k0M49Om28j1K75J10m64l10J24L90r4n82
$$ -372 -316 186 281 -109 -233 -73 152 124 23 -64 -84 365 371 -57 -68 207 317 -147 -457 -333 57 -37 -619
1451f19K05M46K73k06j60M94N02l75n13Q0K14r9q26k3L91N8k94j86M26M21O0k08
$$ -619 -414 32 305 99 -61 433 935 560 47 127 341 242 -584 -607 -216 -158 -452 -638 -212 209 269 61
1473F1P1L23j8j35k43q7K91k06k18j98K37K30l31j51K10P0Q2k03k40L97M86j28
$$ 61 132 455 437 302 59 -28 263 57 -161 -359 -122 108 -223 -374 -164 -94 -12 -215 -455 -58 428 300
1495C00m34K90L38J73m41k80L16N3m45n63J85K30j00l20J29O52J20l30J26M38
$$ 300 -134 156 494 667 226 -54 262 315 -130 -693 -508 -278 -378 -698 -569 83 203 -127 -1 437
1515D37L20l08l53m1K43o2l30l66K14K39k21r9J09K10J75j27r6M0K28L4j70k46
$$ 437 757 449 96 55 298 236 -94 -460 -246 -7 -228 -327 -218 -8 167 40 -56 -16 212 246 76 -170
1537a70M03K04k76k94J93R3M1m57l5J72M1k49k05K59N03p0l31J71O89k5n93n4
$$ -170 233 437 161 -133 60 153 194 -263 -298 -126 -85 -334 -539 -280 223 153 -178 -7 682 657 64 10
1559A0K57J38m29n18L32O5J9m8j99M14L4p8jK72J20j27k48m8P2m1N6k12n3J59
$$ 10 267 405 -24 -542 -210 -145 -126 -174 -373 41 75 -3 -4 268 388 261 13 -35 37 -4 52 -160 -213 -54
1583e4L05j94l13LL26M8l63p5L89J85j61k07J67L63j63l55M9N23l24m93l13N35
$$ -54 251 57 -256 -253 73 121 -242 -317 72 257 96 -111 56 419 256 -99 -50 473 149 -344 -657 -122
1605a22R9l04OQ9L87J09l3j22K75J25l25j55n1J17j65k21J02r7Q6J74j85J16K45
$$ -122 -23 -327 -321 -232 155 264 231 109 384 509 184 29 -22 95 -70 -291 -189 -286 -200 -26 -211 -95 150
1628A50J74j55j81J61L1O4k69O3J19K1n8l39J79L14k89n05K73K42J6k60n9L09
$$ 150 324 169 -12 149 180 244 -25 38 157 178 120 -219 -40 274 -15 -520 -247 -5 11 -249 -308 1
1650AK87j91n4K18J41Ml35j9K77j59l36k18K80j31r0M2K0K92mJ51j54J70O9N2
$$ 1 288 97 43 261 402 406 71 52 329 170 -166 -384 -104 -235 -325 -283 -263 29 25 176 22 192 261 313
1674C13j61q9j18J23j49j31j45K06K13j20k29Q7M82k50l28J39L79rk35k0L07M5
$$ 313 152 63 -55 68 -81 -212 -357 -151 62 -58 -287 -200 282 32 -296 -157 222 213 -22 -42 265 310
1696C10ql45R1K52k45l79m8K33J25k66P9R5N4J33j06J86J50m8j60m2K7P0k06k37
$$ 310 302 -43 48 300 55 -324 -372 -139 -14 -280 -201 -106 -52 81 -25 161 311 263 103 61 88 158 -48 -285
1720b85L8O9M5k7rm4K95J7j07r4J45N1p8k52K03J06J29l87j04L15J23j92k34K54
$$ -285 -247 -178 -133 -160 -169 -213 82 99 -8 -102 43 94 16 -236 -33 73 202 -185 -289 26 149 -43 -277 -23
1744b3J08j79k19J37K48Oj74J33O8K41k98j24k5J42K8k58j96J44K24j72M7O3J02
$$ -23 85 -94 -313 -176 72 78 -96 37 105 346 48 -76 -101 41 69 -189 -385 -241 -17 -189 -142 -79 23
1767B3J91j37j4J81l3K4k08j64R8R0j66l03K61J23O3k17QM09o0r8j81J21K55j08
$$ 23 214 77 63 244 211 235 27 -137 -39 51 -115 -418 -157 -34 29 -188 -180 229 169 71 -110 11 266 158
1791A58k58K0L40q8j97m2L2J69j72k25M7J67l6j18J16J24O7O9o3O2P2R9k61j53
$$ 158 -100 -80 260 172 -25 -67 -35 134 -38 -263 -216 -49 -85 -203 -87 37 104 173 110 172 244 343 82 -71
1815g1N9K3p9k70n1K73J82j39k18L53J61j24j6p4K11q4o9j05J22K22k50j25PJ05
$$ -71 -12 11 -68 -338 -389 -116 66 -73 -291 62 223 99 83 9 220 136 67 -38 84 306 56 -69 -62 43
1839D3M4k11p5J34J24j46j14J68J68O4j61l4J81J00j18k46r9K41n1j61j83J83
$$ 43 87 -124 -199 -65 59 -87 -201 -33 135 199 38 4 185 285 167 -79 -178 63 12 -149 -332 -149
1861a49J49j77M3N6J63J67j70k8O3J85r9l84J19J43k7k89J9J30J03pj95P3K02
$$ -149 0 -177 -134 -78 85 252 82 54 117 302 203 -181 -62 81 54 -235 -216 -86 17 10 -185 -112 90
1884I0Q5k60q5K88j18N8r4MJ72j33N6j49L7P3j53o9J35J7P6j00m8P9J97Rn3O8
$$ 90 175 -85 -170 118 0 58 -36 -32 140 7 63 -86 -49 24 -129 -198 -63 -46 30 -70 -118 -39 158 167 114 182
1910A82M8r2p5n2J9nj61j90J19L17q6j37pJ87J14p1m8q0K77j63j85m2K83j43k11
$$ 182 230 138 63 11 30 25 -136 -326 -207 110 24 -113 -120 67 181 110 62 -18 259 96 -89 -131 152 9 -202
1935b02p3J89J31j31n9J87j3M0j77N1R3K49j25j74J1K54j01j07j76J17k0Q0k80
$$ -202 -275 -86 45 -86 -145 42 29 69 -108 -57 36 285 160 -14 -3 251 150 43 -133 -16 -36 44 -236
1958b36M2Q7J66j56m0J63J70mj92R9J39J4l29J40k1Q4k16j98K14L8m0q4P3J16
$$ -236 -194 -107 59 -97 -137 26 196 192 0 99 238 252 -77 63 42 126 -90 -288 -74 -36 -76 -160 -87 29
1982B9O5j54j08J89J81J2j61P8j56J13j20Np3R4o0km7j2L8N6m1q2K40J3j3j92
$$ 29 94 -60 -168 21 202 214 53 131 -25 88 -32 -27 -100 -6 -66 -68 -115 -127 -89 -33 -74 -156 84 97 84 -108
2008a08K44Q4m2k25L3J34q8k62L6N4J27k42Q3J18J66mj05o4K01J0q0q4N1k7k5
$$ -108 136 220 178 -47 -14 120 32 -230 -194 -140 -13 -255 -172 -54 112 108 3 -61 140 150 70 -14 37 10 -15
2033a5N2q9P3l3m4Q5p2K2O4o3r5J42O1n2j7l3J33N0j01k44J73N5r4jj26J97l8
$$ -15 37 -52 21 -12 -56 29 -43 -21 43 -20 -115 27 88 36 19 -14 119 169 68 -176 -3 52 -42 -43 -169 28 -10
2060a0r3J5J01J85n2j33J19N2k5k42OJ34j9l01J33K6J74r7k5J31O3q9j61J61P
$$ -10 -103 -88 13 198 146 13 132 184 159 -83 -77 57 38 -263 -130 -104 70 -27 -52 79 142 53 -108 53 60
2085F0m2R7j89M2J60k04J59k29J2J45R5j70p1O4P5j21QJ07J30j11K5pM1O4q7k14
$$ 60 18 115 -74 -32 128 -76 83 -146 -134 11 106 -64 -135 -71 4 -117 -109 -2 128 17 42 35 76 140 53 -161
2111a61K17om6j54r2K11P4n2p6K72K6j02j04R1J6m1k5l8Q7n3r6o9p3P2J04L5q7
$$ -161 56 50 4 -150 -242 -31 43 -9 -85 187 213 111 7 98 114 73 48 10 97 44 -52 -121 -194 -122 -18 17 -70
2138g0J07O0j53R1l7p0J18k0p9N8J46n7r9M1O3o0r7j0o7K6K5P4o9L04p3j82J50
$$ -70 37 97 -56 35 -2 -72 46 26 -53 5 151 94 -5 36 99 39 -58 -68 -135 -109 -84 -10 -79 225 152 -30 120
2165A20J24j49r4Ko1J3Pr4N5N8kj1j9M6J23j84R9K8P3r9L0P9p8j8L2j61J8M3j6
$$ 120 244 95 1 3 -58 -45 -38 -132 -77 -19 -21 -32 -51 -5 118 -66 33 61 134 35 65 144 66 48 80 -81 -63 -20 -36
2194c6J5p0k2J05K9j43P5J34R2l0j35L0J03j02l8k5N0J4n1k01K19q5R2l1k3P2
$$ -36 -21 -91 -113 -8 21 -122 -47 87 179 149 14 44 147 45 7 -18 32 46 -5 -206 13 -72 20 -11 -34 38
2220C8l0k7P7J26j23k11J86p5ro1j8J42j24M2J09q2PKQ5J00k37J73m0N1q7o4J18
$$ 38 8 -19 58 184 61 -150 36 -39 -48 -109 -127 15 -109 -67 42 -40 -33 -31 54 154 -83 90 50 101 14 -50 68
2247F8J1q8j07J1J17N8j50L0k9J59n0p2J44J27rk02K1L3q6J27rk97J90q4n0N1
$$ 68 79 -9 -116 -105 12 70 -80 -50 -79 80 30 -42 102 229 220 18 39 72 -14 113 104 -193 -3 -87 -137 -86
2273h6J33j42M0J12L9P0o7qPK5l7m6j91J87K0r2M8q1Q8J06j05j94R2J95kj82J69
$$ -86 47 -95 -55 57 96 166 99 91 98 123 86 40 -151 36 56 -36 12 -69 19 125 20 -174 -82 113 111 -71 98
2300I8%O9j48m2Q4O2j95k7K4P4q2j15J16K9R3j27PJ60n6O6Jl4j3R3j71j9L5l7
$$ 98 98 167 19 -23 61 123 -72 -99 -75 -1 -83 -198 -82 -53 40 -87 -80 80 24 90 91 57 44 137 -34 -53 -18 -55
2328e5P1r9m3K33P0j72k9j4N3Q8j07p8Q8L1j12n7K64M5m9k63Q7J21l3j23OM3o9
$$ -55 16 -83 -126 107 177 5 -24 -38 15 103 -4 -82 6 37 -75 -132 132 177 128 -135 -48 73 40 -83 -77 -34 -103
2355a03P6n4R0m2J24o9l8J6R2p0k9j3k7l5N7O6j55M1J49j39j1P1J11m6k0p6k5
$$ -103 -27 -81 9 -33 91 22 -16 0 92 22 -7 -20 -47 -82 -25 41 -114 -73 76 -63 -74 -3 108 62 42 -34 -59
2382e9K05k41J0O7q3Qn0J48R9Q8k34r1J10N2kj63J85R2q6j07n6J02K2J2JqL9k0
$$ -59 146 -95 -85 -18 -101 -93 -143 5 104 192 -42 -133 -23 29 27 -136 49 141 55 -52 -108 -6 16 28 29 21 60 40
2410D0mr5R1O9n6n1O7o8P1n9J6M7k3N6j85L5o8J99j78L1M9m4j2p2J79O0L6j34
$$ 40 36 -59 32 101 45 -6 61 -7 64 5 21 68 45 101 -84 -49 -117 82 -96 -65 -16 -60 -72 -144 35 95 131 -3
2438cqJ41k5j07j40pK01j06K2L4kp0j15R5kL9J04j22J62K8k0n9M5j72J47R5j45
$$ -3 -11 130 105 -2 -142 -149 52 -54 -32 2 0 -70 -185 -90 -92 -53 51 -71 91 119 99 40 85 -87 60 155 10
2465A0l8J38j36qP0j32J62k6J18k25J30m6J4m3n6N9L4j22NP7O9j76L7M1J28j04
$$ 10 -28 110 -26 -34 36 -96 66 40 158 -67 63 17 31 -12 -68 -9 25 -97 -92 -15 54 -122 -85 -44 84 -20
2491b0r0K1N8J12j85L3K8J17Q5j94P0m3N1j04L6M8j74J46p3l8N5PnJ9p0M4K5J47
$$ -20 -110 -89 -31 81 -104 -71 -43 74 159 -35 35 -8 43 -61 -25 23 -151 -5 -78 -116 -61 -54 -59 -40 -110 -66 -41 106
2519A06j74J34J6r6l9K3Nm1J4R3n6J06q3j2M4N8j58J18J4j35N6p8J07J30j70n5
$$ 106 -68 66 82 -14 -53 -30 -25 -66 -52 41 -15 91 8 -4 40 98 -60 58 72 -63 -7 -85 22 152 -18 -73
2545g3oK9Q5p1q0J07n5J39j08J18K1k40J95K1m1j38P4N5k5j47J61L6k4j12N5J90
$$ -73 -79 -50 35 -36 -116 -9 -64 75 -33 85 106 -134 61 82 41 -97 -23 32 7 -140 21 57 33 -79 -24 166
2571A66j85j4J48m7J06k36%J42J03k50l8m3K89j77Lj6JJ44n4n0lK2k7mL7O5k8
$$ 166 -19 -33 115 68 174 -62 -62 80 183 -67 -105 -148 141 -36 -33 -49 -48 96 42 -8 -11 11 -16 -20 17 82 54
2598E4l6PLl0m9J6J47j79m8N9r1M1K39k5j30p6J98r4J9q8j6J69l6k34J33J3o2
$$ 54 18 25 28 -2 -51 -35 112 -67 -115 -56 -147 -106 133 108 -22 -98 100 6 25 -63 -79 90 54 -180 -47 -34 -96
2625i6L2MQ1K4j13P4m2R9m3J7K6o1m4J15j30J66k02J51o0O3j03L5n8J78o6j55
$$ -96 -64 -60 21 45 -68 6 -36 63 20 37 63 2 -42 73 -57 109 -93 58 -2 61 -42 -7 -65 113 47 -108
2651a08J31j4j28J12k0R3r1l2R6M0j2j95Q8J39J13k42j24J34N5m3o5J57m9P5m1
$$ -108 23 9 -119 -7 -27 66 -25 -57 39 79 67 -128 -40 99 212 -30 -154 -20 35 -8 -73 84 35 110 69
2676F9m6m1l2q3N7J12O2k10J48R4r6OJ8o3N4r4Q1j09m8J43J2qP9j26J02K9j64
$$ 69 23 -18 -50 -133 -76 36 98 -112 36 130 34 40 58 -5 49 -45 36 -73 -121 22 34 26 105 -21 81 110 -54
2703e4j6M4P2k8M8p9P8n1N0q9J01J5q0qQK8j14J47l8k1L5j47K7m4J75p4l2P1L5
$$ -54 -70 -26 46 18 66 -13 65 14 64 -25 76 91 11 3 11 39 -75 72 34 13 48 -99 -72 -116 59 -15 -47 24 59
2732E9j27P2M6P6j98Q8q5K4P0q0ql2L5J58n4j06N7J4N3j54R8J06m8N0j21R7k9
$$ 59 -68 4 50 126 -72 16 -69 -45 25 -55 -63 -95 -60 98 44 -62 -5 9 62 -92 6 112 64 114 -7 90 61
2759F1k6m0j39J44Rj30j6J37J3oN8j07P9p2J04Lj56K7P6n9Pl7J19l7j60J20JJ06
$$ 61 35 -5 -144 0 9 -121 -137 0 13 7 65 -42 37 -35 69 72 -84 -57 19 -40 -33 -70 49 12 -148 -28 -27 79
2787G9o5m5Q0K7r7J42k47J91Lj81N4P6J8k3q9J15j26pomJ13r5%K9P8J56n9j26
$$ 79 14 -31 49 76 -21 121 -126 65 68 -113 -59 17 35 12 -77 38 -88 -95 -101 -105 8 -87 -87 -58 20 176 117 -9
2815iP4q6PK8Kk4m8j9Q6n5n8J26J1p1O1ljr3J57q0%Nj6RK5j04oMN3j8N4j7jO3
$$ -9 65 -21 -14 14 16 -8 -56 -75 11 -44 -102 24 35 -36 25 22 21 -72 85 5 5 10 -6 3 28 -76 -82 -78 -25 -43 11 -6 -7 56
2849E6m6k9k8mJ24j77J09J4o4L1M7m0P9j26M6l4m6J2J03k9J7k4J1Nj7J33r7J01
$$ 56 10 -19 -47 -51 73 -104 5 19 -45 -14 33 -7 72 -54 -8 -42 -88 -76 27 -2 15 -9 2 7 -10 123 26 127
2877A27k20R4p3K6j2J02oJ1Ln4N4J33p1j47M5q7KPj2N6M7q3l8k6J48k2k1P3o5
$$ 127 -93 1 -72 -46 -58 44 38 49 52 -2 52 185 114 -33 12 -75 -73 -66 -78 -22 25 -58 -96 -122 26 4 -17 56 -9
2906iO0K8j1l3J32j87K28k19J41j04l9J09r8m3J39j26M7m4jL5j0J4R9j13O8j11
$$ -9 51 79 68 35 167 -20 208 -11 130 26 -13 96 -2 -45 94 -32 15 -29 -30 5 -5 9 108 -5 63 -48
2932d8O6MkJ1m7n5J10n6j02J65l7m5l8J03k2o2J17q9J9J8O5j1p4J62j78J1n6J06
$$ -48 18 22 20 31 -16 -71 39 -17 -119 46 9 -36 -74 29 7 -55 62 -27 -8 10 75 64 -10 152 -26 -15 -71 35
2960C5m4m0O6q3L4Q2o2QKM3o1P8j29J45j11M5l1K5p4o1J36l5N4j34J84j45Q3k0
$$ 35 -9 -49 17 -66 -32 50 -12 -4 -2 41 -20 58 -71 74 -37 8 -23 2 -72 -133 3 -32 22 -112 72 -73 10 -10
2988a0O5j32k6O3j7J46m5q6R4j18j5O1Mol9M9l9Q1MP6k04L6Q0n6qO5j31J37l7
$$ -10 55 -77 -103 -40 -57 89 44 -42 52 -66 -81 -20 -16 -22 -61 -12 -51 30 34 110 -94 -58 22 -34 -42 23 -108 29 -8
3017hr9Q5k4M5L0j03J33k1j20J15k0N7k5j59J74j0j12R7j4K3p6j5%ML1O9J5lN5
$$ -8 -107 -22 -46 -1 29 -74 59 38 -82 33 13 70 45 -114 60 50 -62 35 21 44 -32 -47 -47 -43 -12 57 72 69 124
3046A24j0j37%J09m7L7p5l1o8J48r5P2n9L4k7L2oj7m6Q2p9J82j00k4J00j47L0
$$ 124 114 -23 -23 86 39 76 1 -30 -98 50 -45 27 -32 2 -25 7 1 -16 -62 20 -59 123 23 -1 99 -48 -18
3073a8R0L0k32R7K2KK8K8Kn1J4j34J02N1M3l7n8M0p8J83j32O7j2j33N6J13j42
$$ -18 72 102 -130 -33 -11 -9 19 47 49 -2 12 -122 -20 31 74 37 -21 19 -59 124 -8 59 47 -86 -30 83 -59
3100e9m5P6J9p5J34%K8j22O3R0j42L6j4l8N4n0K7J34p5n3j4rR2m7n9J29M9p4o1
$$ -59 -104 -28 -9 -84 50 50 78 -44 19 109 -33 3 -11 -49 5 -45 -18 116 41 -12 -26 -35 57 10 -49 80 129 55 -6
3129fP8m0j61J50PM1j19M5M8l7k2Q7j59%O6O5n0j9j1J1m4J38k7n7J15p9m4N9j8
$$ -6 72 32 -129 21 28 69 -50 -5 43 6 -16 71 -88 -88 -22 43 -7 -26 -37 -26 -70 68 41 -16 99 20 -24 35 17
3158A7p7J32j68J63k7r%J8j60J35ro5Q9r3M3r7M1Q3l4N1j8LJ55j95L9l4L7j0Q4
$$ 17 -60 72 -96 67 40 31 31 49 -111 24 15 -50 39 -54 -11 -108 -67 16 -18 33 15 18 173 -22 17 -17 20 10 94
3187I4k1K2jo5q0N8M2m6n6O5k1mO3r9L1M1L9K8m1l0OO2k1k4K0qm7r8J14p0m8N7
$$ 94 73 95 94 29 -51 7 49 3 -53 12 -9 -13 50 -49 -18 23 62 90 49 19 25 87 66 42 62 54 7 -91 23 -47 -95 -38
3219c8P3l8Q6j32%K2rr7J75q5n6J47n1l7L5N9o3p3J41j34O2O2kN3j54M7k4j2Q0
$$ -38 35 -3 83 -49 -49 -27 -36 -133 42 -43 -99 48 -3 -40 -5 54 -9 -82 59 -75 -13 49 47 100 -54 -7 -31 -43 37
3248C7j39J57n1n1M3N8N3j58Q6o5l8R1J3m3o0J5L1J8L4p9J37j83O5J11p5J2M1
$$ 37 -102 55 4 -47 -4 54 107 -51 35 -30 -68 23 36 -7 -67 -52 -21 -3 31 -48 89 -94 -29 82 7 19 60
3275F0j64J36j23Q0J03j31Ool9J22k7J2l8M2op3J41j09l5J06l1r5N0J44j60l7
$$ 60 -104 32 -91 -11 92 -39 -33 -39 -78 44 17 29 -9 33 27 -46 95 -14 -49 57 26 -69 -19 125 -35 -72
3301g2J4M9L9mk2l7n1J05P1n0m4J8Q8j54L7k0J9J9L4j9j09K1Q8lN4r3P4Q2q0M7
$$ -72 -58 -9 30 26 4 -33 -84 21 92 42 -2 16 104 -50 -13 -33 -14 5 39 20 -89 -68 20 17 71 -22 52 134 54 101
3331A01L7r8P8j12M3k6K4n0lk5O3j17Q5L0q2K2O1k5K0m6P1l0j41J64q4J48j17
$$ 101 138 40 118 6 49 23 47 -3 -6 -31 32 -85 0 30 -52 -30 31 6 26 -20 51 21 -120 44 -40 108 -9
3358ij0n7Q9n2N7n2J41j51M0o2R4j10N5L1L1r7k0Q4k8KP5q0J36l3j14L4M3q6P1
$$ -9 -19 -76 13 -39 18 -34 107 -44 -4 -66 28 -82 -27 4 35 -62 -82 2 -26 -24 51 -29 107 74 -40 -6 37 -49 22
3387B2K2J2o0L9l1O0n2k5KJ4P1o2q3P8p7p9K48j72J7m6J27N6mq5l7J15j03p4K03
$$ 22 44 56 -4 35 4 64 12 -13 -11 3 74 12 -71 7 -70 -149 99 -73 -56 -102 25 81 77 -8 -45 70 -33 -107 96
3416I6o1q0R3j02J80j16p4Q2j8K3O5o5k1m0j1L7O7p7k5M0P4M4j00Lj35R8j0M7
$$ 96 35 -45 48 -54 126 10 -64 18 0 23 88 23 2 -38 -49 -12 55 -22 -47 -7 67 111 11 14 -121 -23 -33 14
3444A4M7l4P1n5n6L2j30Q4J14l4j41J45j31OJ11m5l9J41qj10P9j40J35k6M8ln5
$$ 14 61 27 98 43 -13 19 -111 -27 87 53 -88 57 -74 -68 43 -2 -41 100 92 -18 61 -79 56 30 78 75 20
3471B0l8p8R5k6K4J5N2k9j19J47k2q7P5j36Q2l5J2J4k6Q9K1p7MK1n4L4L5Q7k39
$$ 20 -18 -96 -1 -27 -3 12 64 35 -84 63 41 -46 29 -107 -25 -60 -48 -34 -60 29 50 -27 -23 -2 -56 -22 13 100 -139
3500a39K22k1O%j6M0j65o4J31mK4J3o7L3k3L5l7m4L1l3J08M0j05l0j0%J46l0q1
$$ -139 83 62 68 68 52 92 -73 -137 -6 -10 14 27 -40 -7 -30 5 -32 -76 -45 -78 30 70 -35 -65 -75 -75 71 41 -40
3529d0M0JN1q3M2k9L3j8o9L9P2m8O0r1J00o4k3J03q3n7o6Q2LR0r9J39n9n6K5J9
$$ -40 0 1 52 -31 11 -18 15 -3 -72 -33 39 -9 51 -40 60 -4 -27 76 -7 -64 -130 -48 -45 45 -54 85 26 -30 -5 14
3559A4k9P7k5l4j29N9m6K08k1j28n4J61M9r3p8O0k1l5j1O3J83j35L1j37N6L2N1
$$ 14 -15 62 37 3 -126 -67 -113 95 74 -54 -108 53 102 9 -69 -9 -30 -65 -76 -13 170 35 66 -71 -15 17 68
3586F8n3N9o6j15R0j2K0LllmJ0N1k6o2j0J5k3jM6P9n5j43J52j04O7n4O0l3M7o2
$$ 68 15 74 8 -107 -17 -29 -9 -6 -9 -12 -16 -6 45 19 -43 -53 -38 -61 -62 -16 63 8 -135 17 -87 -20 -74 -14 -47 0 -62
3617f2l7N1nP7L2Lj6l2k6lP1o9J1k4Pj20J36L5j5O3Np1p2Q5j5O9Qm9j21O8lJ06
$$ -62 -99 -48 -53 24 56 59 43 11 -15 -18 53 -16 -5 -29 -22 -142 -6 29 14 77 82 11 -61 24 9 78 86 37 -84 -16 -19 87
3649H7M9q3r6J26j48M8n9m3Q5mQ0k8k1n9J20N8m2K7k25J74J04k54J62M7J0q4q5
$$ 87 136 53 -43 83 -65 -17 -76 -119 -34 -38 42 14 -7 -66 54 112 70 97 -128 46 150 -104 58 105 115 31 -54
3676e4r9J68J8N4j39J25k3j4n0l3K16j94o5J79q2O2p1o2J60o2l1l7M4j0m4kk9
$$ -54 -153 15 33 87 -52 73 50 36 -14 -47 169 -25 -90 89 7 69 -2 -64 96 34 3 -34 10 0 -44 -46 -75
3703g5K7O9j19J11j40K29l2j2j8m2J14j16j1K14k78J65j17K5M3O1n5j82J48K2
$$ -75 -48 21 -98 13 -127 102 70 58 40 -2 112 -4 -15 199 -79 86 -31 -6 37 98 43 -139 9 31
3727C1Pn5j5r4J03M0l1l0N5N2j37K5K7N5o5J12j68Q3P3n1m0J04j20N9K9p4L3Q3
$$ 31 38 -17 -32 -126 -23 17 -14 -44 11 63 -74 -49 -22 33 -32 80 -88 -5 68 17 -23 81 -39 20 49 -25 8 91
3755I1m1j09J16m7O4o8J8rJ4k8r9J60p7J03j13j8N3%mrJ1q2J55%j46O7j1Rm6J7
$$ 91 50 -59 57 10 74 6 24 15 29 1 -98 62 -15 88 -25 -43 10 10 6 -3 8 -74 81 81 -65 2 -9 0 -46 -29
3785b9k5J2MJ09r9K7J0mrO6q0l7J17j08Q5k4N4j19Q3K1mk2j5l2N7k1m0M2j02L5
$$ -29 -54 -42 -38 71 -28 -1 9 5 -4 62 -18 -55 62 -46 39 15 69 -50 33 54 50 28 13 -19 38 17 -23 19 -83 -48
3815d8R6j08J06kj23J23q5J36j61J28Qo0j54J88Pj29P8m5J19J9j2j48J76j52J8
$$ -48 48 -60 46 44 -79 44 -41 95 -66 62 70 10 -144 44 51 -78 0 -45 74 93 81 -67 109 -43 -25
3840b5j0l7J55k0L6q0P2p7l1M2K0k6mo4J10J9o0j02K26j33j49R4J19j21K2K8p2
$$ -25 -35 -72 83 63 99 19 91 14 -17 25 45 19 15 -49 61 80 20 -82 144 11 -138 -44 75 -46 -24 4 -68
3867f8J56j45J49k4M8j28PN0NJ2j62Q3n4M8K5l4L6mn2P4Nj0o%L6n1%J17l0q9R5
$$ -68 88 -57 92 68 116 -12 -5 45 50 62 -100 -17 -71 -23 2 -32 4 0 -52 22 27 17 11 11 47 -4 -4 113 83 -6 89
3898H9q4k1J62k02J13j66J21k4J45j37P4j36N4k4QP2r0J00j05m2N8m5N0R1r7r
$$ 89 5 -16 146 -56 57 -109 12 -12 133 -4 70 -66 -12 -36 -28 44 -46 54 -51 -93 -35 -80 -30 61 -36 -45
3924d5N1J21j63q9J48K1n7q1O4k0J38n4j11J20k6J10k09J22JJ2L9Ok1m1rr4n0
$$ -45 6 127 -36 -125 23 44 -13 -94 -30 -50 88 34 -77 43 17 127 -82 40 41 53 92 98 77 36 27 -67 -117
3951a17J59l9j1j9M3j2N8p8N7M5o2o7Q8p5R3m7j62J85N2o7k7P9j15N3n8P1Or3
$$ -117 42 3 -8 -27 16 4 62 -16 41 86 24 -43 45 -30 63 16 -146 39 91 24 -3 76 -39 14 -44 27 33 -60
3979f0pJ17j3l1MM1q5O3p8P8j05J51n7k8l5L1Q1j3l6l9Q8J5o5P8k8j44J77j61
$$ -60 -67 50 37 6 10 51 -34 29 -49 29 -76 75 18 -10 -45 -14 67 54 18 -21 67 82 17 95 67 -77 100 -61
4007f1J0M9J09o6k3N9l9qRm1n0J8P3j25M2J42j62l8n6K04j53J38o2oJ24j26Q5
$$ -61 -51 -2 107 41 18 77 38 30 39 -2 -52 -34 39 -86 -44 98 -64 -102 -158 46 -107 31 -31 -37 87 -39 46
4034D6j10J55j14O3j99K27l8q3J09r5K8J54j59J3lJ87j60n0O9n3J85m0o8p1P9
$$ 46 -64 91 -23 40 -159 68 30 -53 56 -39 -11 143 -16 -3 -6 181 21 -29 40 -13 172 132 64 -7 72
4059G2l6j32P5R0j6j08M4O1j05q6N2J19l2Q8q0J1N6p7j65K72l0p9q0M7P2j00J12
$$ 72 36 -96 -21 69 53 -55 -11 50 -55 -141 -89 30 -2 86 6 17 73 -4 -169 103 73 -6 -86 -39 33 -67 45
4086D5r1J45m6j42J94j37J7P4o5P1j38J24Kk9O2q6O0r5l3N9l9L6LL8o7J86p2o3
$$ 45 -46 99 53 -89 105 -32 -15 59 -6 65 -73 51 53 24 86 0 60 -35 -68 -9 -48 -12 -9 29 -38 148 76 13
4114A3o3O7N4j0n7J2KPP5p6j10J28Nq8R4o0Ql7m6n1J93p1L3L5j07m3K36j54o5
$$ 13 -50 17 71 61 4 16 18 25 100 24 -86 42 47 -41 53 -7 1 -36 -82 -133 60 -11 22 57 -50 -93 143 -11 -76
4143g6L6m9J00L4m5JP4j24O8L9On8m5jK7j4R4o2J30p6n2Rj8O8q7l5O8Q4j06M2
$$ -76 -40 -89 11 45 0 1 75 -49 19 58 64 6 -39 -40 -13 -27 67 5 135 59 7 16 -2 66 -21 -56 12 96 -10 32
4173C2j12O0J5p1J20N3Km0n8j09R8J9L4j1m5j0j08J16k3M2r6J05m4j1Kn1O5l7
$$ 32 -80 -20 -5 -76 44 97 99 59 1 -108 -10 9 43 32 -13 -23 -131 -15 -38 4 -92 13 -31 -42 -40 -91 -26 -63
4201f3J97j06r9R3Q4o6k09O4NJ91j25L0L1n4J4pP3Lj07J34q6Q5l9Rn9lj7K1J1
$$ -63 134 28 -71 22 106 40 -169 -105 -100 91 -34 -4 27 -27 -13 -20 53 56 -51 83 -3 82 43 52 -7 -10 -27 -6 5
4230Eo1j2Q1J0k7l0Q2j07P7%Nq8M5R0p4o1r3K03q7N9m6M4J0M2l3M6p0M6r6P6P3
$$ 5 -56 -68 13 23 -4 -34 48 -59 18 18 23 -65 -20 70 -4 -65 -158 45 -42 17 -29 15 25 67 34 80 10 56 -40 36 109
4261A09j93J11k9L7r3L6P2o7O3j2j35K6J86j59Q4j7j44K02j7j15oJ7J15j14L3
$$ 109 -84 27 -2 35 -58 -22 50 -17 46 34 -101 -75 111 -48 36 19 -125 77 60 -55 -61 -44 71 -43 -10
4286a0L6p6Q4k3l6O6k2l5J16o4K0K4m1Pn6Q3k08Q2N1M2QK0j6J4Lj38O0O0o1k0
$$ -10 26 -50 34 11 -25 41 19 -16 100 36 56 80 39 46 -10 73 -135 -53 -2 40 48 68 52 66 69 -69 -9 51 -10 -30
4316c0nO7m3O7r1n0N3LJ6%m3J18q3M0Q0Jk9n9r3P0N8q5K9P8l8jL3q6J9n9J85p5
$$ -30 -35 32 -11 56 -35 -85 -32 -29 -13 -13 -56 62 -21 19 99 100 71 12 -81 -11 47 -38 -9 69 31 30 63 -23 -4 -63 122 47
4348D7k3J2p1l8N8oK8m%o1R4r2O1J6J5K7j7k8l4N5o1M4J3o0m1M1o8M0R1O1j22
$$ 47 24 36 -35 -73 -15 -21 7 3 3 -58 36 -56 5 21 36 63 46 18 -16 39 -22 22 35 -25 -66 -25 -93 -53 38 99 -23
4379b3J35j9r1p6M1O6RL9o2N6Q1j07k8j2n9N4o4K3J2P7l1q8M3rL5r7jJ79q2K2
$$ -23 112 93 2 -74 -33 33 42 81 19 75 156 49 21 9 -50 4 -60 -37 -25 52 21 -67 -24 -33 2 -95 -96 83 1 23
4409B3n5M9J15k04J40j12O3M7j32k6L8O1Po7J50p7J10j76m6Q9r5J43R7r1j00m
$$ 23 -32 17 132 -72 68 -44 19 66 -66 -92 -54 7 14 -53 97 20 130 -46 -92 -3 -98 45 142 51 -49 -53
4435e3R3j27O0J9P4l7k3n9l6J71p4r9Q3Q3k4k8J1k9K7p9J83j68K1L6Q5l15J77
$$ -53 40 -87 -27 -8 66 29 6 -53 -89 82 8 -91 -8 75 51 23 34 5 32 -47 136 -32 -11 25 110 -205 -28
4462b8P3n2M6n0LJ61j33o8R0j07k3M3L3j05J70q3m0m6J00P8j44J00r5ok9J41p
$$ -28 45 -7 39 -11 -8 153 20 -48 42 -65 -88 -45 -12 -117 53 -30 -70 -116 -16 62 -82 18 -77 -83 -112 29 22
4489B2N2Pr3qO0M3r1l0M3m8J11j39J03J40j90n6RJ29m3L1N6j95J15l3j7R0l6M7
$$ 22 74 81 -12 -20 40 83 -8 -38 5 -43 68 -71 32 172 -18 -74 -65 64 21 52 108 -87 28 -5 -22 68 32 79
4517G9r7mJ16n5k9k8l1J3P8j25P7m9J01j41R1L4k9j07R6nR1p4o3J4Q4l1J23j24
$$ 79 -18 -22 94 39 10 -18 -49 -36 42 -83 -6 -55 46 -95 -4 30 1 -106 -10 -15 76 2 -61 -47 37 6 129 5
4545EQk1l6l2P7J02p9m0J5l0Kk2N4n2N2n0K4J6q2M6P8m5L6k4K6oj00O0K0kP2j57
$$ 5 13 -8 -44 -76 1 103 24 -16 -1 -31 -29 -51 3 -49 3 -47 -23 -7 -89 -43 35 -10 26 2 28 22 -78 -18 2 0 72 -85
4577h5Q4r0N3O2m1P9k7Np0K9m0J40j76J07om1O0qk4J15j75R1j06J30pMN3j64J67
$$ -85 -1 -91 -38 24 -17 62 35 40 -30 -1 -41 99 -77 30 24 -17 43 35 11 126 -49 42 -64 66 59 63 116 -48 119
4606A19r8Mr4J03P7j95l0J4L4J48o3M9j1j55O6JLlK9l7R2m3o1k8M4J7%R0r6L2
$$ 119 21 25 -69 34 111 -84 -114 -100 -66 82 19 68 57 -98 -32 -31 -28 -31 -2 -39 53 10 -51 -79 -35 -18 -18 72 -24 8
4636HK3j6M4m4N8m4N8l8m7r2J79m4j52Q8O2n1j28J24o0O8K3p0j16J99Ll1n6N6
$$ 8 31 15 59 15 73 29 87 49 2 -90 89 45 -107 -19 43 -8 -136 -12 -72 -4 19 -51 -167 32 35 4 -52 4
4664DJ9n5R8r1L5L5n8M9k7j4K1L4j14L4N2M2k9l2n9N3L6M1k4om7n4P8R6j45l3
$$ 4 23 -32 66 -25 10 45 -13 36 9 -5 16 50 -64 -30 22 64 35 3 -56 -3 33 74 50 44 -3 -57 21 117 -28 -61
4694f1JO2n1j5MO6K8K1j45L4J50k11J60P3j27l0j2O0j35J56K5j08N1k8m1Q5m6
$$ -61 -60 2 -49 -64 -60 6 34 55 -90 -56 94 -117 43 116 -11 -41 -53 7 -128 28 53 -55 -4 -32 -73 12 -34
4721c4N3j14l4J74Q1k24L9J5J18j12J21q1p4P4o6k2L9J0j1K3O3o0M1k0k5O7p1
$$ -34 19 -95 -129 45 126 -98 -59 -44 74 -38 83 2 -72 2 -64 -86 -47 -37 -48 -25 38 -22 19 -1 -26 41 -30
4748c0J29m2nM8l2j06J8Q9n6J8p3O7m3N3K7p3l9NP5n9Q1q3J25k03J07K8q0J19
$$ -30 99 57 52 100 68 -38 -20 69 13 31 -42 25 -18 35 62 -11 -50 -45 30 -29 52 -31 94 -109 -2 26 -54 65
4776F5j4q7N7j88J70k1l3P2l6j8J70m8m7L4m0k6j84J53R1o2OJ8l8q3J48n6k8Q1
$$ 65 51 -36 21 -167 3 -18 -51 21 -15 -33 137 89 42 76 36 10 -174 -21 70 8 14 32 -6 -89 59 3 -25 56
4804E6m1n5P2Mj80J80l7L2m6O0J1j0o9j12M7J36l0m9m4j4J18n1m2jJ20k8mj1M4
$$ 56 15 -40 32 36 -144 36 -1 31 -15 45 56 46 -23 -135 -88 48 18 -31 -75 -89 29 -22 -64 -65 55 27 23 12 56
4833E6K8q0K2j4lJ31o7l1j2j1j5P7q4J42j22Q3n3J8p4M1J7n3O4j73k1J41j19J09
$$ 56 84 4 26 12 9 140 73 42 30 19 4 81 -3 139 17 100 47 65 -9 32 49 -4 60 -113 -134 7 -112 -3
4861cR3j43J04j91K18j52J5O7m2o0J12k0K2K9o9J0k7L7J11p2o3M8j2K8k5L2M3
$$ -3 90 -53 51 -140 78 -74 -59 8 -34 -94 18 -2 20 49 -20 -10 -37 0 111 39 -24 24 12 40 15 47 90
4888I0l5n4N7j96J53J2k4R5j01P0m9l7J30j38m0O1p2J53N7n9J4j68NP0L1n4J07
$$ 90 55 1 58 -138 15 27 3 98 -3 67 18 -19 111 -27 -67 -6 -78 75 132 73 87 -81 -76 -6 25 -29 78
4915G8j19R8j38J31r3n9Q1N3ro1K9J25j72J29j0p3M3j35Q0j3l7M9JM3r1R2o3Q7
$$ 78 -41 57 -81 50 -43 -102 -21 32 23 -38 -9 116 -56 73 63 -10 33 -102 -22 -35 -72 -23 -22 21 -70 22 -41 46
4943D6o3P1l6L7n4P3o8O9m3L8r1J3l6M1On6R1j12P3L8n6OO4j00J28m5pK6K2j1
$$ 46 -17 54 18 55 1 74 6 75 32 70 -21 -8 -44 -3 3 -53 38 -74 -1 37 -19 -13 51 -49 79 34 27 53 75 64
4973F4n4j92J59J7j0Qj13J74j9l7J7j22J33p7rJ25p2rM5r4O5q2J03j63R6oO8N8
$$ 64 10 -182 -23 -6 -16 -8 -121 53 34 -3 14 -108 25 -52 -61 64 -8 -17 28 -66 -1 -83 20 -143 -47 -53 15 73
5001G3j08Q7k1j0K1o1J21j19L7l9P6o2R1m1mJ4l8j16J28k2m8j2r1J84o9J29k0
$$ 73 -35 52 31 21 42 -19 102 -17 20 -19 57 -5 86 45 41 55 17 -99 29 7 -41 -53 -144 40 -29 100 80
5028H0j31q8J34J04j76J06m0pm8J21o1M2r5k8R2r3O3J4m8J51j59J54j85J20m5
$$ 80 -51 -139 -5 99 -77 29 -11 -18 -66 55 -6 36 -59 -87 5 -88 -25 -11 -59 92 -67 87 -98 22 -23
5053b3J7L9j7k3o5J00j12L7l1Q2j13j8J36Q3j13Ok3R0rq3J2k7K2O4n6M0l1Q8o0
$$ -23 -6 33 16 -7 -72 28 -84 -47 -78 4 -109 -127 9 92 -21 -15 -38 52 43 -40 -28 -55 -33 31 -25 15 -16 72 12
5082A2j70J49Nk4J84j90LQ0L0o3j24Q6j6K4m8j8K30j41R5p3L7l9q5l3MJ07j36
$$ 12 -158 -9 -4 -28 156 -34 -31 49 79 16 -108 -22 -38 -14 -62 -80 150 9 104 31 68 29 -56 -89 -85 22 -114
5109a14k5R2k6Q8p9K06k27L3k5J24o9m7P0m0r2K25k6j44l0J61L3j23r5J54ol4
$$ -114 -139 -47 -73 15 -64 142 -85 -52 -77 47 -22 -69 1 -39 -131 94 68 -76 -106 55 88 -35 -130 24 18 -16
5135a6q9J61p0j09K15mj46P1l2j12R6J21j20R4j19J56j84O7m2P2J4o5J03p2L0
$$ -16 -105 56 -14 -123 92 88 -58 13 -19 -131 -35 86 -34 60 -59 97 -87 -20 -62 10 24 -41 62 -10 20
5160B0L0r9R8m2m1P8J1rj06J02m1K1j4LM4M8k3l8l0M1Jn8N8j04K2l5O4k0O8M2
$$ 20 50 -49 49 7 -34 44 55 46 -60 42 1 22 8 11 55 103 80 42 12 53 54 -4 54 -50 -28 -63 1 -19 49 91
5190I1j72K40j97Q8j5N9K5q3r9Q8Kk7%j02J94q9j1L7rj50J19j2K8L5J2j6l1K7
$$ 91 -81 159 -38 50 35 94 119 36 -63 25 27 0 0 -102 92 3 -8 29 20 -130 -11 -23 5 40 52 36 5 32
5218C2nj02J83j35O2L1o3O6O0j65L4N0J6p7L3Po2R0J5j63K43j73K8k5n3O6oln8
$$ 32 27 -75 108 -27 35 66 3 69 129 -36 -2 48 64 -13 20 27 -35 55 70 -93 150 -23 5 -20 -73 -7 -13 -16 -74
5247g4N0P1l1O9m5k2rj5kR9j4j11K9L8K9k0l3N3j40O8O5j4j5nQl8j8P6M9q1n0
$$ -74 -24 47 16 85 40 18 9 -6 -8 91 77 -34 -5 33 62 42 9 62 -78 -10 55 41 26 21 29 -9 -27 49 98 17 -33
5278c3Rk9R7o1P8j65J14O7q9lK9j11R6lN2p8L6q3P4q7M9RR2p8O9j25Q6j42J78
$$ -33 -24 -53 44 -17 61 -104 10 77 -12 -15 14 -97 -1 -4 48 -30 6 -77 -3 -90 -41 -32 60 -18 51 -74 12 -130 48
5307D8l6r8J64o3o5oJ14m8Q3n7j54K52n5j45N2k5L6r3P0p1R1M7q0L4jM6n8J76
$$ 48 12 -86 78 15 -50 -56 58 10 93 36 -118 134 79 -66 -14 -39 -3 -96 -26 -97 -6 41 -39 -5 -6 40 -18 158
5335A58k15J12Lj03O1LN8k8l2J6l2O8j94j6J81l1Q6r3J3lNj21O8J28j13Mo2J77
$$ 158 -57 55 58 -45 16 19 77 49 17 33 1 69 -125 -141 40 9 95 2 15 12 17 -104 -36 92 -21 -17 -79 98
5363I8k32Q6P6qN7j28N8p1qJ3r5J55l1N5k0l1N7J7oo1L4j6J19n9r0K8l2J5j8O4
$$ 98 -134 -48 28 20 77 -51 7 -64 -72 -59 -154 1 -30 25 5 -26 31 48 42 -19 15 -1 118 59 -31 -3 -35 -20 -38 26
5393B6l4J30j14O5p6M8m0J5L2p7M2Qq4J14n2j41J66Lm2k2Q9l3J4K6j10J38%j09
$$ 26 -8 122 8 73 -3 45 5 20 52 -25 17 25 -59 55 3 -138 28 31 -11 -33 56 23 37 63 -47 91 91 -18
5421a8J53j82l1J09K4l2n1J5L3j08J00j24J45J4j03J00P8j03l8K6p9J18n4P3r5
$$ -18 135 -47 -78 31 55 23 -28 -13 20 -88 12 -112 33 47 -56 44 122 19 -19 7 -72 46 -8 65 -30
5446c0l2J6k1J8m1O6M4j0j08Q5p0Q8m8L8Kr1N6N7j27R9l1jmJ06o8Q1J1n9K5o9
$$ -30 -62 -46 -67 -49 -90 -24 20 10 -98 -13 -83 5 -43 -5 -3 -94 -38 19 -108 -9 -40 -41 -45 61 -7 74 85 26 51 -18
5476a8K8p7mJ94j28r4J05k2R4k05J63l6m7O0j28J62L8r3qJ7j4Q1p1k4L4O0l3q3
$$ -18 10 -67 -71 123 -5 -99 6 -16 78 -127 36 0 -47 13 -115 47 85 -8 -16 1 -13 68 -3 -27 7 67 34 -49
5504d9kJ02J0rj5j28L9K8j02J0J82L0J2j9j19M9J1p8M4m7Ro3J44o7L0J2P7k92
$$ -49 -51 51 61 52 37 -91 -52 -24 -126 -116 66 96 108 89 -30 19 30 -48 -4 -51 -42 -105 39 -28 2 14 91 -201
5532b01J91Mk9j1R5n3l8P3m9O6l5J6j21N4R4j03%J09j1N5j38J66k39J70k10J20
$$ -201 -10 -6 -35 -46 49 -4 -42 31 -18 48 13 29 -92 -38 56 -47 -47 62 51 106 -32 134 -105 65 -145 -25
5558b5n6M8N9k5O6O2j69N2N4m8n2J4k7k9Q0k2J04j34KK7J3o0M6N7n8J4p6l2N7
$$ -25 -81 -33 26 1 67 129 -40 12 66 18 -34 -20 -47 -76 4 -18 86 -48 -46 -19 -6 -66 -20 37 -21 -7 -83 -115 -58
5587e8l3j2L3R9o4r6Q1O9j9j5lm2LM1Q9j17P9n1J0J14j11k4M1M3o3n0KP6k9j04
$$ -58 -91 -103 -70 29 -35 -131 -50 19 0 -15 -18 -60 -57 -16 73 -44 35 -16 -6 108 -3 -27 14 57 -6 -56 -54 22 -7 -111
5617a11J27N6j63K6L4N7l5N4N4n7j28J21P7j43L3%R3J3m9q8O5j14J34j9m6k7L5
$$ -111 16 72 -91 -65 -31 26 -9 45 99 42 -86 35 112 -31 2 2 95 108 59 -29 36 -78 56 37 -9 -36 -1
5644aPL0lo8P6k3n8O1n8l3R8M3j01k9N3j3Lm0J31j34Jm7J80m2p4pO0k8k2O7K5
$$ -1 6 36 33 -35 41 18 -40 21 -37 -70 28 71 -30 -59 -6 -19 -16 -56 75 -59 -58 -105 75 33 -41 -48 12 -16 -38 29 54
5675E4K2j83J40N7j10kk2L5k7L8l9P3m9M8j64J88j33J26M1n3L7j47J99j21m1j17
$$ 54 76 -107 33 90 -20 -22 -44 -9 -36 2 -37 36 -13 35 -129 59 -74 52 93 40 77 -70 129 8 -33 -150
5701a50K49m9r9P6j03N3n2R8j60J11L6N0m5jm3Q9jm8m8pk3nJ03k0k3J9n7M0Q1
$$ -150 99 50 -49 27 -76 -23 -75 23 -137 -26 10 60 15 14 -29 60 59 11 -37 -44 -67 -72 31 11 -12 7 -50 -10 71
5730G1r0J3L5j45J64j32QQ0n3kN8j12R5j1J1r2l7J61j6nj45J10J9O0m6O8Rj03
$$ 71 -19 -6 29 -116 48 -84 -76 4 -49 -51 7 -105 -10 -21 -10 -102 -139 22 6 1 -144 -34 -15 45 -1 67 76 -27
5758b7J11j55kk9L6O1J7P8k2j60J86r8q5J5O8J05p3Rq7Q0j69O8J9P3n7l0O6l0
$$ -27 84 -71 -73 -102 -66 -5 12 90 68 -92 94 -4 -89 -74 -6 99 26 35 -52 28 -141 -73 -54 19 -38 -68 -2 -32
5786c2P3j10L2O5n8Q3j35J33j04J04j22O7n8L6M5pn1J60j36NP8%o8N2p9M8L7K7
$$ -32 41 -69 -37 28 -30 53 -82 51 -53 51 -71 -4 -62 -26 19 12 -39 121 -15 -10 68 68 0 52 -27 21 58 85
5814H5jj16J13k2Ol7J0p2J13k2k7l3moJ7Nm8N2kp3mJ10j04J11p7j64J64p3J63
$$ 85 84 -32 81 59 65 28 38 -34 79 57 30 -3 -7 -13 4 9 -39 13 11 -62 -66 44 -60 51 -26 -190 -26 -99 64
5843F4j24R5Kl5P7l3mlJrj7J5K6K8l6L5k49K20p1jJ7jl1l7N1N3l3r2pJ29Mq5J05
$$ 64 -60 35 37 2 79 46 42 39 40 31 14 29 55 83 47 82 -167 53 -18 -19 -2 -3 -34 -71 -20 33 0 -92 -99 30 34 -51 54
5876E4J3k1l0jn4J13r5J07j83K17q6n3O8l2q7K2K5PJ15j07PlP9j5j7n8l2N3K1
$$ 54 67 46 16 15 -39 74 -21 86 -97 120 34 -19 49 17 -70 -48 -23 -16 99 -8 -1 -4 75 60 43 -15 -47 6 27
5905B7j33J45No1J3k2j28K10j8L4n1k4J5m1R5j07p5J46kn5lK6J06m6m2l2M7q0
$$ 27 -106 39 44 -17 -4 -26 -154 56 38 72 21 -3 12 -29 66 -41 -116 30 28 -27 -30 -4 102 56 14 -18 29 -51
5933e1K1J03j24M5q7J00K35k83J10p0L7j05J1N4j2Q3j49l3m3J75L5n4q0K7Q5L0
$$ -51 -30 73 -51 -6 -93 7 242 -41 69 -1 36 -69 -58 -4 -16 67 -82 -115 -158 17 52 -2 -82 -55 30 60
5959F0j13LJ12r2J1J53j33mJ1nJ4k0J11j61J22o3N6QJ1n7L7J2n3k7Q6%j67O4N7
$$ 60 -53 -50 62 -30 -19 134 1 -3 8 3 17 -3 108 -53 69 6 62 70 81 24 61 73 20 -7 79 79 -88 -24 33
5988C3M2l9Qr9l7l0L5l1K04j05J5l9P9Pj89J16M4p6K7jK05k01Q0j3j0JM6J9j24
$$ 33 75 36 44 -55 -92 -122 -87 -118 86 -19 -4 -43 36 43 -146 -30 14 -62 -35 -36 169 -32 48 35 25 26 72 91 -33
6017c3P8L2k5n2K2N2r7K4J13j43p8R5N3o5k3pP9j21J30K4n5K6l7m8O1nK5j50K03
$$ -33 45 77 52 0 22 74 -23 1 114 -29 -107 -12 41 -24 -47 -54 25 -96 34 58 3 29 -8 -56 5 0 25 -125 78
6046G8j26P4o1m0M2P2r2M5Q8J5n4j70J50K3M3r9p0J65p6OJ3n6k3J11J6l5j12O5
$$ 78 -48 26 -35 -75 -33 39 -53 -8 80 95 41 -129 21 44 87 -12 -82 83 7 13 26 -30 -53 58 74 39 -73 -8
6074hL9q5JL5n4N3j12J64r4N8j3p4J02k8J7o0P6o3M5P8j97J02QP6k9M9j71J02
$$ -8 31 -54 -53 -18 -72 -19 -131 33 -61 -3 -16 -90 12 -16 1 -59 17 -46 -1 77 -120 -18 -10 66 37 86 -85 17
6102A7q5Q6Jr2L4P6J8q1K0J37q7r5N7j11J47k0j8j24O2J42m7l2qO7j47J26n6K7
$$ 17 -68 18 19 -73 -39 37 55 -26 -6 131 44 -51 6 -105 42 22 4 -120 -58 84 37 5 -3 64 -83 43 -13 14
6130A4n3N7J3j10J4jK6Q1o0P0l8k12K70J04p5p1k2k7Q1j5J16k31P4Nj19N4J41
$$ 14 -39 18 31 -79 -65 -66 -40 41 -19 51 13 -199 71 175 100 29 7 -20 61 46 162 -69 5 10 -109 -55 86
6157H6j14m8R9N3j07K0l5O6o4l9M9R1m6j8K5o2P3n6O1m3N2n8J50r6q0O3j40J13
$$ 86 -28 -76 23 76 -31 -11 -46 20 -44 -83 -34 57 11 -7 18 -44 29 -27 34 -9 43 -15 135 39 -41 22 -118 -5
6185eL5j27l0J51l7l1N4l5Q5p1J02j14m2J46q6R7r0L0k6l9j4J9j03O0J00l4K9
$$ -5 30 -97 -127 24 -13 -44 10 -25 60 -11 91 -23 -65 81 -5 92 2 32 6 -33 -47 -28 -131 -71 29 -5 24
6212B4k8L7j6K3j50N8O0P7o9kKj0K4N7L7k17Q8l6k4J23j8j28J07o0rM5qN2p0J1
$$ 24 -4 33 17 40 -110 -52 8 85 16 14 16 6 30 87 124 -93 -5 -41 -65 58 40 -88 19 -41 -50 -5 -13 39 -31 -20
6242b0N2m2k6L1R5q0l3m6Ln8J58K3r9J2J19j76M4R0q7Q5L6j72J05K3J5k6J26j20
$$ -20 32 -10 -36 -5 90 10 -23 -69 -66 -124 34 57 -42 -30 89 -87 -43 47 -40 45 81 -91 14 37 52 26 152 32
6270C2J5o1RJ7o0rN9k1J06qj4M6r2k3l7n5J08M3P6k10P6N7k9K1j68P8N2O5o5Q
$$ 32 47 -14 -5 12 -48 -57 2 -19 87 79 65 111 19 -4 -41 -96 12 55 131 -79 -3 54 25 46 -122 -44 8 73 8 16
6300A6j08K0R2pj5Lmk2NQ0k3q2Q6l5M5j17N5J75j74j8M4j54K36q0l9j30P7J8N7
$$ 16 -92 -72 20 13 -2 1 -3 -25 -20 60 37 -45 41 6 51 -66 -11 164 -10 -28 16 -138 98 18 -21 -151 -74 -56 1
6329AR2k33Q8Rl2R6o4m6J08N2j01J25o9k8M8o1N1r0K3k5M3OLM1p5M2N9J20j35
$$ 1 93 -140 -52 -43 -75 21 -43 -89 19 71 -30 95 26 -2 46 -15 36 -54 -31 -56 -13 -7 -4 37 -38 4 63 183 48
6358D8p5mM8R7j64O4p0O3j5L9l9J1O8m1n8r9O2J42j36Q9nk8j25J27k2J9j6n9J36
$$ 48 -27 -31 17 114 -50 14 -56 7 -8 31 -8 3 71 30 -28 -127 -65 77 -59 30 25 -3 -128 -1 -23 -4 -20 -79 57
6387E7q8K5j1q9J85o7q2J01m2j02J30n3%K5Q6j36J32j19O8j3k9P8p5K8k1J1k8
$$ 57 -31 -6 -17 -106 79 12 -70 31 -11 -113 17 -36 -36 -11 75 -61 71 -48 20 7 -22 56 -19 9 -12 -1 -29
6414b9n6J64k2j97J55m6N8l1M0K3q1L5Q5j52Q7m1jk8Q0P2k46K19mr8M5j43J50
$$ -29 -85 79 57 -140 15 -31 27 -4 36 59 -22 13 98 -54 33 -8 -9 -37 43 115 -131 88 84 -14 31 -112 38
6441C8R0j58m8Q0O3K6j31K5P8o6n4J11l1MQ8p1k12J75J9n3JpK9n0LJ89k60N6J28
$$ 38 128 -30 -78 2 65 91 -40 -15 63 -3 -57 54 23 27 115 44 -168 7 26 -27 -26 -33 -4 -54 -51 138 -122 -66 62
6470F2o6N7R5q1j60l0K0J01k6J11k4k3j46J48n7J3J0p2L2J28q3n3k6Q1n8N7nO
$$ 62 -4 53 148 67 -93 -123 -103 -2 -28 83 59 36 -110 38 -19 -6 4 -68 -36 92 9 -44 -70 11 -47 10 5 11
6498A1J9m5P7n4k8J07k38K03o5k3m1k7J85j32J16K5j75O7Qqp1P8k7L8j2l6J31
$$ 11 30 -15 62 8 -20 87 -151 52 -13 -36 -77 -104 81 -51 65 90 -85 -18 -10 -18 -89 -11 -38 0 -12 -48 83
6525H3q7p2N4J16k23R9o1J05j7N6j27J24r2P1J6J8m5m6P4n8nP0j47M7Q4j8m5m1
$$ 83 -4 -76 -22 94 -129 -30 -91 14 -3 53 -74 50 -42 29 45 63 18 -28 46 -12 -17 53 -94 -47 37 19 -26 -67
6553f7J45j02O1o6O9M9l2m0k2J%O3o8L3k2J3K0q2O1N1p7qj40J24j4J3j6kqJ75
$$ -67 78 -24 37 -29 40 89 57 17 -5 -4 -4 59 -9 24 2 15 35 -47 14 65 -12 -20 -160 -36 -50 -37 -53 -55 -63 112
6583A12m3m8n9K4K5l3Q9n0j29J12j46J5O2P9RNm0K8NN3n1m1O2n4N4p3J36n8j16
$$ 112 69 21 -38 -14 11 -22 67 17 -112 0 -146 -131 -69 10 19 24 -16 12 17 70 19 -22 40 -14 40 -33 103 45 -71
6612g1J8J73j7j24J9n9M8Q1m4n4J17j22O2J2j26L9Q3l6pk4K5M7j71J04M4m1q2
$$ -71 -53 120 103 -21 -2 -61 -13 68 24 -30 87 -35 27 39 -87 -48 35 -1 -8 -32 -7 40 -131 -27 17 -24 -106
6639a06R8K5K5m1q0l8J45J7j2q6PM6k8k9J25o1Oq8J2K3j1J12l4k8j2jM7Ko1M5
$$ -106 -8 17 42 1 -79 -117 28 45 33 -53 -46 0 -28 -57 68 7 13 -75 -63 -40 -51 61 27 -1 -13 -14 33 35 -26 19
6669A9j4l3L4L1p7K06j17k8O2j88j8J72Ln0m6J26q1k0Q0o8m4J8J3Q2j12n7J62
$$ 19 5 -28 6 37 -40 166 49 21 83 -105 -123 49 52 2 -44 82 1 -19 61 -7 -51 -33 -20 62 -50 -107 55
6696E5p6JL7K8J3j04N3M0o1ON8p7M0j06J20j2m3O4q1lJ1N6J1n6Q7o8J3j27L9J16
$$ 55 -21 -20 17 45 58 -46 7 47 -14 -8 50 -27 13 -93 27 15 -28 36 -45 -48 -37 19 30 -26 61 -7 6 -121 -82 34
6726C4Lj21J26k9QJ4Lp2j18J62k6k5p1P9Nj15J37l4Q5k2o8O6j61J06Q3p0o3J32
$$ 34 37 -84 42 13 21 35 38 -34 -152 10 -16 -41 -112 -33 -28 -143 -6 -40 45 23 -45 21 -140 -34 49 -21 -84 48
6754D8j87J04O0l1p3P1n9O1J1j4p1P0p2M2J01p2j8OJ2m2N3o3J40m8K1%j16O7n2
$$ 48 -139 -35 25 -6 -79 -8 -67 -6 5 -9 -80 -10 -82 -40 61 -11 -29 -23 -11 -53 0 -63 77 29 50 50 -66 1 -51
6783e1O4N2J0p5M5j8j08J30m5%Q3j52Q8j36O9pJ15o0l8k1M0N6l0M3m6k2J00j09
$$ -51 13 65 75 0 45 27 -81 49 4 4 87 -65 23 -113 -44 -51 64 4 -34 -55 -15 41 11 54 8 -14 86 -23
6811b3P9p6J15l8n6l0K5qL0m5o8Q8J7J71j45m2jr9O2k8Q7o9L9j8J8l2m0K07j92
$$ -23 56 -20 95 57 1 -29 -4 -12 18 -27 -95 -7 10 181 36 -6 -7 -106 -44 -72 15 -54 -15 -33 -15 -47 -87 120 -72
6840g2k6J42j01n8J97o8m0k9l8ON2J72j15r0Q3K0r7K7OL9J0J0J13k17J20O8n8
$$ -72 -98 44 -57 -115 82 14 -26 -55 -93 -87 -35 137 22 -68 15 35 -62 -35 -29 10 20 30 143 -74 46 114 56
6867E6q5k7l1O4m6nK8L9J00Pr9O6o9J8m2J2K9j05M0L7N5j7rO5j62j4N1P6pjJ00
$$ 56 -29 -56 -87 -23 -69 -74 -46 -7 93 100 1 67 -2 16 -26 -14 15 -90 -50 -13 42 25 16 81 -81 -95 -44 32 25 24 124
6898A24j2j63J19r4J62j33lQ9r3k5kJk3P8J8j49K3J27Q5k08O2m4R9N8p0q7R5j26
$$ 124 112 -51 68 -26 136 3 0 89 -4 -29 -31 -30 -53 25 43 -106 -83 44 129 -79 -17 -61 38 96 26 -61 34 -92
6926i2O4l6J26l4o9N7J0j18m0J68j02j0J16J1j79J20lK1M3K7j84J02M6J9Ol1q4
$$ -92 -28 -64 62 28 -41 16 26 -92 -132 36 -66 -76 40 51 -128 -8 -11 10 53 80 -104 -2 44 63 69 38 -46
6953d6P1o9J6P0p5J4Q2j03Nn0J09j06N2QJ2n6J25q6P1M4M3j27m8L0Q6p3n6Q7m5
$$ -46 25 -44 -28 42 -33 -19 63 -40 -35 -85 24 -82 -30 -22 -10 -66 59 -27 44 88 131 4 -44 -14 72 -1 -57 30 -15
6982a5J11p5Lr9J36m5k3L0j10L5J48j24J05l7o0J29q9K8k3M9j57P9k8M1NM4o0
$$ -15 96 21 24 -75 61 16 -7 23 -87 -52 96 -28 77 40 -20 109 20 48 25 74 -83 -4 -32 9 14 58 -2
7009bpj16J56P2mk39N5J35j15R6N2j8r2KN4M3j13L0M9n3R3j4p5kJ6l6J14m3o1
$$ -2 -9 -125 31 103 99 -140 -85 50 -65 31 83 65 -27 -25 29 72 -41 -11 38 -15 78 64 -11 -13 3 -33 81 38 -23
7038b3q1J13j3j1J19r8o1O5q7O3m9J60p3j23J65q7N2nk8J9o7k9M8n0O6JJ6N6l3
$$ -23 -104 9 -4 -15 104 6 -55 10 -77 -14 -63 97 24 -99 66 -21 31 26 -2 17 -50 -79 -31 -81 -15 -14 2 58 25
7067B5J6M2q2j3m2q3J40o2J33k6K5l3M1k5j48kP7%Q8ko8nN3j6p1J7J35k01N4R8
$$ 25 41 83 1 -12 -54 -137 3 -59 74 48 73 40 81 56 -92 -94 -17 -17 71 69 1 -4 49 33 -38 -21 114 -87 -33 65
7097F5P3o3o5kok8QQ1p6Op0K38j83L4l4J3J13j35l7J30J7k1l6M7j58N2L8J32L3
$$ 65 138 75 10 8 2 -26 -18 63 -13 -7 -77 161 -22 12 -22 -9 104 -31 -68 62 79 58 22 69 -89 -37 1 133 166
7126A66k82Q5J22o3O1j28N7j28J42n9K5r2L7J69j51J08j5j62J5L3J47j31L3j6
$$ 166 -116 -31 91 28 89 -39 18 -110 32 -27 -2 -94 -57 112 -39 69 54 -108 -93 -60 87 -44 -11 -27
7150b7p2NJ45k3Pn1o0O1R2j27OL5P7j6n3l1J1o0J33L2k4p2o1J08n7P5j24m8J03
$$ -27 -99 -94 51 28 35 -16 -76 -15 77 -50 -44 -9 68 52 -1 -32 -21 -81 52 84 60 -12 -73 35 -22 53 -71 -119 -16
7179a6k8J8P0r4k9P6j4M2N7o0l2P2L1o5K3M9j15pO4M0j07L1q2J34j42P4l4J13
$$ -16 -44 -26 44 -50 -79 -3 -17 25 82 22 -10 62 93 28 51 100 -15 -22 42 82 -25 6 -76 58 -84 -10 -44 69
7207F9j27k7J49l6l8Qj2m5j5M6J10j8j37N5l6J53q1n3R1k2o6nL1L2pl4j9M7qm4
$$ 69 -58 -85 64 28 -10 -2 -14 -59 -74 -28 82 64 -73 -18 -54 99 18 -35 56 34 -32 -37 -6 26 19 -15 -34 13 5 -39
7237c9p9J90r2M2J1J6r0k9j3J03j4K8j20J16j27Q8Jj69J95q4J21Mj1j1j11J21
$$ -39 -118 72 -20 22 33 49 -41 -70 -83 20 6 34 -86 30 -97 -9 -8 -177 18 -66 55 59 48 37 -74 47
7263D7r5NK5KJ7O2J4o4K8l5k0lM2Pj15J05M5j1K9n7J3j05P5m2K3l0M6j01R4K0
$$ 47 -48 -43 -18 -16 1 63 77 13 41 6 -14 -17 25 32 -83 22 67 56 85 28 41 -64 11 -31 -8 -38 8 -93 1 21
7293B1K6k1J7j49n3O0L5L5l8J35q4l5J32l6j39N4J11j34L7Q9J8j69J49N0p8K0
$$ 21 47 26 43 -106 -159 -99 -64 -29 -67 68 -16 -51 81 45 -94 -40 71 -63 -26 63 81 -88 61 111 33 53
7319E3j69Q2Q9R2o7R6o5j96J35l7q7J40p8k7J12o2M5j15J99k24M0J17j62M5P2
$$ 53 -116 -34 55 147 80 176 111 -85 50 13 -74 66 -12 -39 73 11 56 -59 140 -84 -44 73 -89 -44 28
7344B8q6K4O1q5j3Lm5Q6J3Kj44J37qN9r0LJ13Q3j62%N2P5j56J23r7JJ77p3o1r5
$$ 28 -58 -34 27 -58 -71 -68 -113 -27 -14 -12 -156 -19 -27 32 -58 -55 58 141 -21 -21 31 106 -50 73 -24 -23 154 81 20 -75
7374g5J03R9j56J4l0j9LNJ00j24J2J49j47K2L5O1j1n5K7L6j48J04l0M0J4l8j7
$$ -75 28 127 -29 -15 -45 -64 -61 -56 44 -80 -68 81 -66 -44 -9 52 41 -14 13 49 -99 5 -25 15 29 -9 -26
7401b6o8J11m8J10l5m8N4p8NoO5p3J1J0L2K2Kn3N0k9p4L4n4O7K3m2p2N6M5o0P9
$$ -26 -94 17 -31 79 44 -4 50 -28 -23 -29 36 -37 -26 -16 16 38 40 -13 37 8 -66 -32 -86 -19 4 -38 -110 -54 -9 -69 10
7432A0q4k5O4O2p9R8N1j29N5L8j06rP4l4R5p2P2j7lN5q5J2Lj69M7J59m7P1k26
$$ 10 -74 -99 -35 27 -52 46 97 -32 23 61 -45 -54 20 -14 81 9 81 64 61 116 31 43 46 -123 -76 83 36 107 -119
7461a19J25p6O7m6P6k0o2M3Q6j78J37rN3j18J02J8j70J20L7p7RJ9j2P8J7l3j63
$$ -119 6 -70 -3 -49 27 7 -55 -12 74 -104 33 24 77 -41 61 79 -91 29 66 -11 -2 17 5 83 100 67 -96
7488i6K4L4jl4P2j2O3n3j21J78l5nn4jK1p3J04l9O1j46O5N5rM3k15J52L0j0R3
$$ -96 -72 -38 -39 -73 -1 -13 50 -3 -124 54 19 14 -40 -41 -20 -93 11 -28 33 -113 -48 7 -2 41 -174 -22 8 -2 91
7517I1m7j9j7JK8o8M1N6o5j0qJ30j26N9o1M7j46J64R4j90J06j2n2p0K6Q7j11Q6
$$ 91 44 25 8 9 37 -31 10 66 1 -9 -17 113 -13 46 -15 32 -114 50 144 -46 60 48 -4 -74 -48 39 -72 14
7545A4j10M5k1K3k5N1k6R8r2KJ26j70L4MJ02m5M2p2kJ5J9n9R7m9L9n6p9J56m1
$$ 14 -96 -51 -72 -49 -74 -23 -49 49 -43 -41 85 -85 -51 -47 55 10 52 -20 -22 -7 12 -47 50 1 40 -16 -95 61 20
7574B0J8n5j4P4p7qJ63k8j40j2J13r3N6o2J07n9L9Rr7R6p3J21k2j29L0Q2J4l7
$$ 20 38 -17 -31 43 -34 -42 121 93 -47 -59 54 -39 17 -45 62 3 42 51 -46 50 -23 98 76 -53 -23 59 73 36
7602C6l7J9n3R5j08l5J09r9J68q7J6k7l2M7Q4o6l8ln0j9J62p9l9j3J66j16l9P
$$ 36 -1 18 -35 60 -48 -83 26 -73 95 8 24 -3 -35 12 96 30 -8 -11 -61 -80 82 3 -36 -49 117 1 -38 -31
7630c1Pj01j3Q9J26p1r8K2j1P8n0N3l6P7l5J7Q9r1JMJ4P4j44r3J53m5LJ3K6k2
$$ -31 -24 -125 -138 -49 77 6 -92 -70 -81 -3 -53 0 -36 41 6 23 112 21 22 26 40 114 -30 -123 30 -15 -12 1 27 5
7660Ej2J20o4Jn9q5J36kjj38L1M0M2r0N7lP0j41O5lM6j9R6o3K0p8k0J11l3j20
$$ 5 -7 113 49 50 -9 -94 42 40 39 -99 -68 -28 14 -76 -19 -22 48 -93 -28 -31 15 -4 92 29 49 -29 -49 62 29 -91
7690i1O3O5k6P1j26PR4j10J16n1k3L2l0O8j81O8J46o7n0R5j16JrN8m7O3j50J74
$$ -91 -28 37 11 82 -44 -37 57 -53 63 12 -11 21 -9 59 -122 -54 92 25 -25 70 -46 -45 -54 4 -43 20 -130 44
7718D4j64J26q2RnO9p9L5O5lJ3k0J3l7j5o2N5p0L9M5K9p0O7K0M9j21O1r3J37k1
$$ 44 -120 6 -76 -67 -72 -3 -82 -47 18 15 28 8 21 -16 -31 -93 -38 -108 -69 -24 5 -65 2 22 71 -50 11 -82 55 34
7748C4k4J3r5J51p6j79J96r2N8pJ8k7N7jl1J25p3l2pN2q1N6r2J8J11j03J8l%k5
$$ 34 10 23 -72 79 3 -176 20 -72 -14 -21 -3 -30 27 26 -5 120 47 15 8 60 -21 35 -57 -39 72 -31 -13 -16 -16 -41
7778d1RN4L4Mj07J00j46m5K02J11k13N2n5M7l0n0O1N5m5j89J90L5p8n0J7J2P6
$$ -41 -32 22 56 60 -47 53 -93 -138 64 175 -38 14 -41 6 -24 -74 -13 42 -3 -192 -2 33 -45 -95 -78 -66 10
7805A0j8%k9lL0O7K8kM7j05l9lN9n4M0m9K9n6mJ45R7l22N5J53o8K4p1L2j19J13
$$ 10 -8 -8 -37 -40 -10 57 85 83 130 25 -14 -17 42 -12 28 -21 8 -48 -52 93 190 -132 -77 76 8 32 -39 -7 -126 -13
7835a3p8J13O1j12k2N8J5j0R0j53O5n5M8j1j0L5oo7J25j64J62pj65Q5P8k8p9O7
$$ -13 -91 22 83 -29 -51 7 22 12 102 -51 14 -41 7 -4 -14 21 15 -52 73 -91 71 64 -101 -16 62 34 -45 22
7863B2k8%Q6jm0m4L9m5R4L8m9K1o2l4p0O7L8o9q3J93n6m9o7J40p2Q3m8k3rmj3
$$ 22 -6 -6 80 79 39 -5 34 -11 83 121 72 93 31 -3 -73 -6 32 -37 -120 73 17 -32 -99 41 -31 52 4 -19 -28 -32 -45
7894d5N7n0J31j39k3K7N7l6O6r0J33M9j96K14j13ro7K5L0N9j00p7J23k7l8rJ47
$$ -45 12 -38 93 -46 -69 -42 15 -21 45 -45 88 137 -59 155 42 33 -34 -9 21 80 -20 -97 26 -1 -39 -48 99
7921I9j6l9Qoj35J25k7m5j1k3J03o4Q2l4n1%O1o0l5k4O3j0O3Pk6O1p0K9rNM7j60
$$ 99 83 44 52 46 -89 36 9 -36 -47 -70 33 -31 51 17 -34 -34 27 -33 -68 -92 -29 -39 24 31 5 66 -4 25 16 21 68 -92
7953i2O0k9Q2p4L3N3J4rp4J22o5j27J24N5qknm0L3r0L7Ll6O3n8q3J02O3j40R1
$$ -92 -32 -61 21 -53 -20 33 47 38 -36 86 21 -106 18 73 65 63 58 18 51 -39 -2 1 -35 28 -30 -113 -11 52 -88 3
7983CJ21p1j9l8k1K2j22J46m3j3K5K5J09q8q4L4K7q0OJ32j45n9J93j99J20k0J29
$$ 3 124 53 34 -4 -25 -3 -125 21 -22 -35 -10 15 124 36 -48 -14 13 -67 -61 71 -74 -133 60 -139 -19 -39 90
8010I0j14jP6p5MP8o1mJ45k06M7k6PO1onoM6l1m9L7o1lN8J12j23L4p3J07J2m2
$$ 90 -24 -25 51 -24 -20 58 -3 -7 138 -68 -21 -47 -40 21 15 10 4 50 19 -30 7 -54 -57 1 113 -10 24 -49 58 70 28
8041B8p7P8L3n0j0J08q6j28O5Q8j21P6Q0r5J30j45Kn5L7M2r6J41O5j40kMQQ8m
$$ 28 -49 29 62 12 2 110 24 -104 -39 49 -72 4 84 -11 119 -26 -24 -79 -42 0 -96 45 110 -30 -32 -28 -20 68 64
8070F4j03J39j26J29m5Q4j39mK5j39Q2P8M7j27P2l3K6n9R6qo0n5m6RN5K6J9r5
$$ 64 -39 100 -26 103 58 142 3 -1 24 -115 -33 45 92 -35 37 4 30 -29 67 59 -1 -56 -102 -93 -38 -12 7 -88
8098h8J83q5q3J32j88J23N2l0Ko1K8J8K6N2o5j11J30J2n2N8L5k06J43LQ4n2r2
$$ -88 95 10 -73 59 -129 -6 46 16 18 -43 -15 3 29 81 16 -95 35 47 -5 53 88 -118 25 28 112 60 -32
8125c2N2QL9MOj33L4KN0N0j42M2R8n3p9P2n5O1j6Np7J5J20j10K4J03r3R2Np1N
$$ -32 20 28 67 71 77 -56 -22 -20 30 80 -62 -20 78 25 -54 18 -37 24 8 13 -64 -49 71 -39 -15 88 -5 87 92 21 26
8156B6r7J24L7j05KL3n6o0P0P7n3p2J22%O6q3j97R8l6OJ0J37J3k3o3q6J62Q0j54
$$ 26 -71 53 90 -15 -13 20 -36 -96 -26 51 -2 -74 48 48 114 31 -166 -68 -104 -98 -88 49 62 39 -24 -110 52 132 -22
8185b2L4o5M5L2J2o6
$$ -22 12 -53 -8 24 36 -30
8191c0
$$ Imaginary data points
##PAGE= N=2
##DATA TABLE= (X++(I..I)), XYDATA
0@%%%%%%%%%%%%%%%Qj6J6j6J6j6K4l2L2m0M8n6O5p3Q8j04J19j35J52j68J89k13
$$ 0 0 0 0 0 0 0 0 0 0 0 0 0 0 0 0 8 -8 8 -8 8 -8 16 -16 16 -24 24 -32 33 -40 48 -56 63 -72 80 -88 101 -112
37a12K39k68K98l32L68m08M53n02N54o11O74p43Q20r03R94j095J209j337J477
$$ -112 127 -141 157 -175 193 -215 238 -264 290 -321 353 -390 430 -473 521 -574 635 -702 775
56G75j637J820k033K284k581K942l390L971m752N856p564J0577j7461O3810J0017
$$ 775 -862 958 -1075 1209 -1372 1570 -1820 2151 -2601 3255 -4309 6268 -11193 52617 62634
71F2634p7908M4519O820l8114k0864Q584k0957j117J2528m031m265K8257L105
$$ 62634 -15274 29245 36065 -2049 -22913 -14329 -35286 -36403 -23875 -27906 -32171 -3914 -809
84h09j6849J6347L0075j2490j4595J0003Q025o552L91N8r090p573P954N57j6140
$$ -809 -17658 -1311 28764 16274 1679 11682 19707 13155 13546 13604 4514 -3059 4895 5452 -10688
99a0688p179Q696k356q806K805R932M649K582K619K392J1041J4341j0863k0483
$$ -10688 -17867 -9171 -11527 -20333 -17528 -7596 -2947 -365 2254 4646 15687 30028 19165 -1318
113a318J0702J4998k2211k1960R467O983j2149o706Q672R765M313p17k620Q527
$$ -1318 9384 24382 2171 -19789 -10322 -3339 -15488 -22194 -13522 -3757 556 -161 -2781 5746
127E746J4974n827j7288L406J0699o528j0899j188L031N68j193L52Q37Q50K806
$$ 5746 20720 14893 -2395 1011 11710 5182 -5717 -6905 -3874 -3306 -4499 -4147 -3310 -2460 346
142C46K20k988J870N026l81n433l26Q020L533o565m001J911K378Q63p676j0234
$$ 346 566 -2422 -552 4474 4093 -1340 -1666 6354 9887 3322 -679 1232 3610 4473 -3203 -13437
158a3437N415R356p074r564Q432J3859j488o674O179R321j225o124n288PL710
$$ -13437 -8022 1334 -5740 -15304 -6872 6987 5499 -1175 5004 14325 13100 6976 1688 1695 5405
173E405o723j3175P29R884k18p976J435J1995N406l818J80L948J676P03l292n839
$$ 5405 -1318 -14493 -13764 -3880 -4098 -12074 -10639 1356 6762 2944 3124 7072 8748 9451 6159 320
189C20K00L248k838o657q12N599j70n562J69K746R92K054j777l209O735P871m117
$$ 320 520 3768 930 -5727 -6539 -940 -1110 -6672 -6503 -3757 -2765 -711 -2488 -5697 1038 8909 4792
206D792n700O730Q668n984r834K318L828m834p141m653J662N702j215n573L963
$$ 4792 -908 5822 14490 8506 -1328 990 4818 -16 -7157 -11810 -10148 -4446 -5661 -11234 -7271
221g271J1201L800m770Q44Q035J092o689k861P0j723k814m767l271K333L454j387
$$ -7271 3930 7730 2960 3804 11839 12931 6242 3381 3451 1728 -1086 -5853 -9124 -6791 -3337 -4724
237d724l887K777Q291R74m606J102L939J710J82k974k297L725K983m819n966K774
$$ -4724 -8611 -5834 2457 3431 -1175 -73 3866 5576 5758 2784 487 4212 7195 2376 -3590 -816
253h16M522o016p319L274M275k520l095J556N689M863n06j938K946N785j04p137
$$ -816 3706 -2310 -9629 -6355 -2080 -4600 -7695 -6139 -450 4413 3907 1969 4915 10700 10596 3459
269C459l254L463j687o858k875Q02J000P78k13J56L518N614J236l908R97O318
$$ 3459 205 3668 1981 -4877 -7752 -6950 -5950 -5172 -5385 -5229 -1711 3903 5139 1231 2228 8546
285H546j206o719j035K598j14l045l226R6L391J241l648l200M616N186m534m567
$$ 8546 7340 621 -414 2184 2070 -975 -4201 -4105 -714 527 -3121 -6321 -1705 3481 -1053 -5620
301e620M834N300j517l071J080L951J236k859l126m24J847j270o370j481M655
$$ -5620 -786 4514 2997 -74 1006 4957 6193 3334 208 -216 1631 361 -6009 -7490 -2835
316b835K50l138J238M155L017J068J85mR30K094j499o466j774L864j546o115q51
$$ -2835 -2585 -5723 -4485 -330 2687 3755 3940 3936 4866 6960 5461 -1005 -2779 1085 -461 -6576 -7427
333g427L868K502j281j260K685M190J340k770k329M175L124n274m507L733L335
$$ -7427 -3559 -1057 -2338 -3598 -913 3277 4617 1847 -482 3693 6817 1543 -2964 769 4104
348D104l455m169Q28L129n04l155j556J129L017J23l319J288N799J365k534O24
$$ 4104 649 -3520 -2692 437 -67 -3222 -4778 -3649 -632 -509 -3828 -2540 3259 4624 2090 2714
364B714K940L54k326k202j530j542l21j526m177K38M453P87j836J484M922L040
$$ 2714 5654 6008 3682 1480 -50 -1592 -1913 -3439 -7616 -7378 -2925 -2138 -3974 -2490 2432 5472
380E472j047j550J085J960n78m455l790K750K044n227l730L628M041k137l554
$$ 5472 4425 2875 3960 5920 5342 887 -2903 -153 1891 -3336 -7066 -3438 603 -1534 -5088
395e088K097M717M9k678m34K638K990r21l283J243L776q97l944j167J650m92l542
$$ -5088 -2991 1726 1775 -903 -1337 1301 4291 3370 87 1330 5106 4209 265 -902 748 256 -3286
412c286j626N83K87P95N66o62K516M207J124j498k1K408P23l408l368k35O45j002
$$ -3286 -4912 -4329 -4042 -3247 -2681 -3343 -827 3380 4504 3006 2985 5393 6116 2708 -660 -895 -250 -1252
430a252l506j898L581L285k454j990L959M748j503l888J647M197j465l871p25
$$ -1252 -4758 -6656 -3075 210 -2244 -4234 -275 4473 2970 -918 729 4926 3461 -410 -1135
445a135K120J693k392l246J318L101r88l715m39L407N22k781J84K456Q21R58L83
$$ -1135 985 2678 286 -2960 -1642 1459 471 -3244 -3683 -276 246 -2535 -2351 105 926 1884 2267
462B267o68R49J508r63k855j489J072k72l096j338J220J833Q26j211N90M202K365
$$ 2267 1599 2548 4056 3093 238 -1251 -179 -451 -3547 -4885 -3665 -1832 -1006 -2217 -1627 2575 4940
479D940k539j795K347K433l145m911Q76K711j409l198n34K705K338j647j810K233
$$ 4940 2401 606 2953 5386 2241 -2670 -1794 917 -492 -3690 -4224 -1519 819 -828 -2638 -405
495d05K868m06k737L3L321M67l165m19K168M78j115j597n44M94l6j207j842Q0
$$ -405 2463 2057 -680 -647 2674 3141 -24 -443 1725 2203 1088 -509 -1053 -559 -595 -1802 -3644 -3564
513c564K257P49j128L74K644K202J22j667J52K021m44l280k678O33J180k254k989
$$ -3564 -1307 -558 -1686 -1312 1332 3534 3656 1989 2141 4162 3718 438 -2240 -1607 -427 -2681 -5670
530e670J825L263k08j791J399L737J393k179j157J317J546n61l468j569K827R27
$$ -5670 -3845 -582 -790 -2581 -1182 2555 3948 1769 612 1929 3475 2914 -554 -2123 704 1631
546A631l329j347K277P39j664p99J314N40M0K5o43J159L038O6k586R32K254n11
$$ 1631 -1698 -3045 -768 -29 -1693 -2492 -1178 -638 -598 -573 -1216 -57 2981 3047 461 1393 3647 3136
564C136j917j376p33k04r2j696j818J560K852j430j612L869L410j167j970J081
$$ 3136 1219 -157 -890 -1094 -1186 -2882 -4700 -3140 -288 -1718 -3330 539 3949 2782 812 1893
580A893J596l06k218k004k92J073j33k885j12L556L2k690R02L073L14k058k29
$$ 1893 3489 3183 965 -1039 -1331 -258 -391 -3276 -3388 168 200 -2490 -1588 1485 1799 -259 -488
597d88J068P26M68p17k017Q96K679j147k563O58Q60j129q85M7p3J20Q58n85k54
$$ -488 580 1306 1774 1057 -960 -64 2615 1468 -1095 -437 423 -706 -1591 -1544 -1617 -1497 -639 -1224 -1478
616a478K895K193k769j295K960J189k375k328l86R09m9j814j085J372K155m28
$$ -1478 1417 3610 841 -454 2506 3695 1320 -1008 -1394 -485 -534 -2348 -3433 -2061 94 -334
632c34j280J902K819q65j903L63J361o5j798j413M38N89o7r17p52J301J286j078
$$ -334 -1614 288 3107 2242 339 702 2063 1998 200 -1213 -775 -186 -253 -1170 -1922 -621 665 -413
650d13p98P59J234jj217l34J370J279l32j360k93J870M80k633j587J193Q76j543
$$ -413 -1211 -452 782 781 -436 -770 600 1879 1547 187 -106 1764 2244 -389 -1976 -783 93 -1450
668a450j832Q65K234pj111J057K317J118j179j165J203J145j658k466q54J180
$$ -1450 -3282 -2417 -183 -190 -1301 -244 2073 3191 2012 847 2050 3195 1537 -929 -1783 -603
684f03R3j802p12J452Q78L07k6K16P03J036k03q34J28R37k13j597k28J230J17
$$ -603 -510 -2312 -3024 -1572 -694 -387 -413 -197 506 1542 1339 505 633 1570 1357 -240 -468 762 879
703H79r38j042k74J458J3k038r06K063J493j127j294J987K275l97j280N68R44
$$ 879 -59 -1101 -1375 83 96 -1942 -2848 -785 708 -419 -1713 274 2549 2152 872 1440 2384
720B384j63j709j572M06M29j078j676K95J844N66j133N20J968O83l66m19K6L64
$$ 2384 2221 512 -1060 -654 -225 -1303 -2979 -2684 -840 -274 -1407 -887 1081 1764 1398 979 1005 1369
738A369j2r83j165l1J004k63j465J90J215M18k94p78k03J327O91j271p59J448
$$ 1369 1357 374 -791 -822 182 -81 -1546 -1356 -141 277 -17 -795 -998 329 1020 -251 -1010 438
756D38J447j167j208J226J409j270j689O1R84m7j968q95J405J438n09j117R70
$$ 438 1885 718 -490 736 2145 875 -814 -753 231 184 -1784 -2679 -1274 164 -345 -1462 -492
773d92K257L99j504M2R97k24j146q85j11q8m09l83lN86J243r6n24O45J252j12
$$ -492 1765 2164 660 702 1699 1475 329 -556 -667 -755 -1164 -1547 -1550 -964 279 183 -341 304 1556 1444
793A444n72q34m1J006j35j596o73J142J280j132j680J083J593r30j384K16J536
$$ 1444 872 38 -3 1003 868 -728 -1401 -259 1021 -111 -1791 -708 885 -45 -1429 -1213 323
810C23M29j345k86J795J071p21j478P37J511r79k024k81R80k80j271l36J061O42
$$ 323 752 -593 -879 916 1987 1266 -212 525 2036 1057 -967 -1248 -268 -548 -1819 -2155 -1094 -452
828d52K96K61L89O93R47l76r12p0K94m91p71j022q4N79r3o12k67J183J331j016
$$ -452 -156 105 494 1187 2134 1758 846 776 1070 579 -192 -1214 -1298 -719 -812 -1424 -1691 -508 823 -193
848a93r84J442J345q37j330M98J655M7j651o23J289Q16j190j723K45J534p52j911
$$ -193 -1177 265 1610 773 -557 -59 1596 1643 -8 -631 658 1474 284 -1439 -1194 340 -412 -2323
866b323M72J588K88r13L99J681O43m30k01j1M01j45j276j060j06K06l15n13k05
$$ -2323 -1851 -263 25 -888 -489 1192 1835 1405 1204 1193 1594 1449 173 -887 -993 -787 -1102 -1615 -1820
885a820P23R78L55k21j10R19J041j223q79R88O35r76j309N01J377l56j663j58
$$ -1820 -1097 -119 236 15 -95 824 1865 642 -237 751 1386 410 -899 -398 979 623 -1040 -1198
903a198J210O59j054j358P90J740o80j238O23J743L33j205k68J200K15q43j105
$$ -1198 12 671 -383 -1741 -951 789 109 -1129 -506 1237 1570 365 97 1297 1512 669 -436
920d36k58N29l01j009k32P17P89K1j91N88Q87J06k30k84l20L50j71j080n49O24
$$ -436 -694 -165 -466 -1475 -1707 -990 -201 -180 -371 217 1104 1210 980 696 376 726 555 -525 -1074 -450
940d50N37n92r03P07J509k30j061N9J078N07q92j081Q26J096n89j246L16J354
$$ -450 87 -505 -1408 -701 808 578 -483 -424 654 1161 269 -812 14 1110 521 -725 -409 945
958I45n7j617l40J133L88j067p08L96J010K27n87J8J032O99l81o85J03M49o74
$$ 945 888 -729 -1069 64 452 -615 -1323 -927 83 310 -277 -259 773 1472 1091 406 509 958 284
977B84p82l47j60J59k1m51J02R10R88k00o65Q82J194o78j011j61N69R1r80j022
$$ 284 -498 -845 -1005 -846 -867 -1318 -1216 -306 682 482 -183 699 1893 1215 204 43 612 703 -277 -1299
997a299O61R69n74j178L99J518k8j495O3J391L52p10m00O40J078l03q60j3M99
$$ -1299 -638 331 -243 -1421 -1022 496 468 -1027 -964 427 779 69 -331 309 1387 1084 224 211 710
1016G10R6q71q56K86J72o67k77J48O94O25N4j74N20R97K66o76q70M73M07r36r97
$$ 710 806 -65 -921 -635 -463 -1130 -1407 -1259 -565 60 114 -60 460 1457 1723 1047 177 650 1057 121 -876
1037h76j64M09K85q46p8R27Q25m41p14O56J172k9j444O8J063K20p80o56O38N18
$$ -876 -1040 -631 -346 -1192 -1270 -343 482 41 -673 -17 1155 1126 -318 -250 813 1033 253 -403 235 753
1057G53n41p55n2L62n9n43n14O88P81j82l56K39R59P09o71k11j14J58J29j017
$$ 753 212 -543 -595 -233 -292 -835 -1349 -661 120 -62 -418 -179 780 1489 818 607 493 651 780 -237
1077b37r47M77N19p55n49Q95R21j44n49M99Q70J71l85j001P5J058m25j486J26
$$ -237 -1184 -707 -188 -943 -1492 -597 324 180 -369 130 1000 1171 786 -215 -140 918 493 -993 -867
1096h67J043J4o99j05N84L13l26l37R7M33M77p37o35R72Q59o74m96K35L43q4m90
$$ -867 176 190 -509 -614 -30 283 -43 -380 -283 150 627 -110 -745 227 1086 412 -84 151 494 410 -80
1117h0l37k59K17K44q40j80J292O71q93o9R28O92k04r03l00L60J44p57j039M06
$$ -80 -417 -676 -459 -215 -1055 -1235 57 728 -165 -234 694 1386 1182 279 -21 339 483 -274 -1313 -907
1137i07R24n48q30Q94R81j13n24K21P07K11l77p19R0N35p4q31l32O45K39l53l57
$$ -907 17 -531 -1361 -467 514 401 -123 98 805 1016 639 -80 10 545 471 -360 -692 -47 192 -161 -518
1158e18J01K58J15l63j84J33P81K25n71J48R21J89o62l41n6N21n48j139j67O08
$$ -518 -417 -159 -44 -407 -591 -458 323 548 -23 125 1046 1235 573 232 176 697 149 -990 -1157 -549
1178e49K11o50m13R85J128m32n95P05Q87Q2j119k39O48o9r14l40J82L15k36l62
$$ -549 -338 -988 -1401 -416 712 280 -315 390 1277 1359 240 1 649 580 -334 -674 -492 -177 -413 -775
1198g75L15M02J69k44j36K19M55n9j63o2J62N47o9n98l35N71J63o90q05K56P54
$$ -775 -460 -58 111 -133 -269 -50 405 346 183 121 283 830 761 163 -172 399 562 -128 -933 -677 77
1219G7n56o74L59P20K84l75O3Q57O19n35q21L40N34m63j409K9Q53r8o65n0O53
$$ 77 -479 -1153 -794 -74 210 -165 -102 755 1374 839 18 358 892 429 -980 -951 -98 -196 -861 -911 -258
1240b58O04n1l24L20L39j07k43l13J62K01l26k61R7J03J74j46l77J2L70J95m42
$$ -258 346 295 -29 291 630 523 280 -33 129 330 4 -257 -160 -57 117 -29 -406 -394 -24 171 -271
1261b71m60N83N35k79m25L63O69J26o80m58O86J65q24n44J55O90l40p57N23Q74
$$ -271 -731 -148 387 108 -317 46 715 841 161 -297 389 554 -270 -814 -659 31 -309 -1066 -543 331
1281C31R1k99MO07K49l27o02M9K81l64n84l18M48L41k64j42K60L58K42n9j98l6
$$ 331 422 123 127 734 983 656 54 103 384 20 -564 -882 -434 -93 -357 -499 -239 119 361 302 104 68
1303F8K75K90m51m44M27K83l77l90J29M21j04o56k37O52J93n69k97M52R75j02
$$ 68 343 633 182 -262 165 448 71 -319 -190 231 127 -529 -766 -114 79 -490 -787 -335 640 538
1323E38o65M01P25Ro64m32K84J51n46o70J09L64kl24N5O43L12k04J4L71K77j58
$$ 538 -127 274 999 1008 344 -88 196 347 -199 -869 -760 -396 -398 -722 -667 -24 288 84 98 469 746 588
1345E88l42k44R2J27j44l33k71L42L06l73k71K88L45J45n60j26N19L57k47l39
$$ 588 246 2 94 221 77 -256 -527 -185 121 -252 -523 -235 110 255 -305 -431 88 445 198 -141
1365a41L35O70j48r08J12N75j84q53l69O54J94n10k10L00N60K83l65L7O70J57
$$ -141 194 864 716 -192 -80 495 311 -542 -911 -257 -63 -573 -783 -483 77 360 -5 32 702 859
1385H59m43l15Q1K68l75l51k25J50P5J17j92J12N08O0k30j08L09J88k15m71J13
$$ 859 416 101 182 450 75 -276 -501 -351 -276 -159 -351 -239 269 329 99 -9 300 488 273 -198 -85
1406h5M76k5l80m23L52N65m04o20K7O67j68m80p7O09L05l34j78M39M09j71m21
$$ -85 391 366 -14 -437 -85 480 76 -544 -517 150 -18 -498 -575 34 339 5 -173 266 675 504 83
1427H3j53L69j16m40k98J35L97k10j85K7L51L68J39l45n9L71L0l49m46K95J29
$$ 83 -70 299 183 -257 -555 -420 -23 -233 -418 -391 -40 328 467 122 63 434 464 115 -331 -36 93
1448I3k38m15J30N50n9l71k01P30K51m07l91M16L14j27m23J4N71J12o74j49L45
$$ 93 -145 -560 -430 120 61 -310 -511 219 470 63 -328 88 402 275 -148 -134 437 549 -125 -274 71
1469G1K72l76m86M5L07L3k69l8L01M47L7j39J59J91Q7l65k67LJ7k39k52k71K67
$$ 71 343 -33 -519 -474 -167 -134 -403 -441 -140 307 344 205 364 555 642 277 10 13 30 -209 -461 -732 -465
1492d65M60k62k54L93M53J79l90j41N10K4m28k27J79K25p9n79N9M95p1m21j02
$$ -465 -5 -267 -521 -128 325 504 114 -27 483 507 79 -148 31 256 177 -402 -343 152 81 -340 -442
1513d42J64L08j98k98K32M84m6j14n9K64L34k83l21O7p4j5l00j86ML16r7j26N6
$$ -442 -278 30 -168 -466 -234 250 204 90 31 295 629 346 25 92 18 3 -297 -483 -479 -163 -260 -386 -330
1536c30L74M07k65p7P6L89j53n21Q8K07L0l80m45K56N89k13m09J83N30o2m31n2
$$ -330 44 451 186 109 185 574 421 -100 -12 195 225 -155 -600 -344 245 32 -377 -194 336 274 -157 -209
1558b09L49K35l88k27J79M22j64k55J00J13J2l61j25K21N2j44j14J53J41J76J00
$$ -209 140 375 -13 -240 -61 361 197 -58 42 155 167 -194 -319 -98 -46 -190 -304 -151 -10 166 266
1579B66m7j91K24K40l18l13l9K42o5m21o4M21J23j76j37K55M05j38m09O3N28j60
$$ 266 219 28 252 492 174 -139 -178 64 -1 -422 -486 -65 58 -118 -255 0 405 267 -142 -79 449 289
1601B89n89o2L76J48m55j21K82K29j02j22L0K02Q8l43l2L06J98p0k27J09Q2N3
$$ 289 -300 -362 14 162 -293 -414 -132 97 -5 -127 -97 105 193 -150 -182 124 322 252 25 134 216 269
1623B69j50K2j92p0J88l74j47J84J44j3q6J49M11P0k21j16L03K20l09n75P1L74
$$ 269 119 141 -51 -121 67 -307 -454 -270 -126 -139 -225 -76 335 405 184 68 371 591 282 -293 -222 152
1645A52j41n18l7L76K00k01k8K25L04j79j60q4L72nk79k3K07J35k74j16p9J06
$$ 152 11 -507 -544 -168 32 -169 -197 28 332 153 -7 -91 281 276 -3 -26 181 316 42 -74 -153 -47
1667d7l9p6j04o1K61O5j97N8J90J55P1k43K37N2l0j19l06J15P9l25j77J8M18p6
$$ -47 -86 -162 -266 -327 -66 -1 -198 -140 50 205 276 33 270 322 292 173 -133 -18 61 -264 -441 -423 -5 -81
1691h1j99Q5L13J71k34k4J15J47o8l06N3J95j68k61L8K24J61k34j05J23J00q4
$$ -81 -280 -195 118 289 55 31 146 293 225 -81 -28 167 -1 -262 -224 0 161 -73 -178 -55 45 -39
1713c9p4O9l6J99p2n9J82p3J31j21j46J9J1jk22r2K66J14k37r2K42K13J09j20
$$ -39 -113 -44 -80 119 47 -12 170 97 228 107 -39 -20 -9 -10 -232 -324 -58 56 -181 -273 -31 182 291 171
1737A71j87L76pl51l61L15J01r2l40oM62K8k57%M36Q1l27j20J43J13p6k08K6J05
$$ 171 -16 360 353 2 -359 -44 57 -35 -375 -381 81 109 -148 -148 288 369 42 -78 65 178 102 -106 -80 25
1761B5j8q4Q3j25J42P2k70O5l4J60p7j14J21K34J40k48j45J55Q2L0l25nJ04n2
$$ 25 7 -77 6 -119 23 95 -175 -110 -144 16 -61 -175 -54 180 320 72 -73 82 164 194 -131 -136 -32 -84
1785h4k19m7K36J65ok54L28J70K9q4j37J20O7k66k55jJ24pr9m0J45J06Jl7L2J18
$$ -84 -303 -350 -114 51 45 -209 119 289 318 234 97 217 284 18 -237 -238 -114 -121 -220 -260 -115 -9 -8 -45 -13 105
1811A05o3m7p7K03O5r4p5Q9J18L7l58j34N7K20j86j68Q8J55J3rj80M01J29j29
$$ 105 42 -5 -82 121 186 92 17 106 224 261 -97 -231 -174 46 -140 -308 -220 -65 -52 -61 -241 160 289 160
1835A60j37K02O3k9k13j76J58Q8k15k32J96J48r5q1J22J98l1J9j06k7J47pk37
$$ 160 23 225 288 259 46 -130 28 116 -99 -331 -135 13 -82 -163 -41 157 126 145 39 12 159 152 -85
1858h5R3J27o6j37l2j27K31o3k12J51N3J05q9j47J08L26j59j47K9L95l30P7j74
$$ -85 8 135 69 -68 -100 -227 4 -59 -271 -120 -67 38 -51 -198 -90 236 77 -70 -41 354 24 101 -73
1881g3N0J13o2j96oJ54%o3L8J97K6j79oR1P6k6j65j12R8J24q4j86m7L20K5p8r5
$$ -73 -23 90 28 -168 -174 -20 -20 -83 -45 152 178 -1 -7 84 160 134 -31 -143 -45 79 -5 -191 -238 82 107 29 -66
1908f6Q1Q3K0k23M5K8K55k15j93J56J56m5j50O8J44m2k49j47K30Q0n8N6l1K62
$$ -66 15 98 118 -105 -60 -32 223 8 -185 -29 127 82 -68 0 144 102 -147 -294 -64 16 -42 14 -17 245
1932B45l4k23L3J51p2j07j80J41P3k19P0r2N9M4K9r5K22L3L9J1j19J6R4j52r9
$$ 245 211 -12 21 172 100 -7 -187 -46 27 -192 -122 -214 -155 -111 -82 -177 45 78 117 128 9 25 119 -33 -132
1957a32k8K07O5k38q9J22J53n6j38P4J42m6M6j68K07Q6J3k55J23K07j74j90l7
$$ -132 -160 47 112 -126 -215 -93 60 4 -134 -60 82 36 82 -86 121 207 220 -35 88 295 121 -69 -106
1980a06J50k38N5j96K58K5L2o2R7p8K61p0k6J14k1q7n8j11l6J70j2j78j0J34K5
$$ -106 44 -194 -139 -335 -77 -52 -20 -82 15 -63 198 128 102 216 195 108 50 -61 -97 73 61 -117 -127 7 32
2005C2%j99K17J68q8k53P1J67J02k06O7K5L2j60k0J2M1o5j40Q9N9N2j55O8lJ83
$$ 32 32 -167 50 218 130 -123 -52 115 217 11 78 103 135 -25 -45 -33 8 -57 -197 -108 -49 3 -152 -84 -87 96
2031I6l5jj7J84r1j94n1J5m4R1j09M3J3J13M5j36J48%J04o7j45O5O9j4j64l9J78
$$ 96 61 60 43 227 136 -58 -109 -94 -138 -47 -156 -113 -100 13 58 -78 70 70 174 107 -38 27 96 82 -82 -121 57
2058E7o4j05N3L1KK4j27J79mm2n5PN2P6j32P6k1N8k4j58J0R8o5r5q5L12j09N5
$$ 57 -7 -112 -59 -28 -26 -2 -129 50 46 4 -51 -44 8 84 -48 28 7 65 41 -117 -107 -9 -74 -169 -254 58 -51 4
2086DR1L7M4J7j01k7kl5j1j6l0k2l1o7N6r8L35j35pP7MK4j39L2K3J99j80o3%J32
$$ 4 95 132 176 193 92 65 63 28 17 1 -29 -51 -82 -149 -93 -191 144 9 2 79 83 107 -32 0 23 222 42 -21 -21 111
2116A11p5j19j1J41q3l6%J1J45L3j81Q5Q5K5O0j33J07r9p9m2%Pk4o2p0MJ60J81
$$ 111 36 -83 -94 47 -36 -72 -72 -61 84 117 -64 21 106 131 191 58 165 66 -13 -55 -55 -48 -72 -134 -204 -200 -40 141
2144A41j14m4J65Q9j13N5m0qo7n1r7J8Lm4K6O7mN8k01J2J86L6p7o9K14k8kj14
$$ 141 27 -17 148 237 124 179 139 131 64 13 -84 -66 -63 -107 -81 -14 -18 40 -161 -149 37 73 -4 -73 141 113 111 -3
2172co0J89j12qM9o7k4lk3n8K06p7r9L3P7L4Q0K2j42k9J71j58q2K5P9o0n2P5k8
$$ -3 -63 126 14 6 55 -12 -36 -39 -62 -120 86 9 -90 -57 20 54 134 156 14 -15 156 -2 -84 -59 20 -40 -92 -17 -45
2201d5J7k6K6j4J19m5o2J3J67j40q3l8J05K4l4j3R9r8M5p5K3K4j03J35j38J79
$$ -45 -28 -54 -28 -42 77 32 -30 -17 150 10 -73 -111 -6 18 -16 -29 70 -28 17 -58 -35 -11 -114 21 -117 62
2227F2n3N0k6M1n6O8l9l3j32N5J45j24j01N7J67k5M0j29lK07k12J37l0n4j7j48
$$ 62 9 59 33 74 18 86 47 14 -118 -63 82 -42 -143 -86 81 56 96 -33 -36 171 -41 96 66 12 -5 -153
2253a53LK54j72j11M4R1N1k3k7m9J60jm2p1K8J00o7nj2n4Q7q9J9j43J14QK0m2
$$ -153 -150 104 -68 -179 -135 -44 7 -16 -43 -92 68 67 25 -46 -18 82 15 10 -2 -56 31 -58 -39 -182 -68 -60 -40 -82
2281h2N3J35n8j22K51m7kj19Q3o3m1K8k5j9M2k1j00M0K06j43j57K43QK4j03n6
$$ -82 -29 106 48 -74 177 130 128 9 92 29 -12 16 -9 -28 14 -7 -107 -67 139 -4 -161 82 90 114 11 -45
2307d5Q4j4j4q2m8J45Nn8j31J76n2P2j6J6mj6kKl1J47p9q3k2P3J37j60o6j5l1
$$ -45 39 25 11 -71 -119 26 31 -27 -158 18 -34 38 22 38 34 18 16 18 -13 134 55 -28 -50 23 160 0 -66 -81 -112
2336a12P9K7j09M1K2L3q4Q3J44K9j19N0n2k1n3L5j36J12K5j57K32j3k2N0j23R3
$$ -112 -33 -6 -115 -74 -52 -19 -103 -20 124 153 34 84 32 11 -42 -7 -143 -31 -6 -163 69 56 34 84 -39 54
2362E4Pk8o9J19p1L3j6j3m5J3P0j36M8n4R3k9n1K6O1J60j95R3P6Jk05%J50o5l0
$$ 54 61 33 -36 83 12 45 29 16 -29 -16 54 -82 -34 -88 5 -24 -75 -49 12 172 -23 70 146 147 -58 -58 92 27 -3
2391cj67J00K01j57P9j44J25J14k17J32r4J07J7n1j1l2N7j10L8j05J71k3o9R7
$$ -3 -170 -70 131 -26 53 -91 34 148 -69 63 -31 76 93 42 31 -1 56 -54 -16 -121 50 27 -42 55
2415E5n2q3O6kj7J20om3l2rN7J02j26j23J97r2j43P0p7J48j17RJ44M5j20q4O9
$$ 55 3 -80 -14 -16 -33 87 81 38 6 -3 54 156 30 -93 104 12 -131 -61 -138 10 -107 -98 46 91 -29 -113 -44
2442d4J85o1N1p4j01K44k27lk9M5P7j25k4Q4%L5j35M9m1M0R4r3j9R6P0j48p4J21
$$ -44 141 80 131 57 -44 200 -27 -30 -59 -14 63 -62 -86 -2 -2 33 -102 -53 -94 -54 40 -53 -72 24 94 -54 -128 -7
2470gL5k7j08l4J42jo3n0J45j2m3Kk2J26m2j10J12m1O8n4j54O1P9n3M0kpJ23j89
$$ -7 28 1 -107 -141 1 0 -63 -113 32 20 -23 -21 -43 83 41 -69 43 2 70 16 -138 -77 2 -51 -11 -13 -20 103 -86
2499h6JJ60%m9L1o3j2Q2m3mj01J42p4j37J04R2j23J34j53K06p0Q4L4k26J65p9
$$ -86 -85 75 75 26 57 -6 -18 64 21 17 -84 58 -16 -153 -49 43 -80 54 -99 107 37 121 155 -71 94 15
2525A5p4J47J01j37j07l3Q4o0J31n4p6mJ23RJ5o8N4j7K0q5l7R0kj2n1J11j71N4
$$ 15 -59 88 189 52 -55 -88 -4 -64 67 13 -63 -67 56 65 80 12 66 49 69 -16 -53 37 35 23 -28 83 -88 -34
2553c4q8J96j05NM5j47R9L3O3r4l3J61j48j00Q6L9pnl4Q1J27j17o9o3J46kp8K9
$$ -34 -122 74 -31 -26 19 -128 -29 4 67 -27 -60 101 -47 -147 -61 -22 -29 -34 -68 13 140 23 -46 -109 37 35 -43 -14
2581a4P1p4M2MM0l0k8K0j0j13r2P9L7P3K1j1l6Q0p7J38j00KQ6l1j4q7n8nM0lp5
$$ -14 57 -17 25 29 69 39 11 31 21 -92 -184 -105 -68 5 26 15 -21 59 -18 120 20 22 108 77 63 -24 -82 -87 -47 -50 -125
2612a25R5K2P3p8j4n9N1O4Pl5j8O0p2J1k9M3N5j07O3j5J1k5R5r7Q9p3lL8R4j01
$$ -125 -30 -8 65 -13 -27 -86 -35 29 36 1 -17 43 -29 -18 -47 -4 51 -56 7 -8 3 -22 73 -24 65 -8 -11 27 121 20
2642B0k1M2J3K2l0j7j57P5NJ3j48J56J0N6o7MO3J38j61j1j8L8j7j24QJ02J8J18
$$ 20 -1 41 54 76 46 29 -128 -53 -48 -35 -183 -27 -17 39 -28 -24 39 177 16 5 -13 25 8 -116 -108 -6 12 130
2670A30j95Q3n6M8m6L7PJ21j17O2j28J56jk12J77r3j5k6P4P7j54J5J37j11O2k0
$$ 130 -65 18 -38 10 -36 1 8 129 12 74 -54 102 101 -111 66 -27 -42 -68 6 83 -71 -56 81 -30 32 12
2696A2J16j87R9j7Ln9j5Q8l0n4p4J42k8n1l5KJ34M3l4m4j40K56j11j00R3O7mj37
$$ 12 128 -59 40 23 26 -33 -48 40 10 -44 -118 24 -4 -55 -90 -88 46 89 55 11 -129 127 16 -84 9 76 72 -65
2724f5o8J30l1R8j12K4mN5j22L6l2O4P6p5Q9q5N8mo0n0N0j28J21J5L5p2O2nj34
$$ -65 -133 -3 -34 64 -48 -24 -28 27 -95 -59 -91 -27 49 -26 63 -22 36 32 -28 -78 -28 -156 -35 -20 15 -57 5 0 -134
2753a34K66j7p6q4N7N9J9p9m7N7j6o2j5P6Jk6J4nK6l3qL3J48j45M4L0j01J14j8
$$ -134 132 115 39 -45 12 71 90 11 -36 21 5 -57 -72 4 5 -21 -7 -12 14 -19 -27 6 154 9 53 83 -18 96 78
2782G8q2n4J63j38n2M0K1KK6QP8q1m0R5N3l8o0M5J7j32J98q2j32J65j12N2k03
$$ 78 -4 -58 105 -33 -85 -45 -24 -22 4 12 90 9 -31 64 117 79 19 64 81 -51 147 65 -67 98 -14 38 -165
2809a65J22NP0k0m9o9J17K4J3o3l0O0L5l1p0n1J48o9k6J1m3L6O4mM0j18J32n4
$$ -165 -43 -38 32 12 -37 -106 11 35 48 -15 -45 15 50 19 -51 -102 46 -23 -49 -38 -81 -45 19 15 55 -63 69 15
2837A5l1J01P2k42J28j20J06K4j22J30m0k5J7m5J76j90J26j9l7Pj15O7o8P7N9
$$ 15 -16 85 157 -85 43 -77 29 53 -69 61 21 -4 13 -32 144 -46 80 61 24 31 -84 -17 -85 -8 51
2862E1q9q8J78j71J00%J8j9j2j20J25n8J01L3o0j1M6R3k22K08j18L1K9j74J66
$$ 51 -38 -126 52 -119 -19 -19 -1 -20 -32 -152 -27 -85 16 49 -11 -22 24 117 -105 103 -15 16 45 -129 37
2887C7j5N8J4j91N1O6N7j85J34O9k6n4L1m1L7r2q2P9P3o3J2J9l6J19m1P5r6P9
$$ 37 22 80 94 -97 -46 20 77 -108 26 95 69 15 46 5 42 -50 -132 -53 20 -43 -31 -12 -48 71 30 105 9 88
2915H8q9n0oL7Q9j26N2l3n3L3K1L3r2J20m5r4K05j13J15l1m1%o6K7Rl6J4L9j13
$$ 88 -1 -51 -57 -20 69 -57 -5 -38 -91 -58 -37 -4 -96 24 -21 -115 90 -23 92 61 20 20 -46 -19 -10 -46 -32 7 -106
2944a06j4J11m2j10J31qQ2Nl3j4m6N5J12k13J51k1j47J20r1J38j49O9J08q2m1
$$ -106 -120 -9 -51 -161 -30 -38 44 49 16 2 -44 11 123 -90 61 40 -107 13 -78 60 -89 -20 88 6 -35
2969c5L2K3o0M0L0P7j62O7j1N9K5m8qp9J61r0m5N9r0P8m8P0j19J08n2l6R6N7j61
$$ -35 -3 20 -40 0 30 107 -55 12 1 60 85 37 29 -50 111 21 -24 35 -55 23 -25 45 -74 34 -18 -54 42 99 -62
2998f2J04N6o2p1M3R3j58J47p9Rl2J05J7j46P8M4n1r6L5Q5n6k0J00n0Lk0L1j4
$$ -62 42 98 36 -35 8 101 -57 90 11 20 -12 93 110 -36 42 86 35 -61 -26 59 3 -17 83 33 36 16 47 33
3026C3q9Q8j19J40j1Q5j25J01o9L7NKn3P8p7j58K11j13P7o0M2N9k8Pk5j04M5N6
$$ 33 -56 32 -87 53 42 127 2 103 34 71 76 78 25 103 26 -132 79 -34 43 -17 25 84 56 63 38 -66 -21 35
3054C5n4m5K0K6K5q4M3J9J04j05L8j06K0J5J52j25mJ2Qj01J06J07j24Q8j07k8
$$ 35 -19 -64 -44 -18 7 -77 -34 -15 89 -16 22 -84 -64 -49 103 -22 -26 -14 -6 -107 -1 106 -18 70 -37 -65
3080f5J4J37m3j50J08K3j09J76j18N1q0j21J58P9j4l4J36k50J6P1M1L4o4K8n6
$$ -65 -51 86 43 -107 1 24 -85 91 -27 24 -56 -177 -19 60 46 12 148 -102 -86 -15 26 60 -4 24 -32
3105c2N4m4K3P7j25J47j56J25m4o8j1k0J69n6O4o8J5M1j22k3J54q1o8P8M3l6O6
$$ -32 22 -22 1 78 -47 100 -56 69 25 -43 -54 -74 95 39 103 35 50 91 -31 -54 100 19 -49 29 72 36 102
3132A02MRr3J14j11J6L0l0kjp0q5J41k5N0p3m3kL1J18jn2l3n9O4o1m2R2N5l2m5
$$ 102 106 115 22 136 25 41 71 41 39 38 -32 -117 24 -1 49 -24 -67 -69 -38 80 79 27 -6 -65 -1 -62 -104 -12 43 11 -34
3163c4P2ok6L3o5J9O1m5j8O8l5o6J6J5N9L5j50pK3L4m3J15j6j37J63j36J61p6
$$ -34 38 32 6 39 -26 -7 54 9 -9 59 24 -42 -26 -11 48 83 -67 -74 -51 -17 -60 55 39 -98 65 -71 90 14
3191A4J6n4M3P2j24r2Q3Kj5O5k6J01j13J18j14l1r1K05j92J92l5p2J31j43O1n2
$$ 14 30 -24 19 91 -33 -125 -42 -40 -55 10 -16 85 -28 90 -24 -55 -146 59 -133 59 24 -48 83 -60 1 -51
3217e1lL2j4j0qM5P2M8j91m7J09P3j59J86r8L4p8K8J05j02LK0OL4m5M0k9r1N5
$$ -51 -54 -22 -36 -46 -54 -9 63 111 -80 -127 -18 55 -104 82 -16 18 -60 -32 73 -29 -26 -6 0 34 -11 29 0 -91 -36
3246c6M7K5k5MNJ07j53Lo1P8L7j1L6m8l5P2j34O0R0o7j3P9j03l8M8J16m8j1l7
$$ -36 11 36 11 15 20 127 -26 -23 -84 -6 31 20 56 8 -27 45 -89 -29 61 -6 -19 60 -43 -81 -33 83 35 24 -13
3275a3l7O1K0n6L2m3j5Q5j4j44O7Q1p2K2J09j42k7R3M5p1R6j39J08j1k9k4RM6
$$ -13 -50 11 31 -25 7 -36 -51 34 20 -124 -57 24 -48 -26 83 -59 -86 7 52 -19 77 -62 46 35 6 -18 -9 37
3303C7n7k0J28m4k9P6j66JJ8M9J78j30j42J67j4j5jj06J63M4j91j9n4K32n2k1
$$ 37 -20 -40 88 44 15 91 -75 -74 -56 -7 171 41 -101 66 52 37 36 -70 93 137 -54 -73 -127 105 53 32
3329C2K1j4L2p4Jj8q5Q4O1j6q1P7L1n2Pk5nJ03j23M6J04m8l1J1O9m7j38P6K5p
$$ 32 53 39 71 -3 -2 -20 -105 -21 40 24 -57 20 51 -1 6 -19 -24 79 -44 2 106 58 27 38 107 60 -78 -2 23 16
3359A6J52j56j9L1K8j74J46r0k1O9N6k5O2m9On7J00K3j17K0o6K7N5p2n6J83K9
$$ 16 168 12 -7 24 52 -122 24 -66 -87 -18 38 13 75 26 32 -25 75 98 -19 1 -65 -38 17 -55 -111 72 101
3386A01r2j00R9O2j8l0J5j0k0l6K7R6m9q0M6K7n3j7M9k9N3o1J29j86M0J12kj70
$$ 101 9 -91 8 70 52 22 37 27 7 -29 -2 94 45 -35 11 38 -15 -32 17 -12 41 -20 109 -77 -37 75 73 -97
3414i7J09O3r4m1N5K0r0J17j4J2m3l3MQ8r7J7Kp3K0M9%k0Q0r5J10r6l1k8J61m4
$$ -97 12 75 -19 -60 -5 15 -75 42 28 40 -3 -36 -32 56 -41 -24 -22 -95 -75 -26 -26 -46 34 -61 49 -47 -78 -106 55 11
3444A1K6j0j64K58q1j35l0J40oj7J05j88J62r6P1q5J5J06j17j4M9m7J45op2qP3
$$ 11 37 27 -137 121 40 -95 -125 15 9 -8 97 -91 71 -25 46 -39 -24 82 -35 -49 0 -47 98 92 20 12 85
3471H5q2l3n8Q5J5Q8r1J51k15l9J11O3l5j1j04N0M1l7J36k27J45k4J3L5j17K4
$$ 85 3 -30 -88 -3 12 100 9 160 -55 -94 17 80 45 34 -70 -20 21 -16 120 -107 38 14 27 62 -55 -31
3497c1l7M7N9L3o1O1j98J21m0m4J14l0k3O9l8Rn0j0P0O9j24J47j22j08P7O8m7
$$ -31 -68 -21 38 71 10 71 -127 -6 -46 -90 24 -6 -29 40 2 11 -39 -49 21 90 -34 113 -9 -117 -40 28 -19
3524a9p7J50j7Q4o5J40l29J43j0n8N6o3J20p0J95j92J2Q2m0N8j09N5p4J36j37
$$ -19 -96 54 37 121 56 196 -133 10 0 -58 -2 -65 55 -15 180 -12 0 82 42 100 -9 46 -28 108 -29
3549b9J19j02p9P2j11J56J2J6j04nj7J69j16J5K2o1J03k3p0K0MK3l1L5P2j30m2
$$ -29 90 -12 -91 -19 -130 26 38 54 -50 -55 -72 97 -19 -4 18 -43 60 37 -33 -13 -9 14 -17 18 90 -40 -82
3576h2P3K01j73L1Pp3O6K1k9k9J3R0j63LP3J4L6o2o7Nj8J21k8J1N1j09M2m3PN2
$$ -82 -9 192 19 50 57 -16 50 71 42 13 26 116 -47 -44 29 43 79 17 -50 -45 -63 58 30 41 92 -17 25 -18 -11 41
3606D1j57M1N5J35k61R5L3pO1p2O9M1K1j27J01j65N9N7k7%mJ06p4k3Kj4Qk1N2
$$ 41 -116 -75 -20 115 -146 -51 -18 -25 36 -36 33 74 95 -32 69 -96 -37 20 -7 -7 -11 95 21 -2 0 -14 -6 -27 25
3635B5qN1o9p6J81nj2j65L6J67rj23l3j33K11n2L1l4qO3j6Ll2k7J38j25j1R2k2
$$ 25 17 68 -1 -77 104 99 87 -78 -42 125 116 -7 -40 -173 38 -14 17 -17 -25 38 22 25 -7 -34 104 -21 -32 60 38
3664C8p3M7R1kj42j8M2N1P8q6Mk1l8Q7l2r4J38p7p6N8K6P5k5p2M2k2J8N3oL0j3
$$ 38 -35 12 103 101 -41 -59 -17 34 112 26 30 9 -29 58 26 -68 70 -7 -83 -25 1 76 51 -21 21 -1 17 70 64 94 81
3695H1j33j7P5o3J13p4N6M6l1j13q6J66J22r2N1p1m8l9R4r6L0r9J33K9o4L5r0
$$ 81 -52 -69 6 -57 56 -18 38 84 53 -60 -146 20 142 50 101 30 -18 -57 37 -59 -29 -128 5 34 -30 5 -85
3722h5J50j21l4n1J56k8j4J15j7m6r4P6l7O7j26P8P9r2L2j44O3N9Ml0qJ70k09
$$ -85 65 -56 -90 -141 15 -13 -27 88 71 25 -69 7 -30 37 -89 -11 68 -24 8 -136 -73 -14 -10 -40 -48 122 -87
3749h7J3J56j10j1j24K18j5j50N4P1J6o3O2l0lJ1K0k8j40J63R4J4k35J81o2N0
$$ -87 -74 82 -28 -39 -163 55 40 -110 -56 15 31 -32 30 0 -3 8 28 0 -140 23 117 131 -104 77 15 65
3775F5j15n0R8K2p1J03r0J07j19J4J01np4j4k3Q5j21K2P3M9o5j6N9p0P0o4M4J17
$$ 65 -50 -100 -2 20 -51 52 -38 69 -50 -36 65 60 -14 -28 -51 34 -87 -65 8 57 -8 -24 35 -35 35 -29 15 132
3803A32j10n6j8J69l9r6K3J08j6j14N9q5R2p0MkMK2K7o5m8oJ27nm3P0ML9o1n7
$$ 132 22 -34 -52 117 78 -18 5 113 97 -17 42 -43 49 -21 -17 -19 -15 7 34 -31 -79 -85 42 37 -6 64 68 107 46 -11
3833a1m9K11k14kN6M6j29J5J62Lk21O9O9j0P1q0j8L5L0nj9N2j38J95j11o9P6l8
$$ -11 -60 151 -63 -65 -9 37 -92 -77 85 88 -133 -64 5 -5 66 -14 -32 3 33 28 9 61 -77 118 7 -62 14 -24
3861b4J7MJ82k23J20j49J17Q5j60N1p3J06J5p1M8o9J4m2LJ68n9m9Qm4K2l3L3R1
$$ -24 -7 -3 179 -44 76 -73 44 129 -31 20 -53 53 68 -3 45 -24 -10 -52 -49 119 60 11 19 -25 -3 -36 -3 88
3889H8j24r2M8l9M8MnP3LP0l7J3K7j59Q0N5pl2N4p6l4N4l5rR3o2k4m9Q1k6RM9
$$ 88 -36 -128 -80 -119 -71 -67 -72 1 4 74 37 50 77 -82 -2 53 46 14 68 -8 -42 12 -23 -32 61 -1 -25 -74 7 -19 -10 39
3921C9p9NJ17o2K6J8qj03P5Jj30P4o1J14q6J96j38qp4R9k6M0mj48J94m2M7o2l3
$$ 39 -40 -35 82 20 46 64 56 -47 28 29 -101 -27 -88 26 -60 136 -2 -10 -84 15 -11 29 25 -123 71 29 76 14 -19
3950a9o5R5j3NP5m3k8n0kO0Qj17J43l1j7j61J96j9k0j9j0J1O3m3K6Mp2P1L2j09
$$ -19 -84 11 -2 3 78 35 7 -43 -45 15 23 -94 49 18 1 -160 36 17 -3 -22 -32 -21 42 -1 25 29 -43 28 60 -49
3980d9n1Q0Qp4P3K8O1n8l8Q9j51J26j3p3J44n0j57K38p7m4n9Q1n3l7J76j47k5
$$ -49 -100 -20 -12 -86 -13 15 76 18 -20 69 -82 44 31 -42 102 52 -105 133 56 12 -47 34 -19 -56 120 -27 -52
4007e2M9K0j01J71j24l2J06J05j51N2M9k5j54N2J26l13J59M3L3l3j4k4Q5m5J6
$$ -52 -3 17 -84 87 -37 -69 37 142 -9 43 92 67 -87 -35 91 -222 -63 -20 13 -20 -34 -58 27 -18 -2
4032bJ0j4N5j54J65j47K51l0k77J79L7o7k7J6j07L2J1J06mo1MN5r5P7m8m4J02
$$ -2 8 -6 49 -105 60 -87 164 134 -143 36 73 6 -21 -5 -112 -80 -69 37 33 -28 -24 31 -64 13 -35 -79 23
4059B3m4O5Q4m5m9L3J09j11o9Qn9J77j54M8J9m6M6n2N9L9j29R8k2L4j16N6J9J22
$$ 23 -21 44 128 83 34 67 176 65 -4 4 -55 122 -32 16 35 -11 35 -17 42 81 -48 50 28 62 -54 2 21 143
4087A43j83J37q7k3J00k8q3k1Lk4M3M7n9K2MqN0j22J84j41O0R8j28N4k8j3j6l
$$ 143 -40 97 10 -13 87 59 -24 -45 -42 -66 -23 24 -35 -13 -9 -17 33 -89 95 -46 14 112 -16 38 10 -3 -19 -22
4115b2o2qO3J30j24j8rm6L1J58j31O1rn0J16j08N8j96K27j84J67j25qJ27j6J4
$$ -22 -84 -92 -29 101 -23 -41 -50 -96 -65 93 -38 23 14 -36 80 -28 30 -166 61 -123 44 -81 -89 38 22 36
4141C6o2J09k25Q2M1J21%r6o1LQ3m1M2q5Km2J50jN6j48R8Lj09J72qk00Q8P1l3
$$ 36 -26 83 -142 -60 -19 102 102 6 -55 -52 31 -10 32 -53 -51 -93 57 56 112 -36 62 65 -44 128 120 -80 8 79 46
4170D6j4p0P2k5J7o8O0K0K2q2N4n9K2LQ6k06J35m7L5ON0l7Qj28J65k4q5L2J24
$$ 46 32 -38 34 9 26 -42 18 38 60 -22 32 -27 -5 -2 84 -122 13 -34 1 7 57 20 28 -100 65 41 -44 -12 112
4199A12j02n0pQ1p7Q4m7O1j05K8L4p9J58%m5k7nJ4n9j2jQ4j12Q7j8R8j28K6oN0
$$ 112 10 -40 -47 34 -43 41 -6 55 -50 -22 12 -67 91 91 46 19 14 28 -31 -43 -44 40 -72 15 -3 95 -33 -7 -13 37
4229C7m2M6j52K5J71o7K6K0l5r1J66q9l7j0j8oO6K1Nj4Lq7O2K0n4l9k5J29M2p8
$$ 37 -5 41 -111 -86 85 18 44 64 29 -62 104 15 -22 -32 -50 -56 10 31 36 22 25 -62 0 20 -34 -73 -98 31 73 -5
4259eQ9j37M6M8Kp3L8k7M6o1ln3M2R9Nl2r1J57j21K3Q2k25J94n2m1ON1L6J00j48
$$ -5 84 -53 -7 41 43 -30 8 -19 27 -34 -37 -90 -48 51 56 24 -67 90 -31 -8 74 -151 43 -9 -50 -44 7 43 143 -5
4289eN4k7j07R6n5M4L4o3Q9L7j13K5N0j53L7J76j04j9OJ34j36k5M4M3p1J9pJ8
$$ -5 49 22 -85 11 -44 0 34 -29 60 97 -16 9 59 -94 -57 119 15 -4 2 136 0 -25 19 62 -9 10 3 21
4317B1m1Q5o1J56j00l7l6RK9L1J0k3m7Q1m7j23J7J83o2L2j37J63j80J12L3q4Q0
$$ 21 -20 65 4 160 60 23 -13 -4 25 56 66 43 -4 77 30 -93 -76 107 45 77 -60 103 -77 35 68 -16 64
4344F4j68J12Lk%o1O2N2%n7K0J00j92J89r6O9j00K4k7nj48O2J13J2J49j66om3
$$ 64 -104 8 11 9 9 -52 10 62 62 5 25 125 -67 122 26 95 -5 19 -8 -13 -161 -99 14 26 175 9 3 -40
4372d0K0L6p0l4R7q6N1J47P3k23n1J04k1o7J21n8lJ6q2P8J1Q8j49l2M3PO8K2j5
$$ -40 -20 16 -54 -88 9 -77 -26 121 194 -29 -80 24 3 -64 57 -1 -4 12 -70 8 19 107 -42 -74 -31 -24 44 66 51
4401E1k7n0JN1o3l1J1P2j2o7J01m1l6N7j09J55n6K3o4J23j45O6m3l7R7J7j65R7
$$ 51 24 -26 -25 26 -37 -68 -57 15 3 -64 37 -4 -40 17 -92 63 7 30 -34 89 -56 10 -33 -70 27 44 -121 -24
4429b4P8Oj9r6O7k4m5O1l6J4n6Q4m5O6j02O9K3L2q8K9J01J4j68RR9o0O2Q5m4r7
$$ -24 54 60 41 -55 12 -12 -57 4 -32 -18 -74 10 -35 31 -71 -2 21 53 -35 -6 95 109 -59 -50 49 -11 51 136 92 -5
4459ep8P9l3l4J96r6J8m4m9Q5m9j5R4No3rk9J15k1j04P7o8%J54p0J2j15k0k0J14
$$ -5 -83 -4 -37 -71 125 29 47 3 -46 39 -10 -25 69 74 11 2 -27 88 67 -37 40 -28 -28 126 56 68 -47 -67 -87 27
4489B7k01J31N7r6l3J78m5m8N1j91J08P8l7k4J0Q1Kj90J16J37m5j8o1L4p7R3n8
$$ 27 -174 -43 14 -82 -115 63 18 -30 21 -170 -62 16 -21 -45 -35 46 48 -142 -26 111 66 48 -13 21 -56 37 -21
4516b1J01l5k1L2j02l4R0MO1q0N8m2q9P0l9J41k58J34p7j1Q9LL1m2M5lj50K13
$$ -21 80 45 24 56 -46 -80 10 14 75 -5 53 11 -78 -8 -47 94 -164 -30 -107 -118 -29 -26 5 -37 8 5 -145 68
4544F8j79J17Ml9O0l5J4k3O5m4lk4O5j01RR4O3j34m5K4J7K7n6O0j8oj9j29K18
$$ 68 -111 6 10 -29 31 -4 10 -13 52 8 5 -19 46 -55 -46 48 111 -23 -68 -44 -27 0 -56 4 -14 -20 -39 -168 50
4573E0q8R6l7Q1j19P3m3p1O3k7P2j00P6m8N5p1M4q2J58j57M7J2K1M1m8Q3j2q6
$$ 50 -38 58 21 102 -17 56 13 -58 5 -22 50 -50 26 -22 33 -38 6 -76 82 -75 -28 -16 5 46 -2 81 69 -17
4601a7K5j9O6j07M0J42j30n3j03J57PL8l7O7J5j94J51N2k08J35r6j7M9O0rq3j5
$$ -17 8 -11 55 -52 -12 130 0 -53 -156 1 8 46 9 76 91 -103 48 100 -108 27 -69 -86 -37 23 14 -69 -84
4628h4j46J89J00l8L7p2M0P5j12q7J49j19J25r9J05j53J01J8o9J35p1q7J16N5
$$ -84 -230 -41 59 21 58 -14 26 101 -11 -98 51 -68 57 -42 63 -90 11 29 -40 95 24 -63 53 108
4652A08k47J62L6m3L5m8p4J52k9L0o6J0n6J7O3q3P1k3j09J42N7q2m2P7N1j51J1
$$ 108 -139 23 59 16 51 3 -71 81 52 82 16 26 -30 -13 50 -33 38 15 -94 48 105 23 -19 58 109 -42 -31
4679c1J9JL8N5j11mJ20n9pk4j4P9r6O8r5qM7j26J68N1j31k6J94L9j00po1O8J4
$$ -31 -12 -11 27 82 -29 -33 87 28 21 -3 -17 62 -34 34 -61 -69 -22 -148 20 71 -60 -86 108 147 47 40 -21 47 61
4708F1Q6q0l1l4m1L9n4o8M1J88m6l9n8p3O9n5O6R6j45O6P5p2n9M9R7L4o3p0L2
$$ 61 147 67 36 2 -39 0 -54 -122 -81 107 61 22 -36 -109 -40 -95 -29 67 -78 -12 63 -9 -68 -19 78 112 49 -21 11
4737A1k9Q0r6P8J8j37k5P1M1l4nP3j3o5Q2o6M5O0j69J36j56Q6O1q4M1J7p5LJ23
$$ 11 -18 62 -34 44 62 -75 -100 -29 12 -22 -27 46 33 -32 50 -16 29 89 -80 56 -100 -14 47 -37 4 21 -54 -51 72
4766G2J8j48p4J40J24j0o8J4j28r4R8R0p4N1n5J57j64K8O3L3p7L5l8r8J02K7j14
$$ 72 90 -58 -132 8 132 122 54 68 -60 -154 -56 34 -40 11 -44 113 -51 -23 40 73 -4 31 -7 -105 -3 24 -90
4793i0P2K0Mq6J24j61J05P3M1l2n4n5K0Lo4N4N1rk1KJ16j84R5r0J13j14mJ15J8
$$ -90 -18 2 6 -80 44 -117 -12 61 102 70 16 -39 -19 -16 -80 -26 25 16 -5 -3 113 -71 24 -66 47 -67 -71 44 62
4822F2q0N5Rn7J87k84J03N4K8lj67J78j14O3j23M0N2r7J19J3N8m3p1N5J2Kn1j
$$ 62 -18 37 46 -11 176 -108 -5 49 77 74 -93 85 -29 34 -89 -49 3 -94 25 38 96 53 -18 37 49 51 0 -1
4850arL7lm9J6oK9j2K7j49J52p7L5Mr1Q8J05m3PR0m7r4pj2M2k9R1j34J29o4o8
$$ -1 -10 27 24 -25 -9 -15 14 2 29 -120 32 -45 -10 -6 -97 -9 96 53 60 150 103 9 2 -10 32 3 94 -40 89 25 -43
4881d3O6j86J75O1j52K9Q8p3K0m5N1lP9j01J3Q7p1K1K5l2q6J10M5k13J52N0n8
$$ -43 23 -163 12 73 -79 -50 38 -35 -15 -60 -9 -12 67 -34 -21 66 -5 16 41 9 -77 33 78 -135 17 67 9
4908Ij6j9L3K3j0m3m0N5LO7K8r4J53j85R5m8Rm3ql9J23l0N2j24L9M9o2m7%L9m
$$ 9 -7 -26 7 30 20 -23 -63 -8 -5 62 90 -4 149 -36 59 11 20 -23 -31 -70 53 23 75 -49 -10 39 -23 -70 -70 -31 -35
4939c5P4K6O4j12RmrK2k3RM5j38qJ07j0p7O3lQ1m0j52J96r1J03j90J03K5o7L2
$$ -35 39 65 129 17 26 22 13 35 12 21 66 -72 -80 27 17 -60 3 0 81 41 -111 85 -6 97 -93 10 35 -32 0
4968@n5O1q7K7l5J68q6n5J52l5o8NJ22o1l7Q0r9Q0m1O1K3j57K9jo3M3Q2k11K73
$$ 0 -55 6 -81 -54 -89 79 -7 -62 90 55 -13 -8 114 53 16 96 -3 77 36 97 120 -37 -8 -9 -72 -29 53 -158 115
4997A15Oo9RN6j34j5O3j04R7j53P9Rn3P2pR7j42R1j08Q6m2J24m4o1K00r6q8L3
$$ 115 121 52 61 117 -17 -32 31 -73 24 -129 -50 -41 -94 -22 -29 68 -74 17 -91 -5 -47 77 33 -28 172 76 -12 21
5025B1m2K8J0l3J00j78J96j08o8K8K5m5j8P6j0R1l3j08J6J04K8j09L0o8Q2k4j5
$$ 21 -21 7 17 -16 84 -94 102 -6 -74 -46 -21 -66 -84 -8 -18 73 40 -68 -52 52 80 -29 1 -67 15 -9 -24
5052b4j28J46Pl3M2J0nk8j1J00k2j05R1K4o3jL9nr8M6J9K8q8J11q4pO1k8N3K7
$$ -24 -152 -6 1 -32 10 20 15 -13 -24 76 54 -51 40 64 1 0 39 34 -64 -18 1 29 -59 52 -32 -39 22 -6 47 74
5082G4j8n9O0j0Q9j79L2MK0oJ9j6Q9rj02N2k4p9J16j54P2L2K4N8j05k5Qj2nr6
$$ 74 56 -3 57 47 136 -43 -11 -7 13 7 26 10 99 90 -12 40 16 -63 53 -101 -29 3 27 85 -20 -45 -37 -49 -54 -150
5112a50K68j53R5j24N8N9j12N7J7k0L6r8N8q5J44%K2Rm9j6J0L6Rm4pp4J32k1l8
$$ -150 118 -35 60 -64 -6 53 -59 -2 15 -5 31 -67 -9 -94 50 50 72 81 32 16 26 62 71 27 20 -54 78 57 19
5141A9R7k06J32k5n3K3L9o9k7P6J23j67L5P0j5j01Mk4k7R1N2j24R1%m7P5L1j43
$$ 19 116 -90 42 17 -36 -13 26 -43 -70 6 129 -38 -3 67 52 -49 -45 -69 -96 -5 47 -77 14 14 -33 42 73 -70
5169g0Lol8K35p5rk3o3J21o6n2k4P3N0n4l7l9Q4n0J1Q2k4r0R5km9JN9j17J83n2
$$ -70 -67 -73 -111 124 49 40 17 -46 75 9 -43 -67 6 56 2 -35 -74 10 -40 -29 53 29 -61 34 32 -17 -16 43 -74 109 57
5200E7j52P1O0m6J17k33O1J57p8O0j63J6R7rm0m3K7rR1j5n8N6l2kK4n0N1j8M4
$$ 57 -95 -24 36 -10 107 -126 -65 92 14 74 -89 -73 24 15 -25 -68 -41 -50 41 26 -32 24 -8 -10 14 -36 15 -3 41
5229D1j7k0q9Q0O5L8n6m8N9m2M5m1m4N4l2p9J35m7L9m6k3l1P9n1N5M5j10N0L1
$$ 41 24 4 -85 -5 60 98 42 -6 53 11 56 15 -29 25 -7 -86 49 2 41 -5 -28 -59 20 -31 24 69 -41 9 40
5258D0kJ5j83J26o0O9m0J9M2q5M6M0n5N1j18J23p1P6M2n2Ok5n3J20j43K9R3j1
$$ 40 38 53 -130 -4 -64 5 -35 -16 26 -59 -13 27 -28 23 -95 28 -43 33 75 23 29 4 -49 71 -72 -43 50 39
5286C9m6L3Qm2l0N1%J8Nn5O8J1p5KN2Q1l2j13M6n3Q7l9o2K31j55k8j03J18j4k9
$$ 39 -7 26 34 -8 -38 13 13 31 36 -19 49 60 -15 -13 39 120 88 -25 21 -32 55 16 -46 185 30 2 -101 17 3 -26
5316b6J37j06K3k01J79j32J28j4k4k5Q9r5P7J2m6P5j06K39j73j0mn3L2k4O9l5
$$ -26 111 5 28 -173 6 -126 2 -12 -36 -61 28 -67 10 22 -24 51 -55 184 11 1 -3 -56 -24 -48 21 -14
5342a4n7K6N7k6J12r1R7j0j2l2Lm2J8p2M6k8n2J38m9j9j0Nj3J0L9KL3m5jN8r7
$$ -14 -71 -45 12 -14 98 7 104 94 82 50 53 11 29 -43 3 -25 -77 61 12 -7 -17 -12 -25 -15 24 26 59 14 13 71 -26
5373b6J5n8J13np5N1q1O3R0j16J13p3o7O9N2kj65J19m9J2j4O9K2jo8J07r0mj8
$$ -26 -11 -69 44 39 -36 15 -66 -3 87 -29 84 11 -56 13 65 63 -102 17 -32 -20 -34 35 57 56 -12 95 5 1 -17
5402a7Qj3j7m1J40q6O1o7l8QL7O0j47P3lL0Mj32J00k4J28j06j45K79m6N9j01M
$$ -17 -9 -22 -39 -80 60 -26 35 -32 -70 -62 -25 35 -112 -39 -42 -12 -8 -140 -40 -64 64 -42 -187 92 46 105 4 8
5430Hj6P1l3q6K7j29J30p4K32q0m2k5k9L8k1J01%o6K2n7M7p1ON3l0J10k7o1P3
$$ 8 -8 63 30 -56 -29 -158 -28 -102 130 50 8 -17 -46 -8 -29 72 72 6 28 -29 18 -53 -47 6 -24 86 59 -2 71
5459G1j83M2J56j8j7kJ4p3J%jQ5n8PJ02j43O2n7M5J3j23J38k8m2m0PK3j6m6R9
$$ 71 -112 -70 86 68 51 49 63 -10 -9 -9 -10 75 17 24 126 -17 45 -12 33 46 -77 61 33 -9 -49 -42 -19 -35 -81 18
5489A8l7k4LKJ27q6o1J14j5j03O1k5PK7k6j1N7L8o4p6J04l4n9J36j42L1LRK0k0
$$ 18 -19 -43 -40 -38 89 3 -58 56 41 -62 -1 -26 -19 8 -18 -29 28 66 2 -74 30 -4 -63 73 -69 -38 -35 -26 -6 -26
5519b6j6n2M9l4R5qM7q3Q8m9j5P7k5j08N2RN3O0j53M1j5m8J20l1K1r3J7J07n1
$$ -26 -42 -94 -45 -79 16 8 55 -28 60 11 -4 73 48 -60 -8 1 54 114 -39 2 -13 -61 59 28 49 -44 -27 80 29
5548B9J0o4K7L9m6R3m7j22J90j39%J3M3Jp4P1j00L5J7KN2n3N1p1qP0k4N8r0L4
$$ 29 39 -25 2 41 -5 88 41 -81 109 -30 -30 -17 26 27 -47 24 -76 -41 -24 -22 30 -23 28 -43 -51 19 -5 53 -37 -3
5578cj04J17k4N5q8J24n5Pp7R2l7j6o6P1n7R5j05N0J07j4j15j02J39l8QP5mn5
$$ -3 -107 10 -14 41 -47 77 22 29 -48 44 7 -9 -75 -4 -61 34 -71 -21 86 72 -43 -145 -6 -44 -36 39 35 -20
5606b0l5J31q0j4j0Q3k4o1N9rj0J2J3l7L0M8o2kPL5L9k10J45j10k0Q7J04k8q4
$$ -20 -55 76 -4 -18 -28 55 31 -30 29 20 10 22 35 -2 28 76 14 12 19 54 93 -117 28 -82 -102 -15 89 61 -23
5635b3J6j6pQ5j17Q3l5nR8Nq9o0J68k12O3Q6J3j01Q2K3p1N8r8J09j78J71r6J33
$$ -23 -7 -23 -30 55 -62 21 -14 -19 79 84 -5 -65 103 -109 -46 40 53 -48 34 57 -14 44 -54 55 -123 48 -48 85
5663H5m4k6k3q9J36M4j48Q8O1q4N3l4M8n8j23J33l6qo2J16l7L9ll0O8p0j76N0
$$ 85 41 15 -8 -97 39 83 -65 23 84 0 53 19 67 9 -114 19 -17 -25 -87 29 -8 31 28 -2 66 -4 -180 -130
5691a30L9J09J29o7o3O2j64Q0P0j5K8p1M7k0m2oP6q8J03o2L3n7N9m5l7r1K2Q3
$$ -130 -91 18 147 80 17 79 -85 -5 65 50 78 7 54 34 -8 -14 62 -26 77 15 48 -9 50 5 -32 -123 -101 -18
5719a8RM9Om1J1l1j2j0j9N4P0Km3M0j27J17j43RJ05JJ8o9K0j2J6kO4N1j74N4o1
$$ -18 -9 40 46 5 16 -15 -27 -37 -56 -2 68 70 27 67 -60 57 -86 -77 28 29 47 -22 -2 -14 2 0 64 115 -59 -5 -66
5750f6N9q1R6n8N4nqj21P7J70j37lm8J41L5n2j13R9rN2r2JO5N4k30J18N3km1Q6
$$ -66 -7 -88 8 -50 4 -1 -9 -130 -53 117 -20 -23 -71 70 105 53 -60 39 30 82 -10 -9 56 110 -120 -2 51 49 8 94
5780I4m6r0N5Ln9m5nJ23Mk9N4j9j07K9M2M9J2r3q8J30q0J13J9j39J53j31N1j39
$$ 94 48 -42 13 16 -43 -88 -93 30 34 5 59 40 -67 -38 4 53 65 -28 -116 14 -66 47 66 -73 80 -51 0 -139
5808a39J18j11Q3J97q2o6p2J36o6K0k8l0R1j27Q4K9l0O7j01Mj5PJ8j18J48j1O6
$$ -139 -21 -132 -49 148 66 0 -72 64 -2 18 -10 -40 51 -76 8 37 7 74 -27 -23 -38 -31 -13 -131 17 6 72
5835G2k5r1R4o9m1J6n9m6J06O0M8m2l0R9k30J53O0j66J12K9n8J7L8Ml8l7O1J2
$$ 72 47 -44 50 -19 -60 -44 -103 -149 -43 17 65 23 -7 92 -138 15 75 -91 21 50 -8 9 47 51 13 -24 37 49
5863D9k2o1M4L3j21J58j31J61j89N3O1j29J09k1J29j95J51r4R5o2L2mr3O0q0P1
$$ 49 27 -34 10 43 -78 80 -51 110 -79 -26 35 -94 15 -6 123 -72 79 -15 80 18 50 46 -47 13 -67 4
5889DP2p1K8j3r6R9o9K36j48j60J97j69J92j26M2R4m1p6%N4m4N7q2N7J5j42J08
$$ 4 76 5 33 20 -76 23 -46 190 42 -118 79 -90 102 -24 18 112 71 -5 -5 49 5 62 -20 37 52 -90 18
5916A8j2j10J57j5J2j02N9j21J07P2q7k3l7J11o3l4L1Q2j02J7JL4m4P5n0J8ON2
$$ 18 6 -104 53 38 50 -52 7 -114 -7 65 -22 -45 -82 29 -34 -68 -37 45 -57 -40 -39 -5 -49 26 -24 -6 0 52
5944E2j31O5m9J05l0j15Q9j32J59n7N8Q3p9KK4Pr2J36j3j39Q2R2r0P2Pj14J75
$$ 52 -79 -14 -63 42 12 -103 -14 -146 13 -44 14 97 18 20 44 51 -41 95 82 -57 25 117 27 99 106 -8 167
5971A67j77m8N5j3q8J35PmkP8p1q8M2N5Lj15J39q5L3k6n0J09q4r0J83R0j32p5
$$ 167 -10 -58 -3 -16 -104 31 38 34 32 110 39 -49 -7 48 51 -64 75 -10 23 -3 -53 56 -28 -118 65 155 23 -52
5999e2K14k42J05O7K5l6j01L6j63J84q3O5m4n5J16l8j9Q2j00M2m4P4Nk8m6MnJ17
$$ -52 162 -80 25 92 117 81 -20 16 -147 37 -46 19 -25 -80 36 -2 -21 61 -39 3 -41 33 38 10 -36 -32 -37 80
6027H0L1k01J31n6j4J39p6pj02O0J29j05R9j08k2J56n5j27J24o3k3KK8J0l3J15
$$ 80 111 -90 41 -15 -29 110 34 27 -75 -15 114 9 108 0 -22 134 79 -48 76 13 -10 -8 20 30 -3 112
6053A12j70L2R1j00kJ88j40J6lp0P7o9P6j14%J65l9N1n8r9N2R7p1l6L0j14J81
$$ 112 -58 -26 65 -35 -37 151 11 27 24 -46 31 -38 38 -76 -76 89 50 101 43 -56 -4 93 22 -14 16 -98 83
6080H3j6o2r1Q4J13j90J04j4q1L5l8K1L2R7j00nL5nK5M5k6j0j06J61j29n3J53
$$ 83 67 5 -86 -2 111 -79 25 11 -70 -35 -73 -52 -20 77 -23 -28 7 2 27 72 46 36 -70 91 -38 -91 62
6107F2J7Mj40J28k2l1L5J18k33O5k1J02m4j20O2K9m3O9J5L3r8Qk7m1P7L6o6J1
$$ 62 79 83 -57 71 49 18 53 171 -62 3 -18 84 40 -80 -18 11 -32 37 52 85 -13 -5 -32 -73 4 40 -26 -15
6135a5J0j1rk1J08p8N3p0J01l8o2j10J17k9J51n8nk5P5j33l6J28p6Q5M9m6rNn0
$$ -15 -5 -16 -25 -46 62 -16 37 -33 68 30 -32 -142 -25 -54 97 39 34 9 84 -49 -85 43 -33 52 101 55 46 51 1
6164AP5l0m3L6n4N5M0j76o1J36P0m6l1J5q5J81j17M7o5j6j0J27l0L0m0J08j0j91
$$ 1 76 46 3 39 -15 40 80 -96 -157 -21 49 3 -28 -13 -98 83 -34 13 -52 -68 -78 49 19 49 9 117 107 -84
6192h4Q5j17J33p7J02l3J05l5q6M2p4K3R7r3K8o3J43j40R4lj43O8K6q9Q6J48j13
$$ -84 1 -116 17 -60 42 9 114 79 -7 35 -39 -16 81 -12 16 -47 96 -44 50 47 -96 -28 -2 -91 -5 143 30
6219C0j4L7O8p5j45K99k32M6N2p2O7l0k1q2Mm5L4J10m9PM4Q8j69N9O4q0%jp3K2
$$ 30 16 53 121 46 -99 200 -32 14 66 -6 61 31 10 -72 -68 -113 -79 31 -18 -11 33 121 -48 11 75 -5 -5 -6 -79 -57
6249e7N3k0Pj0R2p7rN9r2K0N5j3N7o4m3L9J1o7J02o9KN8j36J40lp8O2K5l1K4n6
$$ -57 -4 -24 -17 -27 65 -12 -21 38 -54 -34 21 8 65 1 -42 -3 8 -59 43 -26 -24 34 -102 38 35 -43 19 44 13 37 -19
6280a9M5k8j7R6r8n3J29r9O3NN2r3P6j18M6rn1O9O3O5k05r2Q1M3P6j21J30l8n2
$$ -19 26 -2 -19 77 -21 -74 55 -44 19 24 76 -17 59 -59 -13 -22 -73 -4 59 124 -81 -173 -92 -49 27 -94 36 -2 -54
6309e4O2L1m1l2Q0j13j8J45j34j1N8O2k5m5Q4Kl2j2m8k1P3n3J6O4j08J5NK7o5
$$ -54 8 39 -2 -34 46 -67 -85 60 -74 -85 -27 35 10 -35 49 51 19 7 -41 -62 11 -42 -26 38 -70 -55 -50 -23 -88
6338h8O8Q9Mk9m9q3J42p0m2N5m4R2R1j85P8o9m3L2K6j17K21p4j2Qq4Q2q1J24N9
$$ -88 -20 69 73 44 -5 -88 54 -16 -58 -3 -47 45 136 -49 29 -40 -83 -51 -25 -142 79 5 -7 1 -83 -1 -82 42 101
6367A01j13M9m5n8J1n8J53J7p6p9P6n2J44n9Rn4J44n8q0l4J50oj43K9K4q3J44
$$ 101 -12 37 -8 -66 -55 -113 40 57 -19 -98 -22 -74 70 11 20 -34 110 52 -28 -62 88 82 -61 -32 -8 -91 53
6394E3r4J16j28M9m3R1Q5j74Q6q4J2J6L8n4L7o9K9%q0Q4P2p3n8J31m7O0k3l2M0
$$ 53 -41 75 -53 -4 -47 44 129 -45 41 -43 -31 -15 23 -31 6 -63 -34 -34 -114 -30 42 -31 -89 42 -5 55 32 0 40
6423D0R9o0o2%M0j89J61n3j9Kj14R5R5PmL1p9L9K0j01O4j2J56j49k0J5o4OP7l8
$$ 40 139 79 17 17 57 -132 29 -24 -43 -41 -155 -60 35 42 38 69 -10 29 49 -52 12 0 156 7 -13 2 -62 -56 21 -17
6453a7J3O2o8L3j4k2J7L8p8N5j62J93n0l2J31j43J30j49O5P4j8Jj7J1n7K3L8n1
$$ -17 -4 58 -10 23 9 -13 4 42 -36 19 -143 50 0 -32 99 -44 86 -63 2 76 58 59 42 53 -4 19 57 6
6481FrO6j9m1P8n4r0K5M9M6q5K0ql7R0p4O8j7P5k7l1j19J35p0N2L2m0Mr9J13m7
$$ 6 -3 63 44 3 81 27 -63 -38 11 57 -28 -8 -16 -53 37 -37 31 14 89 62 31 -88 47 -23 29 61 21 25 -74 39 -8
6512hj2N0r0R4j65M6J52j2j74J55q6J8R1j51K03j58M4N9J2p2J2P6p2l7R4l4k4
$$ -8 -20 30 -60 34 -131 -85 67 55 -119 36 -50 -32 59 -92 111 -47 -3 56 68 -4 8 84 12 -25 69 35 11
6539A1n7P5q9M3Q7K3l6j9n8N2K3j05N7Q1j35L7K9q6J24mn7j11PJ22k3R2pj26J1
$$ 11 -46 29 -60 -17 70 93 57 38 -20 32 55 -50 7 88 -47 -10 19 -67 57 53 -4 -115 -108 14 -9 83 76 -50 -39
6568c9O3Nj8O2j49N5p1N7L3l6R2p7o2PJ62l6l7n1R7m2j5K2o8R1k8j21Q4L5Kq9
$$ -39 24 29 11 73 -76 -21 -92 -35 -2 -38 54 -23 -85 -78 84 48 11 -40 57 15 0 22 -46 45 17 -104 -20 15 17 -72
6598g2PL7J35j57J02q1KJ45k01nL7K6PQ1Q1j51m2m9L7J96j49N7n7m0R4q7j12J35
$$ -72 -65 -28 107 -50 52 -29 -27 118 -83 -88 -51 -25 -18 63 144 -7 -49 -98 -61 135 -14 43 -14 -54 40 -47 -159 -24
6626b4j9K20j39k7J4kk5J8O6n3K0l9l2M1n9J57r2K8r0k2J18m5m8M9K5o1J11j29
$$ -24 -43 177 38 11 25 23 -2 16 82 29 49 10 -22 19 -40 117 25 53 -37 -59 59 14 -34 15 40 -21 90 -39
6654c9P5j07j5R0l6R6n9O6Kj25P0J02L7j62NN6j5j8rL3r4m3J14ok7k2o0N5M3O9
$$ -39 36 -71 -86 4 -32 64 5 71 73 -52 18 120 157 -5 0 56 41 23 14 47 -47 -90 24 18 -9 -31 -91 -36 7 76
6684G6m9k8n5R5No2p6M7r9M1J14r5P8l7O5k1q7J7J22jl6NN3r4O1r7O5n7K1j5J9
$$ 76 27 -1 -56 39 44 -18 -94 -47 -146 -105 9 -86 -8 -45 20 -1 -88 -71 51 50 14 19 72 -22 39 -58 7 -50 -29 -44 -25
6715b5Q6m3ln6q7K50p2Rl6r2P4m7O3Rr2R1j08l0J30k2J2O8l3N5j1n2j6k6P9l8
$$ -25 61 18 15 -41 -128 122 50 59 23 -69 5 -42 21 30 -62 29 -79 -109 21 -1 11 79 46 101 90 38 22 -4 75 37
6745C7q5JJ96j24j08J09M4r3M0k3o1K3N7k0K0N0o5R3o8K3l2O2lr5O9M%K0p8j6
$$ 37 -48 -47 149 25 -83 26 70 -23 17 -6 -67 -44 13 -7 13 63 -2 91 23 46 14 76 73 -22 47 51 51 71 -7 -23
6775b3n3J53pm2N1j07P0n4P3k1l1L6q4Lm7l5K35j58NJ03q4jM0J1J5N9n6k30J85
$$ -23 -76 77 70 28 79 -28 42 -12 61 40 9 45 -39 -36 -83 -118 117 -41 -36 67 -17 -18 22 33 48 107 51 -179 6
6804FP0l7n7L6L0j53K3J32n5N0l4K0L8o4L1o6p3K1O9j8K6j30L10j87k3Q0Pl9J8
$$ 6 76 39 -18 18 48 -105 -82 50 -5 45 11 31 69 5 36 -30 -103 -82 -13 -31 -5 -135 175 -12 -35 45 52 13 31
6833C1J25j98o5J00l1o4J38r9J36l6o2r4J47Jj0J11j69n0M7JJ8m7N4j5K0N8p3
$$ 31 156 -42 -107 -7 -38 -102 36 -63 73 37 -25 -119 28 29 19 130 -39 -89 -42 -41 -23 -70 -16 -31 -11 47 -26
6860b6LJ7N7q5J12j4l7n2nJk7P8j7m4k0P5n0QJ1J8L7J0J9j10q9K35o9k0n5P2K9
$$ -26 -23 -6 51 -34 78 64 27 -25 -30 -29 -56 22 5 -39 -59 16 -34 -26 -15 3 40 50 69 -41 -130 105 36 16 -39 33 62
6891F2K1j31N0M6j12L3n4J0J44j11J13K2j24K8n9L1N6k0J9O0j13QLL4K1p5J45
$$ 62 83 -48 2 48 -64 -31 -85 -75 69 -42 71 93 -31 -3 -62 -31 25 5 24 84 -29 -21 -18 16 37 -38 107
6918A07k8q1M9L4K3k2j03r3J28K2o5q1J41j2m8J65q6k8J4j17J92m9k1j13l7Q6
$$ 107 79 -2 47 81 104 82 -21 -114 14 36 -29 -110 31 19 -29 136 50 22 36 -81 111 62 41 -72 -109 -23
$$ [...]
8191B0
##END NTUPLES=NMR FID
##END=
