##TITLE=1H_DE-80H_X3
 200.13MHz, d2o
 8 sc
 
 19ns.26.2.2025
##JCAMPDX= 6.0         $$ Bruker NMR JCAMP-DX V2.0
##DATA TYPE= NMR FID
##DATA CLASS= NTUPLES
##ORIGIN= UXNMR, Bruker Analytische Messtechnik GmbH
##OWNER= pz
$$ XWIN-NMR		Version 3.5
$$ Wed Jul 16 14:51:22 2025 Russian Standard Time (UT+4h)  Yarkov@DPX200
##.OBSERVE FREQUENCY= 200.1313
##.OBSERVE NUCLEUS= ^1H
##.DELAY= (6, 6)
##.ACQUISITION MODE= SIMULTANEOUS
##.ACQUISITION SCHEME= undefined
##.AVERAGES= 8
##.DIGITISER RES= 18
##SPECTROMETER/DATA SYSTEM= spect
##.PULSE SEQUENCE= zg30
##.SOLVENT NAME= CDCl3
##.SHIFT REFERENCE= (INTERNAL, CDCl3, 0, 14.3821)
##AUDIT TRAIL= $$ (NUMBER, WHEN, WHO, WHERE, WHAT)
$$ ##TITLE= Audit trail, XWIN-NMR		Version 3.5
$$ ##JCAMPDX= 5.01
$$ ##ORIGIN= Bruker BioSpin GmbH
$$ ##OWNER= Yarkov
$$ C:/Bruker/XWIN-NMR/data/yarkov2/nmr/H-C/1/audita.txt
$$ ##AUDIT TRAIL=  $$ (NUMBER, WHEN, WHO, WHERE, WHAT)
(   1,<2025-07-16 14:50:35.75 +0400>,<Yarkov>,<DPX200>,
      <created by zg, POWCHK disabled, PULCHK disabled
       configuration hash MD5:
       00 E9 B6 7A A2 85 ED C7 34 08 36 98 17 FE 4E 26
       data hash MD5: 16K
       80 45 1B F8 81 43 A9 20 22 37 53 F0 BF BA 75 85>)
$$ ##END=
$$ 
$$ hash MD5
$$ F0 32 92 CA 96 89 1B F8 2D 48 59 B2 95 DF 28 A2
##$RELAX= 
##$RELAX= 
##$RELAX= 
##$RELAX= 
##$RELAX= 
##$RELAX= 
$$ Bruker specific parameters
$$ --------------------------
##$DU= <C:/Bruker/XWIN-NMR>
##$EXPNO= 1
##$NAME= <H-C>
##$PROCNO= 1
##$TYPE= <nmr>
##$USER= <yarkov2>
##$AMP= (0..31)
100 100 100 100 100 100 100 100 100 100 100 100 100 100 100 100 100 100 
100 100 100 100 100 100 100 100 100 100 100 100 100 100 
##$AQSEQ= 0
##$AQ_mod= 1
##$AUNM= <au_zg>
##$AUTOPOS= <>
##$BF1= 200.13
##$BF2= 200.13
##$BF3= 200.13
##$BF4= 200.13
##$BF5= 200.13
##$BF6= 200.13
##$BF7= 200.13
##$BF8= 200.13
##$BYTORDA= 1
##$CFDGTYP= 0
##$CFRGTYP= 5
##$CHEMSTR= <none>
##$CNST= (0..31)
1 1 145 1 1 1 1 1 1 1 1 1 1 1 1 1 1 1 1 1 1 1 1 1 1 1 1 1 1 1 1 1 
##$CPDPRG= <>
##$CPDPRG1= <>
##$CPDPRG2= <>
##$CPDPRG3= <>
##$CPDPRG4= <mlev>
##$CPDPRG5= <mlev>
##$CPDPRG6= <mlev>
##$CPDPRG7= <mlev>
##$CPDPRG8= <mlev>
##$CPDPRGB= <>
##$CPDPRGT= <>
##$D= (0..31)
0 0.7 0 0 0 0 0 0 0 0 0 0.03 0 0 0 0 0 0 0 0 0 0 0 0 0 0 0 0 0 0 0 0 
##$DATE= 1752663035
##$DBL= (0..7)
120 120 120 120 120 120 120 120 
##$DBP= (0..7)
150 150 150 150 150 150 150 150 
##$DBP07= 0
##$DBPNAM0= <>
##$DBPNAM1= <>
##$DBPNAM2= <>
##$DBPNAM3= <>
##$DBPNAM4= <>
##$DBPNAM5= <>
##$DBPNAM6= <>
##$DBPNAM7= <>
##$DBPOAL= (0..7)
0.5 0.5 0.5 0.5 0.5 0.5 0.5 0.5 
##$DBPOFFS= (0..7)
0 0 0 0 0 0 0 0 
##$DE= 6
##$DECBNUC= <off>
##$DECIM= 32
##$DECNUC= <off>
##$DECSTAT= 4
##$DIGMOD= 1
##$DIGTYP= 9
##$DL= (0..7)
0 120 120 120 120 120 120 120 
##$DP= (0..7)
150 150 150 150 150 150 150 150 
##$DP07= 0
##$DPNAME0= <>
##$DPNAME1= <>
##$DPNAME2= <>
##$DPNAME3= <>
##$DPNAME4= <>
##$DPNAME5= <>
##$DPNAME6= <>
##$DPNAME7= <>
##$DPOAL= (0..7)
0.5 0.5 0.5 0.5 0.5 0.5 0.5 0.5 
##$DPOFFS= (0..7)
0 0 0 0 0 0 0 0 
##$DQDMODE= 0
##$DR= 18
##$DS= 0
$$ [...]
##$SUBNAM2= <"">
##$SUBNAM3= <"">
##$SUBNAM4= <"">
##$SUBNAM5= <"">
##$SUBNAM6= <"">
##$SUBNAM7= <"">
##$SUBNAM8= <"">
##$SUBNAM9= <"">
##$SW= 18.0517328524113
##$SWIBOX= (0..15)
0 0 2 0 0 0 0 0 0 0 0 0 0 0 0 0 
##$SW_h= 3612.71676300578
##$TD= 16384
##$TD0= 1
##$TE= 0
##$TE2= 300
##$TE3= 300
##$TEG= 300
##$TL= (0..7)
0 120 120 120 120 120 120 120 
##$TP= (0..7)
150 150 150 150 150 150 150 150 
##$TP07= 0
##$TPNAME0= <>
##$TPNAME1= <>
##$TPNAME2= <>
##$TPNAME3= <>
##$TPNAME4= <>
##$TPNAME5= <>
##$TPNAME6= <>
##$TPNAME7= <>
##$TPOAL= (0..7)
0.5 0.5 0.5 0.5 0.5 0.5 0.5 0.5 
##$TPOFFS= (0..7)
0 0 0 0 0 0 0 0 
##$TUNHIN= 0
##$TUNHOUT= 0
##$TUNXOUT= 0
##$USERA1= <user>
##$USERA2= <user>
##$USERA3= <user>
##$USERA4= <user>
##$USERA5= <user>
##$V9= 5
##$VALIST= <valist>
##$VCLIST= <CCCCCCCCCCCCCCC>
##$VD= 0
##$VDLIST= <DDDDDDDDDDDDDDD>
##$VPLIST= <PPPPPPPPPPPPPPP>
##$VTLIST= <TTTTTTTTTTTTTTT>
##$WBST= 1024
##$WBSW= 4
##$XGAIN= (0..3)
0 0 0 0 
##$XL= 0
##$YL= 0
##$YMAX_a= 65097
##$YMIN_a= -44322
##$ZGOPTNS= <>
##$ZL1= 120
##$ZL2= 120
##$ZL3= 120
##$ZL4= 120
##$ABSF1= 10
##$ABSF2= 0
##$ABSG= 5
##$ABSL= 3
##$ALPHA= 0
##$AQORDER= 0
##$ASSFAC= 0
##$ASSFACI= 0
##$ASSFACX= 0
##$ASSWID= 0
##$AUNMP= <proc_1d>
##$AZFE= 0.1
##$AZFW= 0.1
##$BCFW= 1
##$BC_mod= 2
##$BYTORDP= 1
##$COROFFS= 0
##$CY= 83.5205535888672
##$DATMOD= 1
##$DC= 2
##$DFILT= <>
##$DTYPP= 0
##$F1P= 10.8118882576601
##$F2P= -7.23987719738617
##$FCOR= 0.5
##$FTSIZE= 0
##$FT_mod= 4
##$GAMMA= 1
##$GB= 0.15
##$INTBC= 1
##$INTSCL= 1
##$ISEN= 128
##$LB= 0.25
##$LEV0= 0
##$LPBIN= 0
##$MAXI= 10000
##$MC2= 0
##$MEAN= 0
##$ME_mod= 0
##$MI= 1.114404
##$NCOEF= 0
##$NC_proc= 0
##$NLEV= 6
##$NOISF1= 3.799351
##$NOISF2= 2.8
##$NSP= 1
##$NTH_PI= 0
##$NZP= 0
##$OFFSET= 14.38212
##$PC= 1
##$PHC0= -1362.974
##$PHC1= 20.39091
##$PH_mod= 1
##$PKNL= yes
##$PPARMOD= 0
##$PSCAL= 0
##$PSIGN= 0
##$REVERSE= no
##$SF= 200.129724274929
##$SI= 16384
##$SIGF1= 3
##$SIGF2= 2
##$SINO= 400
##$SIOLD= 16384
##$SREGLST= <1H.CDCl3>
##$SSB= 0
##$STSI= 0
##$STSR= 0
##$SW_p= 3205.1282051282
##$SYMM= 0
##$S_DEV= 0
##$TDeff= 0
##$TDoff= 0
##$TI= <>
##$TILT= no
##$TM1= 0
##$TM2= 0
##$TOPLEV= 0
##$USERP1= <user>
##$USERP2= <user>
##$USERP3= <user>
##$USERP4= <user>
##$USERP5= <user>
##$WDW= 1
##$XDIM= 8192
##$YMAX_p= 0
##$YMIN_p= 0
$$ End of Bruker specific parameters
$$ ---------------------------------
##NTUPLES= NMR FID
##VAR_NAME=  TIME,          FID/REAL,        FID/IMAG
##SYMBOL=    X,             R,               I
##VAR_TYPE=  INDEPENDENT,   DEPENDENT,       DEPENDENT
##VAR_FORM=  AFFN,          ASDF,            ASDF
##VAR_DIM=   8192,          8192,            8192
##UNITS=     SECONDS,       ARBITRARY UNITS, ARBITRARY UNITS
##FACTOR=    0.0002768,     1,               1
##FIRST=     0,             0,               0
##LAST=      2.2672688,     0,               0
##MIN=       0,             -44322,          0
##MAX=       2.2672688,     65097,           0
$$ Real data points
##PAGE= N=1
##DATA TABLE= (X++(R..R)), XYDATA
$$ [...]
1008a47K18M41k79o56l02K55P96j77k96k20L39M2n03L27J324k73j445k07J057
1027B94L68o68j27O45l31r44L9Q04L91l00p13j21N31K1k83O11O29m83r53L03J122
1048H35l88o83M75J78r29k12O36O11j56p69L7K88O4j45K2O16J65j180l88J301
1068C78N15o26n75M65K73o71l62J155L05j042n89K28P43r0l70K86M23l97p16L44
1088c23R58K14r86l33P18j52p39M80J006k15j225k19R88N43p89k46M40L1p29k99
1108h77J082P44p85q63M24O37l1o30M49P79q60q83L80J077j34p92o1N52k45o02
1128f39M10R38j65j026l54P06M34n12J8P72m1r53j80Q40R43r31q00M32L67o30
1148c71k86P16N66p01q25M35Q72L5m77j3L37p0p17K27J123j55q41k17L80Q7l96
$$ plain form
1008 -147 71 512 233 -423 -725 -470 326 149 -147 -367 -28 14 -489 -162 1162 889 -556 -763 294
1027 294 662 -6 -133 512 181 -763 -724 80 471 171 -542 -663 -132 -111 -394 217 846 363 -590 -287 835
1048 835 447 -236 239 417 -512 -724 -88 523 367 -402 -365 -77 -13 -158 -136 480 645 -535 -923 378
1068 378 893 267 -308 157 430 -241 -603 552 857 -185 -774 -546 197 107 -263 23 446 49 -667 -323
1088 -323 635 849 -137 -470 248 96 -643 -163 843 628 -597 -816 172 715 -74 -320 120 151 -578 -877
1108 -877 205 949 164 -699 -275 362 331 -299 150 929 69 -814 -434 643 509 -283 -344 208 -37 -639
1128 -639 -229 709 544 -482 -836 -130 304 -208 -190 582 541 -412 -592 248 1191 260 -540 -108 259 -371
1148 -371 -657 59 625 -76 -901 -466 406 441 -36 -49 288 218 -499 -272 851 696 -145 -362 18 105 -291
1169b91k4P27j61q71k68O59N68k29m10L64L39p23P1P77L68n72p47J60N49j73l40
1190b27K71L15n23n95J61Q97K78p94k05L82R5l38J47Q65L8p85k78K98L33k24l0
1211H1j30J8l42k39M70L57om82j55N16p2p9M55K83n37m17K53J88J99j70j65q4
1233e8l18J04O0K88K95m57o32M29M82j83p9L43N7m33k07M02L53r2j64l68j40O9
1255b49J90M8J49p8l20r1M0N42j9j70Q3k02j06J79K98m5m5j57j20L5n2M07j88
1278A29k07j86j27k0M92K28j85j44j57Q7MJ16M18j51m38j35L6J79K09J44k60k6
1300Fr3j02P5K39K27l11n24J73K97M3MQ6n0p8j91K23K97J23k95l73Q9J70j49J86
1324G2L29j83m30j47K02L85j27k85J73j25k46R6M51K63l01m52K00M22j81j06K20
$$ plain form
1169 -291 -315 412 251 -620 -888 -229 339 110 -300 64 403 -320 -249 528 896 324 -423 -263 286 113 -227
1190 -227 44 359 -164 -759 -598 299 577 -217 -422 -40 55 -283 -136 729 767 -18 -296 2 335 111 81
1211 81 -49 -31 -373 -612 -142 215 209 -273 -428 88 16 -63 392 675 138 -279 -26 162 361 191 26 -58
1233 -58 -376 -272 -212 76 371 -86 -718 -289 193 10 -69 274 331 -102 -309 93 446 354 190 -178 -318 -249
1255 -249 -59 -11 138 60 -260 -351 -311 231 212 42 125 -77 -183 -4 294 249 204 47 -73 -38 -90 317 129
1278 129 -78 -264 -391 -411 81 309 124 -20 -177 -90 -86 30 448 297 -141 -276 -240 -61 148 292 32 6
1300 6 -87 -189 -114 125 352 41 -483 -310 -13 30 34 120 70 -8 -199 24 321 444 149 -224 -135 35 -114 72
1324 72 401 218 -212 -359 -157 228 101 -184 -11 -136 -382 -286 165 428 127 -325 -125 297 116 10 230
1345B30Mk70m22L8P09n4m10P1j3O9j62L0N84K70q48r5K77L67k9m19K79J91m52
1368e5m87M64M46k04n88M8K98N9m13M37L25j59n06LP54K22n60l5L98m09m85Q0
1390c67P31Q8q00k20N99L4j82q6L53K43m46o89P46O27k38m79J8L64j70n46L85
1411c5O54m13p00n5M42K89k23j99L77q4m37Q8N15M71m43n77L09K69k86k23M89
1432B28K57n30o56N19N25l58k82L44j7j91k23L53N70k36m72o9L18J52l10p5N66
1453D13r4q26O5P20K29o21k73L90L6n38K19N22J12l92m10K75M61j00m32M52mk55
1475e1m41L82O06j00n93q5L70l39o2M01L22k76n21M9N03L7j75O0j03Q4l11q6P03
1498C74K18n43l06K34N7k3k88N08J18o66j92L62L72J14m32J5K89k86l3J57M16
$$ plain form
1345 230 234 -36 -458 -420 289 235 -175 -104 -117 -48 -210 -180 404 674 -174 -269 8 375 346 -73 206 397 -55
1368 -55 -542 -78 368 164 -424 -376 -78 -19 -432 5 330 171 -335 -332 422 644 84 49 447 38 -447 -367
1390 -367 364 452 -348 -568 31 65 -117 -203 150 393 -53 -742 4 631 393 -86 -68 296 126 -420 -35
1411 -35 619 206 -494 -549 -107 182 -41 -240 137 53 -384 -296 219 690 247 -330 -21 248 -38 -261 228
1432 228 485 -45 -701 -182 343 -15 -297 47 30 -161 -384 -31 539 303 -169 -238 80 232 -78 -153 413
1453 413 319 -507 -442 278 507 -114 -387 3 39 -499 -280 242 354 -38 -448 -173 288 188 -244 208 204 -51
1475 -51 -492 -110 496 396 -197 -282 88 -251 -313 88 410 134 -387 -338 165 202 27 87 -16 68 -243 -329 374
1498 374 592 49 -257 -23 34 11 -277 231 349 -317 -509 -147 225 339 -93 -78 211 -75 -108 49 465
1519D65p9n53k01M44K35m04O2J78m6l69j97N88K24m28k40J64J34M2r4M01K44m40
1541A30m20J54M87j25j82j49K09l19k66L10M45q1l16j95K77J60k64J51L63q4m82
1562a97n1L33L89k99k56R7n6q2M3J98J44k29m08P6L80J03r3j82K34p2k33J77M45
1585D61j95j99j02j47J58qR5J72k5l75j06N0K99Q0k04q3K52k44l8K75J94j21l60
1608a71m5K34J15r3K63k30k72n0J67P7J70K8j26k75J15J07j41K82P6k85j41J22
1630g3J59R2n4Q5k67k1L2J62n6Q7q7m01K0M17r9Q7l2Kj90J6R6K68j8k7j14k71
1656a87Q1J91J1R4j39k64q1J19L50M0k57j5Jj81J04K10J54o5j60j04R7J52OOl1
1681A32j18j86r8L73K94m10j61m3J71J62j39J83N8q9k08J53M1J15j09q0M7j80
$$ plain form
1519 465 386 -167 -368 76 311 -93 -31 147 101 -268 -465 123 347 -81 -321 -157 -23 19 -75 326 570 130
1541 130 -290 -136 351 226 44 -105 104 -215 -481 -171 274 193 -123 -318 -41 119 -145 6 369 285 -197
1562 -197 -248 85 474 175 -81 16 -40 -122 -79 119 263 34 -374 -298 82 185 92 -90 144 72 -161 16 461
1585 461 266 67 -35 -182 -24 -32 63 235 210 -165 -271 -221 78 158 -46 -129 123 -121 -159 116 310 189 -171
1608 -171 -216 18 133 40 303 73 -199 -249 -82 -5 165 193 67 -208 -93 14 -127 155 231 -54 -195 -73
1630 -73 86 178 124 209 -58 -79 -47 115 59 146 59 -342 -322 95 -4 83 51 53 -137 -121 -25 243 225 198 84 -187
1656 -187 -106 85 96 190 51 -213 -294 -175 175 215 -42 -57 -56 -237 -133 77 231 166 6 -98 -1 151 157 163 132
1681 132 14 -172 -270 103 397 -13 -174 -217 -46 116 -23 160 218 129 -79 74 115 230 121 41 88 -92
1703i2j21P2K48m7k04k24K15J45J8N9J36j49k67J23J94K49j59k64J80p8j44l7
1725a47L10J94m72j69qK84J01r4k4J10j02j67K06J59J73k21k49J80N0k30J52Q8
1747A24r4k19o9O1K12m2pR0nj71l1K32K07q0l78O6K77k15n5K81k6k37k50J17M45
1772B33k5m08L3O3R4k27J29M59j1m34j03J63J22P4l24K37J59m01j21L11J87j29
1794H1k28J1K93k96OK00kk6k57K0L63m7r7R5k0p0k69J36L02Q9l39k13L25Jl02
1819b44K04J51N8l14p7L42J2n6j82p3L25j79k08K55L09j81k44j74M11L3k88R9
1841b1M4l8k14J97J51O8j23j84Q6N5MP5l8J57k57j40J38L49k50j12K4lj78p0K41
1866c9K58j46k70O9PK00n2p0K91j48j89n0L18J9j49j16k8J9k7p9K54N8j99j76
$$ plain form
1703 -92 -213 -141 107 60 -144 -368 -153 -8 10 69 205 56 -211 -88 106 355 196 -68 112 34 -110 -147
1725 -147 163 357 -115 -284 -292 -8 93 -1 -25 85 -17 -184 22 181 354 133 -116 64 114 -116 36 124
1747 124 30 -189 -258 -197 15 -27 -34 56 51 -120 -151 81 288 208 -170 -104 173 -42 -97 184 158 -79 -329 -212 233
1772 233 208 -200 -167 -104 -10 -237 -108 351 340 -94 -197 -34 88 162 -162 75 234 -167 -288 23 210 81
1794 81 -147 -136 157 -139 -133 67 65 39 -218 -198 165 118 21 116 96 26 -243 -107 195 284 -55 -268 57 58 -244
1819 -244 -40 111 169 -145 -222 120 132 76 -106 -179 146 -33 -241 14 323 142 -102 -276 135 168 -120 -21
1841 -21 23 -15 -229 -32 119 187 64 -120 -34 21 25 100 62 219 -38 -178 -40 309 59 -53 -29 -32 -210 -280 -39
1866 -39 219 73 -197 -128 -121 79 27 -43 248 100 -89 -139 179 198 49 -67 -95 -76 -103 -182 72 130 -69 -245
1890b45J16K68k29O2K47j75l9j6O7J26l5j59J8N3m4k3k6J50qk86M0R5J32j41N6
1915DO3j05p4J31J41kl0j66k6K5M3J21n7p6j45q9J9J46J03j11P1Lk2R6k1L3J29
1942B04k22k5P5Q4k5j12K3j53j5J8R0J69nk63M3k8Q5n5Q7J45r9j39Q9M8O9j8j67
1969i7Q9j11k1J70k0P0m2j80p8K00J16k1Kq0J35j68L5J73j05m8R4j09kJ6k5R5
1995H8O3j62q3j9J72Kq8j04J24Ll5J9J77Qk73j5N5J36m0n9L6k7l5q9J55J73p3
2022A09j91Q9J04n7j72J40P5k8k46J99K7J56Mj61j15R4j61n0K20K3j17j82K75
2045C5o0j6n4K22n8n3k24K58J95j74k19J17R8k7k9m9J94n2k68J27k2R1o9j11K12
2070F4L8k90Q0K26Q7j27j43J02P0j0j96L39n8k39j39o8N01j69j69L7P9j37r4K93
$$ plain form
1890 -245 -129 139 -90 -28 219 44 5 -11 56 182 147 -12 6 59 15 -8 -34 116 108 -178 -138 -43 89 -52 4
1915 4 67 -38 -112 19 160 158 128 -38 -64 -39 4 125 68 -8 -153 -242 -223 -77 26 -85 -14 -11 -33 63 42 75 204
1942 204 -18 -43 32 116 91 -21 2 -151 -166 -148 -58 111 106 -157 -114 -142 -57 -112 -25 120 21 -118 -29 19 88 70 -97
1969 -97 -8 -119 -140 30 10 80 38 -142 -220 -20 96 75 77 -3 132 -36 -1 172 67 19 113 4 2 18 -7 88
1995 88 151 -11 -94 -113 59 61 -27 -131 -7 -4 -39 -20 157 165 -108 -123 -68 68 28 -31 5 -22 -57 -146 9 182 109
2022 109 -82 7 111 54 -118 22 97 69 -177 22 49 205 209 48 -67 27 -134 -184 36 59 -58 -240 35
2045 35 -25 -41 -95 127 69 16 -208 50 245 71 -148 -31 67 40 11 -38 156 104 -164 -37 -59 32 -37 -148 64
2070 64 102 -188 -108 118 205 78 -65 37 107 97 -99 240 182 -57 -196 -264 237 68 -101 -64 15 -122 -216 77
2094G7LJ93l17K0O3Q6n3NM8j6k63M2K68l6r7k34J77m6K7k37K24J61k7k11L9J06
2120BJ01m5o8J51j17j15p1K46k4j60r5K40m3k8m3J24l1j69M4M0J79k8j29K37j29
2145F9j37QJ51K34l26k33J94J31k19L5J02J34l05o1J50J89L2k20N3J63q2q3J21
2168A00O8j40j29j05K14O6o1j31J43l1k04J49J93k8n4p1k5J60p5m6J78l0j17j11
2192h7m3K37L1k64R3Q3j30j29J01J98Qk25l2J53J4R8m5rM8j65o1J29J11k6j24
2217c6L4Q2j31nJ47P7k18k7n1J45J1j9J92j0k19n2k1K70j17nj90q7K01N3j01J81
2243A04o4j49o9K43Q1p3L6j86J83k06k6K83j6p4r6N9N2k7n1j09J70o7j11N9O3
2268IN6%j35J5R8j57R0J78j48j8o8L4K0M4K1r1K5K9j37K10k6P6j44k2j18J29j
$$ plain form
2094 77 80 273 -44 -24 39 125 72 77 125 109 -154 -112 156 120 23 -211 -34 -80 -53 -290 -66 95 68 -143 -104 2
2120 2 103 58 -10 141 24 -91 -162 84 60 -100 -195 45 2 -26 -69 55 24 -145 -101 -61 118 90 -39 198 69
2145 69 -68 -60 91 325 -1 -234 -40 91 -128 -93 9 143 -162 -223 -73 116 148 -72 -19 144 62 -21 100
2168 100 168 28 -101 -206 8 74 13 -118 25 -6 -210 -61 132 104 50 -21 -46 114 39 -7 171 141 24 -87
2192 -87 -130 107 138 -126 -33 50 -80 -209 -108 90 98 -127 -159 -6 8 106 61 52 100 -65 -126 3 114 88 -36
2217 -36 -2 80 -51 -56 91 168 -50 -77 -128 17 28 9 201 191 -28 -80 -101 169 52 47 -143 -230 -29 24 -77 104
2243 104 40 -109 -178 65 146 73 109 -77 106 -100 -126 157 141 67 -29 30 82 55 4 -105 65 -2 -113 -54 9
2268 9 65 65 -70 -55 43 -114 -24 154 6 -12 -80 -46 -26 18 39 -52 -27 2 -135 75 49 125 -19 -41 -159 -30 -31
2295c1o3R6q2P4j8N9O2R5m9j29N3j85J83j33J25Q5k60L3p5J80L3Nr1M7p6R2qR4
2323A16j52J6p2O3J30O3k17N3m1l3J2N8M2l7j07j8l5P3O3R6J3k5j87J14O3q8O6
2350B9J47p4j17p5Q5O0o2m8k3N1j50K66m5N8q0j17R0J7n2N3k7M9m4j05jK03n4
2377C4j89j7k6J40P3K0J5q9Q4mo2K7Q7m8n8m5O9o7P9M9m7j32k6J25J4L0l2m2Q4
2406D6r9j0J83m7M5n6j3n8P2j71J33K0n3p2L0j4Q4l7n1P9j1j04k5K43J2k01j11
2433a86K17qN3o0l4N6l4j03J77M9o9j77J17L6N0j39Q5l7J2q7j44K71J93k17j8
2458Cp8O3p7KK69j61K1j41O1M5M8k07J39k3K4r7Q3K02p5j71J03k8Q8j75N3J16
2484H7J08l58P3J21r5O7J60j92k9N9q6J68n6n5N4m1R2l7o6J55nk19M0PO6r3k6
$$ plain form
2295 -31 -94 2 -80 -6 -24 35 97 192 143 14 67 -118 65 -68 57 142 -118 -85 -160 20 53 58 -33 14 -62 30 22 116
2323 116 -36 -20 -92 -29 101 164 -53 0 -41 -74 -62 -4 38 1 -106 -124 -159 -86 -23 73 86 61 -126 -12 51 -37 29
2350 29 176 102 -15 -90 -5 55 -7 -55 -78 -27 -177 89 44 102 22 -95 -5 12 -40 13 -14 35 -9 -114 -115 88 34
2377 34 -155 -172 -198 -58 15 35 50 -39 45 41 -21 6 93 45 -13 -58 11 -56 23 72 25 -107 -133 -8 6 36 4 -38 46
2406 46 -53 -63 120 73 118 62 49 -9 63 -108 25 45 -8 -80 -50 -64 20 -17 -68 11 0 -104 -129 114 126 -75 -186
2433 -186 31 23 76 16 -18 38 4 -99 78 127 58 -119 -2 34 84 -55 30 -7 5 -82 -226 45 238 21 3
2458 3 -75 -12 -89 -87 182 21 42 -99 -38 7 55 -152 -13 -36 -12 -109 -26 176 101 -70 33 5 93 -82 -29 87
2484 87 195 -163 -90 31 -64 3 163 -29 -58 1 -85 83 27 -28 26 -15 77 40 -26 129 124 -95 -55 -48 18 -75 -101
2511a01R2K9j32JR4J05j25m2J12q2J30k1K2MQj63L9O0J05j23L9j09j8o1j6J08
2537d5J41j04j35L93j65m9PO8j18j19N0OJ72Jj09o9O8o6M0N4N9j62k5L4Q1k7M6
2564B7KK3j64J97r2R5Jr7k8M4J1Om3NJ6K2k33J85J73q6o8J4L0n6k%J50r8n3m0
2594e9P2J14j79O9R2j71n1J8K9J29J1j14P1k7q2J17J15o6o6O0J25j86K7j31K10
2619A27k85J90j02J19N3l4q5K5m5J61k7j74L4j26J44%n4J10J00o9L3K6j13m6J03
2644F5j54J87j26n8J19j6q4L8J07r3Kl3N5N3pj24J89q6Q4p9m9O1r9nN4K4j02j9
2672i6J25j8j61J46j76J26O9N4k3lo9J18k5j0Ol2n9m9P7J03j34r5O0K3O5m7n1
2699g6J26n7j18K47j06qp9k1J44q4k7j2J40q6k9N5j17J10J1k8O0j6n0L0J32j01
$$ plain form
2511 -101 -9 20 -112 -111 -17 88 -37 -79 33 -49 81 60 82 86 94 -69 -30 30 135 12 51 -58 -76 -137 -153 -45
2537 -45 96 -8 -143 250 85 36 43 111 -7 -126 -76 -70 102 103 -6 -75 -7 -73 -33 21 80 -82 -107 -73 8 -19 27
2564 27 29 52 -112 85 -7 88 89 -8 -36 8 19 25 -18 -13 3 25 -208 -23 150 64 -4 10 40 -16 -18 -18 132 34 -19 -59
2594 -59 13 127 -52 17 109 -62 -113 -95 -66 63 74 -40 31 4 -78 39 154 88 22 82 207 21 48 -83 127
2619 127 -158 32 -70 49 102 68 -17 8 -37 124 97 -77 -43 -169 -25 -25 -79 31 131 62 95 121 8 -38 65
2644 65 -89 98 -28 -86 33 17 -67 -29 78 -15 -13 -46 9 62 55 -69 120 34 118 39 -10 51 -48 -53 1 25 -77 -96
2672 -96 29 11 -150 -4 -180 -54 15 69 46 43 -26 92 67 57 63 31 -28 -77 0 103 -31 -126 -66 -43 22 -25 -76
2699 -76 50 -7 -125 122 16 8 -71 -92 52 -32 -59 -71 69 -17 -46 9 -108 2 13 -15 45 29 -21 9 141 40
2725D0k2n4Q4JK5p7J4m0lj1j7l5L7oj6P6M0j02O2J69k1j05o2r0J23k2PJ4j30K02
2755H1j22N8j1Ln7M6K8Rq1J1J24j17J3q9J23mJ4K5l8Kn1O8O2m3o5l8P7j36K45
2784A37j53M6p6k6k6J80j41K7PmJ32j04l6j6R3j3j47Q3N0n4j13J84m7m7n9J92
2810F9p5pO3o5J01j27j4QK08p3r0q4kQ9o2J44j21N4o0nk8J31m4p6P8j0l5p0J79
2839G6R8j82j04R1Q2L1p2o5Kj7q5J29O9l8kj74J84r7J75o0j56P4J3n9J26k5J5
2866B9L7j27P6K2j99J14J52j88P9r3P0J27j40R7j8R3j68q5J23N0j46Q4O1n6m6
2891e2J04j16J35j64J4qJ03O1j2r2K5N0k9n3J28j00p8Q8O2j24J1k1J32Koj66J69
2918F3o2N4j01M9l6R1j8m7M0l9j04P1Q0j2Q3j37O9j47J00l8Q6o1L6n4N9m0j08
$$ plain form
2725 40 18 -36 48 49 74 -3 11 -29 -32 -43 -60 -95 -58 -64 -80 -4 36 -66 -4 165 144 39 -23 -113 10 -12 -5 9 -121 81
2755 81 -41 17 6 9 -48 -2 26 35 -46 -35 89 -28 -15 -104 19 15 29 54 16 18 -33 35 97 54 -11 -49 28 -108 137
2784 137 -16 30 -46 -72 -98 82 -59 -32 -25 -29 103 -1 -37 -53 40 27 -120 -37 13 -41 -154 30 -17 -64 -123 69
2810 69 -6 -13 50 -15 86 -41 -55 -47 161 88 -2 -86 -88 1 -61 83 -38 16 -44 -49 -77 54 10 -66 12 2 -33 -103 76
2839 76 174 -8 -112 -21 61 92 20 -45 -43 -60 -145 -16 53 15 13 -161 23 -74 101 41 -115 -41 -28 -87 39 14 29
2866 29 66 -61 15 37 -162 -48 104 -84 -5 -98 -28 99 -41 56 38 131 -37 -122 1 51 -95 -11 50 -6 -52
2891 -52 52 -64 71 -93 -79 -87 16 77 65 -27 -2 48 19 -34 94 -6 -84 4 66 -58 -47 -68 64 66 60 -106 63
2918 63 1 55 -46 3 -33 58 40 -7 33 -6 -110 -39 41 29 112 -25 44 -103 -3 -41 45 -16 20 -34 25 -15 -123
2945a23P6M1n2O7r4J83j71M4K0J8J8p3J05p2K02j83k7p3J05jJ0j34P6R4j16N4
2971fnJ68m9l7n1L2j00L3R2m1r5k7K23j36n5M6k4o8L8P3rN6j13L7J5J5j6K3n4
3000c5J06q7l7P5j4P2k1j80J70k2M1j56Q1P5j87P8p8J74j6N6k5j29q7J56k2k2
3026c4j4jJ6N3l7O8j44J17N3l3l3j04K22j08k7j1R9lj87J84j03L9j21M9L4Oo8
3053h8J43q6J8q4PJ36jj13P7jn5J44j06L9k8P7k09K22r2J2q9m9K21j59nL0J36
3080I7m7m5m3J49j06L5j0o0N2q7n0P8n%L5l7j8k6R5K0K8n1lm5LJ97j00Qn9j8M7
3111C4k6K2N4o3L7K5j02LN4k2k6J2PJ6Qpm6J66l5j45K1J3L1o2j6Q1j7k8L3m4L5
3142A3Pj0L8k6n7J05j66J55r5pJJ38o6j28N9K6L3M8j07M6J7o2m8R9R1j08k3p4
$$ plain form
2945 -123 -47 -6 -58 9 -85 98 -73 -29 -9 9 27 -46 59 -13 189 6 -21 -94 11 10 20 -114 -38 56 -60 -6
2971 -6 -11 157 108 71 20 52 -48 -15 77 36 -59 -86 137 1 -54 -8 -32 -100 -62 11 2 58 -55 -18 -3 12 -4 19 -35
3000 -35 71 -16 -53 22 8 80 59 -121 49 27 68 -88 -7 68 -119 -41 -119 55 39 95 70 -59 -146 10 -12 -34
3026 -34 -48 -49 -33 20 -17 51 -93 24 77 44 11 -93 129 21 -6 -17 82 79 -108 76 -27 12 -109 -60 -26 -20 -88
3053 -88 55 -31 -13 -97 -90 46 45 -68 9 8 -47 97 -9 30 2 79 -130 92 0 12 -77 -126 95 -64 -69 -39 97
3080 97 50 5 -38 111 5 40 30 -30 22 -65 -115 -37 -42 -42 -7 -44 -62 -88 7 27 55 4 1 -44 -41 156 56 64 5 -13 34
3111 34 8 30 84 21 58 83 -19 -16 38 16 -10 2 9 25 33 26 -20 146 111 -34 -13 0 31 -31 -47 34 17 -11 22 -22 13
3142 13 20 10 48 22 -35 70 -96 59 -36 -43 -42 96 30 -98 -39 -13 20 68 -39 7 24 -38 -86 13 104 -4 -27 -101
3170a01J27k4k8o7M8J68k26N6J26k5l2n6q1J94j36k0R6Jj12K4O7J0L2Ok04J75
3196A8M4k8Mq3R3j10J32Q5k06o0pO8L2M4n4L5J09r2q3R8j54P7L8M6j68K11j10
3223b1mR1n7P7n1q1l6M1M8J14j24j6J5n3O0P4K0n5J7p1n6LJ21r7M3kJ07j25P6
3252E8p8J51j97P0n6M1j8n4J28kj6N6j19m1J3l4RQ5P8j03P2k7M7p6K3J18j73M3
3280bJm8J44j30n1R8k0R7q2P0m6M0p0k0J1M9p6%P0N3nj07Q1l4j63J29j2J2J27
3309A16q8n1J7k0O8m7J2n3j09J98j79K08o0Mj04R6p9J0N2Oo6O0O7m5NK1o5m6J36
3338F4j02j9L7K5Nj03P7J28p8k8J13l9r1R8n7L2Qj35K02o9j09J0l6P8N9q3P4q2
3366b1L6l0Q7o3Q7j86J42j00M2r1J21j07M2J78r0j0L6j08o7J30j07jK8L7lk6q0
$$ plain form
3170 -101 26 2 -26 -93 -45 123 -103 -47 79 54 22 -34 -115 79 -57 -77 19 20 -92 -68 -1 9 41 47 -157 18
3196 18 62 34 38 -45 48 -62 70 155 -51 -111 -118 -50 -18 26 -28 7 116 24 -59 39 -115 -38 0 46 -122 89 -21
3223 -21 -25 66 9 86 35 -46 -82 -41 7 121 -3 -19 -4 -57 3 77 97 42 59 -12 -68 -65 56 -41 2 0 107 -18 58
3252 58 -20 131 -66 4 -52 -11 -29 -83 45 43 27 83 -36 -77 -64 -98 -89 -4 74 -29 43 16 63 -13 10 128 -45 -2
3280 -2 -1 -49 95 -35 -86 12 -8 89 7 77 31 71 1 -19 -8 41 -35 -35 35 88 83 -24 57 23 -140 -11 -23 -11 116
3309 116 28 -23 -6 -26 42 -5 7 -46 -155 43 -136 72 12 16 -88 8 -71 -61 -9 -3 -69 -9 58 13 18 39 -26 -72 64
3338 64 -38 -57 -20 5 10 -93 -16 112 34 6 119 80 -11 87 30 62 70 -65 137 68 -41 -31 -67 11 70 -13 61 -21
3366 -21 15 -15 72 9 96 -90 52 -48 -6 -97 24 -83 -41 137 47 37 73 -35 -102 28 -79 -80 -52 -15 -18 -44 -124
3393a24M5J64m5j33K08j18L5p6ql2J42j6K6N7j62O7q3J0R3l7l2J35j95J1J88p9
3419D1RN2r9J25r4rr9PR0l2r3J32j1o5k6J50j3j20r6Q5J24j24J34n8q9J15q7j67
3447b18K30N2o5J1kJ0np2K9K6L9j39P5l8J10Lj50J99j72Q6JK0m0m3m5QJ10j5l4
3476b9k6J7j2O1Q4k6m5J1O6j20M6o6J89o5j9j57J51p5M8M9j57P9N7k7m6P6Rm3
3504C0n3L6O7m6n7Ml3L7J6QN2j1%J8j86o5J13J71j61J49q1L6p8J58j87k9N3J54
3532A15j59n8J62p4j1q4J99k7j42Qk2J04J3m1M7j20J62p6R7n0p6N1Mj06K11k07
3558h0k0N0KN8j19N4K0j27J92j9L8r9O3N3k1r2l9J35l9o6J22j44JJ27q0K1p5m3
3586a27J30O7j10j7M9N6K0k10K18j48O9P4j20r3J49Mo6N3N1K1o3M2n5l1J24k11
$$ plain form
3393 -124 -79 85 40 -93 115 -3 32 -44 -52 -84 58 42 68 125 -37 30 -53 -43 50 13 -19 116 -79 -68 120 41
3419 41 50 102 3 128 34 25 -74 -67 23 -9 -102 30 19 -46 -72 78 65 -55 -151 -66 58 -66 68 10 -79 36 -51 -218
3447 -218 12 64 -1 10 8 18 13 -59 -30 -4 35 -104 -29 -67 43 46 -104 95 -77 9 10 30 -10 -53 -98 -90 20 5 -29
3476 -29 -55 -38 -50 11 95 69 24 35 101 -19 27 -39 150 85 66 -91 60 -15 33 82 -75 4 61 34 -12 64 73 30
3504 30 -23 13 80 34 -23 -19 -52 -15 1 9 61 50 50 68 -118 -183 -70 101 -60 89 8 44 -34 124 -63 -92 -39 115
3532 115 -44 -102 60 -14 -25 -109 90 63 -79 -71 -93 11 24 -17 30 -90 72 -4 93 43 -33 18 22 -84 127 -80
3558 -80 -100 -50 -48 10 -109 -55 -35 -162 30 11 49 -50 13 66 45 -47 -86 49 10 -56 66 -78 -77 50 -30 -9 -84 -127
3586 -127 3 70 -40 -57 -8 48 68 -142 76 -72 -3 71 -49 -142 7 11 -55 -2 49 70 7 49 -6 -37 87 -124
3612a24Q0m7j6R5K4JQ0K5j30P3j04K2p3R2J9r7P7p5K9J18n3J23n9n9K2k09Q8J7
3640f1M6Q2m1r6P0m0Q9m1L8Q5j6j76p0J14M5P3j00O1l5R6o1j02J28p7r9K35j19
3667B8J6jn9L4Kk8M2j09J99r7K8j39J74Nj97J22K4q2P9q9%J67j29R8n4N3j08K42
3695B21j86p5J1m3J3J11p8N3M2j10O9jK7ml0mj06m7J70k1o5K1JJ35j25j21J77
3722C5n5Q0k0JM4k4m7j8J9j68J85k4J6k3p8J85j59nQ6n2O1J3j24K02j44K6n5M1
3750bk3n6M1M1j05R4O9nN2q0N7j85K18o0q7Q4j3o8J5J22j79J9Q7j9p3J75j05k0
3778fJ0l1J67k24M9O9l9O1k9N9n7l0p2O5m5J14j02R9p3L9O8j18J21j42J1OR5m6
3806A9p6k9M8l8R0l5OJ22j13K0O3j7n8K9M4r2R8q5k0J6o9N3L2K8j1j75J72l5K
$$ plain form
3612 -124 -44 -91 -107 -12 12 13 93 118 -12 61 -43 -21 -94 -2 17 -80 -3 -78 -49 69 16 139 80 21 43 -166 -78 -61
3640 -61 -15 67 26 -70 0 -40 49 8 46 131 115 -61 -131 -17 28 101 1 62 27 123 62 -40 88 11 -88 147 28
3667 28 44 43 -16 18 20 -8 34 -75 124 27 55 -84 90 95 -102 20 44 -38 41 -48 -48 119 -10 88 34 87 -21 221
3695 221 35 -40 -29 -72 -59 52 -26 27 69 -41 28 27 54 50 20 16 -90 -137 33 12 -53 -32 -31 104 -21 -142 35
3722 35 -20 60 40 41 85 61 14 -4 15 -153 32 8 24 1 -77 108 -51 -56 30 -22 39 52 -72 130 -14 12 -43 -2
3750 -2 -25 -81 -40 1 -104 -10 59 54 106 26 83 -102 116 56 -31 53 40 -28 -13 109 -70 -51 36 17 -56 119 14 -6
3778 -6 4 -27 140 -84 -35 34 -5 56 27 86 29 -1 -73 -8 -53 61 -41 58 -15 24 92 -26 95 -47 -36 -30 65 19
3806 19 -57 -86 -38 -76 14 -21 -15 107 -6 14 77 60 2 31 75 -17 81 -4 -24 -8 -77 -24 8 36 25 -150 22 -13 -11
3835a1Q8r9J7jl8K2J01l5j18K5P2J11j98j8J79l2p3O6j55j5J00J21kr4Nj00L9
3862d3Q0o8J34j89O6N2n8Q7j5r0J1J8k5O4N5p8lr9J23k2r8J46j3j77K18j87Q1
3889c0k0k7N2R9l0o7k5pJ17p4N8q3mk4Q7R3n1r7J17l3p5mJ7R9j26n6J21j7K1p3
3919d2J2o1m0R5J18n9J9mm5PJ1m8N1q9N9L1%Kp1l3N7Rk1l5K2J13o8k3p4O0R2m7
3951bj4l3Q2K7Lj12M9j02J68j25K1N2m8O6O5o7j46P6J80p4k4%p1P1p5O7K9j55
3979i2J0N4LK3P8J0j18J6P8o8m0O9n0k2j7J18q1j2k5J35j20j4J06j5lj39J49o6
4007c3RL4rNJ7l2l1K3j6J9R2n9M8r6J50k01J4K52j92J6l8Q5j06j5J12%j04Q1L2
4036E7qk6MqK5j1K5k0l7k4NJ16j87J30q7J39j76J37qj56J20L4j07L1OL1R7k1o3
$$ plain form
3835 -11 77 -22 -5 -6 -44 -22 79 44 -74 -49 23 134 -64 -82 97 65 -8 58 -97 -112 -12 109 107 13 18 -82 -43
3862 -43 37 -31 103 -86 -20 32 -26 61 46 -44 -33 -15 -40 24 79 1 -2 -101 22 0 -98 48 35 -142 76 -111 -30
3889 -30 -50 -77 -25 74 44 -23 -48 -55 62 -12 46 -37 -41 -65 22 115 64 -33 84 51 -24 -28 -11 88 -38 -94 27 10 31 -42
3919 -42 -30 -91 -131 -36 82 23 42 38 -7 0 11 -37 14 -75 -16 15 15 17 -54 -87 -30 -21 -42 -77 -55 58 -10 -33 -107 -47 45 -2
3951 -2 -16 -49 33 60 63 -49 0 -102 66 -59 -38 14 -34 32 97 30 -116 -40 140 66 42 42 -29 42 -33 34 63 -92
3979 -92 -82 -28 -25 -2 76 86 -32 -16 62 -6 -46 23 -27 -49 -66 52 -29 -41 -66 69 -51 -65 41 26 23 -116 33 -33
4007 -33 -24 10 1 6 23 -9 -40 -17 -33 -14 78 19 67 -29 121 -80 -66 186 -6 10 -28 57 -49 -64 48 48 -56 25 57
4036 57 49 23 27 19 44 33 58 38 1 -23 -18 98 -89 41 -46 93 -83 54 46 -110 10 44 -63 -32 -26 5 102 81 18
4065A8KK4Q1k26J77n1l6j2p0K15q8l4J7q1k2jK9Q3j7J01q2m9J9j61O0J03n3M9
4093ej01J43o9L5k0Qm4M6Q5r6j07J69k2j81O0J05o4P8m1l8J6nN0k6J2Q2n1j41
4121a22J57K5r0lj3J4k6J34j5k1n5J02o4j0K2m8M8j01J51j08O9q3J3qQ4j14M4
4148a8Q7n4K7m8M4J5m6J5J9N8p3p5J39j12J5L0j3N8J5n8M6o4o1J28n9q5Q4j49
4176a35Q2J02r9j9R2o9kK0L2J14k20L3J61j57J73k9j04J47j02ML6Qj17Q5J0p5
4202b9m6Q4%J59o1n7p1l6n5J12L5P2k05N8j8m6K01k21K16r0K8k5O9j41N1L2K7
4229D3k1m5k3qM7J0j9o2J1M4K7O7j6P6j51O1o5J05n8K1j03l2M3L1Q2j18K5j70
4257a98J08Q7K7j10R1K7q1KJ14j98J15O8k0n2M2p0K31j45R9k26J4J21lN0q8r5
$$ plain form
4065 18 20 44 125 -101 76 25 -11 -23 -93 122 34 0 17 -64 -86 -87 -58 25 8 109 27 -22 -3 -164 -104 -1 -54 -5
4093 -5 -106 37 -32 3 -17 -9 -53 -7 78 -18 -125 44 22 -159 -99 6 -58 20 -21 -59 -43 -48 2 -24 -12 70 19 -122
4121 -122 35 60 -30 -33 -46 -32 -58 76 61 40 -15 87 23 13 35 -13 35 -66 85 -23 46 -37 -24 -32 52 -62 -18
4148 -18 69 15 42 -6 38 53 7 22 41 99 26 -49 90 -22 -7 23 10 68 83 25 71 7 -54 74 15 -70 14 -135
4176 -135 -53 49 -50 -69 23 -46 -48 -28 4 118 -102 -69 92 -65 108 79 -25 122 20 24 60 68 -49 36 46 -29
4202 -29 -75 9 9 168 107 50 -21 -57 -112 0 35 107 -98 -40 -58 -104 97 -124 92 2 30 5 74 -67 -16 16 43
4229 43 22 -23 -46 -54 -7 3 -16 -78 -67 -23 4 71 55 131 -20 41 -24 81 23 44 -59 -91 -48 -17 65 -53 -28 -198
4257 -198 -90 -3 24 -86 5 32 -49 -47 67 -131 -16 52 32 -20 22 -48 183 38 137 -89 -75 46 43 93 5 -90
4283i0J28m2J1L6K2k00J17oJ38j16L5l3l1O4j6l7L1K0k8j4K8ok7m5P8l5l9lo5
4312a25J75j0p8Qn1P9J2qO1j11m5J49m1N5l7j13K00q1o5l2K1J17n1o0P0Q0j44
4339b5Q0j2q9J16j17o6J14n4Q6j5L3M1m1p9j48K11M0j77J53J6r6L0M6L3M5m6k48
4366a69J28M6r2K4J17m8LjK2n8m5P9M0nm2p3M5ML8m2L3k6N9m0j29J87q6L8r1J01
4396A7o1J10m9n6O6r2R3j00%J22K6J7j86J76r7o3Q2J6n0j7J6p5O2n8J50p6Rm8
4424f6n8J98o4Q9j75J18Kj10J40l6n9j02J28L1p8J79j89R8l0M6pn0J05r9l3j2
4450c4J4P1r9P5O0r6j18J86o8J11r4K7k7j09M6J16l7L7npo2L7l9o1J52L8l13K62
4478F3j0m9P0n6r9O0R9m5m7K3o5K2J9M6r1J69p5j07OJ50k2j39J31l8j8k2NJJ22
$$ plain form
4283 -90 38 -4 7 43 65 -135 -18 -24 114 -2 33 0 -31 33 17 -20 11 31 3 -11 17 11 -16 -61 17 -18 -57 -60 -125
4312 -125 50 40 -38 -30 -81 -2 10 2 63 -48 -93 56 15 70 33 -80 120 39 -26 -58 -37 80 29 -31 39 119 -25
4339 -25 55 43 -46 70 -47 -113 1 -53 33 18 51 92 51 -28 -176 35 75 -102 51 67 -29 1 47 80 125 79 -169
4366 -169 -41 5 -87 -63 54 6 9 8 30 -28 -73 6 46 41 -1 -74 -29 -25 13 -29 4 -22 37 -3 -132 55 -31 7 -84 17
4396 17 -44 66 17 -39 27 -65 28 -72 -72 50 76 93 -93 83 -14 -77 5 21 -29 -46 -30 -105 -43 -101 49 -27 -18 -66
4424 -66 -124 74 10 99 -76 42 44 -66 74 38 -21 -123 5 36 -42 137 -52 46 16 62 55 5 110 11 -22 -34
4450 -34 -20 51 -48 27 87 -9 -127 59 -9 102 8 35 8 -101 -55 61 24 61 56 49 -13 24 -15 -76 76 114 -199 63
4478 63 53 4 74 18 -81 -21 78 33 -14 9 -56 -34 -15 31 -60 109 34 -73 -67 83 61 -78 53 15 -3 -25 -20 -19 103
4507A03j15m8J3R0k2L0O0j41J3L1k6j7nJ7kN7j06K9N2rkQ7l8j56N6J25k04J66
4535C8j39P6O1p7m8N1Q2M8q5j4R0j20O0j44P2J58j29j07J5N7pJ02L0j7P6j85K7
4562b9L3p8L4qJ5qL5o5L9O5Mnk5M2k02J26J52k33N6M6J4J23o2o9J9j2l4R4k3k4
4592B0Om9j6m8N4K8j2k0LQ5p2L8o0l8O9m2J3N3l4L7N5k3lJ14j08j24R0o8J31j02
4622b3L2l1K3J2K0k1K2q2J6K5k9k3l4R1o3mK9M5J20k10mn1J21k1M8O3L7k03L4
4651f1Q9l2KpOn3n4J52ml9n6P8q0M3j8K9J34j32l7M1M0o5r2Q9Q8q1P1p9p8J12
4681FJk7k4N5k0qk1K9nN3r4N0j60K53l8Ok2l3K3j9Q7j51N8k7M2o3J83j33j0m2
4711e1N2L6p0K3p6O8N9j7l4m8R3l6j9m5K1O5o9R0M4r4P4J00j35n3K9j12K7J2M2
$$ plain form
4507 103 -12 -60 -47 43 21 51 111 -30 -17 14 -12 -29 -34 -17 -19 38 -68 -39 13 4 2 89 51 -105 -49 76 -128 38
4535 38 -101 -25 36 -41 -89 -38 44 92 7 -7 83 -37 23 -121 -49 109 -20 -127 -112 -55 -62 40 70 53 129 -56 -29
4562 -29 4 -74 -40 -48 -33 -41 -6 -71 -32 33 37 32 7 49 -153 -27 125 -108 -52 -6 8 131 69 0 19 7 -27 67 44 20
4592 20 26 -23 -39 -87 -33 -5 -17 -37 -34 51 -21 17 -43 -81 -12 -54 -41 12 -22 15 70 47 44 158 50 -74 16 -52 79 -23
4622 -23 9 -22 1 13 33 12 34 -48 -32 -7 -36 -59 -93 -2 -65 -69 -40 5 125 -85 -89 -140 -19 -40 8 71 108 -95 -61
4651 -61 28 -4 -2 -9 -3 -56 -110 42 38 -1 -57 21 -59 -16 -34 -5 129 -3 -40 1 41 -24 -116 -27 61 -20 51 -28 -106 6
4681 6 7 -20 -44 11 -9 -17 -38 -9 -14 39 -55 -5 -165 88 50 56 34 1 24 5 92 -59 -1 -28 14 -49 134 1 -9 -51
4711 -51 1 37 -33 -10 -86 -18 41 24 -10 -58 35 -1 -20 -65 -44 21 -48 42 86 -8 66 166 31 -22 7 -105 -78 -66 -24
4740b4o0N6R2m9q5J6R9m9KP2o0r0Q2j03J41J6j15jQ2l2n8M0o4R0n7J30q3N4%n3
4770a1Nrq0M6Q2P9m3j05J8L7R4j05Q3l0j88J05K6R0j09J5j38J57m8J10q3j4p9
4797i5J48m6m7L1ML8J1l5j2r4N4J8qO2n8kJ8K5K3q6P5k0L9l4Rlk7M5j2k3n4k1
4829g7O2N5o9L4J76k34Q0N0j09J1j04Q8J31j78k7P3N1o2L9J9j18J13N6j52J77
4854H5j26j0J26j25Q7j8q1J72n6n8l7K0l9j8Q7M2j89J35j08M7J26l2l6O4m4n6
4880d2N7j26J02p3K62k87J84q2lj4Ol9O7J5q3KJ16j12K6R2j87J31Qn4N2J1n4R
4908a6L7M0j02J23j32nO5O1m3P7k03Q6l3Q2j47KN8L9R1j23J05j53J13j07J04k8
4934ij66J97m2P1n2j49J48j4K2oo8O7K7J3m1M7J25j60k3K4j23J84j02p3O0J18
$$ plain form
4740 -24 -84 -28 64 15 -70 -54 45 -4 -2 70 10 -80 2 -101 40 56 -59 -60 22 -10 -68 -28 -92 -2 -59 71 -12 42 42 -11
4770 -11 -6 -15 -95 -49 33 112 69 -36 -18 19 113 8 91 61 -127 -22 4 94 -15 0 -138 19 -29 81 -2 -16 -95
4797 -95 53 7 -40 -9 -5 33 44 9 -3 -97 -43 -25 -33 29 -29 -31 -13 12 35 -51 24 4 43 9 18 15 -12 33 21 -2 -56 -77
4829 -77 -15 40 -29 5 181 -53 27 77 -32 -21 -125 -37 94 -84 -111 -38 13 -49 -10 9 -109 4 60 -92 85
4854 85 -41 -51 75 -50 37 19 -62 110 54 -4 -41 -21 -60 -78 9 51 -138 -3 -111 -64 62 30 -6 58 14 -42
4880 -42 15 -111 -9 -82 180 -107 77 -5 -8 -22 -16 -55 12 27 -56 -54 62 -50 -24 68 -119 12 20 -34 18 29 -25 -16
4908 -16 21 61 -41 82 -50 -55 10 71 28 105 -98 -12 -45 37 -110 -108 -50 -11 80 -43 62 -91 22 -85 19 -9
4934 -9 -175 22 -20 51 -1 -150 -2 -16 6 0 -68 -1 26 39 -2 45 170 10 -13 11 -112 72 -30 -103 -43 75
4960G5lN7j50n5L0l4M6jj8J24M4j31K1N7k2m5m6j7J75j63J35m8k7j0m6J5j8J53
4988I8j34N1q2l5J55Lj10LJ58o9j11O4M2k3l9P7L2m8Jj5j10J59j81J12Kj1J4r0
5016h7O7J3J43j57L0R6j22K2Rk8nJ11j19J9n2O8l5l2K4rm0P6rJ06j2j3L9j29M4
5045A8m9j8%J64j57m8J69j33Q7K6p2n3P3j13K18j65p2J27l3M7J4j2r1Q9L9p6J09
5072H8k1m6n4r0Q6pK3n5Jr6O8J33r7P7K8o3k5qJ13j03Q4j27J06l5pJ00j46R2q9
5101g0k1J29k8m8mJ1j8K8m2R9j2Op9Q4K7m8RNl0L1K0J0j3j3KkOM6K9l0n9k7n3
5134e5J24p5prJ9l7MJ17j17J4J3j9J54N1j41r2M8N7O3J4q6m7rQ2k7K0j22Q2k1
5163bL9p9P9Ml3n2N1lk7r9J07k8Q5LKo4p0M2Q8m1M2k5J3N7k41K10j6o8M4nj38
$$ plain form
4960 75 72 129 -21 -76 -46 -80 -34 -35 -53 71 115 -16 5 62 40 -5 -51 -68 107 -56 79 31 4 -6 -52 -37 -55 98
4988 98 -36 15 -67 -102 53 56 -54 -51 107 38 -73 -9 33 10 -29 48 80 32 33 18 -92 67 -114 -2 0 -11 3 -87
5016 -87 -20 -7 136 -21 9 105 -17 5 14 -14 -19 92 -27 -8 -60 8 -27 -59 -35 -44 -84 -8 -17 89 77 64 103 -26 18
5045 18 -31 -49 -49 115 -42 -90 79 -54 33 59 -13 -66 7 -106 112 -53 -125 2 -31 16 30 18 -73 16 55 -21 88
5072 88 67 21 -33 -123 -37 -44 -21 -76 -75 -171 -103 30 -67 10 38 -25 -50 -58 55 -48 36 -91 15 -20 -27 73 -73 19 -70
5101 -70 -91 38 10 -38 -42 -31 -49 -21 -63 36 24 30 -49 35 62 14 23 28 -2 29 49 59 46 33 35 33 39 85 114 84 25 -2 -55
5134 -55 69 -6 -13 -22 -3 -40 -36 81 -36 -22 -9 -28 126 177 36 -56 -8 49 112 126 40 -7 -16 66 39 59 -63 19 -2
5163 -2 37 -42 37 41 8 -44 7 4 -23 -122 -15 -43 42 45 47 -17 -87 -45 43 2 44 19 32 89 -152 58 42 -26 18 13 -125
5194a25J73n6PJ8l3QP1j01M9K8o8nm1J23r3K6j6P1k2J8p3J6P0n5l7J48pn5q4L
5224d2K8J01j43J20j04%m4J3P8l2j47J73lM8Pp3N3o4m1Q5n5J27ol0l7k0J6O0j82
5253a14M4J13n4m9Q9k8j21J04j58K41n3J5%j16M1L5k2l8R7k15K81q9n4L6l4p0
5279a19J29j19J84j33P5L4j11k3J08ko0P9j22O8j24J31j22M9N0J1N0n2K5l4J6
5304a2j13Q4n5J66j04j3J4J7lR5j07Q5o5L6m0p0L3L7q1J49j34N0p1K06p9K0n1
5331fm6k3N1J14j44K6n8P4P5j10K0qMM3j92J14M2q1L1J39p2R5j55J05k0k9O1p0
5359b0N4M0j22J18j5M3k6j14N3N3o3q7N6J39q1j04n0J48J9l2m7MJ5p8J69M2q9
5386B5p1J42p6m9k7QL0n3K05j27Mk1K6j18J60j51NMN1L8J30j0k41R3Q6j7p6kR1
$$ plain form
5194 -125 48 -8 -1 17 -16 -8 63 -38 11 39 -29 -34 -75 48 -45 -19 -35 36 14 32 -41 -25 45 -10 -47 101 94 39 -45 -42
5224 -42 -14 87 -56 64 -40 -40 -84 -71 7 -25 -172 1 -2 46 53 -20 33 -31 -72 13 -42 85 79 49 12 -8 8 68 -114
5253 -114 -70 43 -11 -60 29 1 -120 -16 -174 67 14 29 29 -87 -46 -11 -33 -71 26 -189 92 3 -51 -15 -49 -119
5279 -119 10 -109 75 -58 17 51 -60 -83 25 23 -37 42 -80 -12 -136 -5 -127 -78 -28 -17 33 -19 6 -28 -12
5304 -12 -125 -41 -96 70 -34 -47 -33 -16 -19 76 -31 54 -11 25 -15 -85 -52 -15 -96 53 -81 -31 -102 104 25 45 -6
5331 -6 -52 -75 -24 90 -54 -28 -86 -12 63 -47 -27 -35 -31 12 -180 -66 -24 -105 -74 65 -7 88 -67 38 18 -11 50 -20
5359 -20 34 74 -48 70 55 98 72 -42 11 64 1 -86 -30 109 28 -76 -126 22 41 9 -38 -34 -19 -97 72 114 25
5386 25 -46 96 20 -29 -56 -48 -18 -71 134 7 11 -10 16 -102 58 -93 -88 -84 -33 5 135 125 -116 -23 63 46 -30 -32 59
5415E9j06J8R6p3R5j03Q7j33P3jo1J24j48q4Q4P7p4P2J2m7q7J4J66j11JR6L3L8
5443A17j18o8j4L4J7J07k3o8M2l7J4m4J63j51Q2Rk1K8j02J78k45R0L4K0l2PJ4
5470C3p6J48j44K5P1J7j10nR2L7j23N7o1M9j2R1k5j06j8M6mj5M9L2p2l1L3L3j4
5499cj2M2j13J02l7m7R6n0m2N3o6N8nJ27k68J40k7LR3j8n9M1mk1J06r1n6L0L5
5528GKq6R6j07j31J86r3J58o0J9j22J16Q4q7J13n0Ll0o0R1L7j56j5Q6M4r2N6N7
5556F6j60Q3j5L6l3J0P5l8Lq0J13j3o9Q4o2P8J4q0k9k9J02m8k4J56j45LJ23j27
5584fJ3pm4L5P1l3L5M5j34l5N0J00q1n5J6L7j04J28l7K5j06P4%q2P3j2k4N6J6
5613A4k7O2L7j27J04m4n3J2PK0J3J36j38K5n7N3R1j27k7n5J11l8N0j3QnP7j66
$$ plain form
5415 59 -47 -29 67 -6 89 -14 73 -60 13 12 -49 75 -73 -157 -73 4 -70 2 14 -33 -120 -106 60 -51 -50 46 79 117
5443 117 -1 -69 -83 -49 -32 75 52 -16 26 -11 3 -41 122 -29 53 62 41 69 -33 145 -100 -10 24 44 12 19 33
5470 33 -43 105 -39 -14 57 74 -36 -41 51 88 -35 22 -39 10 -2 89 64 -42 -60 -14 -18 -33 16 48 -24 -55 -22 11 -3
5499 -3 -15 27 -86 16 -21 -68 28 -22 -64 -11 -77 -19 -24 103 -165 -25 -52 -49 44 26 -33 8 4 -17 89 -2 -58 -28 7
5528 7 9 -77 19 -88 -219 -33 -126 32 -28 -9 -131 -15 69 -18 95 45 48 18 -42 49 86 -70 -85 1 45 -47 9 66
5556 66 -94 -11 -26 10 -23 -13 62 24 27 -53 60 47 -22 62 0 78 92 12 -17 -46 56 8 -16 140 -5 -2 121 -6
5584 -6 7 0 -44 -9 62 29 64 109 -25 -60 -10 90 9 -46 -30 7 -97 31 -6 19 -87 -13 -13 -95 -22 -34 -58 -2 14
5613 14 -13 49 86 -41 63 19 -34 -22 -15 5 18 154 16 41 -16 37 128 1 -26 -81 30 -8 42 29 37 32 109 -57
5641e7N7q8Q4lmMQ3mNl7m7JL9K2K9j02j7K9M3N3k7q4p0J01l9Mk4J56j17o7O0o8
5673h5KJ87q1j9j16RJ86%%j22Q7k08J14L9mj6Q7J6j15N8Jj02J15J5j5m3Q6j08
5701c2p5J60J09k12J79k11O4k7l2J70l5p0n5J25r5M1Q6j96K13j24%l9L0N5k9J23
5727A23k11N3rJ3O8M9r3j4N0Kj12M1M3N7nL3Jj58R5o2k8J26m7J55p5o9l2j3J05
5756H6j04j23J42n8J1Q8pNJ3n3J63k05Q6m6K9p7P5l0M9Jj22J15j8N3q8J34j17
5783Bm1K1J08j62M0M7o3k2M8l8MK00r9q3P8nj5J8L9j69M0OJ9k9OJ3M6K5m6o2J29
5814E5r8J13o9r2J68n9Qr4L3J48j49J28j57J13r0Q0o9k2N4m7K22k14L3J0L3q1
5840d3P7K3K6rj14O0rQ5K3j50L6N6j17P1%m3M4n9M9J7j12J44r6J03Qj3j33L1K5
$$ plain form
5641 -57 0 -88 -4 -7 -11 -7 76 72 77 40 -7 -6 33 55 84 -18 -35 -6 37 90 63 -21 -91 10 -29 -25 -49 107 -10 -77 -17 -85
5673 -85 -83 104 23 4 -112 -103 83 83 83 -39 48 -160 -46 -7 -11 -27 60 76 -39 19 20 -82 33 48 33 -10 76 -32
5701 -32 -107 53 162 -50 129 -82 -18 -45 -77 93 58 -12 -67 58 -37 4 90 -106 107 -17 -17 -56 -26 29 0 123
5727 123 -88 -35 -44 -31 37 86 -7 -21 29 31 -81 -40 3 60 55 88 89 -69 26 -36 -64 62 15 170 95 26 -6 -19 86
5756 86 -18 -141 1 -57 -46 42 35 40 53 0 163 -42 44 -2 27 -50 25 -5 44 45 -77 38 20 73 -15 119 2
5783 2 -39 -18 90 -72 -32 15 -48 -70 -22 -60 -56 144 45 -38 40 35 20 38 77 -92 -52 -46 -27 -56 -50 -37 9 34 -12 -74 55
5814 55 -43 70 1 -91 77 18 26 -68 -35 113 -36 92 -65 48 -42 38 -31 -53 1 -46 176 -38 -5 5 38 -43
5840 -43 34 57 83 74 -40 20 11 96 119 -31 5 61 -56 15 15 -28 16 -43 6 23 -89 55 -41 62 70 57 -76 -45 -20
5869b0P5lK9j38J47j23j7N8R0j12jJ3k9k9J37p0QM6j14J11o9k4J8n6J04p3J15
5896G3p9n3N8k1lo7L3M7j27J65r1J43k1J3kKj27o4R0ok3M0k0p5J22J8M5p3MO1
5926F2j03j2q7J63P9j60qP2lQ2K7j32m2J38n5l2roR1j9j37J35j6J14j90J12l5
5953B9%m4N5j18Q2K2o9R4m8l7l4m1R0K0lr7J53r0L7K9k5oj9O6j6Qp7R5qJ3j63
5984a02M3K2P3m0qq3L3N6Q7p8npLR6j2j14L6j5n1J06m7l5QM8k8Nr0J44q9P0Pl7
6016dP8j6j39J66q9Qj3M6n1n2Q8%m6q5J19o4M9JnK0j12J26Jj04L9M1lR8o2J32
6046A67j99j0N1J5R1r4n5P2p4M7L1r8k3J52J2qj27J3Q4p6m4L0k6L5R5o6O6j49
6074h8mJ48o7l3JQ1l6k1k9L4mR5q8R2j43J25j43QN3k5J07o9J41k54K41p6j55J51
$$ plain form
5869 -20 55 52 81 -57 90 -33 -50 8 98 -14 -15 -2 -31 -60 77 7 15 61 -53 58 -11 -35 -17 -73 31 -42 73
5896 73 -6 -59 -1 -22 -25 -92 -59 -12 -139 26 -65 78 57 70 68 70 -57 -121 -31 -37 -60 -20 -40 -115 7 25 70 -3 1 62
5926 62 -41 -53 -140 23 102 -58 -66 6 3 85 112 -20 -62 76 21 -11 -20 -26 65 46 -91 44 28 142 -48 64 29
5953 29 29 -15 40 -78 4 26 -43 51 3 -34 -68 -109 -19 1 -2 -99 54 -36 1 30 5 -1 -20 46 30 38 -39 56 48 61 -102
5984 -102 -59 -37 36 -4 -12 -95 -62 -6 81 3 -2 -9 -6 90 78 -36 0 -15 -66 40 -7 -42 -34 14 -14 -9 -99 45 -44 26 33 -4
6016 -4 74 58 -81 85 -4 4 -9 37 -14 -66 22 22 -24 -109 10 -54 -5 -4 -9 11 -101 25 26 -78 -39 2 -1 97 35 167
6046 167 -32 -42 9 24 115 21 -34 38 -36 11 42 -56 -79 73 85 77 -50 -37 47 -29 -73 -43 -69 -34 61 -5 61 -88
6074 -88 -92 56 -11 -44 -43 38 2 -19 -48 -14 -18 77 -11 81 -62 63 -80 -72 -19 -44 63 -6 135 -119 122 46 -109 42
6102D2l2J11j15r3J21p8K8K8p2R3k3q3R5l2K1Np7J25r4J53j35l9n4J08j4O4n1
6129BJ0p0pRJ1J59j59J6P2o6l8k5K38j65M8q6L0K4L5o2J29j7q8J24j86L5L1l4
6157c0L8j3L8k3k9J23j08L9j10Q8j7no1J17K8j28q0J53L4o3mn2N2j4M3l0M9j0
6185B5l9J1r2o0R1J19m9J4L4l1o3P8Q8q9J3j43J13j12J76o3P6j8j03J24j41O1
6211B0n4J3K9Q6o1l1q4J60j04N6j18J70j62J1l0N2l0k6QO3J6m2O4l2K3j04J35
6238B8p8J06n4N5q4J13q4K3m9K8M7J0r9Q7j6r3K5K1K2j25L8J2J16p1J16l5j83
6265a24R3k2L1Ol4L0oJ66j73m0J10q0L2N5j4L5j31L2Q1q1k3J15j05J08m2P9j10
6292a2l2O1J0o7O1J11p1l0n6j1J8J3Jm0k5J20j51J15p1P0J1j04L2J8n8R1J0l0
$$ plain form
6102 42 10 121 6 -87 34 -44 -16 12 -60 33 10 -73 22 -10 11 16 -61 64 -30 123 -12 -51 -105 3 -11 53 2
6129 2 12 -58 -65 -56 -45 114 -45 -29 43 -23 -61 -86 152 -13 35 -51 -21 3 38 -24 105 88 0 124 -62 -27 4 -30
6157 -30 8 -5 33 10 -19 104 -4 35 -75 13 -4 -9 -70 47 75 -53 -133 20 54 -9 -13 -65 -13 -27 16 -14 35 25
6185 25 -14 -3 -95 -155 -64 55 6 20 54 23 -40 38 126 37 50 -93 20 -92 84 21 97 79 -24 100 -41 20
6211 20 -34 -21 8 94 33 2 -82 78 -26 30 -88 82 -80 -69 -99 -47 -77 -103 -95 -32 -16 -58 6 -26 -3 -107 28
6238 28 -50 56 2 57 -27 86 2 25 -24 4 51 61 -38 49 33 -60 -35 -14 8 -117 -79 -67 49 -22 94 59 -124
6265 -124 -31 -53 -22 -16 -50 -20 -26 140 -33 -73 37 -43 -11 44 30 65 -66 -34 47 -34 -57 58 -47 61 19 98 -12
6292 -12 -44 17 27 -40 21 132 61 31 -25 -36 -18 -5 -4 -44 -69 51 -100 15 -56 14 25 -79 -47 -29 -87 4 14 -16
6320a6k6l3J12q7OK2p3J43o6J3O7m9pP5o1j0r8lQ6K6p9O6K4K7j68Q0m0L9Mm8J50
6351G6j57J48j0r9r0Q4N7k7pqP2J5m0N7m2qJ7o7j14N1P2Q7q4Pj22J44lq9J01L3
6381E4N1j55K6K7j9J3j32J01N9J3r3Q6m7o6J1L4M3k9L2n5Q7k9QM1j1p9L2J7l5
6410a5N0j25P7k7J6K5j07J32q0J10r8L9M0k3J4j54K20j33o8R7K7J02j24m8P5J4
6436C6L0j64J30j2pR5j84J3J38p8qk4Q5mJ0l4j25J52n0%l8r%L6rq3J19L7n2j01
6466a01j5M6J51n3M5k5j13J78j14JP6j17l7N5N6m6Jk8N3qj2m5J22j17j4J08JM3
6494I1o5L3p2o2J01Kk4m3K0Pj2nJ14j24o1N6kKJ04m4o5M6J3n8j8J11q2J6J1n1
6524f1k2J15k6N4j24K1m9J70r7k1j0J15j11j4J40j50J06J1kj01N0l3R7K0K0k76
$$ plain form
6320 -16 -42 -75 37 -50 -44 -22 -95 48 -18 -5 62 13 6 81 20 10 -88 -91 -5 21 -58 8 32 59 -109 -29 -69 -30 -26 -74 76
6351 76 -81 67 57 -42 -132 -48 9 -18 -25 -33 39 54 14 71 29 21 38 -29 -143 -92 -20 67 -17 -10 -132 12 9 -80 21 54
6381 54 105 -50 -24 3 -16 -3 -135 -34 25 38 -55 31 -16 -82 -71 -37 6 -23 9 -46 41 12 20 61 50 -29 3 20 -15
6410 -15 35 -90 -13 -40 -24 1 -106 26 -54 56 -42 -3 37 14 28 -126 94 -39 -107 -10 17 119 -5 -53 22 36
6436 36 66 -98 32 20 13 108 -76 -63 75 -3 -11 -35 50 46 56 22 -103 49 -1 -1 -39 -48 -48 -12 -21 -104 15 52 0 -101
6466 -101 -116 -70 81 28 73 48 -65 113 -1 0 76 -41 -78 -23 33 -13 -12 -40 13 5 -7 -52 70 -47 -61 47 48 91
6494 91 26 59 -13 -75 26 28 4 -39 -19 -12 -24 -29 85 -39 -100 -44 -46 -44 60 16 -49 -3 10 -48 -66 45 -37 -21 -10 -61
6524 -61 -83 32 6 60 -64 -43 -92 78 -19 -40 -50 65 -46 -60 80 -70 36 47 45 -56 -6 -39 58 78 98 -178
6550a78K09p2k7J29l9n2J2K8n8J6r6J76Mr0M3n0J16j5j26J04L5N1j22l1%J16k9
6577E4k1L3j10K8nJ26k03J19r1j0n5J14J10j18Q0p8Q6j97J27J05o0j11P7P1r3
6602b2j11J75p6%J10rm3m5R9Jl9J7M6o4l8l8J3n8K7J82j68K8K1l5pJ59o9j52K22
6631A26n8j14N5j3N1o5M4Mn6O0pj5j01jN9N2l4O3j84J82j3o8J24J5j49L4kl0L
6660c8O7J4M3l6o6J34m4j76O3J01o4lm7J01o2n5N4P0m2O5p5L5O3j11P5%j54N3
6688c5o3R0j0j02K35j13m2n3P2Nj34K45m4j79Q3k4K03r2o0jj7J31l1j19L9LRk5
6716b9l6J32j29M4Q4m6P9j34M2L3j60J22k2J02j90Q3J17L5L5q6p2j5j2O3N1r9
6742hj36K34Jn8QP3j71k7J41l7R7Rk7M1j98N6J6n3N3m0L7J05j45k3O8l9k6J0J5
$$ plain form
6550 -178 31 -41 -68 61 22 -30 -18 10 -48 -32 -128 48 52 -38 5 -45 71 56 -70 34 69 120 -2 -33 -33 83 54
6577 54 33 66 -44 -16 -21 105 -98 21 -70 -80 -135 -21 89 -29 51 -27 59 -138 -11 94 34 -77 0 71 -22
6602 -22 -133 42 -34 -34 76 67 24 -21 78 79 40 57 103 39 1 -37 -24 -82 -55 127 -41 -13 8 -27 -34 125 56 -96 126
6631 126 68 -46 9 -4 47 -18 26 30 -26 34 27 12 -89 -90 -31 21 -13 50 -134 48 35 -33 91 106 -43 -9 -11 -41 -38
6660 -38 29 43 86 50 -16 118 74 -102 -39 62 -2 -5 -52 49 -13 -68 -14 56 14 79 4 39 102 -9 66 66 -88 -35
6688 -35 -98 -8 -18 -120 115 2 -40 -93 -21 -16 -150 95 51 -128 -45 -69 134 42 -18 -19 -36 95 64 -55 -16 -13 -4 -29
6716 -29 -65 67 -62 -18 66 20 99 -35 7 40 -120 2 -20 82 -108 -25 92 127 162 76 4 -11 -23 40 91 -8
6742 -8 -144 90 91 33 41 114 -57 -84 57 20 117 126 99 140 -58 -2 14 -39 14 -26 11 116 -29 -52 16 -23 -49 -39 -24
6771b4L1Qo5J0L1l2mL9q6N9j9j4J09j5m6m0N3KN8k4Km6R7j4j33J77j61N2m7L1
6801a1j4o7J7O0M1k7l0j8R8o5K9j75Q3N9l2J0J34r3k9N0p9N0L3m4Q2q6n9J29J9
6830F5m2l4J24k10J33o1Lk7%J23p7j00P7k6l0J06l1N1O1n2j03n1Q0L6M6j5j14
6857f8O3l9J81j09m4M6p3O2k7J8j3N0j10R8qq9Q5p5mJ3Q3o6j75K06nM6j18J23
6885E1j18N7R2k15J23n7J09r6L9LJj2j9N1lk1P6j1r1K2J64q3j1q2K0P2Oj36M4
6914b5L6N1n6k8J23r2r7J74j78J96j08l3Q6j52K1L6j30J68J6R8k04K23r3j4O3
6939H1j44O2M6k0PJ4m4PNRl9j0P7o6m4O8K7r4M7L4j1n7J8J4P5p1K1p2J38l5q5
6970d2QQ6m2j13O2o8J47j5m0O0n9L7K3m2p1K3J10m7j1M9j59J08L2K6q0K4PL7m3
$$ plain form
6771 -24 7 15 -50 -40 -9 -41 -45 -6 -92 -33 -52 -66 43 28 -18 -58 -5 -3 55 31 33 -13 84 70 -63 114 -47 5 -42 -11
6801 -11 -25 -92 -75 -15 26 -1 -31 -49 49 -16 13 -162 -79 -20 -52 -42 92 -1 -30 20 -59 -9 24 -20 62 -24 -83 46 65
6830 65 23 -11 113 -97 36 -25 -22 -49 -49 74 -3 -103 -26 -52 -82 24 -7 44 105 53 -50 -101 -21 15 61 46 -68
6857 -68 -5 -44 137 28 -16 30 -43 19 -8 10 -3 47 -63 35 27 -62 23 -52 -56 -43 40 -26 -201 5 0 46 -72 51
6885 51 -67 -10 82 -133 -10 -67 42 -54 -15 -12 -11 -23 -42 9 6 -15 61 50 -41 -19 145 62 51 -31 -11 61 67 -69 -25
6914 -25 11 62 6 -22 101 9 -88 86 -92 104 -4 -37 49 -103 -82 -46 -176 -8 8 106 -98 125 32 18 81
6939 81 -63 -1 45 25 32 46 2 9 14 23 -16 -26 51 -15 -59 9 36 -58 -11 23 12 -45 -27 -13 62 -9 12 -60 78 43 -42
6970 -42 -34 52 10 -103 -41 -109 38 23 -17 43 -16 21 44 2 -69 -46 64 17 6 55 -104 4 36 62 -18 6 13 50 7
6999GM4j80J47kr4N7k5k0L5J12j05J15j25M1r9M1P7m1N8j55J85n0j7l6P9nj24
7026h0P8L2L3K0j61l1P1J38m9J8l0o3pQ5r2oJ49j14q3J68n2N3n0j20L8J84o9p4
7054a4J9k3Ln9om9J72j32N2L8o8J2N8j7QQJ1R3j14N2L5p2m3p0J68o0L7n0K8N1
7084F8j48J95k24Q2k5j5P3l0PR1j24P1J08q1Qq1J17r7j23Q6L4m9l1R6k3p2PR0
7112A0m8R9k8M1m7PL1j19j0J1R2l2j9J09j25K02q1j82J7J53M3o0r9K5p0J90q7
7139B3l2J11k41J70L0j12l1K02j42k6N5l3N5kp4k0Q2N6j21j4k3J79j38qP0k6M5
7166C5p8R4rj15R7m2n8L9J79j60o2J10q4J03j01nk0M5N7K9QN3p3m0R5k0m7QP4
7195A12r4k0K7K3j40J07J29j79P3L6k1r8L8J4K0j07kJ62o5j52K24j83N3N0N4N2
$$ plain form
6999 7 51 -129 18 16 -78 -21 -46 -66 -31 81 -24 91 -34 7 -92 -51 26 -15 43 -112 73 23 6 -30 49 44 -80
7026 -80 -2 30 63 83 -78 -109 -38 100 51 69 39 -24 -31 54 -38 -44 105 -9 -92 76 24 77 27 -93 -55 129 60 -14
7054 -14 5 -18 -15 -74 -80 -129 43 -89 -37 1 -67 -55 3 -14 -6 2 13 106 -8 44 79 7 -36 -106 62 2 39 -11 17 68
7084 68 -80 115 -109 -27 -52 -67 6 -24 -17 74 -50 21 129 48 56 -25 92 -5 -128 -42 -8 -57 -88 8 -15 -87 -80 10
7112 10 -38 61 33 74 27 34 65 -54 -64 -53 39 7 -12 97 -28 174 93 -89 -72 81 124 64 -35 -10 -80 110 23
7139 23 -9 102 -139 31 61 -51 -82 120 -22 -48 7 -26 29 27 -47 -67 15 71 -50 -64 -87 92 -46 -54 16 -10 35
7166 35 -43 51 42 -73 24 -18 -76 -37 142 -18 -80 30 -54 49 -52 -57 -77 -32 25 54 62 115 42 2 97 77 30 38 112
7195 112 18 -2 25 48 -92 15 144 -35 38 74 53 -45 -7 7 27 -80 -82 80 15 -137 87 -96 -43 7 61 113
7221A13k34O4J6n8M0L9o7J26j28Q2J1j12P6K17j84K8J3o4L5N6p4mp3J02M4j51
7247h7J61j01J3M2p7KJ04n6k3j2Q1k3jk6K3p9K8l2J23p9k8n5L3R5p5RQ0l5Nj51
7277a41J73j09K8J04r5M5R6j79L0L3J3l2M2J8rJ4n1N4Qr1M8qN5J9j43N7r8L8O4
7306a7O6l2Jm1J2N5j95J02M9P9j28R0O9l1j3n6l9K08j33j41J84l6n9O1m5J7j17
7333i0O7K2L7J05j09k8m5O5N9j56O7M4j50O4L6L3Q5j73J60k00J20j7m4j5mJ97
7359A30j31RQ6n7n4j5J7J5m2r5J65o5QR4j87K08m2O9j03Oj09P8l3L2j9J6J9Q5
7387H5o4j2L8j90O1J63j39l6J42k9J3Jj06J30m2O0j47J8M6K4M9j50K20j54p5L1
7413f3N0q1P3k4L7p0L7O5o2m9P3qk1O9q7L8ln8J67%J3j19oO7j18O7K5J17q5K0
$$ plain form
7221 113 -121 -57 -41 -99 -59 -20 -87 39 -89 -7 4 -108 -32 185 1 29 42 -22 13 69 -5 -9 -82 20 64 -87
7247 -87 74 -27 -14 28 -49 -47 57 1 -22 -34 47 24 23 -3 20 -59 -31 -63 60 -19 -47 -102 -69 26 -49 -40 40 5 10 -141
7277 -141 32 -77 -49 55 -40 5 101 -78 -48 -15 -2 -34 8 26 17 31 -20 34 42 -49 -1 -9 46 65 -78 -21 -119 -81 -17
7306 -17 49 17 18 -23 -11 44 -151 -49 0 79 -49 41 110 79 66 10 -29 179 46 -95 89 53 -6 55 10 27 -90
7333 -90 -23 -1 36 141 32 4 -41 24 83 -73 -6 38 -112 -48 -12 21 106 -67 93 -107 13 -4 -48 -63 -67 130
7359 130 -1 8 94 37 -17 -32 -15 0 -42 -137 28 -37 -29 65 -122 86 44 113 10 16 -93 -15 -48 -16 -35 -19 0 85
7387 85 21 9 47 -143 -82 81 -58 -94 48 19 32 33 -73 57 15 75 -72 -54 -8 16 65 -85 135 -19 -94 -63
7413 -63 -13 -94 -21 -45 -8 -78 -41 24 -38 -87 -14 -22 -43 26 -61 -23 -26 -84 83 83 96 -23 -29 38 -80 -13 12 129 44 64
7443F4r8j1Q7kJ0o9j3N9L0k3l4j4JM1K5J4Rj01R9l7k2n1K9l2j6R0Lo7r6J09J22
7474A06k66J01J17n1k1p0j2J34L4K2M4q8p0n0J14n1O2J2p4J12n1L1j45N4j9J99
7500A74j90j9J64k20Q3k6J73j96n7J71j01J1L4j04J28j02Q1N8J1p6l9K2M3L6j49
7525i0J52p8m2M6k7J04n8P2o2j4J50j00l8K3j0k1N0o2N4j03Q0Nj30Q5M7j14J23
7552D2N7n6j3m9oJj0m8P8m0N4j04J29j11j5MN7n6J92j06M3n9M7n0RJ0J2J3j30
7581a05J8K04p1o7N5n7J15o8J19j87Lk3P6m9J09j62L7K3Pk4K8J04j39K6M9j19
7607i8J62j67J07N4J2j29N8m8J52j29J4m5R8n8J0J38j58J33l1j44KJ24j3j8p3
7632d7L5Q4j34J14oK7l5jN6n6P8j28O4r3Q0N5k00L3R8Pp4J18m1M4M0r0Op5J16
$$ plain form
7443 64 -34 -45 42 40 50 -19 -32 27 57 34 0 -14 -13 28 53 67 76 -25 74 37 15 -36 -7 -39 -55 35 38 -29 -125 -16 106
7474 106 -160 -59 58 7 -14 -84 -96 38 72 94 138 50 -20 -70 44 -7 55 67 -7 105 54 85 -60 -6 -25 174
7500 174 -16 -35 129 -91 -8 -34 139 -57 -114 57 -44 -33 1 -103 25 -77 4 62 73 -3 -42 -20 23 59 -90
7525 -90 62 -16 -58 -12 -39 65 7 79 17 3 153 53 15 38 28 7 57 -5 49 -54 26 31 -99 -14 33 -81 42
7552 42 99 43 30 -19 -25 -24 -34 -82 -4 -44 10 -94 35 -76 -91 -87 -30 -86 106 0 43 -16 31 -19 -10 0 12 25 -105
7581 -105 -87 117 46 -21 34 -23 92 24 143 -44 -41 -64 12 -37 72 -90 -53 -30 -23 -47 -19 85 -54 -28 21 -98
7607 -98 64 -103 4 58 70 -59 -1 -49 103 -26 -12 -57 41 -17 -7 131 -27 106 75 -69 -67 57 44 26 -47
7632 -47 -12 72 -62 52 46 73 38 37 93 37 115 -13 51 -42 38 93 -107 -74 24 31 -43 75 34 78 118 28 34 -41 75
7661G5L7j52J14j37J8R0j11MO7j08J04L1q9Q2K2j18L6K8l6p1J77O4j51M0j3%N8
7688F1j04N0Q0M0j03K2j5m7P2n3J01q5k3mJ00l1j61J73r7R7n2o3O0N1j91J70j14
7715f6O7o5R0mJ5j0o3lj4p3Q9J24p4j18J2J41l7Kn3O2n5M0j46J80K4J24j43j74
7743a28N6O4o8R0r3J46j36J3J59o9Q4q8n5L0kl9J68j21PQ7p7K8J9p5j4j0n9J3
7771g0L9K7O0rn8M9j2n5O2j50Q3M7j7N8M6j79P6j2P8kj19L9O9k6k7K9j2l8Pj0
7801b7J14pjj18n6M4Q4K5l5K1L9j48JQ9r9M5M7M9j53J24k9N4j23J05m7K0N1l0
7829C9l6p6J35m8Q0j10J6L4R4m2p7n8R5l6j00J06q4M2R7lm1l6j18L5P9L8j60M5
7857i0P5p0K31j96j6P6J9o8O7q5J56j48N4L4m1J02k3p3J1l0m1%N1o7M0P2n1nj24
$$ plain form
7661 75 112 -40 74 -63 -45 45 -66 -62 5 -103 1 32 -57 25 47 -71 -35 -7 -43 -114 63 127 -24 16 3 3 61
7688 61 -43 7 87 127 24 46 31 -16 56 3 104 19 -4 -8 92 61 -100 73 -24 73 21 -42 18 69 -122 48 -66
7715 -66 1 -64 26 22 37 27 -36 -39 -53 -126 -37 87 13 -105 -93 48 11 13 -40 22 -33 7 -139 41 65 189 46 -128
7743 -128 -72 -8 -76 14 -79 67 -69 -56 103 34 118 30 -25 5 3 -36 132 11 18 105 28 56 75 0 -14 -24 -83 -70
7771 -70 -31 -4 56 47 -11 38 26 -29 33 -117 -34 13 -4 54 100 -79 -3 -15 63 61 -58 -19 50 24 -3 26 14 -24 -17 -27
7801 -27 87 80 79 -39 -95 -51 33 58 23 44 83 -65 -64 25 -74 -29 18 67 -86 38 9 63 -60 45 -2 18 69 39
7829 39 3 -73 62 14 94 -16 0 34 128 86 9 -49 46 10 -90 16 -68 -26 71 68 27 -9 -127 -92 -13 25 -135 -90
7857 -90 -15 -85 146 -50 -66 10 29 -39 28 -57 99 -49 5 39 -2 100 77 4 15 -15 -56 -56 -5 -72 -32 40 -11 -16 -140
7886a40K01r3M1M5o9J7rj0R0j16mN1ooNK8jq9jL7L7K7m6Rk3N2M9j16KQ2P9j02
7918B1P0o7p9N8n1J13o5%J1RJ27r9M6q7pq2L9J5nJ16j51N8j4j4J9R2j16m9J6J55
7948G9j8j48j5P4P0j5O0J3j05J01j75J01N9m7m1J91l9j69K1J6n2K5o0q7J16K4
7974b1j9N1k6p3M2M4N3j73P5R7j27O0N4m5M3j08O3J19q3J0M0m3p9J37j76K00j84
8001f9K10m1n9l6n6J1l0j8J24o5J5J06j90K9K6L9n8q3M1J17k6q9j4J00m2M3O1
8028D6K8k5Mrj64P8l5j1J28O9l2K8L0n9j67j7K66j31j4QJ4n0O4K3q2q9K4L6K7
8057a2lm5Q1q1lJ34k07J00j09J29J17j64J92k01R6Jl0O0J9n4j19J04K9oj7k2m9
8084f0J00m9J4k4m4k2nP3Oj7J11p4M0m3j22K1Q2K0J5L7nr4L0mM9o5M2K2m4L8k9
$$ plain form
7886 -140 61 -32 9 54 -15 2 -7 -17 73 -43 -47 4 -2 -8 -3 25 24 -65 -66 -29 8 35 -11 -2 -25 27 76 -40 -38 44 123 21
7918 21 91 24 -55 3 -48 65 0 0 11 20 147 48 94 7 0 -82 -43 -28 -33 83 -68 -10 -24 -38 -19 73 -43 -92 -76 79
7948 79 61 -87 -102 -28 42 27 87 100 -5 96 -79 22 81 34 -7 184 145 -24 -3 13 -39 -14 -74 -161 -45 -21
7974 -21 -40 11 -15 -88 -46 -2 51 -122 -47 50 -77 -17 37 -8 35 -73 -10 109 26 36 76 33 -46 91 -85 115 -69
8001 -69 141 100 41 5 -51 -40 -70 -88 36 -29 -14 92 -98 -69 -43 -4 -62 -145 -104 13 -13 -102 -116 -16 -58 -15 46
8028 46 74 49 53 44 -120 -42 -77 -88 40 109 77 105 135 76 -91 -108 158 27 13 21 35 -15 49 72 -10 -99 -75 -39 -12
8057 -12 -15 -60 21 -60 -63 71 -136 -36 -145 -16 101 -63 129 -72 24 25 -5 55 74 20 -99 5 34 28 11 -11 -60
8084 -60 40 -9 5 -19 -63 -85 -90 -17 -11 -28 83 9 49 6 -116 -95 -13 7 22 59 54 -40 -10 -14 35 -30 12 34 -10 28 -1
8115aj31J65O0p0j9n7m5J00Qk5J2r8J49qM9k2j40JK8Q1O5r7J0o0R6p7P2n8j9J17
8145H6M7m2j45K6L0M6j01J01q1L1j16J21k3J11j45J05k9l5L6l4N2L1j29M5K6P5
8171H9m1k2rJ0r9l1J51p8L0O5l9l0l3R4jK0Nm6l3P7
$$ plain form
8115 -1 -132 33 93 23 4 -53 -98 2 10 -15 -3 -101 48 40 89 67 -73 -72 -44 37 102 5 15 -45 51 -26 46 -12 -31 86
8145 86 133 91 -54 -28 2 48 -53 48 -33 -2 -118 3 -20 91 -54 51 22 -13 23 -11 41 72 -57 -12 14 89
8171 89 48 26 17 27 -72 -103 48 -30 0 65 26 -4 -37 57 56 76 81 35 2 79
8191G9
$$ Imaginary data points
##PAGE= N=2
##DATA TABLE= (X++(I..I)), XYDATA
0@%%%%%%%%%%%%%%%Qj6J6j6J6j6K4l2L2m0M8n6O5p3Q8j04J20j36J52j68J89k13
37a12K40k70L00l34L69m09M55n04N56o12O76p47Q23r05R97j098J212j339J481
56G79j642J826k041K290k587K950l400L978m757N860p560J0541j7286O2082n772
71D5261q6307O2683J2979n0559j0570L2192j7346q827N834q085N871L7979j3777
84G328l1841K6452K5733l2715j468L7173m175l2547K874J3396n039q535K837Q94
98C67m382j0430p778J0453J6133r217j4021J1422J5002l714l452J1129J5477p234
112A9755k6604l667K2329m10k5198l780J6545m417j5599J0263J6661m335n616
125d073J674j442N837R019m604k716O800n579j2409P719J2856j1594j2785J1322
$$ plain form
0 0 0 0 0 0 0 0 0 0 0 0 0 0 0 0 0 8 -8 8 -8 8 -8 16 -16 16 -24 24 -32 33 -40 48 -56 64 -72 80 -88 101 -112
37 -112 128 -142 158 -176 193 -216 239 -265 291 -321 355 -392 431 -474 523 -575 637 -702 779
56 779 -863 963 -1078 1212 -1375 1575 -1825 2153 -2604 3256 -4304 6237 -11049 51033 45261
71 45261 -41046 21637 34616 -15943 -26513 5679 -11667 -20494 -14660 -22745 -16874 21105 7328
84 7328 -24513 1939 27672 -5043 -6511 30662 26487 -6060 -3186 10210 5171 -3364 -527 367
98 367 -4015 -14445 -22223 -11770 4363 -4854 -18875 -7453 7549 3835 383 11512 26989 19755
112 19755 -6849 -10516 11813 11403 -13795 -17575 -1030 -5447 -21046 -10783 5878 1543 -4073
125 -4073 -2399 -3841 1996 11015 6411 3695 10495 4916 -7493 226 13082 1488 -11297 25
139B5K019j7371L031J7087k422r715P28L712N559P150p61m119N058J659j4035
154b395m331J5574K31j8370k789Q118o81j216M077L702N87k866l008L404P757
169G794J332o297m51K008n664j385P790M31p579l549l23J294J247p13K791L403
185B129l813m375N223R376L49n552M4Q21l812o76M58p96J144m900p876M295Q493
202E32j083k313M367J419n010N98P667O92m243J75j703l041K010J260r48N07l182
219b296n590J208N493M68k539J902K705l010k7O706K451j964j055k983k081K050
235A438P81k605k205l24j655l033K328O282l18k359J571R38l3K223K352k09k590
252B582j785J50r80L85K064k101l385r42o55Q52K212R23m07j104N27K302J223
$$ plain form
139 25 2044 -15327 -12296 4791 2369 -7346 -6618 -2906 2653 9803 9042 4923 9981 11640 -2395
154 -2395 -6726 8848 9079 -9291 -12080 -3962 -4643 -5859 -1782 1920 2507 -359 -3367 37 7794
169 7794 9126 2829 2378 4386 -1278 -2663 5127 5558 -2021 -5570 -5893 -4599 -3352 -4065 -1274 2129
185 2129 -1684 -6059 -836 8540 8889 3337 3381 4202 390 -286 172 -624 520 -4380 -12256 -7961 532
202 532 -551 -2864 1503 2922 -2088 -1490 6177 6869 2626 2801 1098 -1943 67 1327 379 886 -2296
219 -2296 -7886 -6678 -1185 -717 -3256 -1354 1351 -1659 -1686 5020 7471 5507 4452 1469 -612 1438
235 1438 2219 -386 -2591 -2915 -4570 -7603 -5275 1007 689 -1670 -99 839 806 3029 5381 5172 2582
252 2582 797 947 -33 352 2416 315 -3070 -4012 -4667 -3815 -1603 -680 -1087 -2191 -1664 638 1861
269A861K083K094k234k444M32o13m45Q78q95l638k690J649K127j293Q30L399j486
286c85k359K373K665J451K23j647j122J39J02o24n52J511r44n288o81M288K20
303f30j841P42R78n67o13K001L329L61j358j053q16J186M22j812J99O41l247k481
321d559J924L058n01k698J284K366k161p13L609K170j594k677p4K495O5k032L65
338C27J123j056l223j027M018J952l805j377K582Q17j332P0L049J353k897k219
354a645J784J894l90j876n24J603j516l114K197L778j143l264M01L167l23k658
370a629K105L117k185l352L14K890Q19k508r06J950j63k520l1K875K025k951k749
387b899K582K292k211p18K489R24k811k061K187K539j262k105O7J163p1k528N37
$$ plain form
269 1861 3944 6038 3804 1360 1792 1179 734 1612 717 -2921 -5611 -3962 -1835 -3128 -2298 1101 -385
286 -385 -2744 -371 2294 3745 3968 2321 1199 1338 1440 816 264 1775 831 -4457 -5138 -850 -630
303 -630 -2471 -1729 -751 -1318 -1931 70 3399 3760 2402 1349 533 1719 2141 329 528 1169 -2078 -4559
321 -4559 -2635 423 -78 -2776 -1492 874 -1287 -2000 1609 3779 2185 -492 -566 1929 1994 -38 327
338 327 1450 394 -2829 -3856 162 2114 -1691 -3068 -486 331 -1001 -931 2118 3471 574 -1645
354 -1645 139 2033 1643 -233 -757 846 -670 -3784 -1587 2191 1048 -2216 -1815 1352 1029 -1629
370 -1629 476 3593 1408 -1944 -1630 1260 2079 -429 -1335 615 452 -2068 -2099 776 2801 -150 -2899
387 -2899 -317 1975 -236 -954 1535 2459 -352 -2413 -226 2313 1051 -1054 -987 176 105 -2423 -1886
404a886M356l50m852K38M382L57l250R16L563j873m256J119K983j5j824j734N64
421a562J743j388r59K691J872k179k482J864L118j595j998K130N79k848j178K046
437a46K313j304l027P05J861j141j255J276K298l78l193o52M001J693k394j463
453h06K241J393l793j683M335J447m259j863J886Q78m99m04J245O59p54j193K38
470i32K519J276k786p06K268j190k306K293K482k340k968J161J936j327j207J585
486b42Q28j170j263m0L139J971k309k030J726J314j688j456K067J884k886k658
502b813J384J948q0j195j55O97k66r79J157J483k4q05q69K71P68j34Q45O61j577
521C17j556M61J405k31j553K11R72j607r93K180K018kj133j248Q30J130k92p65
$$ plain form
404 -1886 2470 2120 -2732 -2494 1888 2245 -1005 -89 3474 1601 -2655 -1536 1447 1432 -392 -2126 -1562
421 -1562 181 -1207 -2166 525 2397 218 -2264 -400 2718 1123 -875 1255 1834 -1014 -2192 -146
437 -146 2167 863 -2164 -1459 402 -739 -1994 -718 1580 1202 -1991 -2643 1358 3051 657 -806
453 -806 1435 2828 -965 -2648 1687 3134 -1125 -2988 -1102 -224 -723 -1127 118 777 23 -1170 -932
470 -932 1587 2863 77 -629 1639 449 -1857 436 2918 578 -2390 -1229 707 -620 -1827 -242
486 -242 586 -584 -1847 -1887 1252 3223 914 -1116 610 1924 236 -1220 847 2731 -155 -2813
502 -2813 -1429 519 439 -756 -911 -214 -480 -1459 -302 1181 1157 352 -517 -246 522 388 1233 1894 317
521 317 -1239 -778 627 396 -1157 -946 26 -1581 -2574 -394 1624 1622 489 -759 71 1201 909 144
539A44K85O02r94k001J037K346n37j212k30n71K71P31M03J42m81l43k62j71Q56
558A5J394j23m05r20p12J378R25j131r16q7n67m49K54J643R70q75p78k87N75J381
578A285r6j054k57j24l77K48M14R98K10j384q52L73N28Q34j29r39k49l35J88K98
598d20L93J117k97j669K19R84M75M91l47j483o33K27L64M78N65L23r85r53J131
617b0P47j90M57o99j621qJ001O84qk8J61n63p60N88J113K52k77j291p27R67N75
638C53j92j08K29k20j223k23K065Q41j181o09j18l19L23O62M60ko62o54O3J117
658F02J011q99j255M72n15j018J013J805m36j623l50J458P0n99P43R37r53j347
676h84j86J400J241p55j140j49M36l07p18J042J418j352k320R33J816r1m03M68
$$ plain form
539 144 429 1031 37 -1964 -927 1419 882 -330 -560 -1131 -860 -129 274 416 -65 -408 -670 -841 15
558 15 1409 1286 881 -39 -751 627 1552 421 -495 -582 -1149 -1598 -1344 299 1269 394 -384 -671 -96 1285
578 1285 1189 135 -122 -246 -623 -375 39 1037 1247 -137 -989 -616 -88 746 617 -322 -571 -906 -718 -420
598 -420 -27 1090 793 -876 -657 327 802 1293 946 -537 -1170 -943 -579 -101 464 787 -198 -1151 -20
617 -20 727 537 994 295 -1326 -1334 -333 351 343 315 476 -87 -847 -259 854 1106 829 -462 -1189 -222 353
638 353 161 53 282 62 -1161 -1384 681 1522 341 -268 -386 -705 -382 280 740 738 76 -578 -515 602
658 602 1613 714 -541 -69 -584 -1602 -589 1216 780 -843 -1193 265 335 -264 479 1416 463 -884
676 -884 -1070 330 1571 816 -324 -473 -37 -344 -1062 -20 1398 46 -2274 -1341 475 384 -19 449
694D49K93p18q32Q80J545o6j270j198L77P70p52k58J500j3k174n57J879J439j040
713B54r97J146J84j329q0J582J276r84k144K78J406k8q44M2P45m33k144J73K728
732H31M37j657m52R68K83p28L08J732q8j957q58Q94J140k44r63K65O16j467p48
751a688J646J398q85j719L29J289k72n98J252Q01q28j661J06J784O73j684n50
768f07P65n45q67OK076L99j885q04J288O13j56O3J50K32q98j007J159J147j16
787A013j229n03Q87p7r89J108J063j215j496L03J080M70m48J34M53o79p20O25
805b20J085N49j342j087Q66L27o45J22R52J51j267q65J309J074p10m96K29k57
823b25l23j00P41P24k44q81k34M41P25p4m86O14l83j466L60J160L35p79k65L24
$$ plain form
694 449 742 24 -808 72 1617 1551 281 -917 -540 230 -522 -780 720 707 -1467 -2024 -145 1294 254
713 254 -743 403 587 -742 -822 760 2036 1052 -1092 -814 592 564 -280 -238 507 74 -2070 -1897 831
732 831 1268 -389 -841 127 410 -318 -10 1722 1634 -323 -1181 -287 853 609 -354 -89 527 -940 -1688
751 -1688 -42 1356 471 -1248 -919 370 98 -500 752 1553 725 -936 -830 954 1627 -57 -607
768 -607 158 -387 -1254 -1248 828 1227 -658 -1462 -174 439 283 346 496 728 -170 -1177 -18 1129 1013
787 1013 -216 -719 168 91 -898 210 1273 58 -1438 -1135 -55 415 -33 101 554 -125 -845 -220
805 -220 865 1414 72 -1015 -149 178 -467 -345 607 758 -509 -1374 -65 1009 299 -197 32 -225
823 -225 -548 -648 93 817 573 -308 -542 -101 624 550 64 678 295 -1171 -811 349 684 -95 -360 -36
843c6l38l18P36R87o56o03l59J61P35J15j31J57l38m62k71N84J170n35j279K50
863d31L35m31J40O58K38o09o77M23O57J12J66k04l38p3k15n8Q46K12q24o85K19
884e39N39P8j03N40n14q16J55M10K95M77q3n40k38J08N44K98K2j50q16l49O71
905a1O7j66L78k71n21k90M33P06K9k41k3k90j17N67L48j06l2m95m63J55M42N00
927E99l02o84J4M0l5L48J8J17Rn73k48Q11N52n6n63j55J69j35nM97L5j85n11m79
951g22K80O51n3l62J31k32o7rP63M23n95k18O9j11l4M74J20j14o84m50N75M13
973B48k66j24l7J15l78l98P54J006n38r33J19N72L27m82J65N52m14p38nN77O00
994G22m94r20K63L41l21p7N47P00p20j013P33Q32m91jL82k87m08k80P06N83n59
$$ plain form
843 -36 -374 -692 44 1031 375 -228 -587 -426 309 424 293 450 112 -350 -621 -37 1133 598 -681 -431
863 -431 -96 -527 -387 271 509 -100 -777 -354 303 415 581 377 39 -34 -249 -307 539 751 -73 -758 -539
884 -539 0 78 -25 515 1 -815 -660 -250 45 522 439 -101 -339 -231 313 611 633 483 -333 -682 -11
905 -11 56 -110 268 -3 -524 -814 -381 325 354 113 90 -200 -317 250 598 492 460 -35 -498 -343 99 599
927 599 297 -387 -373 -333 -368 -20 -2 115 124 -449 -697 114 666 610 47 -108 61 -74 -79 418 453 268 -243 -722
951 -722 -442 209 156 -206 -75 -307 -374 -383 380 803 208 -10 59 -52 -86 388 508 394 -290 -740 -165 248
973 248 -18 -142 -179 -64 -442 -840 -86 920 382 -551 -432 140 467 -15 150 702 288 -450 -455 122 722
994 722 228 -692 -429 -88 -409 -486 61 761 41 -972 -239 593 102 101 483 196 -212 -492 214 797 238
1015B38n68p9K59J25l63o7R62j04j385J4J388L09p74k15Q33j58q68K00J029o0
1035G16o42o98L2P05J7m70L20M32m92q40M39J198k13r48L89M17o08r2O56N83m60
1056D41p92j35O65Q2m04qL93j34r26j02J272N88r91m98O34L57n12l45J012L65
1076I62j144o92O69O93j68m37J18L19n35n22N72P67q8j011l64R95K47p60K61R69
1096H51l70j033j64J195M33j093j80M82l4n84mR03O38r89j150Q26O78k43o14L52
1116a00P33p50r11Q67J123l19q88L6N78j43n70K39P96k53j140j16P84N85o34l69
1136d52P63k2q60n5Q81O91o77j073O87N87l90l46O92K95p72q53M07J088k64p56
1156d29r0M14P9n86J69J098n0j048QO12L46k96k07M59j87p29j99Q76L04m84n93
$$ plain form
1015 238 -330 -409 -150 -25 -388 -455 507 403 -982 -968 420 729 -45 -260 573 415 -453 -253 776 716
1035 716 74 -624 -592 113 130 -340 -20 412 -80 -920 -481 717 504 -444 -55 362 -246 -338 318 901 441
1056 441 -351 -486 179 261 -143 -151 242 108 -818 -920 352 940 -51 -549 85 442 -70 -415 597 962
1076 962 -182 -874 -205 488 320 -117 1 320 -215 -737 -165 602 514 -497 -861 134 381 -379 -118 851
1096 851 481 -552 -716 479 912 -181 -361 121 87 -497 -501 402 1040 51 -1099 -273 405 162 -452 -100
1116 -100 633 -117 -1028 -161 962 643 -245 -209 369 226 -344 -105 691 438 -702 -818 -34 551 -83 -452
1136 -452 311 289 -571 -626 255 946 269 -804 -117 470 80 -266 426 721 -51 -904 -497 591 327 -429
1156 -429 -519 -105 -26 -612 -443 655 605 -443 -435 177 523 227 20 479 292 -437 -636 240 544 60 -533
1177e33J83L38l82l6P26L05p14m42K44P29Ol71K96L7l12n14J43Q59J17j097l51
1198g69O10J3l7o0O02Qp21j60P54L53k67k09q9lR6k03L69K66m58n45o4M12J08
1221Fl31L52J87n67k85O21L66O3k11r6M2j63m6K58J11Lm04o17N02M45j01k78J95
1244E2k1k65j88M84L37k72k20L7p6K97J35m0N0k46k71k2K5L79n1k61j19P2k02
1267c86L85M29j54k60k48Q1K13M0K21j16l99j6L3J55K24J59l86j45m9Q3J43N6
1289F3L7o1l23o9L08J41M22l28l39J16m3L1Q8J73J1m12k49K47K92K3N5j67p4j58
1313b16j13L12K57j00m48M7P8L09P2r5K75j58l96n9L30K37k02l82oK34l03N9M39
1336A71L4k13m43J92L85mn5M3J08k04l99K65O24l3o15o1K07P6k25J1J99J24p04
$$ plain form
1177 -533 -350 -12 -394 -430 296 601 -113 -555 -311 418 424 53 349 386 74 -440 -297 562 679 -418 -769
1198 -769 -159 -146 -183 -243 359 367 -354 -514 240 593 326 117 28 25 121 -82 287 553 95 -450 -514 -102 6
1221 6 -325 27 214 -353 -638 -17 349 412 201 105 147 -16 -62 196 307 310 -94 -711 -209 236 135 -143 52
1244 52 31 -234 -422 62 399 127 -93 -56 -132 165 300 260 310 64 -207 -229 -204 175 124 -137 -256 -184 -386
1267 -386 -1 428 274 14 -234 -153 60 100 321 205 -194 -210 -177 -22 202 361 -25 -170 -219 -136 7 63
1289 63 100 39 -284 -353 -45 96 518 190 -149 -33 -76 -45 43 216 227 -185 -434 -187 105 128 183 16 -58 -216
1313 -216 -329 -17 240 140 -308 -261 -183 126 198 103 378 220 -176 -235 95 332 130 -252 -258 -24 -327 -268 171
1336 171 205 -8 -451 -259 126 122 67 110 218 14 -385 -120 504 471 -144 -205 2 78 -147 -136 63 187 -517
1359e17j86Q11K07k73k53K63L32l19l56O81K30m00n55M8L36k3l43K74K88m18l10
1380d83n9P37J81n33q3L33M9l85K53M70J24p91k67O93P5k78l54L50Ql96m11O90
1402g7N69l04p35L28N33p1m91K54O72m73p49K13O14J24o35n9L16k22k93K05M71
1423A90K63n86m68L91N45l63r8N11J83q15k16N02O23n10n09L72P6j79k57L97M31
1444D83l50o27R8M40L15l55j56N00%q32J51Q97m6o26l41M14J84l84Q9M16l4m94
1466b58k37J70P33k15m92J48K98l10j40K57O57j27p80l0N55j75j96L30K03l37
1486E4m25N6N22Qm54L8P7J35k56l4O25J38n52k95K35L97n0k98K53J08n92j83O34
1509A41K37k60m71Q3J99L9k01Q3M29j46l51j93N96K30l38p7K37j34k63M9L48J61
$$ plain form
1359 -517 -703 108 315 42 -211 52 384 65 -291 390 620 220 -335 -287 49 26 -317 -43 245 -173 -483
1380 -483 -542 195 376 -157 -240 93 142 -243 10 480 604 -187 -454 239 314 36 -318 32 40 -356 -767 -77
1402 -77 492 188 -547 -219 314 243 -248 6 678 205 -544 -331 283 407 -228 -287 29 -193 -486 -281 190
1423 190 453 -133 -601 -210 335 -28 -126 385 568 -247 -463 39 662 152 -357 15 91 -88 -345 52 483
1444 483 133 -494 -396 44 359 4 -152 348 348 -484 -333 564 518 -108 -449 -35 149 -235 -146 270 236 -258
1466 -258 -495 -325 408 193 -299 -151 147 -163 -303 -46 611 484 -296 -326 229 54 -142 188 391 54
1486 54 -371 -315 207 215 -239 -201 -124 11 -245 -279 346 484 -68 -363 -128 269 219 -79 174 282 -310 -493 141
1509 141 378 118 -353 -270 -71 -32 -233 -150 279 133 -218 -411 185 415 77 0 237 103 -160 -111 237 398
1531C98m59m12L73O1j2J67O3R2l93m49N99L89j15l24j8K20q3k80K71L44k67n22
1553c57j36L86J42k25k4K57j06l18J41M24J85k18k95J24P8J3l6N4J99l72m31L25
1575a90L98p1j45p9N4n8l42L74N45k96l01k52L38J51P8m5N2k09k44M8J20K84j11
1598I9k49j00J60o3l3K77Q8j68k60M0J51J89j47K06k55j67K70j0J91K1j81j93
1620a34j65K81J31k36K30O8n25m7L67J49N6j14j09j19P7J52M1J22j68O3l81L8
1642b23L90N7j23j85L4j07j6P5K65j34lp4j49K09K07L8j73O1k75k9J19J68M7k01
1666b2r1O8j76J82J99l6j49j08m3J93J47q4j0j43K4L6j80L42J68k90k56J33j7
1689a13J06n9j1R2j70j99K18K98O2j22j79mJ30q5J89O4r9k00p7J36J92j65n0J7
$$ plain form
1531 398 -61 -473 -100 -39 -51 116 179 271 -122 -571 28 417 302 -22 -40 180 97 -183 88 432 165 -357
1553 -357 -493 -107 35 -190 -214 43 -63 -381 -240 184 369 151 -144 -20 58 71 35 89 288 -84 -515 -190
1575 -190 208 137 -8 -87 -33 -91 -433 -59 486 190 -111 -363 -25 126 204 159 211 2 -242 -194 -74 210 99
1598 99 -150 -250 -90 -153 -186 91 179 11 -249 -209 -58 131 -16 190 -65 -232 38 28 219 240 59 -134
1620 -134 -299 -18 113 -123 107 175 -350 -397 -30 119 175 61 -48 -167 -90 62 103 225 57 120 -261 -223
1642 -223 167 224 101 -84 -50 -157 -173 -98 167 33 30 -44 -193 16 223 261 88 149 -126 -155 -36 132 179 -22
1666 -22 -113 -45 -221 -39 160 124 -25 -133 -176 17 164 80 70 -73 -49 -13 -193 149 317 27 -229 -96 -113
1689 -113 -7 -66 -77 15 -155 -354 -136 162 224 102 -77 -81 49 -36 153 217 118 -82 -159 -23 169 4 -46 -29
1713b9j44o9N3J67L64m50j95L48Q5k4n0N0K52m13k15J58K64o8j24k2r8k2j39K36
1737h5L29j06j81k15K99J23k07J25K30k15j17j91L70K63l05l14J92L9l23R1K67
1758F9R2k48j72PM84j43p0K57l9k32k56J85M66k36l05k3J96j07K5J1K42k3n10
1781c30n5M30J92j23k01J4K13l42l0M12J74k57l42J34J38q4M1L6P7l33L3%L30
1804A27J78l14j54K77j92q9J06J49R1l05j00L07L2j00k6J93q1k26n4L79L0j83
1826D5p4q2J55j02n7J88J05k4l65K6L61oj07j34J56k0l73K51K80j44M2l75J09
1849a45J48l3j15K64j28j1k06J44L43j57j47J06J8o5k21J92J86k62j30M9J85J01
1871A16j63J7Q3n2j74Q0K24Q4n7k61p3K11k3n4K37p7k37k01K21J88k02R8j41K8
$$ plain form
1713 -29 -173 -242 -189 -22 342 -108 -303 45 130 106 56 106 358 -55 -270 -112 152 84 -40 -62 -160 -182 -321 -85
1737 -85 244 138 -43 -258 41 164 -43 82 312 97 -20 -211 159 422 117 -197 -5 34 -289 -198 69
1758 69 161 -87 -259 -252 232 89 19 276 237 5 -251 -66 400 164 -141 -164 32 -75 -50 -39 203 180 -330
1781 -330 -385 45 237 114 -87 -73 140 -202 -232 180 354 97 -245 -111 27 -57 -16 20 97 -236 -203 -203 127
1804 127 305 -9 -163 114 -78 -167 -61 88 179 -126 -226 81 113 13 -13 180 99 -127 -181 198 228 45
1826 45 -29 -111 44 -58 -115 73 178 154 -211 -185 176 170 63 -71 85 65 -308 -57 223 79 121 -254 -145
1849 -145 3 -30 -145 119 -9 -20 -226 -82 261 104 -43 63 81 16 -205 -13 173 -89 -219 -170 15 116
1871 116 -47 -30 53 1 -173 -93 131 215 158 -103 -176 35 12 -42 195 118 -119 -320 -99 89 -113 -15 -156 -128
1895a28p7N4J57R0N1j63o4K21o4p2J80q5m7j95Q3O5L0j7n6j26J25o5k5K26K0j25
1921gj12K0J12J07L6Pq4j29l1K1J62p3j13j38K58j53O7J44k3j21l9j36K25J12
1945A12q7J28j29k8P7r0J09jq2L6n5N7k1K5j93J71p3j2L1J41n3N1p5q3Q3J3N6
1972A08l1p8j19K8M7J43j59L0k0O7k16K07r0K63J8j89j9j10K13l8Rn1J83l38O
1997a36P7N2K01k50j00J47M7j30O8J11j30j52RJ80M5M9Q9j79j7J04k02J46R3j77
2021e5p4RJ39j9o1K1J34k15K9N3K02j47J2r9L8R6j54J61R7j36k6j76J4K52l6j28
2047f9K7Q2j48j69K53J36j11j14k4J95p0J07k4K7j11j28O0K05m7l4q3m5J63j85
2071a07K3J64L9k17o4O8J37r6N7P7j0j37j07J71J34M1k78lK34k99rJ93j0J22l47
$$ plain form
1895 -128 -205 -151 6 96 147 -16 -80 141 77 5 185 100 53 -142 -59 6 36 19 -37 -163 -38 -103 -128 98 118 -7
1921 -7 -119 -99 13 120 156 163 79 -50 -81 -60 102 29 -84 -222 36 -117 -50 94 71 -50 -89 -225 0 112
1945 112 25 153 24 -4 73 -17 92 91 9 45 -10 47 26 51 -142 29 -44 -56 -25 116 63 114 39 -44 39 52 108
1972 108 77 -1 -120 -92 -45 98 -61 -31 -51 16 -200 7 -83 180 198 9 -10 -120 93 55 64 13 196 -142 -136
1997 -136 -59 -7 194 -56 -156 -9 38 -92 -24 87 -43 -195 -186 -6 39 88 177 -2 -19 85 -117 29 122 -55
2021 -55 -129 -120 19 0 -61 -40 94 -121 -92 -39 163 16 28 -71 -33 63 -91 70 167 31 5 -171 -157 95 59 -69
2047 -69 -42 40 -108 -277 -24 112 1 -113 -137 58 -12 95 71 98 -13 -141 -81 124 77 43 -40 -85 78 -107
2071 -107 -84 80 119 -98 -162 -94 43 -53 4 81 71 -66 -173 -2 132 173 -105 -108 126 -173 -182 11 1 123 -224
2096b24O8K23k6l0l3J29j01j04m7L22k1j59q4N9J66j27j22K47K1j96j37m7K23
2119@J28j41O3O6j13j04J00J15Rk13j18L26K4j15N4N1k00q4N4O9J91j08k23J96
2143B7j17P4j05L54n1j60j89J19K08j51m0PN1p6k00J33K80ok55J3M7R0r2k7J06
2168D0j7j86LL04J7J5k41Q0j5q4lJ74m7j30j36R8R0ON7rM2r2m3L5J88J05k99J0
2196c8J91k16l3J80P3j28k43P0K06m4l1j24J43M2n3j30L27j27K6j65QJ84p2Ll1
2221A8J51j99pj3O4K2q7nnj8J64j27K06l2j07q6P0N9r0l7J23j9q5j42K82O7j82
2248a5m2P7J4j40J8J59M3p8k10M2J32Q7pp4l4J1j30J37O9J67k33l0J8n0J7J60
2274A08j20L9l9j02J29J9J27j55K8Pj57J35l1J87j80m1J6o4J17m4o4J19m3jk15
$$ plain form
2096 -224 -156 67 41 11 -22 107 6 -98 -145 177 156 -3 -87 -28 138 11 -111 136 157 -39 -176 -223 0
2119 0 128 -13 50 116 3 -101 -1 114 123 -90 -208 118 142 27 81 132 -68 -152 -98 -29 162 54 -169 27
2143 27 -90 -16 -121 233 182 22 -167 -48 160 9 -31 -24 27 -49 -249 -116 164 158 -97 -84 -37 53 -39 -66 40
2168 40 23 -163 -160 144 161 176 -65 15 0 -84 -87 87 40 -90 -226 -128 -38 -32 25 16 58 -34 -77 -42 146 251 -48 -38
2196 -38 153 -63 -96 84 157 29 -214 -144 62 18 -13 -137 6 48 -5 -135 192 65 91 -74 -66 118 46 49 18
2221 18 169 -30 -37 -50 14 36 -51 -56 -61 -79 85 -42 164 132 25 -61 9 68 -22 -59 64 45 -40 -182 100 167 -15
2248 -15 -57 20 34 -106 -88 71 114 36 -174 -132 0 87 80 6 -28 -17 -147 -10 59 226 -7 -37 -19 -69 -52 108
2274 108 -12 27 -12 -114 15 34 161 6 34 41 -116 19 -12 175 -5 -46 -30 -94 23 -21 -85 34 -9 -10 -225
2299b25K76O3j23j48m0J55j3R3k6J17Rk54k5J53O9k3j06l6Q3l9%J58j03n2L5j15
2325a17J36J5M6N0r8j33J46Q6j07K12k45j47J43j33R8K7M2on7q0P8J08m4l6M4
2350B8l8P3PR0j68N0j98Q3l7M2K4N2r7N8n1J23ml7%k5J19M2J6j53M5o0p1K1N1
2379a5J10j54Q8K3j78J52j51R8J06n3j65R4N0p2L1R1r0J39j76N3Q8O1j42k7P8
2404C9n4M4n6J46j0j91N2n8J01k4j3J86j03q6j25J86J16j47n9N4k3L6m2LJ14m2
2430D4k27j3K20N3r9J8P8lm8j37J71R6j80L4k9l8N1Q1r2L4Or2m3J99o4p7jN4j9
2459b3nM9L5JJ4j99R5R1j25J83j30K4K6j52N9K11j12j44R4Mq9M4J20M6Qk46R4
2486b7J53oj19k0O2K4j74J50m4J20r8j18K8J42J0r3J48j05q3o5J69P1j51L0m8
$$ plain form
2299 -225 51 114 -9 -157 -197 -42 -55 38 12 129 138 -116 -141 12 81 58 -48 -84 -1 -40 -40 118 15 -37 -2 -117
2325 -117 19 34 80 130 32 -101 45 131 24 236 -9 -156 -13 -146 -48 -21 21 15 -42 -122 -44 64 20 -16 28
2350 28 -10 63 70 160 -8 42 -156 -73 -110 -68 -44 8 -89 -31 -82 41 37 0 0 -25 94 136 152 -1 44 -16 -87 -66 -15
2379 -15 95 -59 29 52 -126 26 -125 -27 79 26 -139 -45 5 -67 -36 55 -35 104 -72 -19 69 130 -12 -39 39
2404 39 -15 29 -27 119 109 -82 -30 -88 13 -11 -24 162 59 -27 -152 34 150 3 -56 -2 -25 11 -31 -28 86 44
2430 44 -183 -196 24 77 -22 -4 74 71 23 -114 57 153 -27 7 -22 -60 -9 72 -20 14 20 -72 -115 84 20 -57 -58 -4 -23
2459 -23 -28 21 56 57 71 -128 -33 58 -67 116 -14 10 36 -116 -57 154 42 -102 -8 -4 -93 -49 71 117 125 -121 -27
2486 -27 126 120 1 -19 43 67 -107 43 -1 119 21 -97 -69 73 83 -10 138 33 -50 -115 54 125 -26 4 -44
2511d4j3o4oJ25K2j29J5J6O9j5j2r2J10j62J62K1O4O8j92K8j4O0o8k6J15j0j17
2538h9j9M7J16J4n6M2l8j28Q3J45K3j57l4k7J24p2mJ66o6j38m9J87m3K9j42Ql8
2565a16m4k7L76j12p5M5j32Q0N3m7P7k3l2M0j91J24lN5k0N5k8j13r1K38q8m0P1
2592C2l1J08q9J8j55J39K6j77J7K11O2k38M0J02q2L8J1M0q7PN2j5M1k3m4LM4k5
2620B5j36Q4O0L9j42J03k8M4k8k7O9m3n6rJ38rj20j25J87m9%R3K6K5m1j81N3K03
2648A55k00K2Q4L3j71O3j09J40J3p5p4R1n0L6O8j2J15j18j4pN5n5Oqn0J5%M4P0
2677F7j16k4J51p2n4M3q1J2p0J54Q0j17M6l3q4J67n3j07J74q6l2N8k7j45J27o5
2703h7N2M3J0N9j08jO5Q0j09o9N7l5j2L0l9j8O1K0K1M4l4n2m8Q6o2N0onk7j39
$$ plain form
2511 -44 -57 -121 -127 -2 20 -109 -94 -78 -9 -24 -36 -128 -18 -180 -18 3 67 135 -57 -29 -43 17 -51 -77 38 28 -89
2538 -89 -108 -61 55 69 13 55 17 -111 -28 117 140 -17 -51 -78 46 -26 -30 136 70 -68 -117 70 27 56 -86 -78 -116
2565 -116 -160 -187 189 77 2 47 -85 -5 48 1 78 55 23 63 -128 -4 -7 48 28 83 55 -58 -149 89 1 -39 32
2592 32 1 109 20 38 -117 22 48 -129 -112 99 161 -77 -37 65 -17 21 32 72 -15 -8 44 29 70 47 3 6 50 25
2620 25 -111 -27 33 72 -70 33 5 49 21 -6 63 20 -36 -45 93 84 -36 -161 26 -23 -23 70 96 121 80 -101 -48 155
2648 155 -45 -23 61 94 -77 -14 -123 17 30 -45 -119 -28 -78 -42 26 14 129 11 -3 -10 45 -10 -4 -12 -62 -47 -47 -3 67
2677 67 -49 -73 78 6 -48 -5 -86 -74 -144 10 90 -27 19 -14 -98 69 16 -91 83 -3 -35 23 -4 -149 -22 -87
2703 -87 -35 8 18 77 -31 -32 33 113 4 -65 -8 -43 -55 -25 -64 -82 -21 -1 20 64 30 -22 -70 16 -46 4 -2 -7 -34 -173
2733a73Q9J01k3O5j51J40l0r2J07M9P3o5j91K7J99j17Q4j3J8p9lo1O9O0j53O8
2759br2R9j4o6J83j3j20K0J5M7N3p9oj8L7p0M3J8q3l2P7j11J53n6m9R1l6j2q2
2788a05J2J58p8n2J02p8l3kJ20j6o6l5J20qnj86J55J07j86Q4p7QN5p7L7J03j58
2815a01O9Q0k4J4j19r5K13k1n3R0m7J01j66P5J02j00JjK1j16J14j08J07n7j6J7
2841b0O6K6o7j02J03k8P0l8l5J42j33j16O1N5m8L5p0Q8Rn4p7K36j8o9q8J10OJ4
2869E8j26J33qq1m6J14o6N4q7OJ59o5j41J28N9j17O8K6j31J40p4J9J5r3P9n7J9
2896a5M9k6j64J74m4j0P8k9j9m3j5J26j44J18q7O0Ln5j4J90om7j13j05K63j50
2922b5n7J71j64J68k48J26M0Q6o3l1K3j09J19j69j2L8J51o8r4J59K7o6q2M9p8
$$ plain form
2733 -173 -84 17 -6 59 -92 48 18 -74 33 82 155 90 -101 -74 125 8 92 79 97 18 15 -46 23 83 -70 -2
2759 -2 -94 5 -9 -75 108 95 -25 -5 10 57 110 31 25 7 44 -26 17 35 -48 -80 -3 -114 39 -17 -66 25 -11 -23 -105
2788 -105 -93 65 -13 -65 37 -41 -74 -76 44 28 -38 -73 47 39 34 -152 3 110 -76 8 -69 -61 -6 -83 -46 57 -101
2815 -101 -32 48 24 38 -81 -176 37 16 -37 53 6 107 -59 16 118 18 19 18 39 -77 37 -71 36 -21 -37 -20
2841 -20 46 72 5 -97 6 -22 48 10 -25 117 -16 -132 -71 -16 -64 -29 -99 -11 -2 -56 -133 103 85 16 -72 38 44 58
2869 58 -68 65 57 -24 -70 44 -22 32 -55 -49 110 45 -96 32 91 -26 42 68 -63 77 3 22 37 -56 23 -34 -15
2896 -15 34 8 -156 18 -26 -36 42 13 -6 -49 -64 62 -82 36 -51 9 12 -43 -57 133 127 80 -33 -138 125 -25
2922 -25 -82 89 -75 93 -155 -29 11 97 34 3 26 -83 36 -133 -145 -107 44 -24 -118 41 68 2 -80 -31 -109
2947a09M9R0q4J92j48p0O0K4K9J8l6J3n9o3J22q7P0k6j6K6L7j02J5R2J8p8n1m9
2975a23O5P1L4l2q3Jj8j3J52n8O4j30J4J2J35j03J5K6j33J25J41j00j6N3j60J83
3001A22q5j53K01l3j43M3J7jK3r8K21j80j5jQ3Q3o8lO1o0l7J73j27j2l4OM2qj5
3030Bo3p2K14j38L2j0K8o8P5n1M2l8L8MK0Kl4J06n0k1j5Q0n4p2J0m0J47m6M4q6
3060a4k1j9J8K7p4O8J13m5j14L5J34j24r4R7j45J18k0L9J18j85N4R2j06Q4q9J05
3086E2km8L6j7n2J34j6j11L4L3p3n4l5J43n6o5P9m6J27j00lJ55j40J44o5Pl9j8
3114Dn7KJ18j29O2M4J5k9l2P2l2k6j8k8M1M0r6J4R9r7M1L4r1Q7o8N5p2Q1p1P1
3144C4n6L2o6p1J46o5O2q2L6k9rk7R1p7J84r9n9Q4Lj09O0K3l2j5N3lJ51j23o0
$$ plain form
2947 -109 -60 30 -54 138 -10 -80 -20 4 33 51 15 28 -31 -94 28 -59 11 -15 -31 -5 32 -70 -55 37 55 -23 -74 -123
2975 -123 -58 13 47 15 -68 -67 -85 -98 54 -4 60 -70 -56 -44 91 -12 3 29 -104 21 162 62 46 99 -61 122
3001 122 37 -116 85 52 -91 -48 -31 -32 -9 -107 114 -66 -81 -82 1 84 16 13 74 14 -23 150 23 11 -23 -17 25 17 2
3030 2 -61 -133 81 -57 -25 -35 -7 -75 0 -51 -9 -47 -9 -5 15 17 -17 89 39 18 3 83 29 -43 -33 -73 74 28 72 -14
3060 -14 -35 -54 -36 -9 -83 -15 98 53 -61 -26 108 -16 -110 -13 -158 -40 -60 -21 97 -88 -34 58 -48 36 -53 52
3086 52 50 2 38 21 -31 103 87 -24 10 43 -30 -84 -119 24 -32 -97 -18 -64 63 -37 -40 115 -25 119 54 61 22 4
3114 4 -53 -51 67 -62 0 44 59 30 -2 70 38 12 -6 -34 7 47 -49 -35 64 -33 8 42 -49 38 -30 25 -47 34 -37 34
3144 34 -22 10 -56 -127 19 -46 16 -66 -30 -59 -68 -95 -4 -81 103 4 -55 29 32 -77 -17 6 -26 -41 12 9 160 37 -23
3173b3Q0j80Q4rJ19Kl7m8p7M8O5L9m3O6o2j19J91j09n3N4Jno7M8J7O2L1nj34J64
3203A00j12o4O7j7PM4o8R1N3m8j07M0n4K0n0j7J12O7j59J53j12J40k16J22j5q
3229c1q1k6J65j05M3N6j5K4Ml3o6J41j21M6N0j0M1p8MM9J1K5m6k0j9l7j5K3j5
3258c6j9M2n9O3M8J7M9l3l9O8n7l9l7q3J21r0JQ6j13J68J0j48J83k43J12M7q2
3285f3N7K9p4L9R9j37L0p7J01nj1l3MJ39j83J07Q0j32n9M2M2N0p4j12Q6M7Q6j16
3313c8L6P3j46J54p0O9p0j30J28L8P9j23n9Q3q8RJ52j03M6n0Q4p7P4q5j16P4J7
3340c9J6L9N0j90K17j48M9rpo8R7j00R7l9N7K9j02J11j23L9rl5L2k1P2Jl8k1P7
3369C4l8o9P8j1J2l0K2l4K3q1J92j69P9o4K1l6R9n2o2l7M0k7N3O9J3k8J4rPj1
$$ plain form
3173 -23 57 -123 -39 -48 71 73 36 -12 -89 -41 24 63 20 86 24 -95 96 -13 -66 -12 -11 -16 -83 -35 -18 44 75 70 -64 100
3203 100 -12 -76 -9 -26 -19 25 -43 48 101 53 -54 -14 -68 -48 -98 -115 -3 64 -95 58 -54 86 -130 -8 -23 -31
3229 -31 -112 -138 27 -78 -35 21 6 30 34 1 -65 76 -45 1 51 41 82 4 8 57 68 93 47 27 8 -29 -44 -21 -36
3258 -36 -55 -13 -72 -9 39 56 105 72 33 101 44 5 -32 -115 6 -84 -83 3 -110 58 68 -80 103 -140 -28 19 -63
3285 -63 -6 23 -51 -12 87 -50 -20 -97 4 -1 -12 -45 -41 98 -85 22 102 -30 -89 -47 -5 45 -29 -141 -55 -8 78 -38
3313 -38 -2 71 -75 79 9 78 8 -122 6 44 123 0 -59 24 -64 -55 97 -6 40 -10 74 -3 71 -14 -130 -56 -39
3340 -39 -23 16 66 -124 93 -55 -6 -15 -22 -90 7 -93 4 -35 22 51 -51 60 -63 -24 -33 -68 -36 -57 15 16 -22 -43 34
3369 34 -4 -73 5 -6 6 -24 -2 -36 -13 -94 98 -71 8 -56 -35 -71 28 -24 -86 -123 -83 -110 -57 12 25 -3 11 2 9 -2
3399bqN8n5l3Q1m7N6o8J5L3j00L5J56k01J54j36R5P3l0j02M1M8l4l5j24J31J8
3426A9j50R6P9j10L6j3OL0KM4m8J5M2q6R7j01O9n3J38k11J57Lk6m7j1J05pl3j20
3455g8M8m3Q2o0N6j2J09p0Km0K2M6j4r1J34j0j97J10k3n5m1J75r0j20L3J92j07
3482d2k7P3o4O6m1j6L2q0N0N6k2N9k0M5N0j22n5L4M1J5m3k7O7l1j6K1L9Lj5j00
3512g0J89j08L1o8O3r4J3m0R3j7k0K2j5l8pJ07j10J86j20N3j06J16J0K5j57Q6
3538B4m1o1M3N3mmJ1k08K92n5J5j45J49J4j9p0K2J8m3N3j11O9l2q2K38j13M9j
3566F1j75J15oo8J9o5Q9RL6O6j12K6j28K09r9Q6j31O2l7Q1o4Q7j3m9L4Jj6k8K4
3595A4j22P2RQ5K2lk8p3qk2K06k94P3Q3n9J63j52L5J00l4j22L7o1N6O3M1l1n4
$$ plain form
3399 -2 -10 48 -7 -40 41 -6 50 -18 -3 30 -70 -35 121 -80 74 -62 33 106 76 -26 15 63 29 -6 -130 1 19
3426 19 -131 -35 44 -66 -30 -43 -37 -7 -5 39 -9 6 48 -38 59 -42 27 -26 112 -99 58 61 35 -12 -23 82 75 42 -78
3455 -78 -30 -73 9 -51 5 -7 102 32 34 -6 16 62 48 -43 91 81 -116 -6 -29 -84 -125 50 -40 -160 -127 65 -42
3482 -42 -69 4 -60 6 -35 -51 -19 -99 -49 7 -15 44 24 69 119 -3 -58 -24 17 32 -11 -38 29 -2 -18 3 42 45 30 -70
3512 -70 119 11 42 -26 37 -57 -44 -84 9 -8 -28 -6 -21 -59 -66 41 -69 117 -3 50 -56 60 70 95 -62 24
3538 24 -17 -78 -35 18 14 10 21 -187 105 50 65 -80 69 83 64 -6 16 34 -9 44 -67 2 -30 -112 126 13 62 61
3566 61 -114 1 -5 -73 -54 -119 -30 -21 15 81 -31 -5 -133 76 -23 63 -68 -6 -43 38 -26 61 48 -1 33 34 18 -10 14
3595 14 -108 -36 -27 58 80 77 49 -24 -32 -54 152 -142 -69 14 -45 118 -34 1 101 67 -55 -18 -79 -23 40 81 50 -4
3623dO6m2M7ppk3M8j27J47m3j78O3k6R8J0j56K08j3k1q1J1j03O3M2L5P0no7Ll6
3653b8j9L2n8o5J08J12j08J05j78N3J27j59n0J28rL3J5r5Q6K9J1q2R0N9j58ro5
3680i5R9m4P2m1m8L6L1L4m6o4l2J00P6j36O6M4K7j3o0K4j2nkRk9J4n7J40q3M1
3710D6p0J35l6j63J68r0n7R6j13P2r1M7J1k6N9J5j9o8J79q6o0K1P5m1mk7K4Q6
3738H3j48J16j07J51k1p5M5n2j4J09j7jj50Q5P4L5j44O7Q3j19R2r6N0K6q2L0q4
3765f4NQ4M2j20o7Q3J1L9M4J7l5j30m2K79j32n8KJ77j57n9P0J4J53j67o2N7NJ4
3793CL2m3k8qJ34q7L8j52K25j39J1p4N8p0J18j7j0M6n1p3j0J32p0JJ8k8kl5J14
3822C3j30J23p2O3j10O2O8Mm3p7P1j06J31j06J11L7O2j40L2%L2r0J25r7r5J49
$$ plain form
3623 -4 62 20 67 60 53 30 78 -49 98 55 -123 -60 -86 12 22 -134 74 61 40 -41 -30 -133 -70 -28 7 77 72 5 8 -28
3653 -28 -47 -15 -73 -138 -30 82 -26 79 -99 -46 81 -78 -128 0 -9 24 39 -56 30 59 70 -12 78 137 -21 -30 -95
3680 -95 4 -40 32 -9 -57 -21 10 44 -2 -66 -98 2 78 -58 8 52 79 66 6 30 18 13 11 20 -9 5 -52 88 5 46
3710 46 -24 111 75 -88 80 -10 -67 29 -84 -12 -103 -56 -45 -71 -12 3 -16 -84 95 9 -51 -30 45 4 0 -27 -3 83
3738 83 -65 51 -56 95 74 -1 44 -8 -22 87 70 69 -81 4 78 113 -31 36 119 0 92 -4 46 72 -10 20 -64
3765 -64 -59 25 67 -53 -120 -37 -26 13 57 74 39 -91 -133 146 14 -44 -42 135 -22 -81 -11 3 156 -11 -73 -16 -11 3
3793 3 35 -8 -36 -44 90 3 41 -111 114 -25 -14 -88 -30 -100 18 1 -9 37 -14 -87 -97 35 -35 -34 -16 -44 -46 -81 33
3822 33 -97 26 -46 17 -93 -31 37 41 -2 -79 -8 -114 17 -89 22 59 121 -19 13 13 45 -45 80 -17 -112 37
3848C7q5J8l0J09k0j0k6o5L7P4o1k2Q8m6K7k0o3M8p3JJ10o4oR7l2J23j05j9R3
3877A15j82R5O8j44J11j3n0kJ4L9m4O6m5K9n4pj3p1J09m8R8r2o0k4Q6Q3j03oN0
3906El4j9J0L2K9L0q5O5k5l1o2L4J18p7l0L6Q0l2m1m1J17j2l9o8M9p2R8j22J02
3935A5O6l6o8m2J26n1O6n3j04J39j07j4M6J3M1l9j0J32j00N4j36K08j20j9L8M
3961D9l9j4m3l1J4O6j5j04K58o9j61J28K0j67J28p2Q3n0k6P9K6K1Kjk1o6n4M4
3989a5J8o6J7J2J23j29J02l9l1n4J24n7j08J08l5J36j89O9k9N3p8M8P8q0L1m1
4015c2Q2l6m5l8L1j9P1KK5o3j3Q3n6J6l7R7q2n9Q3n2J3j5L6pL5J3o3rR2n2p2J67
4047I6j26Q0k9p2J0L7P2j95J15J6L9m2m9R2j02J8n7Q3J3j12N3k2J06J01j57N8
$$ plain form
3848 37 -48 -30 -60 49 29 19 -7 -72 -35 39 -22 -44 44 -2 25 5 -58 -10 -83 -82 28 -36 -42 55 23 146 41 22 115
3877 115 -67 28 96 -48 63 50 0 -2 12 51 7 73 28 57 3 -4 -17 -88 21 -27 71 -21 -81 -105 -19 64 -39 -45 5
3906 5 -29 -48 -38 -6 23 53 -32 33 8 -23 -85 -51 67 -10 -40 -4 76 44 3 -38 79 67 28 -40 9 -63 35 -87 15
3935 15 81 45 -23 -65 61 10 76 23 -81 58 -49 -63 -17 -4 37 -2 -12 120 20 74 -62 146 26 7 45 49
3961 49 10 -4 -47 -78 -64 2 -13 -117 141 72 -89 39 59 -108 20 -52 31 -19 -45 34 60 81 83 82 61 -5 -59 -15
3989 -15 3 -63 -46 -34 89 -40 62 23 -8 -62 62 5 -103 5 -30 106 -83 -14 -43 10 -68 -20 58 -22 9 -32
4015 -32 50 14 -31 -69 -38 -57 14 16 41 -22 -35 48 -8 8 -29 68 -14 -73 10 -42 -29 -44 -8 -15 20 33 -30 -39 53 1 -71 96
4047 96 -30 50 21 -51 -41 -4 68 -127 -12 4 43 1 -48 44 -58 -40 -97 -14 -1 -113 -60 -82 24 125 -32 26
4073B6r6O3M9m2L9m5Qkl7J09l4r8J78k07J93n7r5O3o4J17q1M6j38R4nn1N5p3O4
4102b1j0M1n4J31l4J3Mj3n3J2M8l3j7m2M6P0o0l1J00j19R9L6r0m2N4n2P0q1J8
4131a0q9J77n6j02N1ml7R2m1j04P0O3J2j34J11KJ8P7j89L4M3K8rq8L9P5j07J23
4159D5l2pj2m3L6r3J35k9j15mJ59j1l3k3k3O5k6k7N3j27j9J55n6q1J19l2MNK4
4188Gq2N1K3k8L8l7jm8J43o3J5r0K2L8L0n5O4k0K2l6r0M1k1K2J25Qn6K4j04K4
4218c4L2J2o1M6k1l7J38J6jj55R0k6m7L6l6K9K9j3mj5P8r5J25j17M1m6l7Q6m4
4247c1O5m7m7NQ7n6N3J2J0J0j35Q0o7J6J03K6j05Nk1N8p6j0NJ75j00N9%j76J30
4276B8m9NMnL9J0j29l7K3J28N2Ol1j2N7j09j6O3r3J23q6J50q4K9Nj85J16O5jo8
$$ plain form
4073 26 -70 -7 42 0 39 -6 2 0 -37 72 38 -60 118 -89 104 47 -48 15 -49 68 -13 33 -105 -11 -16 -67 -12 -85 -21
4102 -21 -31 10 -44 87 53 66 70 57 4 16 64 31 14 -28 18 88 28 -3 97 -22 77 113 23 -19 35 -17 53 -28 -10
4131 -10 -99 78 22 -80 -29 -33 -70 22 -19 -123 -53 10 22 -112 -1 1 19 96 -93 -59 -16 12 3 -85 -46 29 -78 45
4159 45 13 6 -6 -49 -13 -106 29 0 -115 -119 40 29 -4 -27 -50 15 -11 -38 15 -112 -131 24 -32 -113 6 -26 -22 -17 7
4188 7 -75 -24 -1 -29 9 -28 -29 -77 66 3 18 -72 -50 -12 18 -37 27 7 29 -7 -97 -56 -77 -55 70 78 22 46 -58 -34
4218 -34 -2 10 -51 -5 -26 -63 75 91 90 -65 25 -1 -48 -12 -48 -19 10 -3 -7 -22 56 -39 86 -31 10 -36 -73 13 -31
4247 -31 34 -13 -60 -55 32 -24 29 41 51 61 -74 6 -61 -45 58 84 -21 -16 -37 21 -55 -65 -60 115 15 74 74 -102 28
4276 28 -21 -16 -12 -17 22 32 -97 -134 -111 17 69 75 44 32 89 -20 -36 27 -66 57 -29 121 37 66 71 -114 2 67 66 -2
4306bj5O6J19j26r5pR6j12N8l8l0%J34N4j05M1r6pL5J04j12k8J25n9p2P2k5k3
4334d8Q1j4Pm3j01J14R1m1r4L5k2JJ5Q2j04J5N2o8R9o5j22J23K9m6M6m7J26r4
4362Gm3L5J05j12m8q5J18O6MK4j25n4O8Jn1J30q8J50j60M3J2j0r3N9R0q0R5j44
4390h6k8J41m5R8o4j10M1J00j24J47j09%K0nq5O1K9j9l0O0L9l9j4k8O6J42j97
4417c9O5J1l2O4p4m0O9o3M5LO9k0j10N8J04j45P7l1L3o4j1n1n3Q9L8M0q1l3L1
4446e1M3l3J39j39J64j60O3k5N4p3L2l7P6j50K0J33m0j08P1P2J1k4l3p8k0J25
4472C2L2j57QJ46L6j28l5K7nL3m9J5j2J39j26m5J07p2k7J45o4J5q2R5o2J2N0j2
4500A6J2K5Mp2K9J3n6l0QO1L7l1J49k44P3J10r3K6p1K0oN3Rj22J04j34P8r4J35
$$ plain form
4306 -2 -17 49 168 42 -53 -60 36 -76 -18 -56 -86 -86 48 102 -3 38 -58 -65 -30 74 -38 -66 59 0 -72 0 -25 -48
4334 -48 33 19 26 -17 -118 -4 87 46 -48 -13 -35 -34 -19 63 -41 -26 26 -42 57 -8 -130 -7 22 -24 22 -25 101 7
4362 7 -36 -1 104 -8 -56 -141 -23 43 47 71 -54 -108 -40 -39 -90 40 -48 102 -58 -15 -3 -13 -106 -47 43 -37 58 -86
4390 -86 -114 27 -18 80 16 -94 -53 47 -77 70 -39 -39 -19 -24 -109 -48 -19 -38 -68 -8 31 -8 -22 -50 16 158 -39
4417 -39 26 37 5 69 -5 -45 24 -39 6 9 78 58 -52 6 110 -35 42 11 44 -20 -31 -82 -135 -46 -8 32 -49 -82 -51
4446 -51 -8 -41 98 -41 123 -37 26 1 55 -18 14 -23 53 -97 -77 56 16 -92 -21 51 62 38 5 -73 -93 32
4472 32 64 -93 -85 61 97 -31 -66 -39 -44 -11 -60 -45 -57 82 -44 -89 18 -54 -81 64 0 15 -67 28 -34 -22 28 16
4500 16 28 53 57 -15 14 27 -29 -59 -51 10 47 16 165 -79 -6 104 11 37 -34 -14 -20 33 42 -80 24 -110 -32 -126 9
4529Ipj3mO1j06Q9K5q2N4P6j03M7l6j17J64j4o8n3N4j3Pl0J14n6j1n2R6j7m7J1
4559b2J1O4l7q1%j7K23j45JO1j21L4M1m7J1j09J85N4k99J72l5O3J82j88R9p4M8
4586G4k4m5J4O9j44J26o4j4J8l4r3P2j1P4N0rj79j1J40K8l9j4Q1j75J45M9Jj06
4614b1q2P5O1p6O1o8O4p0N3N2l5l2J3p2Q8q2Q9j9p9N1L1J8r3M0pK1q7L3M1K5J22
4645A15j23K2m3%J0NO6r2N2p0NJ35l5l0L3p2K9k4J36j10p5N0QL6Oq5qO1m4J56
4675A14j16k1PJ41k01J49n4j8k7m7P7mq0K1P8o3J01j09O2K6Nq9J17m5N5q8O3r7
4703d3Q4j2J2K3j10nK4j08J28QJ6L7r7Q2j26J51pj8m8J7k6l0P1l5L0Qj23K00j02
4732AN3LO2J2k07O4O4j74J4J37n6qK9n4L8l1j6M6M9O8j22L7n2J02p4p9O8L0J01
$$ plain form
4529 9 2 -11 -15 46 -60 29 54 -28 26 102 -1 46 10 -107 57 43 -25 -78 -24 -37 -30 -60 54 -2 -13 -65 31 14 -33 -22
4559 -22 -11 53 16 -65 -65 -82 141 -4 -3 58 -63 -29 12 -35 -24 -133 52 106 -193 -21 -56 7 189 1 100 26 74
4586 74 50 5 19 88 -56 70 6 -8 10 -24 -117 -45 -56 18 68 59 -120 -131 9 37 -2 -16 65 -110 35 84 85 -21
4614 -21 -103 -28 33 -43 18 -50 14 -56 -3 49 14 -18 -5 -77 11 -71 18 -1 -80 -29 2 20 -73 -33 -40 -19 -106 -73 -32 -7 115
4645 115 -8 14 -29 -29 -19 -14 52 -40 12 -58 -53 82 47 17 50 -22 7 -17 119 9 -66 -16 -8 28 34 -51 -59 2 -42 114
4675 114 -2 -23 -16 125 -76 73 19 1 -26 -73 4 0 -80 -59 19 -44 57 -52 10 36 41 -48 69 24 79 -9 54 -43
4703 -43 41 29 41 64 -46 -51 -27 -135 -7 1 17 54 -43 39 -87 64 57 39 -9 8 -18 -48 23 -12 18 26 -97 103 1
4732 1 54 57 119 131 -76 -12 52 -122 -108 29 -27 -35 -6 -60 -22 -53 -69 -23 26 94 -28 9 -43 59 -15 -94 -26 4 105
4761A05m2o7n7K7qN7j7p3J07K9nn2O4n7j04J39Kj43J21j00R3j06L1J03m3qm2n6
4789a02J88Jr7Q0l8m3r7J96n9j0j24K21j91J25m4q9K1N3o1OJ70j64l7K46j80o0
4815h9m4K26j06q7qJ13n1K3Q8q1K2RpO2L2j05m5K6M0q8Q7m4N5p6j4L4K8q1Q6l1
4845b6O4m7M9p7MKJ5jJ04m3j20J8L3p7J84o6J2j9J06j92J1J95k26Q7J69j36o5
4872d2n6J56n5R1r8p7J24p9M8q9J44j25J5R7j06N0m1O0j3R5Qj51N1q3Q2k6j7J1
4900b6M5J2n8l4o6K09r0kR6Pj64pJ69m2l3m4M2o8O4Q2j52J8%J11m6j03J11qm9
4929b6Ql6J17o3j5R7k0r4J2n1J05l8j27R5M2J8l7O0k8N2p9J8M7n8N0p8KQ5j36
4958g8J15N1k06N3R8K7l0O5j06M0k9l5J17o4mJ07j52m3J10k7q2RJ48K5j37rP7
$$ plain form
4761 105 63 -4 -61 -34 -42 15 -2 -75 32 61 56 4 68 11 -93 46 48 -95 26 -74 19 -87 -56 47 4 -4 -46 -102
4789 -102 86 87 -10 70 32 -11 -108 88 29 19 -105 116 -75 50 6 -83 -62 -9 -70 -64 106 -58 -95 151 -29 -89
4815 -89 -133 93 -13 -100 -108 5 -46 -23 65 -16 6 15 8 70 102 -3 -48 -22 18 -70 17 -27 28 -48 -62 -28 0 -81 5 -26
4845 -26 38 -9 40 -37 -33 -31 -16 -17 87 44 -76 -58 -25 -102 82 16 28 9 115 -77 -66 129 -97 -10 159 23 -42
4872 -42 -98 58 3 94 -4 -81 43 -36 12 -77 67 -58 -43 54 -52 -2 -43 17 4 99 107 -44 7 -76 6 -20 -37 -26
4900 -26 19 31 -27 -61 -127 82 -8 -10 86 93 -71 -78 91 49 16 -28 14 -54 10 92 -60 -42 -42 69 23 -80 31 23 -26
4929 -26 -18 -54 63 0 -15 82 62 -32 -20 -71 34 -4 -131 -36 6 24 -13 47 19 71 -8 10 57 -1 49 -29 -27 58 -78
4958 -78 37 88 -118 -65 33 60 30 95 -11 29 0 -35 82 18 14 121 -31 -74 36 9 -73 -64 84 109 -28 -37 40
4985D0r8N4L5J5PK6j25J0p6k7J42m6M5O8l0opj22L5J19j41R1J00j15j01J34L5
5012F2J4r2LRoO4r5Q2p2m2J07k11K64pr0k4R1j3k4K0j6qjp2P8J8m2N0j5J5kM7
5044I2r5J30p2m8m3q5N9K2o5K45j16j13R4N8r9jj5M4J5l1m8K02j08j13P1K01k84
5071a03J46q5O1j16J34l9qN0r0kM7P3r9Q1P0j05l7J4J0L4p9K1N6q3L6K3n5P2m5
5100a8K2l6J03j03O6n1R2J2q1r0l4Q0M5R7k2r7M6k3J6k4k2j5P5%N3k04J30MLj8
5130Fo2M1n3J31j70P6PQ9M6l05L18j28p7L1J7L0M0j75J61J0R1k07O3J2k5L4jO
5158Fj08Q2k5Q0m0J25p8r3Q6M3p6J05j41j8N7N0r5P5nNo7j01K11M9j63K9oP2k6
5187C3Mm8K1k2Qk9j9N4j10M6J0J18j01K6n6P5K1J9Kp5k0J6P4j2ol9m8OQ0j22J10
$$ plain form
4985 40 -58 -4 31 46 53 79 -46 -36 -112 -139 3 -43 2 70 40 34 27 -95 -60 59 -82 9 109 -6 -107 27 62
5012 62 76 -16 -13 -4 -10 54 -41 41 -31 -73 34 -177 87 80 -10 -34 57 44 20 40 24 16 15 -57 21 39 -3 47 32 47 45 92
5044 92 -3 127 55 7 -36 -121 -62 -40 -105 140 24 -89 5 63 -36 -37 -52 -8 7 -24 -72 130 22 -91 -20 181 -103
5071 -103 43 -42 19 -97 37 -2 -10 40 -50 -52 -5 68 -31 50 120 15 -22 -8 2 36 -43 -22 34 -49 -13 10 -45 27 -18
5100 -18 4 -32 71 -32 34 -17 75 87 6 -84 -118 -38 7 104 82 -15 31 8 24 0 -22 -37 38 38 91 -113 17 21 24 6
5130 6 -56 -15 -68 63 -107 -31 -24 65 111 -194 124 -4 -81 -50 -33 -3 37 -138 23 33 124 -83 -20 -8 -33 1 0 6
5158 6 -102 -20 -45 35 -5 120 42 -51 35 78 2 107 -34 -52 5 55 -40 35 30 35 -32 -133 78 127 -36 -7 -13 59 33
5187 33 37 -11 10 -12 -4 -33 -52 2 -108 -62 -52 66 -35 -9 -65 10 31 50 52 -23 -43 -27 47 35 29 -10 -58 -52 28 -94 16
5218A6l9l2P8k4K0m6J13o6m3J29j82J21n0NQM0j22L6J40k06P4Pk6O1n6J21M8j43
5246a8p2P1o4J77q5l9l5J72j53Q7j1NJ8n6o2N4L5j7M2j2p8%j0L6K6k2Mn0Q8j38
5276a07J26j01p4O9J2j0J38m1j03L8j2K24l14M2J27p0J92j44O5lM5Kj67M3roJ47
5303A09j76O6k2m1L5QJ8m9O5J0l2N4Mj18j0Q8%L5k0nP6j45lO1n9JJ37j05NK4P
5334A8P6j86J78l4n7N8P0j11P0k0l5O9j9j67L0K4J12m0rj5p7mJ06N0m4p2P2q5
5362d2L3M6R7M1j68p5K5Q0j6r9J17j21M4K6p1OO5l1j8J48j08P5n2q4J29j15l8
5389a06J41m4p0K8Q2q3k6O9J03m1p8J32J9m3j96J78j92Q4L0NN8j6J4k7l7n7J79
5416A06j37M1K0j06O1mn6J53j73J38K2p8K0N2n9k3Q4j48J8J7Q4o8%O0k0M7q8Q5
$$ plain form
5218 16 -23 -55 23 -1 19 -27 86 20 -23 106 -76 45 -5 0 8 48 -74 -38 102 -104 -30 -23 -49 12 -44 77 125 -18
5246 -18 -90 -19 -83 94 9 -30 -65 107 -46 41 30 35 53 -3 -65 -11 24 7 49 37 -41 -41 -51 -15 11 -11 -7 -57 31 -107
5276 -107 19 -82 -156 -87 -75 -85 53 12 -91 -53 -65 159 -155 -113 14 -56 136 -8 57 54 99 101 -66 -23 -32 -38 109
5303 109 -67 -1 -23 -64 -29 -21 -3 -52 13 23 -9 45 49 -69 -79 9 9 44 24 19 95 -50 -53 8 -51 -50 87 -18 -13 11 18
5334 18 94 -92 86 52 -5 53 123 12 82 62 27 96 77 -90 -60 -36 76 36 27 12 -65 -69 37 87 43 -29 43 -42
5362 -42 -9 37 134 175 7 -68 -43 37 21 -78 39 -82 -38 -12 -83 -77 -12 -43 -61 87 -21 54 2 -82 47 -68 -106
5389 -106 35 -9 -79 -51 31 -52 -78 -9 94 53 -25 107 126 83 -113 65 -127 -43 -13 -8 50 34 48 21 -16 -73 106
5416 106 -31 10 30 -76 -15 -19 -75 78 -95 43 65 -13 7 59 0 -23 61 -87 -69 -52 32 -36 -36 24 4 51 -37 48
5444D8r6J17j01J13j16R7K5r8M8m0J18j10j7Q7j18j5k5P6M7o3N3L4o8k6N4Ll0
5471cQ9j62J27j2j43M4J16l8N8rj22M9m5Q4N0p4m7o0J55j27m4J19Qp7N5Q2p7J13
5499A09p9oo4Q8j03L0R0m2J1n9j8J12oQr0J1M3Q6q9j8l2L9r3J6K0j6Q1ko4J19
5529H2p4l7J6ql9N8J35o4j35J4o9K10n7o6R9rN2j10Q5j96K12j03k6j3O0p0J85
5556A32k10Q7J2K3l7m6L2J3n7M2N8k9j9jq4lJ52j47m3J15l4L3Rm1k2J2J49m3L
5585E6K3j21J15j03P9j22J35o4J10r4Rj14O1O4JJ10j18q1k3J18j15R0n0l2QQ9
5611C1j15k5Q2P2Oo6l0J23j53K2P8K5j50O0j25J07K3J2N6p0J6lM3m2m4M8r3J38
5639B6j9J04p0r7Q0o2M7r0L5pJ46j41O9q1N0j8L2j9j32K64j09R2j10l8J16j17
$$ plain form
5444 48 -48 69 -32 81 -35 62 87 -11 37 -3 115 5 -12 75 -43 -58 -83 -7 40 -23 30 64 -4 -30 24 27 -3
5471 -3 86 -76 51 39 -104 -60 56 18 76 67 -55 -6 -51 33 83 9 -38 -98 57 -70 -114 5 13 -64 -9 73 -4 109
5499 109 30 24 -40 48 -55 -25 65 23 34 -25 -43 69 63 71 -19 -8 35 121 32 14 -18 21 -72 -56 -36 -52 29 27 -37 82
5529 82 8 -29 -13 -21 -60 -2 133 69 -66 -52 -121 89 32 -34 65 56 108 -2 83 -113 99 -4 -30 -43 17 -53 132
5556 132 -78 9 21 44 7 -39 -7 6 -51 -9 49 20 1 0 -84 -87 65 -82 -125 -10 -44 -11 -2 -43 -65 -53 96 53 56
5585 56 79 -42 73 -30 49 -73 62 -2 108 14 23 -91 -30 34 35 145 27 -54 -77 41 -74 16 -34 -66 -58 31
5611 31 -84 -109 -27 45 51 -15 -45 78 -75 -53 25 50 -100 -40 -165 -58 -35 -23 33 -37 -21 -24 19 -23 -67 -19 -112 26
5639 26 7 111 41 -56 24 -38 9 -81 -46 -53 93 -48 21 -60 -10 -28 4 -15 -147 117 8 100 -10 -48 68 -49
5665d9L1m0K0N3m7J8M2l5j1k9O3J35j09p4L7J17l2j16N3j42J63J2j12Oq6Q7k9
5692g4lrJ87n9k2q2%Q6lj04Q7r4J62m7N7j5r1J76k28J37L1p0l5K0K6l0O2m4j47
5721a26j7J12%lpML6Lk3J55k09Q0J6o6Q9lN3j58L0QK7J5k0Q8l1l7PR1j48N2j28
5752a10M8P7Rn7R5n9p0M3J05n4l6K6Pn0l1J06j25J22P3r9n9O6Oq0J3l2M3K7j6
5781a2l0m8J73j15p2K12l7j19L4j01J07N7l6O8j55J20O4j07J44j06l0L4mN9k41
5806a41J72o0K4n4k9J09p2N2l1P5n0P0p5J0J9P8j72L5pm5J65%q1K5L6n9k0L7o1
5835e0J26l6r6Q6p8P7m5L3k1j30L1J93l7k0r0O1Qj07L4N4K7R8j78pk8J39m4N0
5863E0j33K4P9K3j39J42q7r7J16J4L8rj1j2m3O6n4R5l4m4KN7q0J09p3j17N4P7
$$ plain form
5665 -49 -18 -58 -38 15 -32 -14 28 -7 -18 -47 16 151 42 -32 5 122 90 -26 27 -115 48 60 -52 -46 -132 -45 -74
5692 -74 -77 -86 101 42 20 -62 -62 24 21 -83 4 -90 72 25 82 67 -24 152 -76 61 92 22 -13 7 33 3 65 21 -126
5721 -126 -143 -31 -31 -34 -41 -37 -1 2 -21 134 -75 5 21 -45 44 41 94 -64 -34 -26 1 16 -4 84 53 16 23 114 -34 18 -110
5752 -110 -62 15 24 -33 62 3 -67 -24 81 27 -9 17 24 -26 -57 49 -76 46 119 20 -39 27 33 -47 -34 -66 -23 4 -12
5781 -12 -42 -90 83 -32 -104 108 71 -48 -14 -115 -8 49 13 81 -74 46 110 3 147 41 11 45 41 100 -141
5806 -141 31 -29 -5 -59 -88 21 -51 1 -30 45 -5 65 -10 0 19 97 -75 -40 -47 -92 73 73 -8 17 53 -6 -26 11 -50
5835 -50 76 40 -56 30 -48 29 -16 17 -4 -134 -103 90 53 33 -57 4 12 -95 -61 -7 20 118 -60 -67 -95 44 0 50
5863 50 -83 -59 20 43 -96 46 -41 -138 -22 -8 30 21 10 -2 -45 21 -33 62 28 -16 -14 43 -37 72 -1 -118 -64 13
5891A3j2j8jJ8K7p2n5J24p3J03m5l4N0j38J19n3J77j00j02J73r7q4J52j17J33
5916H8r3o6P3%j58J82j7k3O3p3Q2p1l9P8J5K2j04L0K1n2k9mR1J4Lj07J30K2Mr6
5946a4J4K3l6m3R5j40M4J58q2j8l5N2j2Q4j75J47k9q2R1r1J09j49J41N4p7j0m0
5973b1O4j04J44j35J6M3l9MJ21m2q8N3j17J59pl2qq0P2P1p2m3o1O3L9M1N8j68
6001f9NJ75q3j00PJ3kQ2l9k6J34K9r8q6Q7M4p0L6L0l2QK5q3l1JP6p0k7J24j78
6031a18J4Q9n3k2M1LM3J7J15j87L7R8j94k0J48J17j35J22j93R4R0n1j05pn6M4
6057f9R2M4j33J43qq6j11Q9J6J15l7j9p0RK7P5l4k32J76o0K0R2q4N3j26J08l9
6084d9Q4Lk7n9J08j9m5m4R2J00j87k6L1l2J27M4l6m5O7j2j16o5R3K8J6M0p5R6
$$ plain form
5891 13 1 -17 -18 0 27 -45 -100 24 -49 54 9 -25 25 -113 6 -47 130 30 -72 101 4 -80 72 -45 88
5916 88 -5 -71 2 2 -156 26 9 -14 49 -24 58 -13 -52 26 41 63 -41 -11 10 -42 -71 -75 16 30 33 -74 56 78 82 -14
5946 -14 0 23 -13 -56 39 -101 -57 101 19 1 -34 18 6 90 -85 62 33 -49 42 -49 60 -89 52 106 29 19 -21
5973 -21 43 -61 83 -52 -36 7 -32 -28 93 51 -37 16 -101 58 51 19 11 -69 3 74 2 -41 -102 -39 0 41 99 -69
6001 -69 -64 111 28 -72 -65 -52 -54 28 -11 -37 97 126 28 -58 29 73 3 39 69 37 45 70 -13 -44 -43 33 -37 -64 60 -118
6031 -118 -104 -15 -68 -90 -49 -46 -3 14 129 -58 -21 77 -117 -137 11 128 -7 115 -78 16 106 55 -50 -57 -113 -69
6057 -69 23 67 -66 77 69 -17 -128 -39 -23 92 55 36 -34 -25 2 77 43 -189 -13 -73 -53 39 -45 8 -118 -10 -49
6084 -49 35 38 11 -48 60 41 -4 -48 44 144 -43 -69 -38 -70 57 101 65 20 87 75 -41 -106 -13 15 31 71 -4 92
6112I2j19O8k08J23LQR4n1LMn8O6q8O4k7P3Pl0Jn0P8p3R7p2J90k40PP3jj1j03
6143h0J02O3q6mj2K4N5j4j17o8J03O4m9Q8r4O0j67J15J28j10n7O1rj24J07P7o6
6170a0K9n7K2j03J73p5J4o1J02n2K6L0q8P0l2mj7J23j32L4k6ro3J68nn2q2R5J7
6199C5j72K39j28N2n9j8O0j9n6J24q2mJ15j2m7l3l4J04rr2N5J8J2j30K1J3R1o8
6227b4m0Q3m9j01J40r5J05j04J7R1O8j63M7P5k4n3oo1N2l1J2j7J04Q8j50O0p3
6254d9J12q8n6L0L5N0Q4j48n9J58j44O8L7k7P9m8j38P6KPM2nl0M8p5J30j33pJ57
6283A08j44n5O5j9K05j50j08J09rJ38r6k7L4p8m8PP1K0mo1n8J06N4Q3j24j4J05
6310A10j9j35N1O0n8l7m0J72j06n1M9K3O5pj21JJ00j5n0p8N5P6l8o1J57n8m6j7
$$ plain form
6112 92 -27 41 -167 -44 -41 -33 61 10 13 17 -41 25 -63 1 -26 47 54 24 25 -25 53 -20 77 5 195 -45 -38 35 34 23 -80
6143 -80 22 85 -1 -5 -17 7 62 48 -69 -137 -34 30 -19 69 -25 35 -132 -17 111 1 -56 5 -4 -128 -21 56 -10
6170 -10 19 -38 -16 -119 54 -21 -7 -68 34 -18 8 38 -50 20 -12 -16 -33 90 -42 -8 -34 -43 -106 62 57 5 -77 18 35
6199 35 -137 102 -26 26 -33 -51 9 -10 -66 58 -24 -28 87 75 28 -5 -39 65 56 -36 19 37 49 -81 -60 -47 44 -24
6227 -24 -64 19 -30 -131 9 -86 19 -85 -68 23 91 -72 -25 50 26 -27 -33 -94 -42 -73 -61 -78 26 114 -36 24 -49
6254 -49 63 -25 -81 -51 -16 34 118 -30 -89 69 -75 -7 30 3 82 34 -104 -28 -26 -19 23 18 -12 36 -39 91 -42 -49 108
6283 108 -36 -91 -26 -45 160 10 -98 11 2 140 44 17 51 -27 -75 -68 3 23 19 -42 -100 6 60 143 19 5 110
6310 110 91 -44 7 67 9 -28 -68 104 -2 -53 -4 19 84 77 -44 -43 57 42 -8 -86 -31 45 7 -54 103 45 -1 -18
6338a8k1N3J5k4l5J5O3%J4n0qr3Q0M1j05J64j21N2j84J75j8j9k0j1J02Jr3J25
6366H0j11J9po4J21j3l6j5L3k9Q8j35O8n0Q4l5l2m2P9j08J71r1k9J18o1p5J01
6393B9L0j23J2O7J8q0Q9r8J5Q3o4J25r5l9K3L0J52j48k7l6L1l3N7o3N2N8j07L1
6421a1J4J7K6p1J67j37K0jj15R7K4p2J11j14M5n7J76j35oo7J7J42j12NK2P7j32
6448g0P6K1N9r5q1K4J32N4j51j1O2l6N5j65J46n5J8J35o5l4k9N7j19j2J87r1j24
6475a12J92r5Q9J8j42J13o1n4O2n0J46r1Q7j28K7KmJ17n4j8oj63J29N2p2l9M4
6502a1N4j06r%J42m5j8j2Pj3l1J6n0P5Rj4M3L5k06R9K0J7m5j35K16k37K30m4L5
6531B2j10K04j43K4pj6L3n8M4r7J54l2m3Q6r3K4N0o6P0mm4kk9Q9n4J4O1m9q8J7
$$ plain form
6338 -18 -39 14 29 5 -30 -15 48 48 62 12 4 -89 -9 32 -73 91 -30 22 -162 13 -5 -24 -44 -55 47 48 -45 80
6366 80 -31 -12 -19 -83 38 25 -11 -26 7 -22 66 -69 -1 -51 33 -2 -34 -76 3 -105 66 -25 -54 64 3 -72 29
6393 29 59 -64 -52 15 33 -47 42 -56 -41 42 -22 103 8 -31 -8 22 174 26 -1 -37 -6 -39 18 -45 7 65 -42 -11
6421 -11 3 20 46 -25 142 5 25 24 -91 6 30 -42 69 -45 0 -57 119 -16 -22 -89 -72 70 -42 -37 -15 62 -70
6448 -70 6 27 86 -9 -90 -66 66 120 -31 -42 20 -16 39 -126 20 -35 -17 118 53 19 -10 47 -72 -84 103 12 -112
6475 -112 80 -15 74 92 -50 63 2 -52 10 -40 106 15 102 -26 1 3 -1 116 62 44 38 -125 4 56 -16 -55 -11
6502 -11 43 -63 -72 -72 70 25 7 -5 2 -11 -42 -26 -76 -1 8 -6 37 72 -134 -35 -15 2 -43 -178 38 -199 31 -13 22
6531 22 -88 116 -27 -3 -10 -26 7 -51 -7 -104 50 18 -25 61 -32 -8 42 -24 46 42 -2 -4 -33 56 2 16 77 28 -60 -43
6561d3J32q2o9Q0n5m0R6o4p3P7J26j44O3P6k5p6K2J5L1n6Q2m2j55J58j3N3q5P3
6589F2n8O4k5o4O5r4O0n1K0lJ07j24j89L00j00Q8j6K7j39N3N9k0o4K6O6Qj19K34
6617A73j79M0q3N4M7q0J10o5j16J04n0K25k79Q9M9l1o0j2N3J5J33j25o6q2J53
6642A7O4jj23J63q0q9j2lL9m9M8J7o2m8J11L0L0J0o8L6P6j45J18r2J21j36L7L4
6670D3r4Q1j66J33R8m7j43J09k4P4n5k8j8L3m4R3j07P4o7O8R7j16K5o6j13K04
6696D4J9j5j1r7J6OL8J41j85n1J8Q6L5n9O0r2M4K5J5l6m1N5m1M9k6O1J9M4o5L2
6726H8o8qM0n8j1j5Mj9p6J34n2R1kp4M3N3l0M9p4j15P9R1o6j04J49o3Q7j2m1o5
6756d5K07j98J60o9j23J57o3Qj16J76j08J20j03j9N4n5m0J07j00nJ30j30K2n9
$$ plain form
6561 -43 89 7 -62 18 -37 -77 19 -45 -118 -41 85 -59 4 80 55 -21 1 16 47 -9 73 31 -124 34 21 74 -11 62
6589 62 4 68 43 -21 44 -50 10 -41 -21 -24 83 -41 -230 70 -30 58 42 69 -70 -17 42 22 -42 -16 50 58 -61 173
6617 173 -6 34 -49 5 52 -28 82 17 -99 5 -45 180 -99 -10 39 8 -52 -64 -11 4 137 12 -54 -136 17
6642 17 81 80 -43 120 40 -49 -61 -64 -25 -74 -26 -9 -71 -119 -8 22 52 62 -6 30 106 -39 79 -13 108 -28 9 43
6670 43 -51 30 -136 -3 95 48 -95 14 -10 64 9 -19 -37 -4 -48 45 -62 12 -55 13 110 -6 19 -47 -160 44
6696 44 63 48 37 -60 -44 -38 0 141 -44 -95 -77 9 44 -15 45 -47 -3 22 37 1 -40 15 -26 23 -3 58 77 121 56 88
6726 88 20 12 52 -6 -17 -32 -28 -47 -123 11 -41 50 48 -26 17 70 40 89 15 -100 -21 70 4 -100 49 -14 73 61 20 -45
6756 -45 162 -36 124 55 -68 89 26 34 -82 94 -14 106 3 -16 38 -17 -57 50 -50 -55 75 -55 -33 -92
6780i2J63m0m4j18J26J0J1j6N2k8N2J9j21j0J08m7k2m2NRMN9m1k8L1M9k3m3j8
6809c5O5j31M7N2J19l11J91Q3j11%J02p5l8R3j16J19j5M1q1N0p8j6m0JJ53q2M0
6836B7P0m8n1K1m3p7J36l5Q0q1p9P1J04j90J30n6J%j0J47j23l6O1kj34J60j05
6863f2M0k5K3O4r5J7K0q7M6R6j09N7OK8p0L7k6J91k25J31R8j67J7J0l0N5j9M0
6891F1j09m3K40j22Pl6j2R7l6ko6m7Q0l7R9j9j14j3J36r2J4l9R3p2J17j47R1p3
6919d4Ml3J33r5N7p6J40o1P4p1j26J30r3Q7o6P8l2Qk7j2L9K6j0Rm3j01M6R3P1
6948A05o2L6j54J08j26lJ74m8l6n7J21j50J5K6M0J26j58O4j1l6P3K5j1j07PK1
$$ plain form
6780 -92 71 31 -13 -131 -5 5 16 0 52 24 76 95 -26 -36 72 25 3 -39 -34 -25 -21 38 -3 -31 0 49 26 -17 -35
6809 -35 30 -101 -54 -2 117 -194 -3 80 -31 -31 71 -4 -42 51 -65 54 39 80 -1 49 -29 -45 -85 -84 69 -13 27
6836 27 97 49 -2 19 -24 -101 35 0 80 -1 -80 -9 95 -95 35 -21 -20 -20 -30 117 -6 -42 19 17 -117 43 -62
6863 -62 -22 -47 -24 40 -55 -38 -18 -105 -59 37 -72 -15 -9 19 -51 -14 -40 151 -74 57 155 -12 5 15 -15 40 21 61
6891 61 -48 -91 149 27 34 -2 -14 83 47 45 -21 -68 12 -25 74 55 -59 -72 64 -28 -14 -53 40 -32 85 -62 29 -44
6919 -44 -40 -73 60 -35 22 -54 86 25 99 28 -98 32 -61 26 -40 38 6 14 -13 -25 14 40 30 39 -4 -105 -59 34 105
6948 105 43 79 -75 33 -93 -96 78 30 -6 -63 58 -92 -77 -51 -11 115 -43 21 10 -26 47 72 61 -46 -39 -18
$$ [...]
8191a24
##END NTUPLES=NMR FID
##END=
