##TITLE=1H_DE-80H_X3
 200.13MHz, d2o
 8 sc
 
 19ns.26.2.2025
##JCAMPDX= 6.0         $$ Bruker NMR JCAMP-DX V2.0
##DATA TYPE= NMR FID
##DATA CLASS= NTUPLES
##ORIGIN= UXNMR, Bruker Analytische Messtechnik GmbH
##OWNER= pz
$$ XWIN-NMR		Version 3.5
$$ Mon Jul 14 14:47:48 2025 Russian Standard Time (UT+4h)  Yarkov@DPX200
##.OBSERVE FREQUENCY= 200.1313
##.OBSERVE NUCLEUS= ^1H
##.DELAY= (6, 6)
##.ACQUISITION MODE= SIMULTANEOUS
##.ACQUISITION SCHEME= undefined
##.AVERAGES= 8
##.DIGITISER RES= 18
##SPECTROMETER/DATA SYSTEM= spect
##.PULSE SEQUENCE= zg30
##.SOLVENT NAME= CDCl3
##.SHIFT REFERENCE= (INTERNAL, CDCl3, 0, 14.3821)
##AUDIT TRAIL= $$ (NUMBER, WHEN, WHO, WHERE, WHAT)
$$ ##TITLE= Audit trail, XWIN-NMR		Version 3.5
$$ ##JCAMPDX= 5.01
$$ ##ORIGIN= Bruker BioSpin GmbH
$$ ##OWNER= Yarkov
$$ C:/Bruker/XWIN-NMR/data/yarkov2/nmr/H-C/1/audita.txt
$$ ##AUDIT TRAIL=  $$ (NUMBER, WHEN, WHO, WHERE, WHAT)
(   1,<2025-07-14 14:47:00.40 +0400>,<Yarkov>,<DPX200>,
      <created by zg, POWCHK disabled, PULCHK disabled
       configuration hash MD5:
       00 E9 B6 7A A2 85 ED C7 34 08 36 98 17 FE 4E 26
       data hash MD5: 16K
       DC 1A B5 A8 CF C9 53 84 D2 F4 7F A8 52 9A D3 02>)
$$ ##END=
$$ 
$$ hash MD5
$$ 35 7A 25 93 B9 1C AE AE 70 A2 86 0B 69 3F 52 75
##$RELAX= 
##$RELAX= 
##$RELAX= 
##$RELAX= 
##$RELAX= 
##$RELAX= 
$$ Bruker specific parameters
$$ --------------------------
##$DU= <C:/Bruker/XWIN-NMR>
##$EXPNO= 1
##$NAME= <H-C>
##$PROCNO= 1
##$TYPE= <nmr>
##$USER= <yarkov2>
##$AMP= (0..31)
100 100 100 100 100 100 100 100 100 100 100 100 100 100 100 100 100 100 
100 100 100 100 100 100 100 100 100 100 100 100 100 100 
##$AQSEQ= 0
##$AQ_mod= 1
##$AUNM= <au_zg>
##$AUTOPOS= <>
##$BF1= 200.13
##$BF2= 200.13
##$BF3= 200.13
##$BF4= 200.13
##$BF5= 200.13
##$BF6= 200.13
##$BF7= 200.13
##$BF8= 200.13
##$BYTORDA= 1
##$CFDGTYP= 0
##$CFRGTYP= 5
##$CHEMSTR= <none>
##$CNST= (0..31)
1 1 145 1 1 1 1 1 1 1 1 1 1 1 1 1 1 1 1 1 1 1 1 1 1 1 1 1 1 1 1 1 
##$CPDPRG= <>
##$CPDPRG1= <>
##$CPDPRG2= <>
##$CPDPRG3= <>
##$CPDPRG4= <mlev>
##$CPDPRG5= <mlev>
##$CPDPRG6= <mlev>
##$CPDPRG7= <mlev>
##$CPDPRG8= <mlev>
##$CPDPRGB= <>
##$CPDPRGT= <>
##$D= (0..31)
0 0.7 0 0 0 0 0 0 0 0 0 0.03 0 0 0 0 0 0 0 0 0 0 0 0 0 0 0 0 0 0 0 0 
##$DATE= 1752490019
##$DBL= (0..7)
120 120 120 120 120 120 120 120 
##$DBP= (0..7)
150 150 150 150 150 150 150 150 
##$DBP07= 0
##$DBPNAM0= <>
##$DBPNAM1= <>
##$DBPNAM2= <>
##$DBPNAM3= <>
##$DBPNAM4= <>
##$DBPNAM5= <>
##$DBPNAM6= <>
##$DBPNAM7= <>
##$DBPOAL= (0..7)
0.5 0.5 0.5 0.5 0.5 0.5 0.5 0.5 
##$DBPOFFS= (0..7)
0 0 0 0 0 0 0 0 
##$DE= 6
##$DECBNUC= <off>
##$DECIM= 32
##$DECNUC= <off>
##$DECSTAT= 4
##$DIGMOD= 1
##$DIGTYP= 9
##$DL= (0..7)
0 120 120 120 120 120 120 120 
##$DP= (0..7)
150 150 150 150 150 150 150 150 
##$DP07= 0
##$DPNAME0= <>
##$DPNAME1= <>
##$DPNAME2= <>
##$DPNAME3= <>
##$DPNAME4= <>
##$DPNAME5= <>
##$DPNAME6= <>
##$DPNAME7= <>
##$DPOAL= (0..7)
0.5 0.5 0.5 0.5 0.5 0.5 0.5 0.5 
##$DPOFFS= (0..7)
0 0 0 0 0 0 0 0 
##$DQDMODE= 0
##$DR= 18
##$DS= 0
$$ [...]
##$SUBNAM2= <"">
##$SUBNAM3= <"">
##$SUBNAM4= <"">
##$SUBNAM5= <"">
##$SUBNAM6= <"">
##$SUBNAM7= <"">
##$SUBNAM8= <"">
##$SUBNAM9= <"">
##$SW= 18.0517328524113
##$SWIBOX= (0..15)
0 0 2 0 0 0 0 0 0 0 0 0 0 0 0 0 
##$SW_h= 3612.71676300578
##$TD= 16384
##$TD0= 1
##$TE= 0
##$TE2= 300
##$TE3= 300
##$TEG= 300
##$TL= (0..7)
0 120 120 120 120 120 120 120 
##$TP= (0..7)
150 150 150 150 150 150 150 150 
##$TP07= 0
##$TPNAME0= <>
##$TPNAME1= <>
##$TPNAME2= <>
##$TPNAME3= <>
##$TPNAME4= <>
##$TPNAME5= <>
##$TPNAME6= <>
##$TPNAME7= <>
##$TPOAL= (0..7)
0.5 0.5 0.5 0.5 0.5 0.5 0.5 0.5 
##$TPOFFS= (0..7)
0 0 0 0 0 0 0 0 
##$TUNHIN= 0
##$TUNHOUT= 0
##$TUNXOUT= 0
##$USERA1= <user>
##$USERA2= <user>
##$USERA3= <user>
##$USERA4= <user>
##$USERA5= <user>
##$V9= 5
##$VALIST= <valist>
##$VCLIST= <CCCCCCCCCCCCCCC>
##$VD= 0
##$VDLIST= <DDDDDDDDDDDDDDD>
##$VPLIST= <PPPPPPPPPPPPPPP>
##$VTLIST= <TTTTTTTTTTTTTTT>
##$WBST= 1024
##$WBSW= 4
##$XGAIN= (0..3)
0 0 0 0 
##$XL= 0
##$YL= 0
##$YMAX_a= 83264
##$YMIN_a= -67969
##$ZGOPTNS= <>
##$ZL1= 120
##$ZL2= 120
##$ZL3= 120
##$ZL4= 120
##$ABSF1= 10
##$ABSF2= 0
##$ABSG= 5
##$ABSL= 3
##$ALPHA= 0
##$AQORDER= 0
##$ASSFAC= 0
##$ASSFACI= 0
##$ASSFACX= 0
##$ASSWID= 0
##$AUNMP= <proc_1d>
##$AZFE= 0.1
##$AZFW= 0.1
##$BCFW= 1
##$BC_mod= 2
##$BYTORDP= 1
##$COROFFS= 0
##$CY= 83.5205535888672
##$DATMOD= 1
##$DC= 2
##$DFILT= <>
##$DTYPP= 0
##$F1P= 10.8118882576601
##$F2P= -7.23987719738617
##$FCOR= 0.5
##$FTSIZE= 0
##$FT_mod= 4
##$GAMMA= 1
##$GB= 0.15
##$INTBC= 1
##$INTSCL= 1
##$ISEN= 128
##$LB= 0.25
##$LEV0= 0
##$LPBIN= 0
##$MAXI= 10000
##$MC2= 0
##$MEAN= 0
##$ME_mod= 0
##$MI= 1.114404
##$NCOEF= 0
##$NC_proc= 0
##$NLEV= 6
##$NOISF1= 3.799351
##$NOISF2= 2.8
##$NSP= 1
##$NTH_PI= 0
##$NZP= 0
##$OFFSET= 14.38212
##$PC= 1
##$PHC0= -1358.325
##$PHC1= 12.79091
##$PH_mod= 1
##$PKNL= yes
##$PPARMOD= 0
##$PSCAL= 0
##$PSIGN= 0
##$REVERSE= no
##$SF= 200.129724274929
##$SI= 16384
##$SIGF1= 3
##$SIGF2= 2
##$SINO= 400
##$SIOLD= 16384
##$SREGLST= <1H.CDCl3>
##$SSB= 0
##$STSI= 0
##$STSR= 0
##$SW_p= 3205.1282051282
##$SYMM= 0
##$S_DEV= 0
##$TDeff= 0
##$TDoff= 0
##$TI= <>
##$TILT= no
##$TM1= 0
##$TM2= 0
##$TOPLEV= 0
##$USERP1= <user>
##$USERP2= <user>
##$USERP3= <user>
##$USERP4= <user>
##$USERP5= <user>
##$WDW= 1
##$XDIM= 8192
##$YMAX_p= 0
##$YMIN_p= 0
$$ End of Bruker specific parameters
$$ ---------------------------------
##NTUPLES= NMR FID
##VAR_NAME=  TIME,          FID/REAL,        FID/IMAG
##SYMBOL=    X,             R,               I
##VAR_TYPE=  INDEPENDENT,   DEPENDENT,       DEPENDENT
##VAR_FORM=  AFFN,          ASDF,            ASDF
##VAR_DIM=   8192,          8192,            8192
##UNITS=     SECONDS,       ARBITRARY UNITS, ARBITRARY UNITS
##FACTOR=    0.0002768,     1,               1
##FIRST=     0,             0,               0
##LAST=      2.2672688,     0,               0
##MIN=       0,             -67969,          0
##MAX=       2.2672688,     83264,           0
$$ Real data points
##PAGE= N=1
##DATA TABLE= (X++(R..R)), XYDATA
$$ [...]
$$ plain form
748 -304 -738 -90 212 -263 48 403 321 24 564 440 -2 196 210 -254 -54 59 -381 -359 -35 -352 -416 -162
770 -162 -132 -246 -137 211 191 365 257 279 309 371 105 -71 -11 51 -118 -315 -391 -425 -8 -207 -373 69 267
793 267 -139 -77 294 304 41 318 386 -162 123 351 -184 -156 183 78 -211 -141 -207 -195 34 -42 -256 -37 366
816 366 120 -203 296 440 -17 123 411 67 -33 52 -154 -186 34 66 -153 -394 47 75 -132 -12 91 -17
838 -17 71 -69 -34 3 -158 2 97 -167 10 141 -32 -150 0 112 -102 -259 0 87 -62 -40 -121 -162 132
861 132 39 -228 46 253 -28 -121 140 92 -126 -90 147 41 89 98 12 -70 205 36 -175 -61 12 -162 -68 -53
885 -53 -74 -105 48 76 162 -121 211 162 76 -5 49 122 -40 -182 -55 11 -146 -133 -154 -66 -35 -47 -201 54 116 -54
911 -54 -125 72 305 76 -192 206 165 -68 -13 107 30 -14 135 -175 -211 -128 -32 -108 -230 12 -7 -74 197 133 57
$$ packed form
748c04m34O48L02m75L11L55q2k97N40j24m42J98J4m64K00J13m40K2L24l17o4K54
770a62L0j14J09L48k0J74j08K2L0O2k66j76O0O2j69j97p6l4M17j99j66M42J98
793B67m06O2L71J0k63K77O8n48K85K28n35K8L39j05k89P0o6J2K29p6k14K19M03
816C66k46l23M99J44m57J40K88l44j00Q5k06l2K20L2k19k41M41K8k07J20J03j08
838a7Q8j40L5L7j61J60R5k64J77J31j73j18J50J12k14j57K59Q7j49K2q1m1K94
861A32r3k67K74K07k81r3K61m8k18L6K37j06M8Rq6q2K75j69k11J14P3j74R4J5
885e3k1l1J53K8Q6k83L32m9q6q1N4P3j62j42J27O6j57J3k1Q8L1j2j54K55O2j70
911e4p1J97K33k29k68L98m1k33N5J20p7m4J49l10l6Q3R6p6j22K42j9o7K71o4p6
$$ plain form
936 57 122 132 -2 52 -49 91 -1 -99 35 43 -169 -163 -212 -52 11 -157 -88 0 -58 5 -86 -59 326 211 -31 86
962 86 217 62 -27 -83 -12 -13 -120 -40 -163 -254 31 -103 -166 185 229 61 95 142 29 160 162 88 27 66 40 -71
988 -71 -140 -31 131 -71 -73 -118 -170 -258 -229 36 65 149 138 -20 80 248 151 16 71 168 88 -149 -209 -59 -152 -136
1014 -136 97 -107 -45 -12 52 -60 0 95 41 57 18 61 -2 -28 35 59 72 104 36 -181 -215 -153 -204 -249 -75 47 -134
1041 -134 -124 101 58 82 388 158 148 138 40 -35 -26 38 69 -174 -15 44 -171 -122 -63 -72 42 19 21 -82 -39 104 28
1068 28 129 161 61 -32 29 -137 -11 13 57 -165 -123 -11 7 -58 22 131 100 83 45 87 10 -65 65 -100 4
1093 4 49 -15 -128 22 -85 18 -54 -216 156 -59 -36 -108 27 -2 -78 164 -53 -47 -65 127 -157 -57 115 76
1117 76 -30 -23 -1 -88 133 18 10 44 181 -91 -31 58 116 -179 -29 46 -96 -85 -74 39 -47 142 53 78 131 -22
$$ packed form
936E7O5J0j34N4j01J40r2r8J34Qk12Om9J60O3j68O9Q8n8O3r1K7L85j15k42J17
962H6J31j55q9n6P1jj07Q0j23r1K85j34o3L51M4j68L4M7j13J31Kp4o1L9k6j11
988g1o9J09J62k02km5n2q8K9K65K9Q4j1j58J00J68r7j35N5R7q0k37o0J50r3J6
1014a36K33k04O2L3O4j12O0R5n4J6l9M3o3k6O3K4J3L2o8k17l4O2n1m5J74J22j81
1041a34J0K25m3K4L06k30j0j0r8p5RO4L1k43J59N9k15M9N9rJ14k3Kj03M3J43p6
1068B8J01L2j00r3O1j66J26K4M4k22M2J12J8o5Q0J09l1j7l8M2p7p5J30j65J04
1093DM5o4j13J50j07J03p2j62L72k15K3p2J35k9p6K42k17Oj8J92k84J00J72l9
1117G6j06PK2q7K21j15qL4J37k72O0Q9N8k95J50P5j42J1J1J13q6J89q9K5N3j53
$$ plain form
1143 -22 99 97 64 42 70 -16 -37 -11 -19 -128 -159 -195 -76 34 3 -26 -66 150 41 76 25 161 136 -109 -13 54 -22
1170 -22 -25 -105 -113 -116 11 -148 -142 2 5 -36 55 111 138 135 46 132 81 162 46 -130 -103 -9 -171 -149 -115 -90 41 -172 -116
1199 -116 -73 20 104 44 26 182 177 30 42 0 8 -51 -38 -126 -102 -61 -29 -186 -33 51 26 -152 19 49 -6 -14 -6 78 145
1228 145 119 -52 -16 21 55 -65 -46 -158 -95 -123 -143 -100 -1 17 76 -10 115 9 129 14 90 39 -24 -83 -122 -67
1254 -67 69 89 -19 -109 -101 -18 24 -46 108 26 46 21 30 94 72 104 39 24 2 17 29 -111 8 29 -180 22 -8 -90
1282 -90 17 -62 70 -34 43 95 -110 -67 -53 44 -110 -83 112 -33 -104 18 37 96 3 -59 -37 -67 87 -22 -11
1307 -11 41 24 27 -8 59 -7 108 -24 -56 22 -48 -102 12 3 -21 -41 -59 73 122 -43 143 68 -51 -11 -21 -67 -100 -167
1335 -167 -23 5 -42 96 -53 42 91 102 76 28 49 -26 -35 12 -66 -90 -11 -117 -17 -241 46 -43 43 -12 29 58 75
$$ packed form
1143b2J21kl3k2K8q6k1K6qj09l1l6J19J10l1k9m0K16j09L5n1J36k5k45R6O7p6
1170b2lq0qlJ27j59OJ44Lm1R1N6K7lq9Q6n1Q1j16j76K7R4j62K2L4K5J31k13N6
1199a16M3R3Q4o0j8J56nj47J2m2Qn9J3q8K4M1L2j57J53Q4k5j78J71L0n5qQQ4O7
1228A45k6j71L6L7L4j20J9j12O3k8k0M3R9J8N9q6J25j06J20j15P6n1o3n9l9N5
1254f7J36K0j08r0QQ3M2p0J54q2K0k5RO4k2L2o5j5k2J5J2j40J19K1k09K02l0q2
1282i0J07p9J32j04P7N2k05M3J4R7j54K7J95j45p1J22J9N9r3o2K2l0J54j09J1
1307a1N2j7Ll5O7o6J15j32l2P8p0n4J14rk4k0j8J32M9j65J86p5j19M0j0m6l3o7
1335a67J44K8m7J38j49R5M9J1k6m8K1p5rM7p8k4P9j06J00k24K87q9Q6n5M1K9J7
$$ plain form
1362 75 -1 97 -16 24 96 49 6 14 -66 -23 -83 -94 -70 27 -101 -88 -77 55 169 24 61 -1 135 35 157 117 128
1389 128 -52 70 -69 -11 -18 -133 -36 -91 -41 4 -3 -20 80 82 0 16 89 -11 45 157 83 113 27 -33 -30 54 -57 34
1417 34 43 -26 -4 49 131 -27 -13 62 162 -42 67 81 130 29 66 -90 62 56 60 -8 -21 -11 -42 -90 -47 24 -14 -72
1445 -72 58 -39 9 19 144 110 -120 71 -5 -59 -76 35 39 25 83 -83 -2 -129 -54 40 22 -80 22 -24 10 17 25
1472 25 31 -19 -2 -34 -86 -55 0 -46 -63 -38 141 76 -23 -94 87 -102 -39 2 23 -137 122 74 57 -12 -50 77 71 -22
1500 -22 11 -16 -87 24 33 125 -21 88 31 -14 46 112 40 33 38 34 35 50 65 49 46 -20 -68 -28 25 20 50 4 30 -41 29 43
1532 43 98 -42 46 15 45 118 -3 -22 -30 -44 -16 -4 80 48 10 -66 -71 -147 -7 20 -61 -17 -12 103 -108 -52 -41 64 16
1561 16 -19 12 65 52 7 -30 -56 -16 -99 -20 -132 -125 -60 -73 -55 62 71 -48 -7 115 -47 59 45 91 136 -38 29 77
$$ packed form
1362G5p6R8j13M0P2m7m3Qq0M3o0j1K4R7j28J3J1J32J14j45L7o2J36j00J22m0J1
1389A28j80J22j39N8pj15R7n5N0M5pj7J00Kq2J6P3j00N6J12p4L0q6o0LQ4j11R1
1417C4Ro9K2N3Q2j58J4P5J00k04J09J4M9j01L7j56J52oMo8j3J0l1m8M3P1l8n8
1445g2J30r7M8J0J25l4k30J91p6n4j7J11Mj4N8j66Q1j27P5R4j8j02J02m6L4PQ
1472B5On0J7l2n2L1N5m6j7K5J79o5r9p1J81j89O3M1K1j60K59m8j7o9l8J27or3
1500b2L3k7p1J11RR2j46J09n7m5O0O6p2pNmJJ5J5j6lo6m8M0N3nL0m6K6p1P0J4
1532D3N5j40Q8l1L0P3j21j9qj4K8J2Q4l2l8p6np6J40K7q1M4NJ15k11N6J1J05m8
1561A6l5L1N3j3m5l7k6M0q3P9j12PO5j3J8J17Rj19M1J22j62J06j4M6M5j74O7M8
$$ plain form
1589 77 -94 -42 -8 -18 32 -150 -129 19 -69 49 -71 104 -8 -120 -84 -26 -79 76 47 -93 97 -53 53 64
1613 64 -116 -34 -35 -62 5 -21 -107 -93 11 39 -38 -9 113 -14 -69 51 151 27 -18 133 68 -42 106 -40 -87
1638 -87 15 -32 25 79 114 43 16 66 16 18 -67 108 38 23 38 105 116 93 6 5 -37 -72 -92 12 -32 -124 -64 -41 -11 -11
1668 -11 6 16 -75 11 3 -19 42 -31 -117 24 -71 -57 31 95 -6 6 34 -98 -45 -3 83 -7 -37 14 6 25 66 -110 -5
1697 -5 55 147 171 -80 6 -36 2 -141 -30 -72 -1 -161 -82 21 54 -106 45 63 88 0 6 86 117 62 9 -43 -93 -59
1725 -59 -107 43 -62 38 -78 -2 5 -79 -14 -100 -21 17 9 31 43 18 -97 66 110 -23 -73 16 -21 134 -82 72
1751 72 104 -11 -53 -45 107 -36 -13 -57 -40 -78 32 92 77 -35 17 44 11 51 -13 -40 28 -42 60 -24 113 16 25 40
1779 40 -56 -19 -24 -63 8 -5 18 -47 -4 -57 53 -45 -19 34 2 88 15 -6 -51 -10 96 -31 74 22 -83 -68 -51 46
$$ packed form
1589G7j71N2L4j0N0j82K1J48q8J18j20J75j12j12L6N8n3J55k9j40J90j50J06J1
1613F4j80Q2jk7O7k6q6J4J04K8p7K9J22j27n5J20J00j24m5J51o5j10J48j46m7
1638h7J02m7N7N4L5p1k7N0n0Kq5J75p0j5J5O7J1k3q7jm2l5k0J04m4r2O0K3L0%
1668a1J7J0r1Q6qk2O1p3q6J41r5J4Q8O4j01J2K8j32N3M2Q6r0l0N1qJ9M1j76J05
1697eO0R2K4k51Q6m2L8j43J11m2P1j60P9J03L3j60J51J8K5q8OQ0L1n5n3n2n0L4
1725e9m8J50j05J00j16P6Pq4O5q6P9L8qK2J2k5j15J63M4j33n0Q9l7J55k16J54
1751G2L2j15m2QJ52j43K3m4J7l8J10O0j5j12N2K7l3M0o4k7O8p0J02q4J37r7RJ5
1779D0r6L7nl9P1j3K3o5M3n3J10r8K6N3l2Q6p3k1m5M1J06j27J05n2j05J5J7R7
$$ plain form
1807 46 12 -37 -34 -58 120 -120 84 16 -54 60 -56 -21 -57 -33 54 -22 -2 -103 23 -158 -65 4 9 50 -7 98 38
1834 38 62 78 -70 -114 -40 102 -37 -20 6 128 21 68 -54 20 44 -30 102 3 38 -13 51 21 -27 -91 -80 35
1860 35 -100 -43 34 14 -44 -67 -18 4 108 1 105 -24 -55 65 -38 17 98 31 -27 -108 -92 -4 -80 -7 7 -35 -16
1887 -16 -171 -36 27 56 -16 -5 49 70 26 -51 101 24 -31 -69 -4 12 -14 -48 53 -71 -57 -73 -44 -60 -36 -82 37
1914 37 -4 -16 -65 -50 -43 55 58 -41 -63 98 -30 -51 -44 76 -32 124 -26 -23 -86 27 98 -108 13 -27 79 109 33
1941 33 -42 -25 20 -52 52 -45 7 8 15 63 -30 -134 -36 105 1 28 -38 12 61 79 -40 0 -21 -55 -82 23 -27 46
1969 46 -139 -47 -25 -6 81 96 -84 95 0 -65 -34 15 56 53 -35 7 17 96 46 -106 135 118 120 -21 65 -1 -54 -56 69
1998 69 -91 -134 -52 -23 -89 -43 47 -174 -19 36 84 33 34 24 52 119 -36 0 4 110 -9 56 40 37 71 63 16 -62 36
$$ packed form
1807D6l4m9Lk4J78k40K04o8p0J14j16L5l6K4Q7p6K0j01J26j81R3O9NM1n7J05o0
1834C8K4J6j48m4P4J42j39J7K6J22j07M7j22P4K4p4J32r9L5n1O4l0m8o4J1J15
1860C5j35N7P7k0n8k3M9K2J04j07J04j29l1J20j03N5Q1o7n8q1J6Q8p6P3J4m2J9
1887a6j55J35O3K9p2J1N4K1m4p7J52p7n5l8O5J6k6l4J01j24J4j6K9j6K4m6J19
1914C7m1j2m9J5PR8Lr9k2J61j28k1PJ20j08J56j50Lo3J13P1k06J21m0J06L0p6
1941C3p5J7M5p2J04r7N2JPM8r3j04R8J41j04K7o6N0M9J8j19M0k1l4k7J05n0P3
1969D6j85R2K2J9Q7J5j80J79r5o5L1M9M1lq8M2J0P9n0j52K41j7Kj41Q6o6n3kJ25
1998F9j60m3Q2K9o6M6R0k21J55N5M8n1Jj0K8O7j55L6MJ06j19O5j6lL4qm7p8R8
$$ plain form
2027 36 33 -46 22 15 -69 53 -60 -31 -13 -71 -29 -44 6 -14 -32 -36 -11 -11 49 -49 6 -59 95 -18 -79 142 -58 45 -11
2056 -11 74 -62 -136 35 -16 50 89 32 37 17 -40 -6 -65 22 -15 -97 63 33 25 99 53 -74 84 44 19 74 43 -86
2084 -86 96 -11 23 -58 -13 -76 -79 -28 -96 -58 -74 -10 46 58 16 2 9 47 60 -9 6 -24 -51 -17 119 95 -11 99 -46
2113 -46 72 -140 89 -42 -70 66 -31 52 -3 85 -22 20 -45 -79 -57 23 29 99 -41 88 -78 17 3 -55 43 -25
2139 -25 19 34 24 -64 91 24 -25 104 43 -33 17 6 27 -84 58 13 8 104 -25 -8 35 48 -22 66 -181 -41 43
2166 43 0 -38 13 10 -17 54 31 -34 -86 25 -100 25 -31 -9 3 -170 12 -37 -48 8 49 -17 -20 -73 -143 40 22 125
2194 125 -15 -89 20 -3 -95 4 50 -19 39 -11 73 70 13 86 72 3 7 -115 10 22 1 -109 -75 -16 42 -12 -44 42
2222 42 -94 2 -55 7 88 -16 -28 87 -58 100 -96 -77 -75 14 74 -65 42 -88 -61 1 -30 20 91 0 -65 49
$$ packed form
2027C6lp9O8pq4J22j13K9J8n8M2j5N0k0j8mK5%O0r8N5o5J54j13o1K21k00J03n6
2056a1Q5j36p4J71n1O6L9n7Nk0n7L4n9Q7l7q2J60l0qP4m6j27J58m0k5N5l1j29
2084h6J82j07L4q1M5o3lN1o8L8j6O4N6J2m2j4PL8J3o9J5l0k7L4J36k4j06J10j45
2113d6J18k12K29j31k8J36r7Q3n5Q8j07M2o5l4K2Q0OP0j40J29j66R5j4n8R8o8
2139b5M4J5j0q8J55o7m9J29o1p6N0j1K1j11J42m5nR6j29J7M3J3p0Q8k47J40Q4
2166D3m3l8N1lk7P1k3o5n2J11j25J25n6K2J2j73J82m9j1N6M1o6ln3p0J83j8J03
2194A25j40p4J09k3r2R9M6o9N8n0Q4ln7P3j4o9Mj22J25J2k1j10L4N9N8n4l2Q6
2222D2j36R6n7O2Q1j04j2J15j45J58j96J9KQ9O0j39J07j30K7O2l1N0P1r1o5J14
$$ plain form
2248 49 -63 -30 211 85 15 -76 -86 -117 19 -101 -8 -17 -71 -9 4 18 24 -16 -17 -58 22 -76 14 -83 -111 42 78 -33
2276 -33 -27 -48 37 127 36 -34 -106 54 -1 -54 105 -66 -150 93 23 -49 -165 -85 81 -24 -89 -81 65 -16 79 -32 -2
2303 -2 -12 -13 -166 -63 -36 108 35 -14 45 -32 -4 -1 -8 113 17 -41 36 16 29 39 -23 -79 -126 -72 -65 -39 33 -88 26 18
2333 18 49 57 -23 -66 57 85 38 64 -19 -106 15 101 120 -60 -2 -18 -57 -30 83 -42 -35 36 24 30 69 -17 84 10 41
2362 41 94 37 23 25 -8 71 137 97 -4 -88 -104 -65 9 -130 -86 -156 -27 99 -126 28 19 -68 -115 61 111 7 -14
2389 -14 21 1 4 -48 53 -50 -8 133 -37 62 -66 7 -14 -5 -25 -1 -70 114 -2 11 -39 -40 -64 -9 44 8 -37 -20
2417 -20 -37 -46 -16 -95 10 56 68 -61 18 77 81 26 3 -24 19 -2 -31 19 -63 2 32 -29 6 37 -58 75 -12 72 -4 -47
2447 -47 49 -31 29 -42 95 1 -47 17 -58 63 21 103 42 -64 8 30 -105 -47 -90 127 -59 -9 -16 63 -19 20 -69 -88
$$ packed form
2248D9j12L3K41j26p0r1j0l1J36j20R3rn4O2J3J4Om0jm1Q0r8R0r7k8J53L6j11
2276c3Ok1Q5R0r1p0p2J60n5n3J59j71q4K43p0p2j16Q0J66j05o5QJ46q1R5j11L0
2303bj0jj53J03K7J44p3m9N9p7K8LpJ21r6n8P7k0J3J0o2n6m7N4PK6P2j21J14q
2333A8L1Qq0m3J23K8m7K6q3q7J21Q6J9j80N8j6l9K7J13j25PP1j2OL9q6J01p4L1
2362D1N3n7j4Kl3P9O6m0j01q4j6L9P4j39M4p0J29J26k25J54rq7m7J76N0j04k1
2389a4L5k0Ln2J01j03M2J41j70R9j28P3k1Rk0K4o9J84j16J3n0jk4N5N3l6m5J7
2417b0j7rL0p9J05M6J2j29P9N9Mn5k3k7M3k1k9N0q2O5L0o1L5L1r5J33q7Q4p6m3
2447d7R6q0O0p1J37r4m8O4p5J21m2Q2o1j06P2K2j35N8m3K17j86N0pP9q2L9q9j9
$$ plain form
2475 -88 110 70 -69 67 16 -19 87 18 8 -34 50 37 -44 -16 26 20 -13 -6 71 -34 80 142 -68 -79 58 8 167
2502 167 -8 -27 -46 -53 -60 39 -57 -36 42 -117 50 -67 82 -23 89 34 -49 -6 18 -21 -32 -23 -17 79 24 -57 -15 47
2530 47 -47 -12 23 -12 56 -54 46 -38 12 -12 7 9 8 -22 26 65 49 -2 29 9 -18 47 -42 6 -74 13 -72 37 111 16
2560 16 111 -54 -17 0 63 50 18 9 65 -6 -57 57 79 -40 4 42 -22 -47 -61 -81 30 20 -9 132 69 18 -36 4
2588 4 -53 120 28 31 -7 26 -28 76 41 -78 -48 -88 16 49 30 36 0 -5 37 72 42 -3 -5 -28 107 -33 -38 25 42 -41
2618 -41 116 -33 -56 41 -45 23 46 -70 -63 -84 26 -39 134 -23 -4 24 24 -83 62 12 105 -2 39 -59 1 31 11
2645 11 15 8 38 -76 23 -87 -59 -29 43 -18 -29 -58 26 8 -73 -63 -9 76 101 -13 68 -94 -46 -12 -45 -64 -69 85 23
2674 23 -6 -9 -68 -35 -36 42 -37 13 -17 35 56 8 -75 -24 -40 2 55 -74 -35 -3 -84 -69 79 -82 9 -22 21 86 -13 -51
$$ packed form
2475h8J98m0j39J36n1l5J06o9j0m2Q4j3q1K8M2ol3PP7j05J14O2k10j1J37n0J59
2502A67j75j9j9ppR9r6K1P8j59J67j17J49j05J12n5q3M3K4l9j1ROR6n5q1M2O2
2530D7r4L5L5l5O8j10J00q4N0k4J9Kjl0M8L9j6n1L1k0k7O5q9M8q0Q7q5J09P4r5
2560A6R5j65L7J7O3j3l2rN6p1n1J14K2j19M4L8o4k5j4k0J11j0k9J41o3n1n4M0
2588Dn7J73r2Ll8L3n4J04l5j19L0m0J04L3j9Ol6nM2L5l0m5kk3J35j40nO3J7q3
2618d1J57j49k3R7q6O8K3j16Pk1J10o5J73j57J9K8%j07J45n0R3j07M1r8O0L0k0
2645A1MpL0j14R9j10K8L0P2o1j1k9Q4j8q1J0N4Q5K5j14Q1j62M8L4l3j9nJ54o2
2674B3k9ln9L3jP8p9N0l0N2K1m8q3N1j6M2N3j29L9L2q1J5J48j61R1l1M3O5r9l8
$$ plain form
2704 -51 2 55 -94 -6 11 -19 30 95 15 -11 -6 -67 6 -26 -74 -19 27 43 10 -3 -12 34 -108 27 -49 51 -29 -31 80
2733 80 75 -80 85 0 39 -52 25 77 -35 -60 -16 -87 -111 36 -23 32 3 108 -34 50 56 -118 -9 -94 126 -13
2759 -13 57 46 -122 -63 -145 -17 -44 72 -111 -46 -58 -39 -82 4 17 -68 11 114 -18 46 10 41 42 -20 -113 2 25
2786 25 44 65 10 53 -50 79 62 -38 3 -47 68 41 47 93 130 63 -45 -67 5 -32 107 82 32 -73 -18 7 56
2813 56 -53 -65 25 129 104 -46 -33 5 110 73 -78 18 35 -49 109 74 -60 24 -19 51 91 13 40 97 -29 -57
2839 -57 -19 94 23 -37 6 -29 101 15 67 6 13 -65 133 87 66 -112 16 -21 -124 57 26 77 2 -4 -12 -33 -27 -42 -129
2868 -129 -24 -4 -40 46 26 -1 92 -35 89 68 36 32 -65 -119 2 -26 27 17 -12 -54 94 108 -24 -38 46 66 -10
2895 -10 44 -40 -75 10 77 32 74 128 -89 76 -100 24 -36 -106 20 -7 70 -51 18 -20 -21 30 -31 -24 51 -3 -65 -51
$$ packed form
2704e1N3N3j49Q8J7l0M9O5q0k6No1P3l2m8N5M6J6l3j3rM6j42J35p6J00q0kJ11
2733H0nj55J65q5L9r1P7N2j12k5M4p1k4J47n9N5k9J05j42Q4Oj74J09q5K20j39
2759a3P0j1j68N9q2J28k7J16j83O5j2J9m3Q6J3q5P9J03j32O4l6L1Jo2r3J15K3
2786B5J9K1n5M3j03J29j7j00M1n0J15k7OM6L7o7j08k2P2l7J39k5n0j05N5K5M9
2813E6j09j2R0J04k5j50J3L8J05l7j51R6J7q4J58l5j34Q4m3P0M0p8K7N7j26k8
2839e7L8J13p1o0M3l5J30q6N2o1Pp8J98m6k1j78J28l7j03J81l1N1p5oqk1Oj5q7
2868a29J05K0l6Q6k0k7R3j27J24k1l2mr7n4J21k8N3j0k9m2J48J4j32j4Q4K0p6
2895a0N4q4l5Q5O7m5M2N4k17J65j76J24o0p0J26k7P7j21O9l8jN1o1PP5n4o2J4
$$ plain form
2923 -51 35 7 -59 -42 -28 -49 82 12 73 9 41 41 -74 -36 -77 49 -89 34 107 41 103 17 -45 -19 -49 31 37 84 130
2952 130 55 -38 67 -32 -84 -19 -20 -11 -72 58 65 -77 -25 -29 35 -16 95 59 28 19 28 37 -16 -69 72 -20 -56 -83 47 62
2982 62 -89 -17 -52 9 60 -16 -55 -5 -108 5 32 -6 -27 43 -70 59 57 -96 55 -22 71 -15 40 -33 -54 26 -31
3009 -31 1 -152 107 -57 8 -3 35 112 -36 27 69 -80 77 -50 -42 -49 -48 61 31 -15 30 51 12 14 -2 -30 3 -97
3037 -97 -15 -11 -39 -56 -36 143 -32 7 -46 -134 -57 75 -73 157 81 -45 -23 -48 -74 -69 20 -42 138 -32 -35 9 61 30
3065 30 -52 63 3 66 17 115 22 105 -56 14 38 -1 16 26 19 -89 -59 13 -36 30 121 -101 -38 -10 62 58 27 -17 -56
3094 -56 49 12 31 -40 36 0 -30 70 -9 17 17 48 -93 -177 -11 28 81 11 -105 -7 41 62 -50 34 35 102 47 187
3122 187 -51 -110 0 -2 19 -75 27 56 121 -50 39 82 -35 -91 -66 -50 -107 -10 -46 64 13 -102 21 78 3 18
$$ packed form
2923e1Q6k8o6J7J4k1J31p0O1o4L2%j15L8m1J26j38J23P3o6O2q6o2K6l0Q0OM7M6
2952A30p5r3J05r9n2O5jRo1J30Pj42N2mO4n1J11l6l1rRRn3n3J41r2l6k7J30J5
2982F2j51P2l5O1N1p6l9N0j03J13K7l8k1P0j13J29kj53J51p7R3q6N5p3k1Q0n7
3009c1L2j53K59j64O5j1L8P7j48O3M2j49J57j27QpJJ09l0m6M5K1l9Kj6k8L3j00
3037i7Q2Mk8j7K0J79j75L9n3q8P7J32j48K30p6j26K2k5k6NQ9o2J80j70lM4N2l1
3065C0q2J15o0O3m9R8r3Q3j61P0K4l9J7J0pj08L0P2m9O6R1k22O3K8P2ml1m4l9
3094e6J05l7J9p1P6l6l0J00p9K6%L1j41q4J66L9N3p0j16R8M8K1j12Q4JO7n5J40
3122A87k38n9J10kK1r4J02K9O5j71Q9M3j17n6K5J6n7R7l6J10n1j15J23N7p5J5
$$ plain form
3148 18 -8 51 -29 -65 85 17 -53 -48 22 -43 112 45 6 57 49 -36 14 144 47 28 -43 59 -18 38 60 93 -51 -27 4
3177 4 -6 74 -65 127 -9 2 25 -117 57 -93 -50 -32 11 -32 -75 -79 -26 60 30 -12 -20 132 -25 -42 -33 -74 -38 -62
3205 -62 58 51 22 -72 52 79 30 -41 91 48 -23 18 -31 -41 8 73 -20 8 -71 21 71 -55 -19 79 -66 -21 -18 0 -58
3234 -58 -41 -9 16 10 11 84 -102 26 46 -35 56 153 -30 7 -75 -54 6 53 -36 -26 -15 -84 -7 -82 63 -10 90 -40
3262 -40 112 23 -4 -6 -102 42 53 -12 -56 1 -42 -32 42 -3 -27 13 -39 -48 26 -3 62 -23 1 36 -108 -59 -2 -77 -40 -47
3292 -47 -97 71 -14 -7 20 -47 50 -13 -65 -62 71 -49 80 16 -41 -8 74 -90 -30 51 27 28 46 -37 27 -37 91 62 -16
3321 -16 -18 18 -75 -63 8 66 78 -65 38 54 -17 20 123 14 -26 -177 -58 -11 -42 83 68 -84 53 -33 -8 50
3347 50 47 28 -52 49 6 64 32 -53 20 -68 46 -124 -67 16 117 -89 -43 -7 61 -62 -39 15 32 69 -47 -36 -4
$$ packed form
3148A8k6N9q0l6J50o8p0NP0o5J55o7l9N1qq5N0J30r7j9p1J02p7N6K2L3j44K4L1
3177Dj0Q0j39J92j36J1K3j42J74j50M3J8M3m3m3mN3Q6l0m2qJ52j57j7Rm1L6k4
3205f2J20pk9r4J24K7m9p1J32m3p1M1m9j0M9O5r3K8p9R2N0j26L6R8j45M5LJ8n8
3234e8J7L2K5oJP3j86J28K0q1R1R7j83L7q2K1O0M7q9J0J1o9P7p5J45p3J00j30
3262d0J52q9k7kr6J44J1o5m4N7m3J0P4m5k4M0n2rP4k9O5q5K4L5j44M9N7p5L7p
3292d7n0J68q5PK7o7R7o3n2LJ33j20J29o4n7L3Q2j64O0Q1k4JJ8q3O4o4J28k9p8
3321a6kL6r3J2P1N8J2j43J03J6p1L7J03j09m0j51J19M7l1J25j5j52J37q6K5N8
3347E0lj9q0J01m3N8l2q5P3q8J14j70N7Q3J01k06M6L6O8j23K3N4J7L7j16J1L2
$$ plain form
3374 -4 57 -31 87 93 102 -6 -81 76 -13 -71 43 127 15 -14 -33 -59 -66 14 -44 -2 11 -102 9 -33 -22 32 -71 23
3402 23 30 43 82 -8 -57 43 51 15 87 5 70 -134 30 -25 22 -25 0 -37 79 -20 21 -34 11 2 40 -55 36 12 52 44
3432 44 -27 -16 -155 -50 89 18 -109 -97 -17 -23 -119 -59 -13 13 -166 -84 -68 -41 -73 -8 34 21 -108 -73 39 -8 -30
3459 -30 -6 48 -31 79 -20 -21 -84 -23 -27 27 -34 0 -19 10 -92 -5 -21 47 26 97 -12 42 -37 -113 -77 7 -32 -103 50
3488 50 -13 -17 -74 60 -148 -92 -20 -6 76 127 262 41 -78 -70 33 -46 -42 3 -47 -60 -25 -32 26 -30 -33 -11 -62 9 45 46
3518 46 -10 37 129 35 -2 -87 9 -27 -52 -106 -18 -83 -45 18 -112 44 2 96 27 50 0 -2 -60 109 7 -28 10 -162
3546 -162 28 -46 -44 22 8 88 19 -17 -53 42 53 -21 -71 26 -79 -41 16 -71 -13 9 15 -41 -9 63 3 -33 20 -10 -94 -56
3576 -56 63 -47 -1 -48 -81 -35 17 52 -48 53 92 -73 -32 31 41 -25 -145 8 -20 -19 -82 -81 -25 -13 -38 0 -114
$$ packed form
3374dO1q8J18ORj08p5J57q9n8J14Q4j12k9j9k6pQ0n8M2J3j13J11m2J1N4j03R4
3402B3PJ3L9r0m9J00Ql6P2q2O5k04J64n5M7m7K5l7J16r9M1n5M5rL8r5R1k4M0q
3432D4p1J1j39J05J39p1j27J2Q0or6O0M6K6j79Q2J6K7l2O5M2j3j29L5J12m7k2
3459c0K4N4p9J10r9jo3O1mN4o1L4j9K9j02Q7j6O8k1P1j09N4p9p6L6Q4l9p1J53
3488E0o3mn7J34k08N6P2J4Q2N1J35k21j19QJ03p9MM5n0j3L5pN8n6lK2n1P1L6J
3518D6n6M7R2r4l7q5R6l6k5n4Q8o5L8O3j30J56m2R4o9K3n0kn8J69j02l5L8j72
3546a62J90p4KO6j4Q0o9l6l6R5J1p4n0R7j05L8N7q7N8K2On6L2P2o0l6N3l0q4L8
3576e6J19j10M6m7l3M6N2L5j00J01L9j65M1O3J0o6j20J53k8Jo3JN6J2k5L8j14
$$ plain form
3603 -114 -147 59 -13 -131 -50 -75 -17 159 -11 55 24 -83 63 142 -37 -34 1 -8 24 -5 97 -179 -119 64 -78
3628 -78 -45 -132 -46 46 78 40 -98 -9 -78 75 -74 97 -125 -56 -138 43 -34 -157 38 25 90 33 -16 6 44 -140
3654 -140 -76 103 -32 69 28 87 40 11 -34 -34 20 66 0 5 -152 33 8 -35 -2 -108 19 18 -90 23 -85 -85 -20
3681 -20 18 -3 5 11 -30 27 40 18 44 77 -41 -24 -30 75 2 56 -60 11 58 9 -64 -65 29 -51 133 42 -34 -28 -48 19 36
3712 36 78 60 28 51 -9 70 -41 -49 -47 -7 -61 19 10 -54 7 -54 117 -17 34 -80 -26 -29 26 -48 13 -6 66 -101 64
3741 64 -162 -92 113 -14 20 -23 39 33 56 -51 38 57 17 -62 33 27 -23 35 26 -43 -1 -47 -27 -63 -11 -10 -85 101 -23
3770 -23 16 116 30 -117 113 1 -21 -1 -9 -48 65 41 46 49 43 114 88 -126 36 17 114 101 -2 -124 -10 36 -81
3797 -81 -87 -92 -13 2 35 -15 -27 -22 -80 -66 143 -91 -115 17 40 -53 28 24 137 -40 -28 -53 -15 -125 62 -17 8 3 58
$$ packed form
3603a14l3K06p2j18Q1k5N8J76j70O6l1j07J46P9j79LL5rL2k9J02k76O0J83j42
3628g8L3q7Q6R2L2l8j38Q9o9J53j49J71k22O9q2J81p7j23J95j3O5n7m9K2L8j84
3654a40O4J79j35J01m1N9m7k9m5%N4M6o6Nj57J85k5m3L3j06J27jj08J13j08%O5
3681b0L8k1QOm1N7J3k2K6L3j18J7oJ05p3N4j16P1M7m9p3jR4q0J84r1p6Ok0O7J7
3712C6M2j8l2K3o0P9j11qKM0n4Q0ro4O1o1J71j34N1j14N4lN5p4O1j9P2j67J65
3741F4k26P0K05j27L4m3O2oK3j07Q9J9m0p9R5on0N8ro9M2m6K0l6N2Jp5J86j24
3770b3L9J00q6j47K30j12k2K0ql9J13k4NLoP1k6k14J62j9R7j3j03j22J14M6j17
3797h1onP9J5L3n0j2Nn8J4K09k34k4J32K3r3Q1mJ13j77J2k5L8j10J87p9K5nN5
$$ plain form
3826 58 81 -26 -11 19 19 23 18 24 44 78 -28 -68 -18 43 -105 23 72 -65 -67 -11 -45 -32 -18 97 108 107 64 199 -83
3855 -83 53 -47 107 79 -2 23 -75 41 40 -36 -70 -92 -24 90 -79 -115 -60 -61 -29 14 9 -127 -26 17 -66 -27 -22 40
3883 40 9 -98 -14 84 -18 53 3 -7 -37 93 18 -31 81 128 61 -34 -127 8 -123 -14 -35 33 11 96 22 -73 31
3910 31 -2 19 -8 12 -11 6 30 29 -9 -18 -66 -52 -62 -53 -73 134 58 -37 -7 -36 48 -19 -98 47 -14 -34 -75 -74 -74 -6 -101 -38
3942 -38 19 149 42 -85 50 23 -104 0 -21 -40 -24 -23 19 72 -32 -16 48 41 -54 -19 -63 -84 -4 13 -74 -17 -14 -54
3970 -54 35 -88 -26 -112 97 12 -38 5 20 -77 -33 41 18 2 17 -4 -40 74 64 77 25 73 -20 121 3 -16 -10 -2 22
3999 22 34 12 -25 -17 69 68 -55 150 -5 5 4 -59 -101 -120 33 -8 60 -10 -34 45 6 8 -68 -30 -75 13 -66 -163 -75 -36
4029 -36 -6 -24 5 26 -47 -11 38 -138 -109 12 -71 -4 -37 113 36 -37 -67 -57 0 192 -57 6 -26 -76 -67 50 105 27
$$ packed form
3826E8K3j07J5L0%MnOK0L4j06m0N0O1j48J28M9j37kN6l4J3J4J15J1jm3J35k82
3855h3J36j00J54k8q1K5r8J16jp6l4k2O8J14j69l6N5jL2M3nj36J01M3q3L9NO2
3883D0l1j07Q4R8j02P1n0j0l0J30p5m9J12M7o7r5r3J35j31J09k1O8k2Q5p4r5J04
3910C1l3K1k7K0k3J7K4jl8rm8J4j0Rk0K07p6r5L0k9Q4o7p9J45o1k0m1J%O8r5O3
3942c8N7J30j07j27J35k7j27J04k1j9J6JM2N3j04J6O4pr5L5m4k1Q0J7q7N7Lm0
3970e4Q9j23O2q6K09q5n0M3J5r7M4P4k3j6J5k1l6J14j0J3n2M8r3J41j18j9OQK4
3999B2J2k2l7QQ6jj23K05j55J0jo3m2j9J53m1O8p0k4P9l9Kp6L8m5Q8p9r7Q8L9
4029c6L0j8K9K1p3L6M9j76K9J21q3O7l3J50p7p3l0J0N7J92k49O3l2n0RJ17N5p8
$$ plain form
4057 27 2 -61 -37 -45 7 -21 -14 196 -82 -36 -44 -42 7 -42 -16 24 28 -40 106 66 71 -155 -35 -13 -51 37 61 25 46 -25 28
4088 28 -14 52 35 149 -113 -65 -71 -95 22 -58 -19 -42 -77 -33 57 -5 24 -59 59 -100 -27 -57 -60 -42 -27 -1 -50 76
4116 76 -32 -31 -21 26 59 -5 41 2 75 26 18 -47 -111 32 -98 -54 -41 -33 25 -54 -49 -155 -14 -10 -2 8 -79 41 -32 -9
4146 -9 58 10 4 36 -7 21 79 -32 -78 -35 -5 -37 -18 -56 -4 -5 10 -19 8 -144 -6 -44 45 -22 -84 61 -10 141 17
4175 17 54 -44 -94 112 -49 -36 -12 -57 -24 12 -3 -31 95 -110 7 21 -53 27 154 -18 8 37 -75 -47 90 -83
4201 -83 -8 -9 68 -39 86 125 -13 4 54 57 -53 26 27 -75 -30 -12 -106 -78 -24 25 -41 -100 84 104 -15 6 -40 18
4229 18 -51 5 49 -40 -54 -26 26 -18 18 119 -106 99 -3 56 24 106 -4 -47 -76 -54 -37 69 -30 -93 14 -23 26
4256 26 -78 -2 -96 -21 -119 85 -108 44 -33 143 76 47 92 -64 61 120 2 -22 0 -20 -115 -5 -40 -70 -121 -44
$$ packed form
4057B7k5o3K4qN2k8PK10k78M6qKM9m9K6M0Mo8J46m0Nk26J20K2l8Q8K4l6K1p1N3
4088B8m2O6j7J14k62M8ok4J17q0L9k3l5M4R0o2K9q3J18j59P3l0lJ8J5K6m9J26
4116G6j08JJ0M7L3o4M6l9P3m9qo5o4J43j30M4J3QN8p9Nj06J41MQJ0q7J20p3K3
4146iO7m8oL2m3K8N8j11m6M3L0l2J9l8N2jJ5k9K7j52J38l8Q9o7o2J45p1J51j24
4175A7L7r8n0K06j61J3K4m5L3L6j5k8J26k05J17J4p4Q0J27j72K6K9j12K8J37j73
4201h3P5jP7j07J25L9j38J7N0Lj10P9Jj02M5J8r4K8N4M9o6n9J84K0j19K1m6N8
4229A8o9N6M4q9j4K8N2m4L6J01k25K05j02N9l2Q2j10m3k9K2J7J06r9o3J07l7M9
4256B6j04P6r4P5r8K04j93J52p7J76o7k9M5j56J25N9j18k4K2k0r5J10l5l0n1P7
$$ plain form
4282 -44 -122 -21 132 -11 -12 -32 -26 70 16 44 -113 23 -20 -17 -78 -30 66 47 -109 46 -32 76 1 -45 48 -176 -56
4309 -56 -62 -26 42 12 125 -85 109 37 -61 -27 16 55 -10 -14 2 -18 34 -65 -1 44 36 -66 -111 67 -29 -43 -58 -31 -44
4338 -44 55 27 -12 0 47 -38 -97 -35 82 -66 14 25 -104 34 -5 91 46 66 -72 -28 -75 72 7 -62 35 -64 -49
4365 -49 66 25 14 -50 -17 -18 18 -56 -40 -48 122 74 -132 -60 -61 5 47 87 -52 -10 113 -91 45 -69 -25 -80 -120 13
4393 13 11 16 20 22 -19 53 -25 56 -59 8 12 31 71 -52 51 -61 -24 16 11 -61 10 -73 63 9 36 -9 -55 1 28 -5 10
4424 10 55 -64 95 -3 -28 -28 96 7 -7 114 -57 3 -96 -117 -235 24 -100 -88 90 75 22 13 30 -117 118 -59
4450 -59 -28 9 75 -6 -86 1 -31 -9 -11 58 62 4 -98 118 19 102 13 -101 -13 -20 2 133 -22 -24 7 -81 -83 45 89 61
4480 61 80 -29 63 -25 107 -23 -36 13 42 55 75 102 -20 -18 -8 18 33 42 -19 -4 38 7 -25 -19 24 -47 -74 -13 72 -33
$$ packed form
4282d4p8J01J53j43jk0OR6n4K8j57J36m3Lo1M8R6j9j56J55p8J08p5m6R3k24J20
4309e6oL6O8l0J13k10J94p2r8L4M3L9o5mJ6k0N2r9O4M5qj02m5J78r6j4j5K7j3
4338d4R9k8l9J2M7q5n9O2J17j48Q0J1j29J38l9R6m5K0j38M4m7J47o5o9R7r9J5
4365d9J15m1j1o4L3jL6p4J6qJ70m8k06P2jO6M2M0j39M2J23k04J36j14M4n5m0J33
4393A3kNMKm1P2p8Q1j15O7MJ9M0j23J03j12L7M0np2P1q3J36n4K7m5m6N6K7l3J5
4424A0M5j19J59r8k5%J24q9j4J21j71O0r9k1j18K59j24J2J78j5n3rJ7j47K35j77
4450e9L1L7O6q1q0Q7l2K2kO9Mn8j02K16r9Q3q9j14Q8pK2J31j55kL1q8kJ28M4k8
4480F1J9j09R2q8J32j30j3M9K9J3K0K7j22KJ0K6J5Ro1J5M2l1l2OM3p1k7O1Q5j05
$$ plain form
4510 -33 -40 -65 88 -48 11 -24 -8 -123 52 91 -45 -1 69 -110 -24 0 4 64 6 -25 -18 -49 -18 -8 6 26 26 -3 85
4539 85 53 53 20 -29 -37 -70 -68 -22 -71 151 46 38 26 40 -76 85 29 -14 -134 -16 -12 -40 107 -18 -6 145 -125 25
4567 25 42 -8 -25 36 -37 -12 -34 0 150 -2 48 39 38 -2 -115 5 14 52 -1 27 -33 -41 -60 3 11 89 21 90 -2 -73 83
4598 83 -40 154 124 22 -58 74 39 -111 26 -14 -88 -42 -13 -2 20 -32 45 -53 88 57 69 48 29 -36 -28 66 125
4625 125 -10 55 -57 -6 45 33 1 -1 77 36 26 37 -5 -18 -2 68 -37 -23 -14 -84 54 19 -34 76 59 0 17 -5
4653 -5 14 115 30 -70 71 12 117 -2 -69 -14 1 45 46 50 12 -100 -109 -24 98 -8 -87 110 17 0 -47 130 -86
4680 -86 37 33 -110 43 -17 21 41 80 -82 14 -62 35 -45 70 59 -57 -41 -14 -56 45 24 -113 -67 18 -16 -66 -18
4707 -18 115 61 59 -76 -84 -17 -48 -36 -22 22 -39 -95 -64 124 53 -45 82 -147 5 12 -15 33 -32 114 -11 24 9 -26
$$ packed form
4510c3pk5J53j36N9l5J6j15J75L9j36M4P0j79Q6K4MO0n8l1Pl1L1J0J4K0%k9Q8
4539H5l2%l3m9ql3KM6m9K22j05qj2J4j16J61n6m3j20J18Mk8J47j25J2J51k70J50
4567B5J7n0j7O1p3K5k2L4J50j52N0rjm0j13J20RL8n3K8o0qj9O3QP8o8O9r2p1J56
4598H3j23J94l0j02q0J32l5j50J37m0p4M6K9J1K2n2P7r8J41l1J2k1j9o5QR4N9
4625A25j35O5j12N1N1j2l2kP8m1j0J1m2j3J6P0j05J4Rp0J38l5n3J10j7n9J7k2
4653eJ9J01q5j00J41n9J05j19o7N5J5M4JMl8j12rQ5J22j06p9J97r3j7m7J77k16
4680h6J23mj43J53o0L8K0L9j62R6p6R7q0J15j1j16J6K7m2J01k1j37M6Q5l4n0M8
4707a8J33n4kj35qO7l1J2J4M4o1n6L1J88p1r8J27k29J52Pk7M8o5J46j25L5j5l5
$$ plain form
4735 -26 25 55 -63 -69 67 64 1 84 60 40 -45 -22 24 -11 -93 -54 73 -22 44 15 -124 28 -8 -81 -60 -48 2 -60 -96
4764 -96 31 -43 -68 1 -25 109 50 -13 2 13 -101 3 12 34 28 -3 -56 35 66 33 -15 124 116 -32 37 67 -143 -66
4792 -66 10 26 3 -25 9 -60 20 8 56 -106 -52 -21 39 65 -35 32 59 -7 -25 -48 13 -87 -37 -17 -56 -26 -23 -53 40
4821 40 77 -106 72 12 -30 11 110 -34 43 -43 -12 27 -11 -41 6 -11 91 -23 75 50 28 21 -12 -38 20 41 86 20
4849 20 -55 61 -18 33 2 43 -4 -3 132 11 48 96 20 -45 -33 76 53 144 54 -55 90 -84 103 18 -19 149
4875 149 -42 138 -29 -37 64 -22 74 79 59 -20 45 -101 71 -32 -59 224 45 1 -41 -7 4 -56 -8 -61 -9 -17 45
4902 45 -5 3 18 35 -20 -15 66 83 -23 109 35 17 -22 72 117 -71 70 55 23 12 20 -10 -13 -45 84 64 -124 -33 44
4931 44 51 -9 -14 -42 -35 79 -33 95 33 26 -29 -33 14 76 29 -23 27 -19 -66 10 65 32 61 0 -17 73 -56 105 -68 39
$$ packed form
4735b6N1L0j18oJ36lo3Q3k4k0q5K3M6l5q2L9J27r5O6k9j39J52l6p3K1J2N0o2l6
4764i6J27p4k5O9k6J34n9o3J5J1j14J04RK2ol1n3R1L1l3m8J39qj48O9L0k10P7
4792f6P6J6k3k8L4o9Q0j2M8j62N4L1O0K6j00O7K7o6j8k3O1j00N0K0l9L0Ll0R3
4821D0L7j83J78o0m2M1R9j44P7q6L1L9l8l0M7j7J02j14R8k5k2pl3k6N8K1M5o6
4849B0p5J16p9N1l1M1m7JJ35j21L7M8p6o5J2J09k3R1r0j09J45j74J87q5l7J68
4875A49j91J80j67qJ01q6R6Nk0p9O5j46J72j03k7K83j79m4m2L4J1o0M8n3N2qO2
4902D5n0QJ5J7n5NQ1J7j06J32p4j8l9R4M5j88J41j5l2j1Ql0ll2J29k0j88R1P7
4931D4Po0nk8PJ14j12J28o2pn5mM7O2m7n2N0m6m7P6N5l3K9o1j7R0j29J61j73J07
$$ plain form
4961 39 147 17 24 -6 -72 -61 -11 41 25 -84 79 -40 73 6 39 50 69 57 -70 12 -21 145 -35 -119 -17 8
4987 8 131 -52 60 19 -76 -51 18 138 -57 -116 -87 21 -8 27 -39 -65 102 35 36 78 -80 -28 84 82 -106 7
5013 7 80 -5 46 34 -6 137 -9 7 4 19 41 6 -47 -23 19 -24 -80 -18 69 107 151 8 24 69 -121 -159 62 -16 39
5042 39 -18 -39 -146 -68 -97 -14 -25 -100 -130 94 98 -36 -54 44 57 116 40 -53 25 -8 -103 -63 -54 8 -54 -5 -61 -22 -39 6
5072 6 -16 -71 -45 131 85 -113 63 18 -40 -15 63 -35 33 59 -64 -29 -20 -23 30 -74 27 -49 56 -66 -40 -70 5 42
5100 42 59 3 -17 4 35 -70 -12 -58 -85 3 13 120 -9 -49 0 -69 10 -61 9 37 0 -30 22 -104 45 6 19 89
5128 89 -5 38 39 -19 -5 29 -68 81 2 7 17 47 -20 89 80 -103 16 54 -44 -42 14 51 20 -2 -33 -52 -5 -67 -9 13
5158 13 50 -109 -11 -11 8 47 91 -8 6 35 6 56 53 -96 14 63 48 -63 -63 129 25 -10 -198 86 80 27 -25 4
$$ packed form
4961C9J08j30Pl0o6J1N0N2j6j09J63j19J13o7L3J1J9j2j27Q2l3J66j80q4J02K5
4987HJ23j83J12m1r5K5O9J20j95n9K9J08k9L5o6k6J67o7JM2j58N2J12kj88J13
5013GP3q5N1j2m0J43j46J6lJ5K2l5n3K4M2m3n6O2Q7L8M4j43J6M5j90l8K21p8N5
5042C9n7k1j07P8k9Q3j1p5l0K24Mj34j8R8J3N9p6r3P8l3r5M0RO2o2M9n6L9j7M5
5072Fk2n5K6J76m6j98J76m5n8K5P8r8O8K6j23L5RlN3j04J01p6J05j22K6l0P5L7
5100D2J7n6k0K1L1j05N8m6k7Q8J0J07j29m0M9o9P9p1P0K8l7l0N2j26J49l9J3P0
5128H9r4M3Jn8J4L4r7J49p9NJ0L0o7J09rj83J19L8r8KN6L7l1k2l1j9M7o2N8K2
5158A3L7j59R8%J9L9M4r9J4K9k9N0lj49J10M9j5j11%J92j04l5j88K84on3n2K9
$$ plain form
5186 4 46 15 -76 46 0 -128 -88 104 -49 -124 -23 6 112 1 -27 -8 103 131 53 -21 -107 52 74 43 -54 32
5212 32 25 68 64 33 -57 63 61 -13 -13 -12 -43 -66 0 -139 1 -15 14 -49 -56 -69 9 52 -23 -38 0 54 -79 39 16 26 51
5243 51 -81 -9 -40 44 -67 57 2 -6 68 59 -37 -40 27 -1 -15 47 -56 -7 17 -61 -1 36 88 -100 -20 -53 57 -61
5271 -61 -10 -147 5 21 -54 -143 -6 36 60 -91 32 -3 3 51 110 -8 4 -39 54 81 -7 34 39 -86 -6 -74 -110 109
5299 109 119 -56 54 8 -33 52 9 4 76 38 -8 9 26 98 -56 -67 -3 -26 23 -24 42 -105 -81 -139 -20 30 -14 77
5327 77 23 -44 -66 84 103 -7 -39 -83 13 4 105 -3 141 37 -98 85 37 28 -100 34 12 51 -11 65 88 31
5353 31 -28 91 30 68 -35 -4 -52 0 -27 -46 13 -34 -116 0 -27 -48 -46 37 12 34 91 2 79 40 18 -90 -128 64
5381 64 -51 56 6 -17 -23 34 -120 38 28 32 2 -47 67 -53 81 70 7 -115 8 -71 14 -79 -28 -33 8 -91 19
$$ packed form
5186DM2l1r1J22m6j28M0J92j53p5J01K9J06j11k8J9J11K8p8p4q6J59K2l1r7Q6
5212C2pM3ml1r0J20kp4%Jl1k3O6j39J40j6K9o3pj3P8M3p5j5L8N4j33J18k3J0K5
5243E1j32P2l1Q4j11J24n5qP4rr6lO7k8j4O2j03M9K4p8O0L7N2j88Q0l3J10j18
5271f1N1j37J52J6p5q9J37M2K4j51J23l5OM8N9j18J2m3R3K7q8M1Nj25Q0o8l6K19
5299A09J0j75J10m6m1Q5m3nP2l8m6J7J7P2j54j1O4k3M9m7O6j47K4n8J19N0m4R1
5327G7n4o7k2J50J9j10l2m4R6rJ01j08J44j04j35J83m8rj28J34k2L9o2P6K3n7
5353C1n9J19o1L8j03L1m8N2k7j9N9m7q2J16k7k1KQ3k5K2N7q9P7l9k2j08l8J92
5381F4j15J07n0k3oN7j54J58j0Ml0m9J14j20J34j1o3j22J23p9Q5r3N1nM1r9J10
$$ plain form
5408 19 8 -70 -16 48 38 21 74 -53 -74 -112 -13 5 73 30 -23 -54 -80 92 82 -19 -68 95 3 -91 70 -83 -53
5435 -53 51 -124 -36 -46 35 99 28 -43 86 1 -58 33 183 -50 26 49 17 -39 34 -38 -22 68 38 53 33 49 33 -50
5463 -50 113 38 5 20 34 24 -46 -148 45 35 98 23 -157 38 63 12 48 -118 -9 21 -79 -119 -18 -9 32 66
5489 66 107 -43 33 -8 -102 75 -27 54 27 -81 -11 -63 145 47 -44 -47 -16 -22 -60 18 -128 69 -82 7 51 -3 -14
5516 -14 19 16 -45 -43 -9 69 -59 -112 10 -17 6 -79 -29 10 -14 -29 -81 -96 19 17 -174 -6 10 -59 -44 -20 30 12 54
5545 54 -82 -113 25 -125 -104 -2 -62 142 -13 36 51 11 -63 -53 -76 -95 -21 -6 31 30 -5 -63 -7 -102 17 -58 -92
5572 -92 34 -92 -152 -56 49 -70 -86 -63 -39 36 66 78 7 78 53 -10 14 12 -102 -17 34 78 62 27 42 -107 121
5599 121 -13 -1 -41 -10 -76 41 -12 48 -11 30 28 92 -24 -8 1 43 -84 -97 76 84 -168 -35 -11 -24 -91 0 -17 6
$$ packed form
5408A9j1p8N4O4j0j7N3j27k1l8R9J8O8m3n3l1k6J72j0j01m9J63r2r4J61j53L0
5435e3J04j75Q8j0Q1O4p1p1J29q5n9R1J50k33P6K3l2n6P3p2J6R0l0J5k0J6j6q3
5463e0J63p5l3J5J4j0p0j02J93j0O3p5j80J95K5n1L6j66J09L0j00m0J01RM1L4
5489F6M1j50P6m1r4J77j02Q1k7j08P0n2K08r8r1lL1ol8P8j46J97j51Q9M4n4j1
5516a4L3lo1KL4P8j28n3J22k7K3q5N0L9k4j5n2j5J15kj91J68J6o9J5K4N0j8M2
5545E4j36l1J38j50K1J02o0K04j55M9J5m0p4J0k3j9P4J5L7jl5n8N6r5J19p5l4
5572i2J26j26o0R6J05j19j6K3K4P5L0J2p1P1k5o3K4kj14Q5N1M4j6l5J5j49K28
5599A21j34J2m0L1o6J17n3O0n9M1kO4j16J6RM2j27j3J73Qk52J33K4j3o7R1j7K3
$$ plain form
5627 6 -46 -88 -77 87 9 17 26 46 43 82 36 37 13 -30 -25 35 73 -51 -64 -35 -52 -50 -37 29 17 3 -29 -29 -24 130 -138 -101 28
5660 28 30 60 -36 -38 -3 -47 -57 59 -5 -32 -72 37 23 53 -60 -49 39 6 14 -86 17 -51 75 14 -30 24 55 62 -65
5689 -65 -162 -61 -91 28 -63 17 -37 6 178 -32 -98 60 -17 -82 -53 -96 -69 -20 -27 10 -54 40 126 -44 -54 54 -68
5716 -68 -44 4 -58 -78 -63 3 70 12 -2 -78 14 9 36 -43 -7 27 -14 32 88 31 -106 -10 16 -34 -95 -38 71 9 -61 -5
5746 -5 -58 -147 55 -21 -32 -43 -2 73 -101 25 -20 -8 -47 86 -53 63 -27 -3 43 -53 79 -31 -21 18 -36 -72 -17
5773 -17 34 -59 -34 -65 -6 -51 -68 -30 -2 44 11 133 -77 -48 -69 -61 -32 84 -43 63 -26 73 14 -30 50 -11 4 -13
5801 -13 -9 -30 79 80 22 41 47 47 -37 41 -96 -84 10 -52 -88 2 -2 73 9 -58 -40 -52 42 11 91 111 122 13 -111 6
5831 6 -78 18 -73 14 -114 -26 15 24 47 3 -98 -43 80 -39 -2 -170 -22 51 -33 45 -4 19 -37 -72 0 55 -42 56
$$ packed form
5627Fn2m2J1J64p8QRK0lL9m6Jk4m3NO0L8j24j3K9j7KJ3O6j2j4l2%NJ54k68L7J29
5660B8KL0r6kL5m4j0J16o4k7m0J09j4L0j13J1Q8l3Qj00J03o8J26o1m4N4L1Pj27
5689f5r7J01l0J19r1Q0n4M3J72k10o6J58p7o5K9m3K7M9pL7o4R4Q6j70j0J08j22
5716f8K4M8o2k0J5O6O7n8j4p6R2nK7p9L6L4m1M6N6n7j37R6K6n0o1N7J09o2p0N6
5746en3q9K02p6j1j1M1P5j74J26m5J2l9J33j39J16r0K4M6r6J32j10J0L9n4l6N5
5773a7N1r3K5l1N9m5j7L8K8M6l3J22k10K9k1QK9J16j27J06q9R9n9m4Q0o1J5j7
5801a3Mk1J09Jn8J9O%q4P8j37J2R4o2l6R0mP5o4o7J8j2R4l1Q0K0J1j09j24J17
5831Fq4R6r1Q7j28Q8M1RK3m4j01N5J23j19L7j68J48P3q4P8m9K3n6l5P2N5r7R8
$$ plain form
5859 56 -17 12 -24 -31 -149 21 34 7 67 -74 -48 -2 140 136 15 23 46 43 29 12 -48 -56 3 88 42 68 10 22 -11 -22
5889 -22 -59 -62 3 10 -27 8 -69 -19 -35 -127 -153 25 46 60 86 -90 -37 -96 -20 -16 -82 -53 -34 -80 0 58 -58 -63 72 -6
5919 -6 -28 -64 87 22 -3 -74 -3 -39 33 -69 -82 9 24 34 -48 11 74 -63 38 16 15 -21 -7 51 52 13 -83 88 91 -4
5949 -4 73 -96 26 -3 30 70 41 40 -28 -28 -23 24 16 70 183 11 -18 -135 -57 -121 -46 -65 -34 -140 -34 30 13 27 -12
5978 -12 -60 23 90 0 98 13 -92 -37 8 -56 65 -35 97 -46 -94 -47 -10 -16 -74 -47 -12 -73 48 43 28 -98 -34 39
6006 39 11 80 176 136 26 -9 24 -3 -53 -30 -24 -50 37 -8 -164 -89 5 71 61 103 32 -14 78 34 -39 -139 -7 -57 8
6035 8 -4 0 43 -63 61 78 -82 -48 48 52 -68 -51 36 -111 71 38 -79 37 -74 -18 7 4 -31 14 47 -103 -73
6062 -73 0 26 -58 6 -67 39 -87 56 43 -60 79 31 -92 86 -70 -57 27 -33 4 -66 -4 -9 -24 46 83 -88
$$ packed form
5859E6p3K9l6pj18J70J3k7O0j41K6M6J42mj21QK3lj4j7o0qN9Q5m6K6n8J2l3j1
5889b2l7lO5Pl7L5p7N0j6r2k6J78K1J4K6j76N3n9P6Mo6K9J9m6Q0N8j16nJ35p8
5919fk2l6J51o5k5p1P1l6P2j02j3R1J5J0q2N9O3j37J01k2jl6J4N8Jl9r6J71Lr5
5949dP7j69J22k9L3M0k9jo8%NM7qN4J13j72k9j17P8o4P5j9L1j06J06O4j7J4l9
5978a2m8Q3O7r0R8q5j05N5M5o4J21j00J32j43m8M7L7on8K7L5o1J21nj5j26O4P3
6006C9k8O9R6m0j10l5L3k7n0K3Ok6Q7m5j56P5R4O6j0M2p1m6R2m4p3j00J32n0O5
6035Hj2MM3j06J24J7j60L4R6Mj20J7Q7j47J82l3j17J16j11N6K5ll5M5L3j50L0
6062g3P3K6q4O4p3J06j26J43j3j03J39m8j23J78j56J3Q4o0L7p0O2nj5P0L7j71
$$ plain form
6088 -88 67 -3 -63 3 -113 -73 3 -51 -49 34 7 -35 -45 -61 -57 -23 -13 -22 51 -40 51 6 -15 31 102 -81 -90 -87 67 131 -18
6119 -18 -8 -15 -46 -81 16 21 -34 94 -77 14 87 10 -19 41 53 -9 1 -64 -32 -31 12 -86 -45 40 41 -107 -3 -26 40 25
6149 25 -120 65 23 -73 -8 84 -21 102 -41 72 -35 -58 -46 57 48 -30 -26 -9 51 28 -63 -11 -37 -126 -28 -22 21 59
6177 59 -72 71 -13 -26 -11 47 133 -6 -22 64 -58 -65 -60 54 -77 -33 -46 -35 -53 -40 58 -16 45 11 -63 30 100 2
6205 2 12 18 -27 87 -123 -14 50 97 54 7 70 -72 -5 -77 -12 26 70 -7 -95 -5 70 -35 -67 -47 71 -95 11
6232 11 84 -20 -19 7 16 -4 0 -8 27 -21 -27 -13 -32 79 -8 -14 55 5 -32 -15 130 -23 -130 -34 -35 -1 63 -31 27 -91 36
6263 36 94 -20 -26 25 4 35 25 -37 41 -29 4 -54 -98 -56 97 42 36 14 -34 -7 1 -24 -26 -21 -88 -96 47 17 5 54 -28 90
6295 90 -51 -51 -23 -47 8 -11 -16 -4 -58 -45 -32 96 -63 -23 90 94 -5 110 -9 18 26 11 71 84 15 -8 14 38 33 61
$$ packed form
6088h8J55p0o0O6j16M0P6n4KQ3k7m2j0j6ML4J0rP3r1R1m5k1M6P1j83rLJ54O4j49
6119a8J0pl1l5R7Nn5J28j71R1P3p7k9O0J2o2J0o5L2JM3r8M1Q5Jj48J04k3O6j5
6149B5j45J85m2r6O5R2j05J23j43J13j07k3J2J03rp8MJ7O0k3r1N2k6q9R8OM3L8
6177E9j31J43q4j3J5N8Q6j39j6Q6j22pNJ14j31M4j3J1j8J3R8p4O1l4p4R3P0r8
6205BJ0Om5J14k10J09O4M7m3m7O3j42O7p2O5L8M4p7q8R0P5j05l2K0J18j66J06
6232A1P3j04JK6Rk0MqL5m8oJ4j9J11q7oO9n0l7J7J45j53j07R6jL4O4r4N8j18J27
6263C6N8j14oN1k1L1j0o2P8p0L3n8m4M2J53n5ok2m8K7Qk5kNo7qJ43l0j2M9q2J18
6295I0j41%K8k4N5j9nJ2n4J3J3J28j59M0J13Mr9J15j19K7Qj5O0J3o9k3K2K4nK8
$$ plain form
6325 61 15 -18 -56 82 19 -163 34 -88 15 -9 11 74 37 33 -80 33 0 -44 51 -113 85 100 56 -36 -20 23
6351 23 -37 -59 -11 -51 -39 -115 16 -83 32 34 2 13 -2 94 63 -9 121 9 137 55 -50 -45 3 -143 -17 -5 -77
6378 -77 124 31 23 48 63 -30 -84 -27 -8 -60 -102 27 26 -8 49 -21 41 38 9 -87 2 97 -110 -64 -72 -82 13 -31 -7 65 -44
6409 -44 -38 -65 -79 103 -50 46 -17 26 49 25 -29 -13 126 26 -28 25 1 33 -11 -103 -51 13 14 -10 20 28 27 44 -125 141
6439 141 7 38 -11 34 -101 -12 -48 18 12 -9 12 73 -11 55 58 -34 -17 86 12 -35 -42 24 4 45 55 -101 63 42 19
6468 19 -10 30 -5 -5 140 10 -54 -15 29 9 0 10 -23 -34 35 -76 -22 73 -49 -38 7 63 56 15 -60 104 -62 43
6496 43 7 25 -83 2 -94 39 77 4 73 -10 -67 -24 -47 -35 16 122 -29 -29 10 79 48 39 4 -96 0 -130 -78 59
6524 59 99 -62 63 -16 14 -10 -54 -93 -56 15 0 39 -24 -52 -20 -140 98 114 59 -51 34 7 47 24 -69 -86 53
$$ packed form
6325F1m6l3l8J38o3j82J97j22J03k4K0O3l7mj13J13l3m4R5j64J98J5m4r2J6M3
6351B3o0k2M8m0J2p6J31r9J15Kl2J1j5R6l1p2J30j12J28q2j05NM8j46J26J2p2
6378g7K01r3qK5J5r3n4N7J9n2m2J29jl4N7p0O2lk9r6Q9R5k07M6qj0R5m4K4P2j09
6409d4Ok7j4J82j53R6o3M3K3k4n4J6J39j00n4N3k4L2m4r2N2O4Jk4L0QjJ7j69K66
6439A41j34L1m9M5j35Q9l6O6ok1K1O1q4O6Lr2J7J03p4m7pO6k0M1J0j56J64k1k3
6468A9k9M0l5%J45j30o4L9M4k0rJ0l3j1O9j11N4R5j22J1M5N6pm1p5J64j66J05
6496D3l6J8j08Q5r6J33L8p3O9q3n7M3k3J2N1J06j51%L9O9l1rl5j00R6j30N2J37
6524E9M0j61J25p9L0k4m4l9L7P1j5L9o3k8L2j20K38J6n5j10Q5k7M0k3r3j7J39
$$ plain form
6551 53 0 69 -4 86 -15 7 11 -73 67 85 56 -7 -7 -7 22 112 -3 42 129 -18 -4 -26 -93 17 -71 49 27 10 -28
6580 -28 59 91 68 -78 -46 -56 12 -9 -61 10 30 -133 -29 39 23 23 35 34 -59 95 35 34 -27 5 73 -120 0 6 89
6609 89 -22 108 44 -58 -55 2 66 -55 -12 -58 20 -18 13 -27 23 64 -37 -2 -67 -36 14 -13 -161 24 -45 -48 -29 -48
6637 -48 59 40 10 -22 -49 57 61 -15 -17 -71 90 21 -10 -139 40 47 -18 52 -2 34 93 -62 25 13 25 14 -41 -181
6665 -181 -75 1 57 -42 23 -2 52 -34 -70 -6 -85 -22 -46 -1 14 108 -63 51 -56 117 65 36 46 -121 85 -14
6691 -14 48 -58 25 -5 -98 -21 20 24 -27 -34 43 -135 -62 -1 -68 49 -91 103 -23 19 26 11 21 -47 -1 24 29 26 5 -22
6721 -22 34 -50 -44 -59 -55 21 59 -50 4 -7 -33 -11 45 38 -7 -35 -58 -71 -50 -37 20 49 -18 6 53 -11 -16 84 -5 -84 -69
6752 -69 5 45 41 -32 -5 30 91 79 -84 24 22 134 -114 -35 -41 -72 44 6 102 19 41 -80 59 99 -3 61 -22 40
$$ packed form
6551E3n3O9p3R0j01K2Mq4J40J8k9o3%%K9R0j15M5Q7j47J4k2o7J10q8J20k2j7l8
6580b8Q7L2k3j46L2j0O8k1n2P1K0j63J04O8j6%J2jr3J54o0jo1L2O8j93J20OQ3
6609H9j11J30o4j02LN7O4j21M3m6P8l8L1m0N0M1j01L5o5L1N0k7j48J85o9lJ9j9
6637d8J07j9l0l2k7J06Mp6kn4J61o9l1j29J79Po5P0n4L6N9j55Q7j2J2j1n5j40
6665a81J06P6N6r9O5k5N4q6l6O4p9O3k4M5J5R4j71J14j07J73n2k9J0j67K06r9
6691a4O2j06Q3l0r3P7M1Mn1pP7j78P3O1o7J17j40J94j26M2Pj5J0o8M6K5Nlk1k7
6721b2N6q4Oj5MP6L8j09N4j1k6K2N6pm5k8k3j3K1J3N7K9o7K4M7o4nJ00q9p9J5
6752f9P4M0mp3K7L5O1j2j63J08kJ12k48P9ol1J16l8R6q3K2j21J39M0j02O4q3O2
$$ plain form
6780 40 0 52 79 -62 -5 24 24 -2 -94 22 7 87 22 85 74 -60 64 27 76 28 -8 -4 -42 -1 -48 -32 -3 -86 98
6809 98 -65 -19 -21 60 -45 -5 -127 -28 57 28 -98 -30 51 31 19 -41 23 48 145 82 9 75 19 18 -56 -31 -100 89 -108
6838 -108 41 -17 61 -1 59 -34 4 68 5 61 -22 -37 -44 82 53 -10 23 -71 34 -70 -69 19 -65 -23 -61 -25 -22 37 -35
6867 -35 23 8 -50 31 -51 103 -10 35 67 47 76 -37 -58 3 -27 -49 3 25 32 21 -87 14 51 23 -51 -12 -42 6
6895 6 126 17 21 86 32 -14 128 15 98 52 -53 -70 60 2 126 -43 40 74 60 56 0 -3 -40 -19 -46 57 -6 34
6923 34 5 13 114 -53 34 -90 5 -38 -106 -29 69 13 3 34 -17 90 -11 -13 -10 16 -32 -35 -12 -28 26 -67 58 93 -80
6952 -80 -116 -9 -54 0 28 -83 89 17 11 60 -24 37 -6 121 -29 -16 -24 -30 -56 -33 -81 88 -15 -71 45 -13 38 2
6980 2 47 -77 -89 -35 54 22 -64 -79 -2 -8 82 30 -12 44 46 -2 -96 7 91 -24 22 11 -26 77 -8 25 -6 51 42 5
$$ packed form
6780D0m0N2K7j41N7K9%k6r2J16j5Q0o5O3j1j34J24l7M9m8l6Ml8M1m7J6K9q3J84
6809I8j63M6kQ1j05M0j22R9Q5k9j26O8Q1k0j2o0O4K5R7o3p3O6n6jp4K5o9J89j97
6838a08J49n8P8o2O0r3L8O4o3N6q3j5pJ26k9o3L3r4J05j04JQ8q4M2l8L6LN9p2
6867c5N8j5n8Q1q2J54j13M5L2k0K9j13k1O1l0k2N2K2Pj1j08J01L7k8p4L9l0M8
6895FJ20j09MO5n4m6J42j13Q3m6j05j7J30n8J24j69Q3L4j4mn6ll7K1k7J03o3M0
6923C4k9QJ01j67Q7j24R5m3o8P7R8n6j0L1n1J07j01kLK6m8lK3j6N4r3J25L5j73
6952h0l6J07m5N4K8j11J72p2oM9q4O1m3J27j50J3qok6K3m8J69j03n6J16n8N1l6
6980BM5j24j2N4Q9l2q6j5P7oR0n2m2N6Km8r4J03Q4j15M6j1l7J03q5L3l1N7rl7
$$ plain form
7010 5 -12 -33 -48 -36 -88 -14 51 51 -36 -94 -69 8 -56 19 -58 -78 20 61 -60 65 -23 75 -26 -11 58 17 64 82 -24
7039 -24 21 4 73 136 30 44 -38 -33 59 67 -48 31 -74 -73 82 59 132 26 -59 -30 73 5 80 -41 -34 187 -59 1
7067 1 -74 -9 -110 33 2 -112 80 63 -4 -27 67 -52 -7 10 77 63 -23 -20 -9 -86 -118 46 12 -101 32 -100 75
7094 75 88 -42 36 -129 -14 -72 -48 -7 94 -16 -14 -106 112 14 122 -81 -130 55 20 -22 -15 -23 -8 -6 -66 34 57
7121 57 -32 -83 45 -33 -49 -27 11 -20 -14 21 -27 -18 -38 -20 63 -12 0 26 10 7 89 15 -34 -19 27 -92 -114 14 -63 -38
7151 -38 -43 76 -77 48 23 -93 -47 8 64 35 64 25 4 0 -8 -59 -7 -55 -11 -99 2 -7 -12 55 110 -15 -96 -27 -3 -28
7181 -28 -93 114 28 -54 -65 18 53 -135 -50 -106 56 4 16 -49 -48 32 19 4 -10 32 16 -17 -14 -18 18 106 -59 64 -113
7210 -113 -58 40 -36 -20 12 -2 -31 71 119 23 46 -45 -11 -58 -66 -73 40 79 16 83 -17 -47 102 -12 46 27 37 -2
$$ packed form
7010Ej7k1j5J2n2P4O5%q7n8K5P7o4P5p7k0R8M1j21J25q8R8j01J5O9m1M7J8j06
7039b4M5j7O9O3j06J4q2NR2Qj15P9j05JJ55k3P3j06q5K9J03o8P5j21PK21k46O0
7067Ap5O5j01J43l1j14J92j7o7k3R4j19M5J7O7j4q6LJ1p7l2J64l4j13J33j32J75
7094G5J3j30P8j65J15n8K4M1J01j10Kr2K18r8J08k03m9J85l5m2PqJ5Ko0J00K3
7121E7q9n1J28p8j6K2L8l1OL5m8Rk0J8Q3p5J2K6j6lQ2p4m9J5M6j19k2J28p7K5
7151c8nJ19j53J25k5j16M6N5N6k9K9l9k1mqn1N2m8M4q8J01rnO7N5j25q1O9K4k5
7181b8o5K07q6q2j1Q3L5j88Q5n6J62n2J2o5JQ0j3j5j4M2j6l3LmL6Q8j65J23j77
7210a13N5R8p6J6L2j4k9J02M8r6K3r1L4m7qpJ13L9o3O7j00l0J49j14N8j9J0l9
$$ plain form
7238 -2 -34 9 6 59 -44 40 -116 -97 -74 52 -21 54 -1 58 -79 73 -112 -60 -64 64 40 -38 -66 41 -12 -16 -56 -116
7266 -116 34 -62 132 -68 151 -43 35 -23 -51 -33 10 6 44 -18 -16 -60 58 100 -21 20 -21 73 13 -89 32 -15
7292 -15 -154 3 75 -40 -43 6 -50 -31 57 98 77 -35 -3 -58 2 7 -4 61 -125 98 -19 -31 -66 119 -51 57
7318 57 -25 -48 -90 30 23 -22 -43 38 -27 15 40 108 -10 -71 -6 -82 -74 70 20 -29 -33 36 -47 129 123 -104 -30 75 23
7347 23 37 -39 -67 -99 -85 96 15 -76 -1 -72 35 56 -70 63 39 38 -19 -62 18 -16 -14 84 -7 49 3 22 13 -41 -18 136
7377 136 46 24 -52 -52 14 -85 -34 -5 59 -93 -74 -95 -33 -28 28 16 -11 33 -54 -22 77 61 -18 -93 -25 3 64 109 -69 0
7407 0 -55 -63 -77 79 19 -17 7 49 -10 19 -73 -38 9 5 -84 82 -36 87 13 10 13 64 -78 -32 -24 40 -69 -25 99 43
7437 43 -2 -110 17 -168 -5 -10 76 25 -60 67 36 56 -47 10 -36 -24 9 82 47 -23 -73 49 25 -40 -61 -22 23
$$ packed form
7238bl2M3lN3j03Q4j56J9K3J26p3P5n5N9j37J52j85N2mJ28k4p8k8J07n3mm0o0
7266a16J50r6J94k00K19j94P8n8k8J8M3mL8o2Km4J18M2j21M1m1R4o0j02J21m7
7292a5j39J57P2j15lM9n6J9Q8M1k1j12L2n5O0Nj1O5j86K23j17j2l5J85j70J08
7318E7q2k3m2J20pm5k1Q1o5M2K5O8j18o1O5p6QJ44n0m9mO9q3J76ok27P4J05n2
7347B3J4p6k8l2J4J81q1r1P5p1J07K1j26J33k4jn7m3Q0l4KR8r1N6m6J9rn4K3J54
7377A36r0k2p6%O6r9N1K9O4j52J9k1O2NN6j2k7M4q7L2R9j6p9p5O8K8O1M5j78O9
7407@n5qj4J56o0l6K4M2n9K9r2L5M7mq9J66j18J23p4lLN1j42M6QO4j09M4J24n6
7437D3m5j08J27j85J63nQ6n1q5J27l1K0j03N7m6J2L3P3l5p0n0J22k4o5k1L9M5
$$ plain form
7464 23 18 -19 97 -95 55 68 -13 37 -96 -5 31 -14 -43 84 11 -57 14 -18 -24 -40 102 -19 48 -114 47 18 20
7491 20 36 37 99 -31 -99 -32 109 -10 -43 -37 -25 -59 97 58 114 75 -56 -47 17 -9 114 -34 -116 8 66 28 0 73
7519 73 17 -35 32 -7 174 -59 -87 -111 31 5 -31 -5 32 -92 -58 12 -74 44 -57 -59 -12 109 -49 -77 -1 25 6
7546 6 -36 -133 22 -95 167 -12 5 -14 -68 -23 -33 -21 -62 -37 10 17 51 57 14 78 7 -45 -12 -89 -76 99 35 -75 18
7575 18 -48 -7 -44 35 87 -108 145 70 -30 -50 -7 -108 -64 2 97 61 30 24 101 -56 -25 -11 57 48 -30 53 97 6 15
7604 15 -104 22 -22 -55 -82 14 6 35 44 42 -51 52 -46 -37 -52 -15 28 53 -25 -37 66 -11 12 56 -19 -60 17 27 -52 75
7634 75 -31 14 -74 59 -40 79 -9 -105 25 4 33 83 -76 3 5 -67 74 33 8 -48 -19 137 -30 63 -37 -75
7660 -75 13 -5 53 -18 -39 -58 46 -20 -4 60 91 51 54 82 -56 100 5 -20 4 20 5 9 -31 -20 70 51 -3 -2 58 -78
$$ packed form
7464B3nl7J16j92J50J3q1N0j33R1L6m5k9J27p3o8P1l2oj6J42j21O7j62J61k9K
7491B0J6JO2j30o8O7J41j19l3OJ2l4J56l9N6l9j31RO4k6J23j48q2J24N8l8k8P3
7519G3n6n2O7l9J81k33k8k4J42k6l6K6L7j24L4P0q6J18j01kM7J21j58k8P6K6j9
7546Fm2r7J55j17K62j79J7j9n4M5j0J2m1K5M7PL4Om3O4p1n2L3p7J3J75o4j10R3
7575A8o6M1l7P9N2j95K53p5j00k0M3j01M4O6R5l6l1oP7j57L1J4O8rp8Q3M4r1R
7604A5j19J26m4l3k7R6qK9Rkr3J03r8Rj5L7M3K5p8j2J03p7K3M4p5m1P7J0p9J27
7634G5j06M5q8J33r9J19q8r6J30k1K9N0j59P9Kp2J41m1k5n6K9J56j67R3j00l8
7660g5Q8j8N8p1k1j9J04o6J6O4L1m0LK8j38J56r5k5K4J6j5Mm0J1R0j9n4JO0j36
$$ plain form
7690 -78 -10 25 24 34 -38 6 -36 56 -23 66 -11 -14 -35 35 72 54 -32 -17 44 42 39 -3 71 182 32 -40 26 60 78 -77 84
7721 84 60 -7 -58 70 -72 -56 -32 -5 23 35 -61 -14 32 -67 -43 63 90 -46 -151 37 -133 14 -25 51 101 128
7747 128 -9 53 115 21 13 -73 -5 7 -80 23 59 -13 20 72 26 28 -27 -5 63 -19 -32 49 29 50 -103 6 -21 80
7775 80 65 -69 30 29 2 -148 -67 -28 129 -50 -19 131 125 -112 34 22 37 -27 -8 -8 -81 -5 45 122 62 29 3 -46
7803 -46 -98 -56 24 42 -39 6 81 117 2 34 -21 128 -47 -25 -36 -61 -44 -114 -119 36 15 -192 -60 -100 -73 -56 -96 5
7831 5 42 -43 41 38 1 73 5 -108 -13 -19 -33 -81 11 124 -3 20 -42 -95 76 53 70 -45 -22 46 7 124 77 110 -19
7860 -19 -11 90 12 -13 -90 -5 49 138 -42 -10 -141 66 -74 65 -64 -23 -33 -23 -14 -85 12 24 -31 -52 52 -52 -4
7887 -4 30 54 -44 9 -32 -91 19 12 -49 20 14 108 25 24 21 22 25 67 -89 -74 -41 10 -22 -26 -3 89 -26 -59 111 60 166 9
$$ packed form
7690g8O8L5jJ0p2M4m2R2p9Q9p7lk1P0L7j8q6J5O1klm2P4J11j50p2O6L4J8j55J61
7721H4k4o7n1J28j42J6K4K7K8J2r6M7M6r9K4J06K7j36j05J88j70J47l9P6N0K7
7747A28j37O2O2r4qq6O8J2q7J03L6p2L3N2m6Kn5K2O8q2j3Q1k0K1j53J09k7J01
7775H0j5j34R9jk7j50Q1L9J57j79L1J50ok37J46j2J5o4J9%p3P6N0P7o0l3k6m9
7803d6n2M2Q0J8q1M5P5L6j15L2n5J49j75K2j1k5J7p0nJ55k1k07J32m0K7J7m0J01
7831EL7q5Q4ll7P2o8j13R5oj4m8R2J13j27K3o2n3J71k3J7j15K3O8l9J17m7L3j29
7860a9QJ01p8k5p7Q5N4Q9j80L2j31K07j40J39j29M1j0J0Rp1R7J2n5k1J04j04M8
7887dL4K4r8N3m1n9J10po1O9oR4q3jlJLM2j56J5L3N1l2mK3R2j15l3J70n1J06j57
$$ plain form
7919 9 -44 47 -35 -5 12 40 53 38 25 22 32 50 18 -9 -84 -37 132 57 89 31 87 -23 -56 -13 -4 -55 -36 51 72 -47
7949 -47 -17 62 -71 -54 -8 71 74 33 53 -62 -47 19 -40 22 -45 -121 66 -41 43 23 -38 -31 -37 61 -65 171 95 -15
7977 -15 11 4 71 2 -107 -14 -60 61 123 -2 17 2 -31 -33 7 45 -33 16 -38 53 -94 -31 65 17 1 -51 59 -34 -75
8006 -75 -50 -90 -18 -33 16 -67 -130 -61 160 84 -15 -37 46 120 -5 -75 49 -45 68 78 57 17 -10 -31 -21 24 4 24
8034 24 -116 -90 -7 42 -37 48 -49 -39 57 -145 -16 -63 -11 -2 57 -16 -34 46 -15 26 158 -104 -147 49 -49 -67 53
8061 53 -5 70 -11 -23 -10 -74 -4 -21 24 125 -18 17 39 -16 1 56 -25 49 59 -54 -56 56 81 -43 -13 23 17 -186
8089 -186 -29 -11 -55 17 5 45 -117 -10 20 -24 11 -37 -94 84 8 66 -49 -20 13 -47 -47 20 -28 -69 -40 119 -74
8116 -74 138 -74 -112 -14 48 -17 -17 -10 5 22 -54 -26 7 -14 87 63 -27 106 -67 29 84 24 79 -72 -5 9 27 -47
$$ packed form
7919In3R1q2L0J7K8J3j5j3lJ0J8l2k7p5M7J69p5L2n8N6j10l3M3Rn1J9Q7K1j19
7949d7L0P9j33J7M6P9Lm1K0j15J5O6n9O2o7p6J87j07Q4k0o1PoR8j26K36p6j10
7977a5K6pO7o9j09R3m6J21O2j25J9j5l3kM0L8p8M9n4R1j47O3R6m8j6n2J10r3m1
8006g5K5m0P2j5M9q3o3O9K21p6r9k2Q3P4j25p0J24r4J13J0k1m0k7k1J0M5k0K0
8034B4j40K6Q3M9p9Q5r7J0R6k02J29m7N2RN9p3j8Q0o1M1J32k62m3J96r8j8J20
8061E3n8P5q1j2J3o4P0j7M5J01j43L5K2n5J7N5q1P4J0j13kJ12K5j24L0L6ok03
8089a86J57J8m4P2j2M0j62J07L0m4L5m8n7J78p6N8j15K9L3o0%O7m8m1K9J59j93
8116g4K12k12l8R8O2o5%PJ5J7p6K8L3k1J01k4r0J33j73R6N5o0N5j51O7J4J8p4
$$ plain form
8144 -47 2 -8 -58 -18 16 74 -17 27 31 53 -32 -8 -16 -42 -56 54 -62 -5 33 45 -25 29 60 -44 8 -26 -17 102 19 70
8174 70 33 19 84 -8 42 -124 108 -20 -5 -13 62 -53 33 -40 19 -5 -35
$$ packed form
8144d7M9j0n0M0L4N8r1M4MK2q5K4qk6j4J10j16N7L8J2p0N4L1j04N2l4RJ19q3N1
8174G0l7j4O5r2N0j66K32j28J5qP5j15Q6p3N9k4l0
8191c5
$$ Imaginary data points
##PAGE= N=2
##DATA TABLE= (X++(I..I)), XYDATA
$$ plain form
0 0 0 0 0 0 0 0 0 0 0 0 0 0 0 0 -8 8 -8 8 -8 16 -16 16 -24 24 -32 32 -40 48 -56 64 -72 80 -96 104 -120 136
36 136 -152 168 -189 209 -233 260 -289 321 -353 393 -433 475 -524 579 -637 701 -773 853 -941
55 -941 1043 -1159 1289 -1443 1624 -1840 2109 -2446 2885 -3486 4356 -5746 8312 -14618 65028
70 65028 49546 -56756 50518 40872 -48060 -20722 30891 -33308 -31214 12859 -25132 -50256
82 -50256 13479 8642 -29151 9571 30365 -14502 587 27269 -4597 -4758 30668 8256 -10244
95 -10244 12350 2763 -19754 2835 4116 -26825 -15798 6502 -16214 -21397 5472 6192 4079
108 4079 21079 14329 8575 24461 6890 -16387 9055 12868 -22642 -11181 12876 -21718 -35247
121 -35247 5905 2494 -26426 5273 26972 -6963 -5601 22054 1777 -9685 21117 17348 -9084
$$ packed form
0@%%%%%%%%%%%%%%qJ6j6J6j6K4l2L2m0M8n6O4p2Q8j04J20j36J52j76K00k24K56
36A36k88L20l57L98m42M93n49O10o74P46q26R08r99J103j216J338j474J626j794
55i41J984k202K448k732L067l464L949m555N331o371P842j0102J4058k2930P9646
70F5028j5482j06302J07274r646q8932K7338N1613o4199K094M4073l7991k5124
82e0256O3735m837l7793L8722K0794m4867J5089K6682l1866j61L5426k2412j8500
95a0244K2594r587k2517K2589J281l0941J1027K2300k2716n183K6869P20k113
108D079J7000o750n754J5886j7571k3277K5442L813l5510J1461K4057l4594j3529
121c5247M1152l411k8920L1699K1699l3935J362K7655k0277j1462L0802l769k6432
$$ plain form
134 -9084 6031 16516 -10431 -13441 6788 -3310 -16376 -3990 -4617 -16044 -5970 2777 -3009
147 -3009 2493 12008 7955 5276 8710 6830 3582 4273 3211 -1686 -5342 -7406 -7250 -6155 -8002 -5173
163 -5173 3634 1301 -4685 3686 6990 -2791 1303 10275 1882 -378 9082 3294 -7078 481 4160
178 4160 -7382 -6061 3868 -4618 -11170 198 -635 -8889 1887 8973 -216 1447 10759 6330 -74
193 -74 3728 5079 -677 -3286 -2518 -5270 -5979 -4175 -4531 -3197 -235 -478 401 1499 637 4042 5834
210 5834 1148 2235 6058 705 -2789 2006 1253 -4090 -1804 510 -5080 -5390 -18 -3903 -5948 2471
226 2471 2127 -2940 4606 7361 -903 2514 9006 815 -3484 4288 2396 -7689 -3990 1688 -5096
241 -5096 -6364 675 -1477 -3856 2124 1825 -1820 2974 5001 801 1375 4118 2313 483 1178 340
$$ packed form
134i084J5115J0485k6947l010K0229j0098j3066J2386o27j1427J0074Q747n786
147c009N502R515m053k679L434j880l248O91j062m897l656k064J56J095j847K829
163e173Q807k333n986Q371L304r781M094Q972q393k260R460n788j0372P559L679
178D160j1542J321R929q486o552J1368q33q254J0776P086r189J663R312m429o404
193g4L802J351n756k609P68k752p09J804l56J334K962k43Q79J098q62L405J792
210E834m686J087L823n353l494M795p53n343K286K314n590l10N372l885k045Q419
226B471l44n067P546K755q264L417O492q191m299P772j892j0085L699N678o784
241e096j268P039k152k379N980k99l645M794K027m200N74K743j805j830O95q38
$$ plain form
257 340 -890 -174 -2285 -4364 -1805 -1986 -4887 -1990 620 -1510 449 3181 1529 2366 4513 2548
273 2548 1410 2989 823 -1868 -30 -191 -4613 -2711 1060 -3486 -4624 1719 571 -3611 683
288 683 3017 -859 436 3485 894 173 3517 2066 -1301 1312 2461 -2198 -2176 369 -2357 -3488
304 -3488 -1165 -2116 -2379 156 757 -215 1136 2932 2094 1119 2002 1964 385 39 -78 -808 -947 -1021 -1104
323 -1104 -879 -1421 -947 397 -1039 -1543 1147 1224 -1130 -176 2113 1186 -96 1400 2044 322 494 780
341 780 -995 -786 272 -1825 -2246 -314 -823 -1764 -85 774 -272 -11 1641 949 -234 1326 1709
358 1709 -549 -309 969 -234 -662 145 -15 -672 -331 -47 -847 -1473 140 497 -1296 -1011 1135 695
376 695 -742 -11 1779 1085 -601 380 1114 -430 -787 37 -846 -629 43 -803 -936 504 603 -448 -182
$$ packed form
257C40j230P16k111k079K559j81k901K897K610k130J959K732j652Q37K147j965
273B548j138J579k166k691J838j61m422J902L771m546j138O343j148m182M294
288F83K334l876J295L049k591p21L344j451l367K613J149m659K2K545k726j131
304c488K323r51k63K535O01r72J351J796q38r75Q83l8j579l46j17p30j39p4q3
323a104K25n42M74J344j436n04K690P7k354R54K289r27j282J496O44j722J72K86
341G80j775K09J058k097m21J932n09r41J679Q59j046K61J652o92j183J560L83
358A709k258K40J278j203m28Q07j60o57L41K84q00o26J613L57j793K85K146m40
376F95j437P31J790o94j686R81P34j544l57Q24q83K17O72q46j33J440R9j051K66
$$ plain form
395 -182 1263 552 -685 706 1015 -821 -32 942 -485 -673 448 91 -846 -82 449 -553 -723 597
413 597 -156 -1135 463 875 -1011 -416 1440 720 -700 39 1003 206 -807 124 200 -392 -210 -261 -826
432 -826 -35 528 -37 -183 604 997 -38 -692 650 711 -726 -470 263 -727 -955 -77 286 -359 -54 1254
452 1254 346 -670 724 933 -528 316 1033 -401 -655 568 -311 -1274 113 757 -929 -966 825 -310
470 -310 -1762 188 679 -712 407 1417 -85 -90 1655 799 -673 788 1515 -963 -1378 333 -752
487 -752 -1942 -103 184 -896 -216 735 -245 -416 920 1533 424 153 982 468 -769 -568 304 174
505 174 -402 -425 -110 -987 -1257 -240 -294 -724 687 945 -435 -33 1418 503 100 1488 1341 -49 -141
524 -141 321 -1270 -1577 222 -662 -1769 -77 -75 -1590 -474 1151 137 143 1890 1362 -647 421 1494
$$ packed form
395a82J445p11j237J391L09j836P89R74j427j88J121l57r37P64N31j002j70J320
413E97p53r79J598M12j886N95J856p20j420P39R64p97j013R31P6n92J82n1n65
432h26P91N63n65j46P87L93j035o54J342O1j437K56P33r90k28Q78L63o45L05J308
452A254r08j016J394K09j461Q44P17j434k54J223q79r63J387O44j686l7J791j135
470c10j452J950M91j391J119J010j502nJ745q56j472J461P27k478m15J711j085
487g52j190J839K87j080O80R51r80j71J336O13j109k71Q29n14j237K01Q72j30
505A74n76k3L15q77k70J017n4m30J411K58j380M02J451r15m03J388j47j390r2
524a41M62j591l07J799q84j107J692Kj515J116J625j014OJ747n28k009J068J073
$$ plain form
542 1494 -348 -714 1431 694 -1243 -734 -286 -1120 -1017 -236 -99 -563 -205 29 -667 -96 1441 1095 516
561 516 981 1494 257 -612 -154 352 -655 -770 45 -883 -1596 -356 -312 -827 421 1426 188 -2 954
580 954 545 -446 845 1081 -478 -71 970 -821 -1526 236 217 -905 -406 303 -726 -956 -29 -58 -178
599 -178 982 1177 -100 282 1129 -2 -317 602 535 -485 -636 -394 -611 -953 -403 235 45 59 426 154
619 154 -257 135 754 412 -142 460 495 -768 -401 398 -357 -404 417 85 -892 -85 435 -488 -416 955 569
640 569 -300 239 486 -391 107 699 -315 -104 501 -455 -1032 -34 205 -458 -181 777 275 -343 347 297
660 297 -241 317 632 15 -394 -42 -153 -291 -501 24 80 -255 -229 116 -89 -244 476 383 45 327 744
681 744 73 -484 261 422 -567 -297 167 -419 -661 -186 -321 -338 352 264 -236 304 660 72 -97 777 571
$$ packed form
542A494j842l66K145p37j937N09M48q34J03P81J37m64L58K34o96N71J537l46n79
561E16M65N13j237q69M58N06j007j15Q15r28p13J240M4n15J248J005j238j90R56
580I54m09r91J291K36j559M07J041j791p05J762j9j122M99P09j029k30R27k9j20
599a78J160J95j277L82Q47j131l15R19o7j020j51K42k17l42N50O38j90J4L67k72
619A54m11L92O19l42n54O02L5j263L67P99p55m7Q21l32r77Q07N20r23P2J371l86
640E69q69N39K47q77M98N92j014K11O05r56n77R98K39o63K77R58n02o18O90n0
660B97n38N58L15o17m09L52j11j38k10N25N6l35K6L45k05j55P20r3l38K82M17
681G44o71n57P45J61r89K70M64n86k42M75j35j7O90q8n00N40L56n88j69Q74k06
$$ plain form
702 571 -91 264 237 -530 -358 -156 -485 -397 -324 -108 -328 -261 -48 157 39 463 505 370 464 309 292 -57 48
725 48 340 -272 -672 -216 -72 -899 -508 207 -201 -252 130 15 6 305 517 191 420 851 129 -395 388 140
747 140 -551 -198 -36 -591 -538 -121 -437 -480 95 303 -230 161 579 242 281 661 174 -3 401 33 -293
768 -293 68 -75 -282 -371 -300 -98 -133 -93 -98 69 225 257 80 352 371 114 208 100 3 303 17 -250 -98 46
792 46 -302 -609 -29 -82 -370 -174 135 -193 -120 582 212 -62 528 297 -26 86 164 -52 -124 3 -284 -207
814 -207 22 -196 -453 101 283 -253 -182 281 48 -75 211 62 -57 53 187 -41 -157 105 118 -158 -150 44
836 44 -58 -233 -95 -117 -47 14 -98 -9 -42 3 129 -75 -163 212 84 40 -65 127 179 21 -114 125 -5 183
860 183 62 -234 44 291 -75 -260 -23 56 -132 -142 79 76 -34 9 111 -77 150 201 -33 -27 153 -182 -88
$$ packed form
702E71o62L55k7p67J72K02l29Q8P3K16k20O7K13K05j18M24M2j35R4j55j7l49J05
725D8K92o12m00M56J44q27L91P15m08n1L82j15rK99K12l26K29M31p22n24P83k48
747A40o91L53J62n55N3M17l16m3N75K08n33L91M18l37L9L80m87j77M04l68l26
768b93L61j43k07q9P1K02l5M0nJ67J56L2j77K72J9k57R4j08r7L00k86k67J52J44
792D6l48l07N80n3k88J96L09l28P3P02l70k74N90k31l23J12P8k16p2J27k87P7
814b07K29k18k57N54J82n36P1M63k33j23K86j49j19J10J34k28j16K62J3k76QJ94
836D4j02j75J38k2P0O1j12Q9l3M5J26k04q8L75j28m4j05J92N2j58j35K39j30J88
860A83j21k96K78K47l66j85K37P9j88j0K21lj10M3J02j88K27N1k34OJ80l35R4
$$ plain form
883 -88 -37 -73 -39 -146 -60 -114 -85 44 61 -80 -142 -13 127 6 -141 42 262 111 -35 186 80 12 38 -199
907 -199 -129 157 14 -409 -170 181 68 -207 -42 209 31 61 253 -12 8 71 -56 67 -16 70 -55 -184
929 -184 -3 16 -181 -4 9 -73 -56 46 -52 -89 -64 160 272 103 235 333 78 -22 34 177 -90 -77 -198 -176
953 -176 -126 -211 -85 -218 266 29 -169 49 211 103 -14 134 149 37 -78 145 38 -85 78 107 -94 -107
975 -107 -1 -195 -300 -100 -66 -159 -95 165 76 101 260 228 95 138 215 34 -112 -106 51 -100 -113 -93 -31 -79 -66
1000 -66 -172 -134 135 -17 -119 166 71 -10 45 50 160 141 54 168 80 -141 -188 -132 -384 -157 -30 -52 -148 -158 -30
1025 -30 126 73 128 232 89 172 33 -129 16 111 67 -138 -50 59 -115 -169 9 49 -105 81 22 -118 -87 -19
1049 -19 -17 -121 252 160 -20 40 219 20 -129 27 -71 -178 -24 -38 -245 -147 -9 -130 34 36 130 29 13 -10
$$ packed form
883h8N1l6L4j07Q6n4K9J29J7j41o2J29J40j21j47J83K20j51j46K21j06o8K6k37
907a99P0K86j43m23K39L51j13k75J65K51j78L0J92k65K0O3j27J23q3Q6j25j29
929a84J81J9j97J77J3q2J7J02r8l7K5K24J12j69J32R8k55j00N6J43k67J3j21K2
953a76N0q5J26j33M84k37j98K18J62j08j17J48J5j12j15K23j07j23J63K9k01j3
975a07J06j94j05K00L4r3O4K60q9K5J59l2j33M3P7j81j46OJ57j51j3K0O2m8J3
1000f6j06L8K69j52j02K85r5q1N5NJ10j9q7J14q8k21m7N6k52K27J27k2r6j0J28
1025c0J56n3N5J04j43Q3j39j62J45R5m4k05Q8J09j74n4J78M0j54J86n9j40L1O8
1049a9Kj04L73r2j80O0J79j99j49J56r8j07J54j4k07R8J38j21J64KR4j01j6k3
$$ plain form
1073 -10 32 128 12 -16 -36 58 -32 -226 -49 53 -14 -58 -153 -9 3 -119 -91 21 -35 112 -12 35 -7 76 83 -130
1099 -130 -36 57 -40 -104 -70 -102 -52 -16 149 16 -12 86 65 -67 -95 154 24 -136 -10 -76 -69 94 -9 -146 -12
1124 -12 102 90 58 48 72 -116 -106 120 60 -103 -97 34 -104 -56 -86 -48 -84 26 61 -36 79 221 159 67 18 -85
1150 -85 89 76 22 -60 -83 -75 0 -146 -152 -67 -60 -170 -143 85 58 22 57 94 115 99 89 59 23 4 -189 -201 -30 -97 -101
1179 -101 -214 -151 -81 -61 -87 47 82 186 165 62 178 155 1 -41 -15 -6 -22 -150 -82 -49 -173 -26 -45 -91 -115 83
1205 83 39 -51 82 98 142 49 94 121 82 28 -57 19 83 -198 -204 -4 -85 -77 -98 -108 -137 9 -34 62 0 162 58 50 -15
1234 -15 26 -67 12 21 -41 -183 50 5 -104 -4 -21 -90 -42 -86 106 40 33 97 72 151 238 -57 39 72 -37 -48 -125 3
1262 3 -49 -134 -76 -40 -26 -17 43 46 117 94 2 -29 17 1 18 32 -72 83 -39 -30 8 81 -103 120 65 -3 -121 -41 -98
$$ packed form
1073a0M2R6j16k8k0R4r0j94J77J02o7m4r5J44J2j22K8J12n6J47j24M7m2Q3Pk13
1099a30R4R3r7o4L4l2N0L6J65j33k8R8k1j32k8K49j30j60J26o6PJ63j03j37J34
1124a2J14j2l2j0K4j88J0K26o0j63OJ31j38M8l0L8l6J10L5r7J15J42o2r2m9j03
1150h5J74j3n4q2k3QP5j46oQ5Pj10K7K28k7l6L5L7K1j6j0l0l6j9j93j2J71o7m
1179a01j13O3P0K0k6J34L5J04k1j03J16k3j54m2K6Rj6j28O8L3j24J47j9m6k4J98
1205H3m4r0J33J6M4r3M5K7l9n4q5P6O4k81oK00q1Qk1j0k9J46m3R6o2J62j04qo5
1234a5M1r3P9Ro2j42K33m5j09J00j7o9M8m4J92o6pO4k5P9Q7k95R6L3j09j1p7J28
1262Cn2q5N8L6J4RO0LP1k3r2l1M6j6J7J4j04J55j22RL8P3j84K23n5o8j18Q0n7
$$ plain form
1291 -98 -21 8 -66 9 54 43 112 88 -5 -38 -22 -20 -18 -139 -114 9 129 -31 -33 112 42 0 1 -72 -5 -5 46 -103 2
1320 2 123 -71 -38 73 119 9 -20 51 34 -53 5 -22 -13 52 70 23 -15 -96 147 88 26 -75 50 -9 -36 -15 8 21
1348 21 40 27 -26 76 57 -72 -22 -15 -21 -59 -139 -27 -79 18 53 -8 19 60 59 172 40 82 70 5 13 12 35 78 -3 26
1378 26 -58 4 -55 -96 0 -45 -87 -108 19 9 64 13 10 -51 43 24 -81 87 -79 -8 -99 8 14 -60 -57 -75 31 144
1406 144 6 179 19 -61 186 72 81 82 153 21 45 3 -17 26 -33 36 -90 -160 -4 -142 6 -79 66 9 33
1431 33 34 63 99 -87 69 -49 -44 98 -70 -110 47 -46 -142 -135 -91 122 -38 -48 49 17 86 16 8 66 97 50 -14 0
1459 0 -3 100 48 98 -10 -59 38 -11 -62 106 33 -97 65 -17 3 -4 8 -70 134 94 -113 -22 -15 95 -67 -70 4 35
1487 35 -11 -106 71 18 -3 -119 35 77 43 -162 -15 -85 46 13 57 -52 2 32 124 -30 -5 -2 14 -42 97 -11
$$ packed form
1291i8P7K9p4P5M5j1O9k4r3l3J6KKj21K5J23J20j60kJ45p0m2Jp3O7%N1j49J05
1320BJ21j94L3J11M6j10k9P1j7q7N8k7RO5J8m7l8q1K43n9o2j01J25n9k7K1K3J3
1348B1J9j3n3J02j9j29N0Pol8q0J12n2R7L5o1K7M1jJ13j32M2j2o5QjK3M3q1K9
1378B6q4O2n9m1R6m5m2k1J27j0N5n1lo1R4j9j05J68j66P1r1J07Op4Lj8J06J13
1406A44j38J73j60q0K47j14RJP1j32K4m2k0M3n9O9j26p0J56j38J48q5J45n7K4
1431C3JK9L6j86J56j18NJ42j68m0J57r3r6PM4K13j60j0R7l2O9p0qN8L1m7o4J4
1459@lJ03n2N0j08m9R7m9n1J68p3j30J62q2K0pJ2p8K04m0k07R1PJ10j62lP4L1
1487C5m6r5J77n3k1j16J54M2l4k05J47p0J31l3M4j09N4L0R2j54K5LJ6n6J39j08
$$ plain form
1513 -11 -76 -97 59 85 8 94 54 42 -87 62 35 -56 -6 42 30 -19 -111 7 -70 -118 148 24 -91 -69 -63 -21 88
1540 88 -34 2 14 47 89 -101 42 -12 -18 -19 23 -80 -63 -116 -39 -55 69 -22 -59 -3 22 72 -32 -73 51 34 61 62
1568 62 -134 -11 87 -15 21 85 21 55 -84 -26 109 -67 -14 48 8 -41 -34 -54 -6 -67 24 27 71 99 62 53 -47 -18
1596 -18 59 -19 -90 -24 -15 -102 -130 -104 119 -99 -44 32 51 -13 -32 61 51 15 -16 -2 61 78 32 -67 15 -5 -79 -146 168
1625 168 21 -95 -52 26 23 -20 113 42 89 -8 -36 29 72 -41 80 -5 -100 -65 -91 -27 -46 26 -15 0 36 -10 62 -50
1653 -50 12 -43 37 125 158 -19 -23 -71 75 -24 78 -69 -1 72 -27 9 164 -38 -173 -80 135 35 -17 -22 124 -4
1679 -4 -33 120 -114 -74 52 37 -135 26 28 48 -41 116 -53 -5 31 -5 3 24 140 87 -10 -7 -72 83 137 130 -18 92
1707 92 30 94 -166 -69 -4 -18 -110 31 -6 51 46 -11 16 72 -29 -30 99 -3 -8 -68 36 -63 142 -68 -58 100 -51
$$ packed form
1513a1o5k1J56K6p7Q6m0j2j29J49k7r1N0M8j2m9r2J18p7m8K66j24j15K2OM2J09
1540H8j22L6J2L3M2j90J43n4ojM2j03J7n3P7j6J24r1l7N6K5N0j04m1J24j7K7J
1568F2j96J23R8j02L6O4o4L4j39N8J35j76N3O2m0m9Pk0M8o1R1LM4K8l7rj00K9
1596a8P7p8p1O6Rq7k8K6K23k18N5P6J9o4j9R3j0l6l1J4O3J7m6r9Q2k0p4o7L14
1625A68j47j16M3P8lm3J33p1M7r7k8O5M3j13J21q5r5L5k6O4j9P2m1J5L6m6P2j12
1653e0O2n5Q0Q8L3j77mm8J46r9J02j47O8P3r9L6J55k02j35R3K15j00n2nJ46j28
1679dk9J53k34M0J26j5j72J61KK0q9J57j69M8L6l6QK1J16n3r7Lo5J55N4pj48J10
1707I2o2O4k60R7O5j4r2J41l7N7nn7K7N6j01jJ29j02no0J04r9K05k10J0J58j51
$$ plain form
1734 -51 29 -180 -56 -8 -7 -38 -48 -38 -45 10 11 -40 42 -21 -18 5 -37 -35 8 66 54 -4 15 -82 -69 -58 0 -42 -3 64 27 3
1766 3 106 100 19 -100 -11 -16 -50 15 -68 2 -126 -63 -63 3 -86 -124 68 -11 -14 23 28 75 84 44 -125 78 56 33 -32 5 31
1797 31 89 -121 110 25 -107 87 -46 134 0 -36 42 147 80 73 53 24 -1 -2 6 98 83 -31 -60 -21 25 -21 54
1824 54 -44 14 -121 109 -9 -15 60 70 -4 114 -12 36 -1 -33 13 -8 23 4 -86 51 -16 -63 -53 -46 32 -1 30 106
1852 106 -75 -48 55 -5 -129 -24 54 -47 38 30 110 19 -51 -16 25 45 -13 -29 41 -83 -17 56 49 0 55 77 -7 0
1880 0 21 -25 20 -70 35 -32 -7 -58 -10 40 -29 2 4 -21 6 20 67 9 -111 -7 61 45 -100 -32 102 -46 -29 -39
1908 -39 -17 16 83 13 16 70 -35 -38 -69 114 130 118 56 -101 -4 6 12 58 27 22 -27 -138 75 -13 -71 -12 162 69 47
1937 47 7 -71 -2 35 -42 2 -100 27 79 84 33 -47 27 -48 21 -85 -74 -27 12 -121 -18 30 -2 -47 -16 -15 31 -6 -39
$$ packed form
1734e1Q0k09J24M8Jl1j0J0pN5Jn1Q2o3LK3m2KM3N8j2n8J9r7J3J1N8m2L9O7l7k4
1766CJ03oq1j19Q9nl4O5q3P0j28O3%O6q9l8J92p9lL7NM7Rm0j69K03k2k3o5L7K6
1797C1N8k10K31q5j32J94j33J80j34l6P8J05o7pk0k9k5jQR2j5j14k9L9M6m6P5
1824E4r8N8j35K30j18oP5J0p4J18j26M8l7l2M6k1L1j9r0J37o7m7J0PP8l3L1P6
1852A06j81K7J03o0j24J05P8j01Q5qQ0r1p0L5M1K0n8j6P0j24O6P3pm9N5K2q4P
1880@K1m6M5r0J05o7K5n1M8N0o9L1Kk5K7J4M7n8j20J04O8j6j45O8J34j48J7j0
1908c9K2L3O7p0LN4j05ll1J83J6j2o2j57R7J0OM6l1nm9j11K13q8n8N9J74r3k2
1937D7m0p8O9L7p7M4j02J27N2Nn1q0P4p5O9j06J1M7L9j33J03M8l2m5L1JM6l7l3
$$ plain form
1966 -39 4 -57 -7 -4 13 -7 -12 4 32 -5 -15 84 8 40 27 6 -95 30 92 58 5 -9 135 112 -18 -5 -43 22 39
1995 39 61 -6 42 28 24 -68 -62 87 -21 91 -69 36 -17 -50 1 66 -30 102 46 -66 -17 16 7 -23 -45 5 14 -16 16
2024 16 -45 53 -129 -26 105 -77 23 -25 -22 14 -2 -18 57 -86 -3 82 -26 27 -95 -29 38 51 -3 102 -41 41
2050 41 -25 17 -2 1 84 74 29 87 54 39 -27 -19 -62 89 105 77 -118 57 124 -50 49 -76 -73 -41 -104 1 -54 -39 65
2079 65 -7 -27 9 113 37 -24 36 112 -9 80 21 -4 -64 32 -13 -31 -74 59 12 -55 -5 16 165 -23 48 -27 24 37
2107 37 67 106 -66 -16 -19 -27 -5 -39 69 -84 -114 -31 27 -47 66 14 48 -110 12 116 -15 -29 81 31 -121 9
2133 9 49 -29 20 -7 -37 -29 -106 58 -108 53 1 -74 19 23 77 -2 86 -13 30 90 -19 4 -6 44 -121 10 19 -74 33
2162 33 -51 41 -10 -13 31 -4 -23 -128 22 56 61 28 -21 -75 -11 61 -76 111 -104 -66 61 -136 -11 17 -73 -28 -18
$$ packed form
1966c9M3o1N0LJ7k0nJ6K8l7j0R9p6L2j3k1j01J25O2l4n3j4J44k3j30J3l8O5J7
1995C9K2o7M8j4mr2OJ49j08J12j60J05n3l3N1O5r6J32n6j12M9L3rl0k2N0Rl0L2
2024A6o1R8j82J03J31j82J00m8LL6j6j6P5j43Q3Q5j08N3j22O6O7J3n4J05j43Q2
2050D1o6M2j9LQ3j0m5N8l3j5o6Qm3J51J6k8j95J75O7j74R9j25LL2o3J05n5J5J04
2079F5p2k0L6J04p6o1O0P6j21Q9n9k5o0R6m5j8m3J33m7o7N0K1J49j88P1p5N1J3
2107C7L0L9j72N0lqK2l4J08j53l0Q3N8p4J13n2L4j58J22J04j31j4J10n0j52J30
2133IM0p8M9k7l0Qp7J64j66J61n2p5R3MN4p9Q8r9M3O0j09K3j0N0j65J31Rr3J07
2162C3q4R2n1lM4l5j9j05J50L4Nl3m9n4O4P2j37J87k15L8J27j97J25K8r0M5J0
$$ plain form
2189 -18 10 -70 44 -3 -33 -33 21 39 -8 47 6 -71 107 -8 -40 -41 50 -45 -17 -97 24 117 82 72 -57 120 -27 -16
2217 -16 -56 -22 62 70 5 20 77 74 -70 16 53 24 76 36 31 -120 38 -82 -30 2 40 -17 29 27 -114 -35 -28 4 24 63
2247 63 -69 36 -49 40 -64 133 2 -52 -79 -62 33 44 -5 -25 68 -37 -28 26 -67 36 18 -23 23 137 21 -111
2273 -111 -53 -7 -56 73 34 -31 -74 88 -117 -1 93 -104 -46 -46 -61 -51 -40 -157 -27 -105 -21 -26 38 -72 -106 64
2299 64 32 56 -132 -78 10 -66 130 -1 -58 48 112 19 -52 78 8 1 -11 51 69 -32 14 -19 -6 2 -23 -33 27 33 -90
2328 -90 -101 108 91 -43 -44 73 -2 -14 -73 -105 97 11 36 -83 -24 70 35 43 95 -39 -45 -47 46 13 72 43 50 -7 -35 41
2358 41 -13 -21 -45 -41 147 -8 -49 121 -35 -38 -51 127 113 -131 -22 40 60 -47 -16 -35 -186 -30 16 -38 5 -27 97
2385 97 -35 -32 60 -23 8 -8 6 6 7 -34 -29 46 18 5 35 104 -58 -19 -38 -100 -18 -74 -37 -106 -52 -42 53 -43 17 -55 -19
$$ packed form
2189a8K8q0J14m7l0%N4J8m7N5m1p7J78j15l2jR1r5K8q0J21R3l5j0j29J77j47J1
2217a6m0L4Q4Qo5J5N7lj44Q6L7k9N2m0nj51J58j20N2L2L8n7M6kj41P9PL2K0L9
2247F3j32J05q5Q9j04J97j31n4k7J7R5J1m9k0R3j05RN4r3J03j8m1M6J14j16j32
2273a11N8M6m9J29l9o5m3J62k05J16R4j97N8%j5J0J1j17J30p8Q4nO4j10l4J70
2299F4l2K4j88N4Q8p6J96j31n7J06O4r3p1J30p0pj2O2J8j01M6l3J3Qk5j0O0Oj23
2328i0j1K09j7j34jJ17p5j2n9l2K02q6K5j19N9R4l5QN2j34okR3l3N9k9Pn7k8P6
2358D1n4qk4MJ88j55m1J70j56lj3J78j4k44J09O2K0j07L1j9j51J56M6n4M3l2J24
2385I7j32LR2q3L1j6J4%Jm1NP5k8j3L0O9j62L9j9o2Q2n6L7o9N4J0R5r6O0p2L6
$$ plain form
2416 -19 -23 55 74 -67 40 143 -87 -55 6 49 48 64 -117 69 -46 -57 16 18 85 -5 27 20 0 71 -48 -84 -1 -24
2444 -24 -31 -15 -139 -78 54 -1 -62 -79 -14 -31 -148 -42 -43 -55 -79 38 -13 37 60 111 -70 -12 -47 -7 -9 37 69 -28 75
2473 75 15 47 -4 -48 85 9 15 44 -60 -18 34 48 -81 -12 -160 -56 -78 -5 14 0 47 -58 -24 38 36 33 -71 18
2501 18 13 -55 -37 -11 36 -11 10 -12 -8 1 22 -27 -128 45 -108 7 -2 69 63 51 62 -106 -103 143 -49 -11 27 -22 1 -50
2531 -50 17 -132 99 67 -38 -55 4 -34 8 -28 -68 -15 -194 -59 -11 -31 9 66 -91 32 16 128 3 1 44 39 -13
2558 -13 -52 71 12 -170 -34 -57 31 -107 76 17 30 20 -69 -22 49 35 -19 54 -133 20 19 74 -19 -142 -18 18
2584 18 -21 -38 20 -75 -47 11 22 -85 41 86 -42 78 -23 -37 -45 7 29 88 32 -26 -29 -6 73 -92 34 -29 -7 -73
2612 -73 -7 92 4 48 -15 -44 49 -16 -69 -79 -1 -49 -59 25 18 42 -14 60 -23 -14 72 12 -41 -6 -77 -65 -21 44 110 -31 109
$$ packed form
2416a9mP8J9j41J07J03k30L2O1M3jJ6j81J86j15j1P3KO7r0L2pk0P1j19l6Q3k3
2444b4pJ6j24O1J32n5o1j7O5j7j17J06jj2k4J17n1N0K3N1j81N8l5M0kM6L2r7J03
2473G5o0L2n1m4J33p6OK9j04M2N2J4j29O9j48J04k2P3J9j4M7j05L4O2klj04Q9
2501A8no8J8K6M7m7K1k2MRK1m9j01J73j53J15rP1oj2J1j68LK46j92L8L8m9K3n1
2531e0O7j49K31l2j05j7N9l8M2l6m0N3j79J35M8k0M0N7j57J23j6J12j25kM3nn2
2558a3l9J23n9j82J36k3Q8j38J83n9J3j0q9M7P1j4n4P3j87J53jN5r3j23J24L6
2584A8l9j7N8r5K8N8J1j07J26M5j28J20j01j4qN2K2N9n6n8lK3P9j65J26o3K2o6
2612g3O6R9q8M4o3k9R3o5n3j0P8m8j0Q4pK4n6P4q3RQ6o0n3L5p1J2M4O5O6j41J40
$$ plain form
2643 109 100 3 62 -4 117 -16 50 42 44 -5 14 58 -1 -65 -64 -19 34 70 -65 -83 84 47 -87 -39 11 10 4 27 -106 16
2673 16 -60 -55 14 7 -14 -118 145 51 85 -30 73 165 -53 -35 93 -7 15 64 7 -74 102 -17 -30 -11 -33 18 -41
2700 -41 31 -66 21 -31 2 13 15 28 5 -8 -26 55 -3 71 45 -9 -23 34 -46 2 15 68 -16 26 -32 -5 71 -24 20 67 -28
2731 -28 -68 -6 -16 65 36 68 47 -9 42 -13 -69 53 43 -50 -77 123 -10 71 -18 2 -44 66 -65 78 -12 16 216
2758 216 -13 7 -26 -83 -87 24 82 34 120 6 103 52 85 72 20 28 68 84 2 21 19 59 18 -35 -66 -11 18 -3 46 -7
2788 -7 37 -2 25 -16 -41 32 -21 -16 122 -8 -58 127 -26 -22 -20 -59 81 -64 -48 141 -20 -39 -70 -72 -75 -31 -33 42 -108
2817 -108 110 158 13 -84 119 -9 -1 38 -9 85 -57 53 15 65 -39 -101 100 -4 77 -24 -52 1 -40 18 -72
2842 -72 -35 -30 -21 -69 -1 176 -52 -31 -97 -39 12 97 8 39 -73 23 -44 -124 -82 -74 -14 -56 -77 11 24 87 -67 34 106
$$ packed form
2643A09rr7N9o6J21j33O6qKm9J9M4n9o4JM5N3L6j35j8J67l7j34M8N0joK3j33J22
2673A6p6NO9pk1j04K63r4L4j15J03R2k18J8J28j00K2M9n7q1J76j19j3J9k2N1n9
2700d1P2r7Q7n2L3J1KJ3k3j3j8Q1n8P4k6n4j4N7q0M8J3N3q4M2n8K7P6r5M4M7r5
2731b8m0O2j0Q1k9L2k1n6N1n5n6J22j0r3k7K00j33Q1q9K0m6J10j31J43r0K8K00
2758B16k29K0l3n7mJ11N8m8Q6j14R7n1L3j3n2QM0J6q2J9kM0m1n3l1N5K9k1M9n3
2788gM4l9K7m1k5P3n3NJ38j30n0J85j53MKl9J40j45J6J89j61j9l1klM4kP5j50
2817a08K18M8j45r7K03j28QL9m7R4j42J10l8N0j04o2K01j04Q1j01k8N3m1N8r0
2842g2L7NRm8O8J77k28K1o6N8N1Q5q9L1j12R6o7q0M2QO0m2k1Q8J3O3j54J01P2
$$ plain form
2871 106 -18 71 -22 -200 -65 -24 67 23 8 -48 50 13 -105 -45 17 -1 5 37 10 113 -104 22 -74 -77 46 67 7
2898 7 23 24 -58 41 -7 30 86 -66 -132 -31 10 -5 -102 14 -5 21 76 65 -19 -47 18 -14 29 -91 -166 -38 102 60
2926 60 -2 -14 -95 52 64 40 8 -43 107 -15 -106 -8 -12 -46 -23 94 -27 147 -32 28 -14 8 -10 66 143 19 -101
2953 -101 -37 50 -127 14 85 -12 40 -68 -79 -17 -71 -94 46 30 -34 34 49 20 10 17 -60 -7 75 17 122 6 15 -73
2981 -73 -60 -11 30 -30 95 98 -116 -29 -5 -57 111 13 50 75 62 18 -3 66 31 4 -94 -63 -12 6 -16 115 -5 -62
3009 -62 -118 35 -35 37 10 35 32 61 80 83 -18 20 16 28 50 -31 -17 -70 55 -52 143 57 34 117 24 -157 49 -46
3037 -46 -54 24 -48 45 45 -10 14 -6 50 -47 58 127 -64 -12 -83 -13 -116 24 -67 24 67 -26 -62 -107 2 -84 120 88
3065 88 28 -39 12 17 -66 -64 151 9 30 -121 82 43 103 25 -13 -25 -156 20 -78 -31 -80 101 186 -27 152 104 -26
$$ packed form
2871A06j24Q9r3j78J35M1R1m4j5n6R8l7j18O0O2j8OL2k7J03k17J26r6lJ23K1o0
2898GJ6Jq2R9m8L7N6j52o6J01M1j5r7J16j9K6N5j1q4k8O5l2M3j20p5J28J40m2
2926F0o2j2q1J47J2k4l2n1J50j22r1R8ml4K3J17j21J74j79O0m2K2j8P6P7j24j20
2953a01O4Q7j77J41P1r7N2j08j1O2n4k3J40j6o4O8J5k9j0Pp7N3Q2n8J05j16Rq8
2981g3J3M9M1o0J25Lk14Q7K4n2J68r8L7K5j3m4k1O9l5k7r8L1N1J8k2J31j20n7
3009f2n6J53p0P2k7K5lK9J9Lj01L8mJ2K2q1J4n3J25j07J95q6k3Q3r3j81K06r5
3037d6qP8p2R3%n5K4k0N6r7J05O9j91N2p1P0j03J40r1R1M3r3l6m5J09q6K04l2
3065H8o0o7N1Nq3KK15j42K1j51K03l9O0p8l8j2j31J76r8M7m9J81Q5k13J79m8j30
$$ plain form
3092 -26 158 -32 99 -44 -11 41 -76 -38 -28 -44 123 22 -26 12 56 -74 113 35 -99 9 14 -203 70 -16
3116 -16 -46 -10 -50 50 44 -21 -1 -52 -63 16 52 90 14 125 -1 28 -45 7 -114 -1 -20 26 -81 -37 -4 68 -53
3143 -53 -26 80 -49 51 -58 9 3 -83 -14 -4 -85 -49 33 -118 -63 15 -50 -22 -24 -55 18 1 31 -41 -30 -3 -34 -49 -104
3172 -104 62 64 -2 -54 -103 3 -64 64 -36 76 65 -38 -21 105 75 34 -25 7 -7 -56 -51 -66 58 -12 48 -66
3198 -66 -17 30 -39 -56 11 86 31 -45 -31 -28 -23 86 -53 5 -120 -32 -16 76 56 -89 -91 23 3 -49 -72 28 2 -32 -28
3227 -28 -1 33 -32 94 -73 46 -73 132 150 29 19 59 -28 19 122 -8 172 70 -8 7 50 -43 61 -10 -144
3252 -144 44 -84 -46 -47 50 -20 -24 6 -20 -7 -94 116 100 -76 -17 -54 -32 42 16 59 -40 -61 -103 42 35 44 11 22 13 -98
3282 -98 39 -87 1 14 16 -14 73 149 -41 43 8 -25 100 -31 6 58 -79 -45 -43 -7 -23 -26 49 -145 12 -40 80
$$ packed form
3092b6J84j90J31j43L3N2j17L8J0j6J67j01m8L8M4j30J87p8j34J08Nk17K73q6
3116a6l0L6m0J00oo5K0n1j1P9L6L8p6J11j26K9p3N2j21J13j9M6j07M4L3P2j21
3143e3K7J06j29J00j09O7oq6O9J0q1L6Q2j51N5P8o5K8kl1P3j7L0p2J1K7l1j5n5
3172a04J66Ko6n2m9J06o7J28j00J12j1j03J7J26l0m1n9L2j4m9Nj5J24p0O0j14
3198f6M9M7o9j7O7P5n5p6J4LNJ09j39N8j25Q8J6R2k0j45kJ14k0n2k3J00k6l4M
3227b8K7L4o5J26j67J19j19K05J8j21j0M0q7M7J03j30J80j02p8J5M3r3J04p1j34
3252a44J88j28L8jR7p0mL0k6J3q7K10j6j76N9l7K2P4k6M3r9k1m2J45pRl3J1rj11
3282i8J37j26Q8J3Kl0Q7P6j90Q4l5l3J25j31L7N2j37L4KL6j6lP5j94J57n2J20
$$ plain form
3309 80 6 39 -49 7 -55 29 -155 -90 15 -25 6 -33 25 94 25 -104 29 13 -9 100 29 52 -63 -3 28 18 73
3336 73 19 112 72 86 68 79 -4 -47 9 7 -99 -33 -82 113 7 -121 63 48 12 -74 21 -3 -57 80 -52 46 -40
3363 -40 -31 36 -113 64 58 54 85 24 -93 0 9 40 16 35 54 -118 -44 -100 -17 -117 12 -98 -119 -53 -96 -46 -128 -70 53
3392 53 -24 -22 13 2 102 -19 -30 -26 -119 -44 15 -56 78 -63 -46 -7 68 -9 41 1 60 -14 -2 -58 47 85 -55 9
3420 9 -6 -56 -95 -62 -43 -5 -3 -26 100 -6 69 -45 -64 131 -50 -14 20 -18 46 44 -45 -75 0 -31 85 -16 -55 -23
3448 -23 20 117 48 37 54 30 -43 -44 -31 10 -3 22 -20 -55 62 -31 74 36 76 -34 6 -73 -41 -70 -6 -45 78 99 81
3477 81 42 -95 56 -97 15 85 -96 -16 -28 17 -117 34 -35 -40 6 48 -80 98 40 -46 71 60 -62 -40 63
3502 63 -66 -18 -52 114 -14 -57 6 -38 -30 136 -36 76 42 -101 -93 55 -143 -19 -29 -50 79 -86 -30 -67 -13
$$ packed form
3309H0p4L3q8N6o2Q4j84O5J05m0L1l9N8O9o9j29J33j6k2J09p1K3j15O0L1j0N5
3336G3n4R3m0J4j8J1q3m3N6kj06O6m9J95j06j28J84j5l6q6R5k4n4J37j32R8q6
3363d0RO7j49J77omL1o1j17R3RL1k4J9J9j72P4n6Q3j00J29j10k1O6m3N0q2N8J23
3392E3p7KL5j1J00j21j1Mr3P5N9p1J34j41J7L9P5p7N0m0N9p4J2n6J05L8j40O4
3420Ij5n0l9L3J9L8Kk3J26j06P5j14j9J95j81L6L4l8O4kq9l0P5l1J16j01l9L2
3448b3M3R7o9j1J7k4p3jJ3M1j3K5m2l5J17r3J05l8M0j10M0p9L2k9O4l9J23K1j8
3477H1l9j37J51j53J12P0j81Q0j2M5j34J51o9nM6M2j28J78n8q6J17j1j22K2J03
3502F3j29M8l4J66j28m3O3m4QJ66j72J12l4j43QJ48j98J24j0k1J29j65N6l7N4
$$ plain form
3527 -13 4 11 -67 27 18 43 28 -64 -9 -2 -20 18 80 5 28 87 -16 34 25 104 86 37 50 -30 81 -157 46 53 -36 -78 -49
3558 -49 -111 5 -104 -53 59 -48 38 -91 -71 157 105 115 -67 43 19 -19 1 -87 -14 -91 -99 72 14 5 -61 22 110
3585 110 48 11 -11 -3 25 27 -69 -47 -46 33 -110 16 6 -4 -16 -27 6 20 34 -85 24 -41 32 125 -41 41 15 14 -14
3614 -14 81 -13 -44 46 -26 54 9 -80 60 34 62 37 3 29 108 -82 61 52 -2 100 -39 -25 32 -83 -102 -66 47
3641 47 -116 -37 10 -32 -22 -68 37 -54 25 22 -126 15 12 -125 -121 50 17 -108 -11 -34 104 16 4 -73 -134 115 -59
3668 -59 28 47 -57 -57 46 -28 50 96 -96 -30 101 22 -19 16 -15 -31 -20 -74 115 -113 105 -45 125 -52 -76 113
3694 113 45 23 32 -34 86 -5 -17 23 -46 9 91 12 -51 -33 -18 -82 32 126 -22 36 -73 -15 30 18 -34 41 -28 59
3722 59 -102 24 51 -47 40 6 40 32 -127 -11 -27 49 78 -53 65 3 11 -45 -31 -91 0 -37 31 68 -66 6 16 60
$$ packed form
3527a3J7Pp8R4rK5j5r2N5Pj8L8O2p5K3N9j03N0rP9j8m9J3q0J11k38K03Pq9m2K9
3558d9o2J16j09N1J12j07Q6j29K0K28n2J0j82J10k4l8K0q8P3p7qJ71n8ro6Q3Q8
3585A10o2l7k2QK8Kr6K2JP9j43J26j0j0j2j1L3J4J4j19J09o5P3R3j66Q2k6jk8
3614a4R5r4l1R0p2Q0m5q9J40k6K8k5l4K6P9j90J43rn4J02j39J4N7j15j9L6J13
3641D7j63P9M7m2J0m6J05r1P9lj48J41lj37MJ71l3j25R7k3J38q8j2p7o1K49j74
3668e9Q7J9j04%J03p4P8M6j92O6J31p9m1L5l1j6J1n4J89k28K18j50J70j77k4J89
3694A13o8k2Ro6J20r1j2M0o9N5Q2p9o3J8J5o4J14R4j48N8j09N8M5j2n2P5o9Q7
3722E9j61J26K7r8Q7l4L4qj59J16j6P6K9j31J18o2Qn6J4o0R1l7O8L7j34P2J0M4
$$ plain form
3750 60 49 -50 -117 81 43 24 -25 -3 -10 37 92 -5 -31 -8 -11 39 22 34 -45 -10 -10 -3 66 -57 33 -43 13 22 -12 -40 72
3781 72 -71 158 9 -24 74 -48 41 -31 17 34 -22 -23 -45 -10 111 13 -41 112 -65 -1 -71 -52 11 -90 1 -17 -32
3808 -32 51 -24 -41 1 -82 -25 -8 36 -38 -9 -2 -33 1 8 18 26 -3 -7 23 -56 18 4 77 -9 -5 -40 17 -8 59 -95 18 -9
3840 -9 -124 -68 -25 27 104 -31 61 -2 18 -115 -80 -15 -29 35 -29 -86 -31 9 51 -31 99 110 -151 7 56 -61 68
3867 68 -34 16 132 -47 -40 -71 -140 169 76 -108 25 52 28 -38 18 35 60 38 -8 31 151 -5 49 -70 10 7 -34
3894 -34 23 -29 108 89 66 23 -38 -13 21 -51 139 -16 -79 -81 5 13 -7 -156 -25 3 -43 -49 106 62 61 -36 -133 -5 -16
3923 -16 141 -9 55 37 72 40 55 -31 31 -78 -80 -2 -66 -109 55 -33 -70 -50 -1 0 -53 -120 65 58 36 -39 29 54 -27
3952 -27 91 121 -1 -48 15 16 -42 14 47 -56 -24 29 -107 -5 50 40 18 79 -101 83 -52 -63 6 81 -58 1
$$ packed form
3750F0j1r9o7J98l8j9m9K2pM7N5r7k6K3lN0j7J2p9L5%PO9j23R0p6N6Rl4k8J12
3781G2j43K29j49l3R8j22Q9p2M8J7n6jk2L5J21r8n4J53j77O4p0J9O3j01R1j8j5
3808c2Q3p5j7M2q3N7J7M4p4K9Pl1L4PJ0Qk9mL0p9P4j4P3q6Ml5N7k5O7j54J13k7
3840ij15N6M3N2P7j35R2o3K0j33L5O5j4O4o4n7N5M0M2q2J30J1k61J58M9j17J29
3867F8j02N0J16j79Pl1o9L09r3j84J33K7k4o6N6J7K5k2m6L9J20j56N4j19Q0lm1
3894c4N7n2J37j9k3m3o1K5L4p2J90j55o3kQ6Qk0j49J31K8m6oJ55m4jr7r7J28j1
3923a6J57j50O4j8L5l2J5q6O2j09kP8o4m3J64q8l7K0M9Jn3o7J85pk2p5O8K5q1
3952b7J18L0j22m7O3Jn8N6L3j03L2N3j36J02N5j0k2O1j80J84j35j1O9P5j39N9
$$ plain form
3978 1 101 -27 31 39 30 58 -6 -32 79 69 -38 2 122 81 -38 -95 -7 77 -81 28 -17 -37 -30 -6 86 20 41 -26
4006 -26 37 5 70 -30 4 24 -19 30 -30 73 -63 -8 46 33 -23 -19 -17 -58 -87 -17 -56 -104 28 -44 -10 3 -52 18 -189
4035 -189 92 -49 10 -68 -48 4 -24 -59 -1 53 35 91 -12 -10 -16 117 -95 27 1 63 42 -110 86 82 13 -65 -38
4062 -38 -51 41 55 -35 1 -24 -3 3 47 -36 83 19 73 4 -33 10 86 52 -101 -23 1 -60 2 93 88 49 -16 -114 -51 -32
4092 -32 51 83 59 -85 -22 -90 -84 -65 29 14 57 -54 55 -21 -14 42 49 -43 46 -23 -47 26 -14 -41 -35 8 19 -32 -13 25 -8
4123 -8 32 155 49 -32 -10 -14 -55 -76 26 51 -17 -66 57 160 8 81 1 15 41 -28 -52 71 30 -30 -15 49 -19 89
4151 89 75 81 -8 -80 -19 -58 65 27 -9 2 5 -43 30 76 33 29 65 -17 -12 9 -18 -58 -48 -81 -56 -52 81 26 -7 -52 19 100
4183 100 -54 -47 -76 97 75 17 6 -21 54 -62 -110 22 4 -24 33 -50 -16 41 -42 41 -116 23 -37 120 -89 78
$$ packed form
3978AJ00j28N8QrK8o4k6J11j0j07M0J20m1j19n7Q8Q4j58J09m5k0PK4R2o6K1o7
4006b6O3l2O5j00L4K0m3M9o0J03j36N5N4j3n6MKm1k9P0l9m8J32p2L4J3n5P0k07
4035a89K81j41N9p8K0N2k8l5N8N4j8N6j03KoJ33k12J22k6O2k1j52J96mo9p8K7
4062c8j3R2J4r0L6k5K1OM4q3J19o4N4o9l7M3P6l4j53P8K4o1O2R1nl9o5r8O3J9
4092c2Q3L2k4j44O3o8OJ9R4j5M3j11J09p6PN6Pr2Q9o9k4P3m0k7OM3J1n1J9L8l3
4123hM0J23j06q1K2mm1k1J02K5o8m9J23J03j52P3q0J4K6o9k4J23m1o0J5O4o8J08
4151H9j4Oq9p2O1l9J23l8l6J1Lm8P3M6m3mL6q2NK1k7m0J0l3K5MJ33n5l3m5P1Q1
4183A00j54Pk9J73k2n8j1k7P5j16m8J32j8k8N7q3L4N7q3Q3j57J39o0J57k09J67
$$ plain form
4209 78 -25 10 -87 20 74 12 -53 -10 -12 84 41 -48 0 -21 -5 -15 47 -81 -81 -3 17 -46 -9 -55 32 -108 15 13 -100
4238 -100 6 11 -54 20 -33 -139 -59 -64 106 -11 15 22 -91 -132 -6 25 -120 -65 -54 -31 55 80 80 33 -40 -4 -19 -24 36
4267 36 62 -132 27 16 -55 5 -16 10 2 -42 -68 -42 31 -115 -1 -45 118 38 -60 -10 6 25 -78 15 37 118 -84
4294 -84 16 -40 -63 0 -20 -56 10 -14 75 35 -47 -9 42 56 89 75 -101 107 31 101 25 26 -48 -60 -39 -22 -26 16 61 -12
4324 -12 -78 -19 -30 -41 63 -45 76 30 -22 -3 -24 -167 49 -7 49 96 -25 41 12 76 132 30 55 -15 59 50 48 -25
4352 -25 28 70 -34 -13 -114 -195 57 8 -4 50 12 -31 -1 -33 30 71 -4 -5 27 -33 9 -94 -19 68 65 -52 -59 19 67
4381 67 -41 -2 -14 -33 38 -13 24 73 28 -79 101 0 33 -36 -69 -83 36 85 -88 -55 33 -8 -185 -23 -104 25
4407 25 -3 105 -5 -17 -40 -22 -31 -69 -3 -41 -9 27 53 -30 22 -55 -19 -8 -5 26 68 33 -7 9 5 14 25 41 63 -96 -23
$$ packed form
4209G8j03L5r7J07N4o2o5M3kR6m3q9M8k1J6j0O2j28%P8K0o3L7m6Q7j40J23kj13
4238a00J06No5P4n3j06Q0nJ70j17K6Pj13m1J26L1j45N5J1K3Q6K5%m7p3L6j5nO0
4267C6K6j94J59j1p1O0k1K6qm4k6K6P3j46J14m4J63q0r8N0J6J9j03R3K2Q1k02
4294h4J00n6k3O3k0l6O6k4Q9m0q2L8N1J4L3j4j76K08p6P0p6Jp4j2K1J7mM2M5p3
4324a2o6N9j1j1J04j08J21m6n2J9k1j43K16n6N6M7j21O6k9O4N6j02K5p0P4rkp3
4352b5N3M2j04K1j01q1K52m9j2N4l8m3L0l2O3M1p5jL2o0M2j03P5Q7lj17pP8M8
4381F7j08L9j2j9P1n1L7M9m5j07J80j01L3o9l3j4J19M9j73L3Q8m1j77J62q1J29
4407B5k8J08j10j2k3J8rl8O6l8L2L6K6q3N2p7L6J1LL1M2l5m0J6mRJ1J6K2j59P3
$$ plain form
4438 -23 -69 -26 -13 -2 23 -9 -68 -2 -49 35 -91 -28 -40 26 8 20 -45 -5 -31 -74 7 19 94 -36 66 -104 47 8
4466 8 -30 -42 51 11 26 -61 -23 182 -72 44 72 116 -44 1 -7 54 72 46 24 -13 -46 -64 99 -2 -24 -10 -12 -92 26
4495 26 29 3 8 -56 -16 30 -8 -18 84 -41 88 -16 15 -58 16 -61 14 50 25 19 -14 111 43 -72 125 -29 -64 96
4523 96 -62 -17 8 -55 -23 -36 36 36 -8 -62 40 -31 52 105 -2 59 -52 22 -78 -18 38 6 -95 -26 74 -72 -167
4550 -167 106 58 -36 63 -41 -162 8 -63 -17 -92 -60 -3 51 7 103 39 4 -17 83 -41 53 46 -89 -3 -14 104
4576 104 65 -12 94 20 -20 -20 33 5 50 -34 -70 37 -35 57 -74 -2 -50 65 23 -75 33 10 -38 103 28 -87 54
4603 54 -133 -27 110 -33 162 -21 -74 -22 13 -21 113 101 -100 11 -24 -4 51 46 60 -5 2 50 65 -48 110 -36
4629 -36 -28 50 19 13 68 -150 77 -17 39 29 -57 10 49 6 -109 16 32 -54 -68 98 18 -53 65 -67 18 61 -67
$$ packed form
4438b3m6M3J3J1K5l2n9O6m7Q4j26O3j2O6j8J2o5M0k6m3Q1J2P5j30J02j70J51l9
4466Hl8j2R3m0J5q7L8K05k54J16K8M4j60M5qO1J8k6k2l7l3j8J63j01k2J4kq0J18
4495B6Lk6No4M0M6l8j0J02j25J29j04L1p3P4p7P5L6k5ol3J25o8j15J97j54l5J60
4523I6j58M5K5o3L2j3P2%m4n4J02p1Q3N3j07O1j11P4j00O0N6l2j01O9J00j46r5
4550a67K73m8r4R9j04j21J70p1M6p5L2N7N4m4R6o4l5k1J00j24R4pj35Q6j1J18
4576A04l9p7J06p4m0%N3k8M5q4l6J07p2R2j31P2m8J15m2r8J08k3m8J41p5j15J41
4603E4j87J06J37j43J95j83n3N2L5l4J34j2k01J11l5K0N5nJ4o5PM8J5j13J58j46
4629c6QP8l1oN5k18K27r4N6j0q6O7L9m3j15J25J6q6j4J66q0p1J18j32Q5M3j28
$$ plain form
4656 -67 -103 -28 -32 -28 65 8 -124 -15 27 -12 35 -13 24 27 42 33 -28 4 -18 -49 63 71 -43 -2 -37 50 -13 23 44 -75
4686 -75 -14 63 34 6 -13 -34 13 -10 -38 0 92 -30 -87 39 28 -55 -26 93 -68 -127 76 -91 12 54 16 -33 37
4713 37 122 -38 -1 63 -43 -51 39 23 39 2 -49 41 6 -14 -28 57 -108 31 2 40 2 13 -2 -29 -50 39 -13 40 -50
4742 -50 43 -46 -25 -53 7 -12 163 153 -79 116 -67 -8 91 -78 -20 37 120 55 21 92 48 -89 -77 52 -22 -70 -22
4769 -22 -40 -11 -11 -3 -73 30 25 -36 -94 -38 66 -70 57 -47 -44 -11 24 -38 7 -55 25 -1 -202 114 36 16 -12 -65 -31
4798 -31 -101 18 68 75 30 -9 -23 175 62 94 -6 35 -65 31 13 -4 87 47 26 -47 -35 -33 -57 -7 57 29 -15 -93 112
4827 112 86 82 -91 33 -25 41 -61 72 -70 -83 -14 -58 35 -50 -177 101 30 18 -37 -145 76 31 70 -63 9
4852 9 -85 4 -11 -27 -58 -3 45 5 108 -91 9 34 17 -44 8 38 13 0 5 -1 85 -26 -36 -29 10 -37 4 59 -88 -18
$$ packed form
4656f7l6P5mMR3n7j32J09M2l9M7m8L7LJ5ro1L2k2l1J12Qj14M1l5Q7o3L6K1j19
4686g5O1P7k9k8j9k1M7k3k8L8R2j22n7J26j1q3K9J19j61n9K03j67J03M2l8m9P0
4713C7Q5j60L7O4j06qR0j6J6l7n1R0l5k0j4Q5j65J39k9L8l8J1j5k7k1Q9n2N3r0
4742e0R3q9K1k8O0j9J75j0k32J95j83N9R9j69N8N7Q3o5l4P1m4j37J2J29p4m8M8
4769b2j8K9%Qp0J03no1n8N6J04j36J27j04LL3L5o2M5o2Q0k6k01L16p8k0k8n3L4
4798c1p0J19N0Pm5l9j4J98j13L2j00M1j00R6j8j7R1m0k1p3J2Kk4N0O4k8m4p8K05
4827A12k6mj73J24n8O6j02J33j42j3O9m4R3q5j27K78p1j2n5j08K21m5L9j33P2
4852Ir4Q9j5j6l1N5M8m0J03j99J00K5j7o1N2L0k5j3NoQ6j11j0PL9m7M1N5j47P0
$$ plain form
4882 -18 -22 73 -81 -5 -82 -7 17 -59 -7 17 -94 48 -101 9 24 -42 22 -83 -37 68 -6 -61 -21 126 29 -38 53
4909 53 55 123 20 -57 -32 -25 75 9 -129 74 -15 17 -46 -103 -47 -58 -10 12 22 -39 -10 -113 -90 54 87 -48 1 -25
4937 -25 3 -20 75 -3 -23 -53 -86 -36 86 -28 0 61 4 49 -85 30 -69 23 -75 -48 55 -126 3 82 -20 -115
4963 -115 47 17 44 -27 4 -13 41 23 29 8 49 -8 -5 48 39 -44 -20 23 -1 -15 24 117 33 -60 41 -21 113 -66 -23
4992 -23 22 -39 -53 140 45 62 -29 36 -89 -7 -128 -60 62 -31 96 -60 16 79 -6 51 -77 30 -48 -102 -31 5
5018 5 29 -72 -48 4 52 11 24 13 36 -42 85 28 3 4 -105 24 -48 25 -8 39 92 -43 28 10 -9 132 -57 -45
5046 -45 27 -15 -80 113 -18 -29 -79 74 -20 -59 -10 -88 79 79 26 -35 31 -2 -24 21 39 57 -6 92 -98 -61 -17 -24 -46
5075 -46 -22 47 103 25 -3 32 30 -66 -136 89 -10 85 -63 101 15 -18 -32 -12 -64 -1 108 -31 26 -38 67 135 101 -39
$$ packed form
4882a8mR5j54P6p7P5K4p6N2K4j11J42j49J10J5o6O4j05M6J05p4n5M0J47r7o7R1
4909E3KO8j03p7K5PJ00o6j38K03q9L2o3n7N6j1M8K2J0o1K9j03K3J44L3j35M9k6
4937b5K8k3R5p8k0l0l3N0J22j14K8O1n7M5j34J15r9R2r8K7J03j81J29P9j02r5
4963a15J62l0K7p1L1j7N4j8Ok1M1n7LN3rq3K4M3k4j4L9R3q4r3J01o2J34j79M3
4992b3M5o1j4J93r5J7r1O5j25Q2j21O8J22r3J27j56P6O3q5N7j28J07p8n4P1L6
5018EK4j01K4N2M8m1J3j1K3p8J27n7k5Jj09J29p2P3l3M7N3j35P1j8j9J41j89J2
5046d5P2m2o5J93j31j1n0J53r4l9M9p8J67%n3o1O6l3k2M5J8J8o3R8j90L7M4pk2
5075d6K4O9N6p8k8L5kr6p0K25r9R5j48J64q6l3j4K0n2O3J09j39N7o4J05O8l4j40
$$ plain form
5103 -39 57 -9 -37 -46 5 -24 -76 -35 9 -40 -43 3 50 -97 -58 27 29 22 16 -5 -56 106 -108 18 3 5 14 105 -27 -148 -77
5134 -77 12 -42 10 45 -59 -105 -63 81 33 -70 124 86 -96 -68 6 98 106 -20 24 7 -18 65 79 -19 68 30 36 -45
5162 -45 18 7 101 40 74 10 14 -3 10 -2 72 52 17 55 -39 -117 -93 108 -48 -39 -23 85 -10 36 -49 -98 -19 -60 50
5191 50 -81 -71 -41 -30 88 -55 -14 66 113 -45 56 95 50 2 177 -65 43 38 89 52 -74 58 -36 -3 -28 -71
5217 -71 20 16 8 -18 -12 61 -12 -26 68 -85 11 -10 28 -117 -103 -42 64 17 -69 -62 -41 51 -47 48 -16 64 -52 -2 -17 -38
5247 -38 117 -31 47 25 -9 -26 78 -13 -32 52 26 110 12 28 -6 -86 42 43 28 -47 -95 55 11 -3 -41 -38 -63 30 88
5276 88 41 -27 75 -12 -33 90 100 -52 135 -24 -35 14 10 47 -190 -117 -93 -23 46 19 -21 64 -152 128 -11 40
5302 40 34 32 15 -9 39 23 48 -12 4 72 -1 -21 32 44 0 91 17 48 -132 -75 -68 -82 36 13 19 36 70 -45 -17 35 -64
$$ packed form
5103c9R6o6k8rN1k9n2M1M4m9lM6M7j47L9Q5Kpok1n1J62k14J26j5KRR1j32j21P1
5134g7Q9n4N2L5j04m6M2J44m8j03J94l8j82K8P4R2Qj26M4j7k5Q3J4r8Q7l8Oq1
5162d5O3j1R4o1L4o4Mj7J3j2P4k0l5L8r4p8K4K01j56RJ6J08r5M6q5m9P9m1J10
5191E0j31J0L0J1J18j43M1Q0M7j58J01L9m5m8J75k42J08nN1l7j26J32r4L3k5m3
5217g1R1mqk6OP3p3j4R4j53R6k1L8j45J4O1J06m7q6PK1R2r8R5o4Q0j16N0j5k1
5247c8J55j48P8k2l4j7J04r1j9Q4k6Q4r8J6l4q0J28Jj5p5m8J50m4j4l8Lk5R3N8
5276H8m7o8J02q7k1J23J0j52J87j59j1M9mL7k37P3K4P0O9k7m0Q5k16K80j39N1
5302D0okj7k4M8j6K5o0J6O8p3k0N3J2m4R1p4L1j80N7Pj4J18k3OJ7L4j15K8N2r9
$$ plain form
5333 -64 60 -80 69 -42 76 -16 -103 -37 -137 84 38 22 2 -44 18 -91 -39 -96 -41 -32 29 82 -25 -31 -24 -5 2 3
5361 3 2 79 -92 37 10 62 49 103 85 0 -3 2 -36 15 -97 23 102 -49 71 -19 -64 93 -25 41 -31 40 34 -184
5389 -184 28 -71 66 46 21 114 72 -76 -28 -132 -80 -35 17 -18 -67 153 49 -40 0 -18 32 -15 128 23 121 -25
5415 -25 34 -1 72 73 101 98 -30 56 -8 -4 4 -95 67 -28 -28 -36 -23 42 -13 -68 54 10 -40 -53 -56 82 41 -11 39 -48 3 -26
5447 -26 52 -15 -15 -9 50 56 -76 -18 140 23 1 56 -32 -68 -63 -45 -31 13 -70 44 10 -30 104 2 7 -61 89 17 -67
5476 -67 15 59 8 -111 -46 97 -120 67 43 -74 59 48 84 -38 8 9 120 -80 25 36 64 17 99 69 14 -23
5502 -23 -15 -72 -92 -44 -72 -1 -58 -114 -1 -84 -68 82 43 -17 -35 -17 -115 52 -25 73 -30 23 69 88 169 14 28 -79
5530 -79 21 -28 -21 -90 -12 -12 27 31 -32 -7 55 22 10 -24 -57 29 -29 -55 -96 50 88 -72 -52 -27 40 9 9 -52 -30 49 -79
$$ packed form
5333f4J24j40J49j11J18r2q7O6j00K21m6j6k0m6O2j09N2n7N5RO1N3j07oPJ9PJ
5361CjP7j71J29k7N2j3N4j8q5lNl8N1j12J20P9j51J20r0m5J57j18O6p2P1ok18
5389a84K12r9J37k0k5R3m2j48M8j04N2M5N2l5m9K20j04q9M0j8N0m7J43j05R8j46
5415b5N9l5P3JK8lj28Q6o4MQr9J62r5%qJ3O5n5n5J22m4n0j3lJ38m1n2N0q7N1k9
5447b6P8o7%ON9Oj32N8J58j17k2N5q8l6NJ8J4M4q3J14l4m0J34j02No8J50p2q4
5476f7Q2M4n1j19O5J43k17J87k4j17J33j1L6j22M6JJ11k00J05J1K8m7Q2l0n5l7
5502b3Qn7k0M8k8P1n7n6J13q3J6J50l9o0j8J8r8J67p7R8j03N3M6J9Q1j55J4j07
5530g9J00m9Po9P8%L9Mo3K5O2l3j2l4l3Q6n8k6m1J46L8j60K0K5O7l1%o1K2P9j28
$$ plain form
5561 -79 22 1 33 33 24 -24 -1 -162 -65 56 21 45 -79 -131 0 -15 -41 -4 -70 75 -63 129 88 -12 -18 69 57
5588 57 -39 -14 18 -27 74 -25 18 27 -21 -94 78 -41 -21 77 -6 49 -86 -27 -87 -56 -41 95 -148 -37 -21 -44 -21
5615 -21 -14 39 45 -26 23 78 -18 68 -5 -42 5 103 30 -80 -57 -2 -99 -77 45 81 3 82 29 50 50 -68 36 -12 20 37
5645 37 -8 65 10 -4 0 -11 -45 -54 -31 73 70 -1 9 19 44 -8 -84 16 127 27 -81 21 2 -18 134 18 -51 -21
5673 -21 31 45 -83 -87 10 11 -112 -47 -61 -12 27 -56 -56 53 55 -52 30 -95 54 -39 46 3 -129 -26 15 27 36 -82
5701 -82 -13 7 107 -104 -6 122 61 76 -54 -41 16 -22 0 -19 78 -94 21 19 -62 45 24 36 1 -22 107 58 -26
5728 -26 -38 -19 -25 42 38 44 -118 81 -121 -13 77 24 -7 -16 25 -94 -8 55 12 -18 9 -70 188 24 -5 -50 56 -106
5756 -106 -26 -28 -70 -69 -23 51 39 -40 -1 -16 -45 -37 48 -2 3 20 -32 49 -13 -122 58 -52 13 43 -37 7 -15 82 -37 -32
$$ packed form
5561g9J01k1L2%rm8K3j61R7J21l5K4j24n2J31j5k6L7o6J45j38J92m1j00oQ7j2
5588E7r6K5L2m5J01r9M3Rm8p3J72j19K0R8q3N5j35N9o0L1J5J36k43J11J6k3K3
5615b1PN3Op1M9N5r6Q6p3l7M7R8p3j10K3N5r7K2J22L6p8P9n3K1%j18J04m8L2J7
5645C7m5P3n5j4Mj1l4rK3J04lp1J0J0K5n2p6J00J11j00j08J02j9k0J52j16o9L0
5673b1N2J4j28mR7Jj23O5j4M9L9q3%J09Kj07Q2j25J49r3Q5m3j32J03M1J2Rj18
5701h2O9K0J00k11R8J28o1J5j30J3N7l8K2j9R7j72J15kq1J07k1J2l5k3J29m9q4
5728b6j2J9oO7mOj62J99k02J08R0n3l1rM1j19Q6O3m3l0K7p9K58j64k9m5J06j62
5756a06Q0km2JM6P4j2p9L9j5k9QQ5n0NJ7n2Q1o2j09J80j10O5L0q0M4k2R7j19N
$$ plain form
5786 -32 25 -97 145 67 20 77 -155 59 40 -57 153 60 -96 -57 -37 -12 38 -66 7 37 -4 42 -163 -18 -24 -9
5812 -9 9 6 -59 -69 -1 -22 -85 -96 7 1 -132 -60 -23 38 -13 -107 44 102 -36 42 -12 21 11 -13 59 3 149 21 -128
5841 -128 -20 -37 13 10 -20 16 54 -12 3 -62 -30 -15 -86 60 59 105 -72 -34 -36 -46 -80 50 -55 -59 -35 21 45 60 -14
5870 -14 39 -79 22 92 -58 -2 -137 -48 -15 -131 -25 -14 0 -96 50 56 -108 1 -111 -47 -36 -47 46 22 -20 -51
5896 -51 -56 -123 26 43 -47 -58 2 26 -39 -83 35 -159 -20 -42 12 13 63 22 39 26 133 -88 14 87 117 -30 61
5923 61 89 11 -35 -56 38 35 23 60 87 20 -28 -6 -88 -9 -17 15 -163 77 140 -122 45 61 64 95 -57 -57 36 -39 55 -39
5953 -39 40 27 25 -22 19 -15 10 19 -41 -46 -75 3 126 16 26 20 35 41 -52 -89 -18 164 11 -98 -32 -8 -39 74 -5 64
5983 64 103 -68 -47 78 -99 44 -60 -61 18 -113 -7 46 112 -5 83 23 -14 17 10 -27 36 -32 -69 -12 10 -45 20
$$ packed form
5786c2N7j22K42p8m7N7k32K14j9r7K10r3j56L9K0K5N0j04P3L0m1M6k05J45oJ5
5812iJ8lo5j0O8k1o3j1J03oj33P2L7O1n1r4J51N8j38P8n4L3j0k4P2n6J46j28j49
5841a28J08j7N0ll0L6L8o6J5o5L2J5p1J46jM6j77L8kj0l4J30j05mK4N6K4J5p4
5870a4N3j18J01P0j50N6j35Q9L3j16J06J1J4r6J46Oj64J09j12O4J1j1R3k4m2l1
5896e1no7J49J7r0j1O0K4o5m4J18j94J39k2N4JN0m1J7j3J07k21J02P3L0j47R1
5923F1K8p8m6k1R4lj2L7K7o7m8K2q2P9qL2j78K40O3k62J67J6LL1j52%R3p5R4r4
5953c9P9j3km7M1l4K5Ro0nk9P8J23j10J0oJ5Or3l7P1J82j53j09O6K4l1J13p9O9
5983F4L9j71K1J25j77J43j04jP9j31J06N3O6j17Q8o0l7L1pl7O3o8l7N7K2n5O5
$$ plain form
6010 20 -35 77 -27 44 58 11 12 35 -41 -4 30 -86 -9 -115 -115 -173 30 26 30 -18 -48 -94 9 23 -79 29 25 35 -7
6039 -7 -36 38 -33 63 -37 -11 24 99 7 -71 50 -56 18 -75 70 28 6 138 -19 40 -8 -36 -43 -15 70 11 -19 -106
6067 -106 -16 -125 3 -45 -5 -18 -28 -102 -21 4 -44 136 58 -37 48 -54 -53 -70 18 53 31 12 -78 7 -34 78 1 4
6095 4 34 104 29 -24 -56 132 4 24 -63 55 26 -125 -53 -57 36 46 -55 19 9 -53 -28 -82 22 -112 -85 -77 -40 6
6123 6 33 -8 1 -84 92 40 61 -82 23 -11 60 10 -88 -36 -29 -32 -83 48 -75 -16 21 50 -48 -41 -23 -68 -58 -46 41 36 81
6154 81 54 -139 28 -60 -21 -29 -9 59 -16 16 -70 50 33 15 -38 -104 12 -12 23 -32 7 48 63 58 42 -97 -78 75
6182 75 56 -71 9 88 -29 -81 111 19 -26 -41 9 7 28 21 5 32 36 14 -60 -14 -45 -85 36 -34 -74 7 89 -4 11 70
6212 70 18 16 -1 89 27 -28 -66 82 14 32 -91 -14 1 120 11 -96 -12 60 -131 -35 6 -96 -78 -85 72 -21 9
$$ packed form
6010B0n5J12j04P1J4m7JK3p6L7L4j16P7j06%n8K03mMm8l0m6J03J4j02J08mJ0m2
6039gk9P4p1R6j00K6L5P5r2p8J21j06P4r3J45m2k2J32j57N9m8k8pK8Q5n9l0q7
6067a06R0j09J28m8M0j3j0p4Q1K5m8J80p8r5Q5j02Jj7Q8L5k2j9r0Q5m1J12p7L
6095DL0P0p5n3l2J88j28K0q7J18k9j51P2mR3J0j01P4j0o2K5n4J04j34K7QL7M6
6123FK7m1Rq5J76n2K1j43J05l4P1n0r8N2Pln1J31j23N9L7K9r8PJ8m5J0J2Q7nM5
6154H1k7j93J67q8L9qK0O8p5L2q6J20j7j8n3o6J16k4L5n5L9M1J5nj6j39J9J53
6182G5j9j27Q0P9j17n2J92r2m5j5N0kK1pj6K7Mk2p4M6l1m0J21p0m0Q1Q2r3J5N9
6212G0n2kj7R0o2n5l8J48o8J8j23P7J5J19j09j07Q4P2j91R6M1j02J8pJ57r3L0
$$ plain form
6239 9 58 125 20 164 -38 33 180 51 -48 -27 -28 125 55 -11 35 107 -46 -9 65 -15 0 13 -32 9 -16 47 -22 -105
6267 -105 -69 -40 8 -78 -68 13 4 7 82 51 34 36 -15 -12 -37 -24 -39 8 2 7 17 -112 -17 -24 15 -42 -65 -9 53 105 12 14 53
6300 53 22 48 -38 28 53 -27 113 23 -2 40 55 23 21 41 -40 14 18 -66 -22 -52 -155 -33 -9 -11 7 183 -37 -45 -12 -32
6330 -32 85 -63 19 -43 -79 -19 36 38 -35 -2 46 36 15 89 -2 -57 -50 10 -59 -52 111 -27 -17 -69 -59 -52 116 42 -121
6359 -121 73 146 -57 7 -58 128 -56 69 78 -21 23 110 -91 -24 -3 -2 24 76 -33 92 75 -111 -33 -62 63 -68
6385 -68 42 -43 5 166 -53 3 96 -112 42 42 34 -21 -91 -60 38 -20 4 -95 -28 73 6 -78 94 49 7 14 2 -49
6413 -49 -14 -43 111 32 42 39 12 -59 -106 -83 14 -39 -51 47 -19 70 -34 -77 14 69 -89 -33 2 -58 32 37 -7 -55 -57 89
6443 89 -98 -53 2 95 15 -24 77 -60 -29 41 -1 25 -67 0 -16 -3 -94 -48 51 16 160 51 78 -34 -23 -108 95
$$ packed form
6239IM9O7j05J44k02P1J47j29r9K1jJ53p0o6M6P2j53L7P4q0J5J3m5M1k5O3o9q3
6267a05L6K9M8q6J0Q1rLP5l1j7Kn1Lk5J3j5M7oNJ0j29R5pL9n7k3N6O2N2r3KL9
6300E3l1K6q6O6K5q0J40r0k5M2J5l2kK0q1N4Mq4M4l0j03J22K4kJ8J76k20qL3k0
6330c2J17j48Q2o2l6O0N5Kp3L3M8j0k1P4r1n5PO0o9PJ63j38J0n2J0PJ68p4j63
6359a21J94P3k03O4o5J86j84J25Rr9M4Q7k01O7K1JK6N2j09J25j7j86P8k9J25j31
6385f8J10q5M8J61k19N6R3k08J54%qn5p0L1R8n8K4r9O7J01o7q4J72m5m2Pj2n1
6413d9L5k9J54p9J0lk7p1m7K3R7n3j2R8o6Q9j04m3R1N5j58N6L5o0R0Nm4m8kJ46
6443H9j87M5N5R3q0l9J01j37L1P0m2K6r2O7j6J3r1M6R9l5J44j09K7j12J1q5K03
$$ plain form
6470 95 67 -66 98 -192 45 -3 -32 -42 38 -79 147 -136 101 58 -48 26 -3 -4 62 66 -5 93 62 7 8 18 -6
6497 -6 144 5 -9 158 6 -53 89 29 115 -31 48 40 18 102 25 40 9 -115 29 15 48 -69 32 -12 -61 68
6523 68 92 143 -53 40 -89 35 -39 -197 5 75 68 -67 -67 0 -44 10 -63 -19 -69 9 17 -2 42 88 -66 -22 45 -6
6551 -6 16 -16 72 64 73 -32 -24 -58 -33 -69 -77 43 6 -53 104 105 -8 -35 -10 16 -28 -55 -45 111 0 -119 -77 -158 -54
6580 -54 -72 55 18 20 28 59 75 99 -130 33 -51 -68 56 -46 -21 21 -60 -75 93 -77 57 -23 -20 112 -31 -4 45
6607 45 35 -52 86 65 85 -2 69 48 11 145 -89 77 -22 -45 -68 91 -95 -4 -34 13 30 74 -63 -104 -26 20 57
6634 57 -44 -69 -137 1 74 86 6 24 50 24 44 63 18 99 1 -26 -23 -33 18 -9 33 112 22 -50 -15 23 -37 34 -72
6663 -72 -38 68 -24 -2 -5 29 -7 39 23 -54 5 35 -7 33 -46 -37 -70 104 -77 54 -27 65 42 36 44 -70 57 -60 -123
$$ packed form
6470I5k8j33J64k90K37m8k9j0Q0j17K26k83K37m3j06P4k9jO6Mp1R8l1n5JJ0k4
6497fJ50j39j4J67j52n9J42o0Q6j46P9qk2Q4p7J5l1j24J44j4L3j17J01m4m9J29
6523F8K4N1j96R3j29J24p4j58K02P0pj35%O7m4N4p3M4n0P8Qj9M4M6j54M4O7n1
6551fK2l2Q8qRj05Ql4K5l6qJ20l7n9J57Jj13k7K5K6m4k7J0J56j11j19M2q1J04
6580e4j8J27l7KQL1J6K4k29J63q4j7J24j02K5M2q1j5J68j70J34q0LJ32j43K7M9
6607D5j0q7J38k1K0q7P1k1l7J34k34J66r9k3k3J59j86R1l0M7J7M4j37m1P8M6L7
6634E7j01k5o8J38P3J2q0J8K6k6K0J9m5Q1r8k7Lj0N1k7M2P9r0p2L5L8o0P1j06
6663g2L4J06r2K2lL4l6M6j6p7N9L0m2M0p9Rl3J74j81J31q1R2k3oQj14J27j17o3
$$ plain form
6692 -123 -82 21 -61 -45 -115 -12 4 -92 19 47 47 64 -7 -15 -92 -9 -105 64 -16 -9 -60 24 203 47 14 32 -58 -99
6720 -99 -77 27 -7 -52 -16 114 21 11 -14 9 -64 -4 -131 -74 21 81 22 18 -35 -18 53 37 78 -90 33 -51 -139 -6
6748 -6 4 -29 -7 -5 -26 39 -134 40 14 -152 -28 -29 -25 48 2 2 105 -19 7 37 31 -23 30 119 74 9 -8 -62 -11 -129
6778 -129 -68 -64 35 5 -43 -2 -55 26 37 -14 29 2 33 47 -99 -5 2 23 -31 -44 86 85 -60 -16 -15 -64 -36 -81 41 -19
6808 -19 107 37 97 33 71 -90 47 21 25 -8 -100 27 -15 -24 -8 -46 -28 -22 4 108 8 -29 59 -66 -78 -22 -20 8 16
6837 16 18 -51 -87 71 123 70 -59 6 -21 -157 -105 33 -91 -67 29 65 -104 -22 -23 -62 48 44 75 -17 61 15 -11 -70
6865 -70 -21 152 108 -24 19 -63 49 -24 96 99 10 -4 -69 -21 -30 36 62 68 -107 -3 17 -76 20 95 15 37 105 80 12
6894 12 -85 -38 -16 -79 -47 51 -19 -4 49 100 70 59 112 -65 9 -28 72 99 88 22 -46 -80 92 -104 -7 41 23 1
$$ packed form
6692a23M1J03q2J6p0J03J6r6J11K8%J7p1qp7Q3r6J69q0Pn1Q4J79j56l3J8r0m1
6720i9K2J04l4m5L6J30r3j0k5K3p3O0j27N7R5O0n9mn3J7P1j6M1j68J23q4q8J33
6748fJ0l3K2Kk1O5j73J74k6j66J24jMP3m6%J03j24K6L0on4N3Q9m5o5j7n4N1j18
6778a29O1MR9l0m8M1n3Q1J1n1M3k7L1J4j46R4PK1n4j3J30jj45M4Jm9K8m5J22o0
6808a9J26p0O0o4L8j61J37k6Ml3r2J27m2rJ6l8J8OK6J04j00l7Q8j25j2N6KK8Q
6837A6Ko9l6J58N2n3j29O5k7j36N2J38j24K4R6L6j69Q2jl9J10mL1r2P8m6k6n9
6865g0M9J73m4j32M3q2J12p3J20Lq9j4o5M8rO6K6Oj75J04K0r3R6P5q0K2O8k5o8
6894A2r7M7K2o3L2R8p0J5N3N1l0j1N3j77P4l7J00K7j1o6o8l4J72j96R7M8j8k2
$$ plain form
6922 1 37 5 12 -40 -5 -3 27 52 19 -4 -59 11 -28 -30 -19 124 -38 -35 28 21 -89 30 -139 -21 37 -36 29 -60 -61 84
6952 84 -17 87 -82 37 -9 -120 69 48 39 -33 -60 135 -61 15 20 -33 -29 -19 34 6 51 -9 -38 11 -46 -55 58 37
6980 37 4 -58 -27 -47 22 47 3 -151 -57 -25 0 14 43 -16 36 -83 -71 26 3 -114 10 4 -87 -43 -16 4 7 -46 -74
7009 -74 -37 -25 35 -52 -12 -16 5 40 25 -53 -23 -12 11 23 -54 27 -9 56 13 2 2 -105 -4 64 55 -44 -38 3 -71 53 -3
7040 -3 110 148 39 -26 -120 11 -65 -39 39 23 -59 -123 18 135 -19 -3 -73 7 14 -5 91 -67 -3 -2 77 -156 -59 -75
7068 -75 -131 111 -76 -1 -84 -12 -35 -4 62 -46 65 -73 7 -28 -60 140 10 70 -76 11 29 107 12 -86 -29 -40
7094 -40 -41 -90 -19 -66 75 45 -16 32 32 -60 -40 -13 83 -41 13 61 -46 13 -34 -4 -55 -50 -27 4 -54 18 -17 107 -7
7123 -7 58 57 19 -5 76 -12 100 -96 0 44 -16 5 58 -56 -60 15 -45 -27 -13 -80 76 -109 -87 65 25 53 -53 -51 -95
$$ packed form
6922AL6l2Pn2L5KL0K5l3k3n5P0l9kJ1J43j62LO3pj10J19j69J18N8p3O5q9jJ45
6952H4j01J04j69J19m6j11J89k1rp2k7J95j96P6Nn3MJ0N3k8M5o0k9M9n7rJ13k1
6980C7l3o2L1k0O9K5m4j54R4L2K5J4K9n9N2j19J2R7k3j17J24or1M4K7K0Ln3k8
7009g4L7J2O0q7M0mK1L5j5p8L0J1K3J2p7Q1l6O5m3j1%j07J01O8rr9OM1p4J24n6
7040cJ13L8j09o5r4J31p6K6P8j6q2o4J41J17j54J6p0Q0Pj9R6j58O4JP9k33R7j6
7068g5n6K42j87P5q3P2k3L1O6j08J11j38Q0l5l2K00j30O0j46Q7J8P8r5r8N7j1
7094d0jm9P1m7J41l0o1M8%r2K0K7R6j24N4M8j07N9m7L0n1NK3L1n8P2l5J24j14
7123gO5jl8k4Q1q8J12j96R6M4o0K1N3j14mP5o0J8J4o7J56j85K2J52m0K8j06Km4
$$ plain form
7152 -95 -40 47 35 -11 -76 -54 67 -5 0 -19 108 53 93 -49 -9 -32 80 124 -55 -60 27 -63 -40 -12 4 73 -2 -12 -35
7181 -35 -13 -38 89 70 -97 9 -50 -22 32 46 16 15 89 34 -35 2 -60 82 -4 75 58 19 -70 30 -136 -29 119
7208 119 16 94 52 77 72 -55 52 62 -76 -26 4 31 -111 34 -11 -38 27 26 81 -75 -94 88 -29 11 66 -3
7234 -3 16 -7 -76 19 -55 -121 -83 -16 22 -8 -78 -7 -17 40 -60 38 60 36 -92 -5 1 73 -42 36 -6 -4 81 104 -23 -40
7264 -40 -36 8 60 -2 11 -27 -8 -4 33 -7 70 -97 -73 65 130 20 -10 46 -108 -92 -47 -33 -74 48 22 0 -28 -5 72
$$ packed form
7152i5N5Q7j2m6o5K2J21p2Nj9J27n5M0j42M0k3J12M4j79nQ7r0K3K8J6O9p5j0k3
7181c5K2k5J27j9j67J06n9K8N4J4l0jP4n5o9L7o2J42q6P9j7l9q9J00j66J07J48
7208A19j03P8m2K5nj27J07J0j38N0L0K7j42J45m5k7O5jN5j56j9J82j17M0N5o9
7234cJ9k3o9R5p4o6L8O7L8l0p0P1j0N7j00R8K2k4j28Q7OP2j15P8m2KQ5K3j27j7
7264d0MM4N2o2J3l8J9ML7m0P7j67K4J38O5j10l0N6j54J6M5J4m1J22k6k2k8K3P7
$$ [...]
8191g6
##END NTUPLES=NMR FID
##END=
