##TITLE=1H_DE-80H_X3
 200.13MHz, d2o
 8 sc
 
 19ns.26.2.2025
##JCAMPDX= 6.0         $$ Bruker NMR JCAMP-DX V2.0
##DATA TYPE= NMR FID
##DATA CLASS= NTUPLES
##ORIGIN= UXNMR, Bruker Analytische Messtechnik GmbH
##OWNER= pz
$$ XWIN-NMR		Version 3.5
$$ Wed Feb 18 11:09:28 2026 Russian Standard Time (UT+4h)  Yarkov@DPX200
##.OBSERVE FREQUENCY= 200.1313
##.OBSERVE NUCLEUS= ^1H
##.DELAY= (6, 6)
##.ACQUISITION MODE= SIMULTANEOUS
##.ACQUISITION SCHEME= undefined
##.AVERAGES= 8
##.DIGITISER RES= 18
##SPECTROMETER/DATA SYSTEM= spect
##.PULSE SEQUENCE= zg30
##.SOLVENT NAME= CDCl3
##.SHIFT REFERENCE= (INTERNAL, CDCl3, 0, 14.3821)
##AUDIT TRAIL= $$ (NUMBER, WHEN, WHO, WHERE, WHAT)
$$ ##TITLE= Audit trail, XWIN-NMR		Version 3.5
$$ ##JCAMPDX= 5.01
$$ ##ORIGIN= Bruker BioSpin GmbH
$$ ##OWNER= Yarkov
$$ C:/Bruker/XWIN-NMR/data/yarkov2/nmr/H-C/1/audita.txt
$$ ##AUDIT TRAIL=  $$ (NUMBER, WHEN, WHO, WHERE, WHAT)
(   1,<2026-02-18 11:08:44.21 +0400>,<Yarkov>,<DPX200>,
      <created by zg, POWCHK disabled, PULCHK disabled
       configuration hash MD5:
       00 E9 B6 7A A2 85 ED C7 34 08 36 98 17 FE 4E 26
       data hash MD5: 16K
       F0 78 9B 0E 73 B0 98 23 8A 8C A8 CF 16 1D 6A 77>)
$$ ##END=
$$ 
$$ hash MD5
$$ 99 0A C1 01 92 06 C7 B6 35 5D D2 EE 7F FF C1 55
##$RELAX= 
##$RELAX= 
##$RELAX= 
##$RELAX= 
##$RELAX= 
##$RELAX= 
$$ Bruker specific parameters
$$ --------------------------
##$DU= <C:/Bruker/XWIN-NMR>
##$EXPNO= 1
##$NAME= <H-C>
##$PROCNO= 1
##$TYPE= <nmr>
##$USER= <yarkov2>
##$AMP= (0..31)
100 100 100 100 100 100 100 100 100 100 100 100 100 100 100 100 100 100 
100 100 100 100 100 100 100 100 100 100 100 100 100 100 
##$AQSEQ= 0
##$AQ_mod= 1
##$AUNM= <au_zg>
##$AUTOPOS= <>
##$BF1= 200.13
##$BF2= 200.13
##$BF3= 200.13
##$BF4= 200.13
##$BF5= 200.13
##$BF6= 200.13
##$BF7= 200.13
##$BF8= 200.13
##$BYTORDA= 1
##$CFDGTYP= 0
##$CFRGTYP= 5
##$CHEMSTR= <none>
##$CNST= (0..31)
1 1 145 1 1 1 1 1 1 1 1 1 1 1 1 1 1 1 1 1 1 1 1 1 1 1 1 1 1 1 1 1 
##$CPDPRG= <>
##$CPDPRG1= <>
##$CPDPRG2= <>
##$CPDPRG3= <>
##$CPDPRG4= <mlev>
##$CPDPRG5= <mlev>
##$CPDPRG6= <mlev>
##$CPDPRG7= <mlev>
##$CPDPRG8= <mlev>
##$CPDPRGB= <>
##$CPDPRGT= <>
##$D= (0..31)
0 0.7 0 0 0 0 0 0 0 0 0 0.03 0 0 0 0 0 0 0 0 0 0 0 0 0 0 0 0 0 0 0 0 
##$DATE= 1771398523
##$DBL= (0..7)
120 120 120 120 120 120 120 120 
##$DBP= (0..7)
150 150 150 150 150 150 150 150 
##$DBP07= 0
##$DBPNAM0= <>
##$DBPNAM1= <>
##$DBPNAM2= <>
##$DBPNAM3= <>
##$DBPNAM4= <>
##$DBPNAM5= <>
##$DBPNAM6= <>
##$DBPNAM7= <>
##$DBPOAL= (0..7)
0.5 0.5 0.5 0.5 0.5 0.5 0.5 0.5 
##$DBPOFFS= (0..7)
0 0 0 0 0 0 0 0 
##$DE= 6
##$DECBNUC= <off>
##$DECIM= 32
##$DECNUC= <off>
##$DECSTAT= 4
##$DIGMOD= 1
##$DIGTYP= 9
##$DL= (0..7)
0 120 120 120 120 120 120 120 
##$DP= (0..7)
150 150 150 150 150 150 150 150 
##$DP07= 0
##$DPNAME0= <>
##$DPNAME1= <>
##$DPNAME2= <>
##$DPNAME3= <>
##$DPNAME4= <>
##$DPNAME5= <>
##$DPNAME6= <>
##$DPNAME7= <>
##$DPOAL= (0..7)
0.5 0.5 0.5 0.5 0.5 0.5 0.5 0.5 
##$DPOFFS= (0..7)
0 0 0 0 0 0 0 0 
##$DQDMODE= 0
##$DR= 18
##$DS= 0
$$ [...]
##$SUBNAM2= <"">
##$SUBNAM3= <"">
##$SUBNAM4= <"">
##$SUBNAM5= <"">
##$SUBNAM6= <"">
##$SUBNAM7= <"">
##$SUBNAM8= <"">
##$SUBNAM9= <"">
##$SW= 18.0517328524113
##$SWIBOX= (0..15)
0 0 2 0 0 0 0 0 0 0 0 0 0 0 0 0 
##$SW_h= 3612.71676300578
##$TD= 16384
##$TD0= 1
##$TE= 0
##$TE2= 300
##$TE3= 300
##$TEG= 300
##$TL= (0..7)
0 120 120 120 120 120 120 120 
##$TP= (0..7)
150 150 150 150 150 150 150 150 
##$TP07= 0
##$TPNAME0= <>
##$TPNAME1= <>
##$TPNAME2= <>
##$TPNAME3= <>
##$TPNAME4= <>
##$TPNAME5= <>
##$TPNAME6= <>
##$TPNAME7= <>
##$TPOAL= (0..7)
0.5 0.5 0.5 0.5 0.5 0.5 0.5 0.5 
##$TPOFFS= (0..7)
0 0 0 0 0 0 0 0 
##$TUNHIN= 0
##$TUNHOUT= 0
##$TUNXOUT= 0
##$USERA1= <user>
##$USERA2= <user>
##$USERA3= <user>
##$USERA4= <user>
##$USERA5= <user>
##$V9= 5
##$VALIST= <valist>
##$VCLIST= <CCCCCCCCCCCCCCC>
##$VD= 0
##$VDLIST= <DDDDDDDDDDDDDDD>
##$VPLIST= <PPPPPPPPPPPPPPP>
##$VTLIST= <TTTTTTTTTTTTTTT>
##$WBST= 1024
##$WBSW= 4
##$XGAIN= (0..3)
0 0 0 0 
##$XL= 0
##$YL= 0
##$YMAX_a= 220950
##$YMIN_a= -228348
##$ZGOPTNS= <>
##$ZL1= 120
##$ZL2= 120
##$ZL3= 120
##$ZL4= 120
##$ABSF1= 10
##$ABSF2= 0
##$ABSG= 5
##$ABSL= 3
##$ALPHA= 0
##$AQORDER= 0
##$ASSFAC= 0
##$ASSFACI= 0
##$ASSFACX= 0
##$ASSWID= 0
##$AUNMP= <proc_1d>
##$AZFE= 0.1
##$AZFW= 0.1
##$BCFW= 1
##$BC_mod= 2
##$BYTORDP= 1
##$COROFFS= 0
##$CY= 83.5205535888672
##$DATMOD= 1
##$DC= 2
##$DFILT= <>
##$DTYPP= 0
##$F1P= 10.8118882576601
##$F2P= -7.23987719738617
##$FCOR= 0.5
##$FTSIZE= 0
##$FT_mod= 4
##$GAMMA= 1
##$GB= 0.15
##$INTBC= 1
##$INTSCL= 1
##$ISEN= 128
##$LB= 0.25
##$LEV0= 0
##$LPBIN= 0
##$MAXI= 10000
##$MC2= 0
##$MEAN= 0
##$ME_mod= 0
##$MI= 1.114404
##$NCOEF= 0
##$NC_proc= 0
##$NLEV= 6
##$NOISF1= 3.799351
##$NOISF2= 2.8
##$NSP= 1
##$NTH_PI= 0
##$NZP= 0
##$OFFSET= 14.38212
##$PC= 1
##$PHC0= -5296.148
##$PHC1= 6.821927
##$PH_mod= 1
##$PKNL= yes
##$PPARMOD= 0
##$PSCAL= 0
##$PSIGN= 0
##$REVERSE= no
##$SF= 200.129724274929
##$SI= 16384
##$SIGF1= 3
##$SIGF2= 2
##$SINO= 400
##$SIOLD= 16384
##$SREGLST= <1H.CDCl3>
##$SSB= 0
##$STSI= 0
##$STSR= 0
##$SW_p= 3205.1282051282
##$SYMM= 0
##$S_DEV= 0
##$TDeff= 0
##$TDoff= 0
##$TI= <>
##$TILT= no
##$TM1= 0
##$TM2= 0
##$TOPLEV= 0
##$USERP1= <user>
##$USERP2= <user>
##$USERP3= <user>
##$USERP4= <user>
##$USERP5= <user>
##$WDW= 1
##$XDIM= 8192
##$YMAX_p= 0
##$YMIN_p= 0
$$ End of Bruker specific parameters
$$ ---------------------------------
##NTUPLES= NMR FID
##VAR_NAME=  TIME,          FID/REAL,        FID/IMAG
##SYMBOL=    X,             R,               I
##VAR_TYPE=  INDEPENDENT,   DEPENDENT,       DEPENDENT
##VAR_FORM=  AFFN,          ASDF,            ASDF
##VAR_DIM=   8192,          8192,            8192
##UNITS=     SECONDS,       ARBITRARY UNITS, ARBITRARY UNITS
##FACTOR=    0.0002768,     1,               1
##FIRST=     0,             0,               0
##LAST=      2.2672688,     0,               0
##MIN=       0,             -228348,         0
##MAX=       2.2672688,     220950,          0
$$ Real data points
##PAGE= N=1
##DATA TABLE= (X++(R..R)), XYDATA
$$ [...]
1836C549n12J987Q0o553m912J809Q66n11P018O907l149n904k516m094l950N269
1852d616J0321L183k747j896m992q551l86P887M715J422K209r12o992n368J849
1867d874K287M6M213N544j460m407j615k250m457M03P394M971n75M9j707q385
1883d823n412M227N592K829L921K368n751q424j078K352M97M311P128m20n675
1898A642k434j429l856m36O227M767o63M65L78o128o174J500L806K135M027M567
1914H394k333p808l542N58q20L043P809K957l977l604k287m059k123N153O261
1929C622O42j82Q77m653o740J48L637J880K798M991J58o588m492J20j473N02O972
1946B219M902k146l082j539m202l901K812O479J998M17K143l274p255j968K443
$$ plain form
1836 3549 3037 5024 5104 -1449 -6361 -4552 -3686 -4197 2821 9728 6579 675 -1841 -5935 -9885 -4616
1852 -4616 5705 8888 6141 4245 -747 -9298 -9684 -1797 2918 4340 6549 5637 -1355 -6723 -4874
1867 -4874 -2587 -2541 1672 7216 5756 1349 -266 -2516 -6973 -6570 824 5795 5220 5269 3562 -4823
1883 -4823 -10235 -6008 -416 2413 6334 8702 2951 -5473 -6551 -4199 -3702 609 7737 7317 1642
1898 1642 -792 -2221 -6077 -6513 -286 4481 3818 4283 4661 -1467 -7641 -6141 -2335 -200 3827 8394
1914 8394 6061 -1747 -5289 -4731 -5551 -2508 5301 8258 4281 677 -1610 -5669 -7792 -2639 3622
1929 3622 4264 4082 4959 306 -6434 -6286 -2649 -769 2029 7020 7178 590 -3902 -3782 -5255 -4753 2219
1946 2219 7121 4975 1893 354 -3848 -7749 -4937 1542 3540 3957 6100 2826 -4429 -6397 -3954
1961c954J982K607N377J904n125n484j126j422l93N733N829m08l083j571l091
1976b225m442P89O068K736j45K231m62o139l689J446J018R23M823M568k721n232
1992d53j637k548l001M361P525J894j718j415l776n777o36N713M096Q19J904m09
2008D942n709m016Q99J381O97K922M198o44m135j483j241l760O75O061L714j07
2024D394K6j713o207m584L625N130J768L163J626n531o717k80J964J066L193M545
2040E468m68m676j629l5k872j70M342K648J11Q37M63l854n406P1K694J931L654
2057C109M306j870o681m352p7P69L152O519K855m599m349j224k443l75N164M325
2073D229q64j148N24k360m154K16K417l45J249M758Q32l926l284j562j955M01
$$ plain form
1961 -3954 -1972 635 6012 7916 2791 -2693 -3819 -5241 -5634 99 5928 5520 2437 866 -2225
1976 -2225 -6667 -5878 190 2926 2781 5012 4550 -1589 -5278 -3832 -2814 -1891 2932 7500 4779 -453
1992 -453 -2090 -4638 -7639 -3278 4247 6141 4423 3008 -768 -6545 -7181 -1468 2628 3447 5351 4942
2008 4942 -767 -4783 -3884 -2503 -1806 1116 5314 4670 535 -948 -2189 -5949 -5274 787 4501 4394
2024 4394 4420 2707 -3500 -8084 -4459 671 2439 5602 7228 1697 -5020 -5300 -3336 -2270 923 5468
2040 5468 5000 324 -1305 -1340 -4212 -4382 -40 2608 2719 3556 4019 165 -5241 -5170 -2476 -545 3109
2057 3109 7415 5545 -1136 -5488 -5565 -4796 -1644 4875 7730 3131 -1218 -2442 -4885 -5260 -96 4229
2073 4229 3365 2217 2741 381 -3773 -3557 -1140 -1485 -236 4522 5354 1428 -1856 -3418 -5373 -4972
2089d972N980N528q41l020k740m612k642L784O167K328o05j005l098m999o06L850
2105a503J756J39K689Q29l086k378K07j197j823K461N269J139j297j57l602n681
2121f235L5M899L757J881J403k102o722l805K581K772K139L628J450m023l961
2136b303m47N13n46J838L862K20j543N37p85m268j806K066K351J591L046J270
2152E596m342n592p94J297J520M561M540j468n339k835o64q59K177N647J458k922
2168A981q87p45l099j433K538J864j7J619K438j925l964j079l21p28K715N340
2184D297J425k676l039k487k635J57N194M272j97j470j629l911k803K100L791
2199C89J281L13J647j257m339p73J460j110N47L973K150j500j739q71l184k626
$$ plain form
2089 -4972 1008 6536 5695 2675 -65 -4677 -7319 -3535 2632 4960 4355 3350 252 -4747 -5353 -1503
2105 -1503 253 392 3081 3910 824 -1554 -1347 -2544 -4367 -1906 3363 4502 3205 3048 -554 -6235
2121 -6235 -6200 -1301 2456 4337 5740 3638 -3084 -6889 -4308 -1536 603 4231 5681 1658 -2303
2136 -2303 -2750 -2237 -2783 -945 2917 3137 1594 2131 1346 -2922 -4728 -2662 -311 1280 4326 5596
2152 5596 1254 -4338 -5132 -3835 -2315 2246 6786 5318 -21 -2856 -3520 -4379 -2202 3445 4903 1981
2168 1981 1094 349 -2750 -4183 -1645 219 202 1821 4259 2334 -1630 -2709 -3030 -3758 -1043 4297
2184 4297 5722 3046 7 -2480 -5115 -4958 236 4508 4311 2841 1212 -2699 -5502 -3402 389
2199 389 1670 1983 3630 2373 -1966 -2739 -1279 -2389 -1842 2131 4281 2781 1042 171 -3013 -5639
2215e639L155M497R28P48l3m013m472k8K817K502K138K054q56m536k330L66K87
2232b415R18L199K173j049k134q45j460k478Q92L964J245J65J375j405m597k154
2248d606J828J858J292L499J431l904l638j96o31j76L701L410m47k054j110j890
2264a633k627Q84L468J556N91J008j047l383k255N11J604J189K434K312j847l655
2280h90j199n41p79J768L984J569j904j182q30l418j063L446K542K23J526K71
2296C523l467l295L09J191M80K634L072j206l328j297j190j123J622L471J795
2311C191p43j151p99k560j669J800K341R46R44J147j627l583j299R71R8J466L707
2328C180J185k993k059j153k013N0M029L224l95r70p06l074k517J872K873N57
$$ plain form
2215 -5639 -2484 2013 2941 3689 3656 -357 -4829 -4857 -2040 462 2600 4654 3798 -738 -3068 -2702 -2415
2232 -2415 -1497 1702 3875 2826 692 -153 -1613 -4091 -3199 765 2010 2175 3550 2145 -2452 -4606
2248 -4606 -2778 -920 372 3871 5302 1398 -2240 -2436 -3067 -3243 458 3868 3421 1367 257 -1633
2264 -1633 -4260 -3376 92 1648 2239 3247 2200 -1183 -3438 -2927 -1323 -134 2300 4612 2765 -890
2280 -890 -2089 -2630 -3409 -1641 2343 3912 2008 826 -4 -3422 -4485 -1039 1503 1726 3252 3523
2296 3523 56 -3239 -2930 -1739 -1259 1375 4447 3241 -87 -1384 -2574 -3697 -2075 1396 3191
2311 3191 2448 1297 498 -2062 -3731 -1931 410 1356 2300 3447 1820 -1763 -3062 -2091 -1993 -527 3180
2328 3180 4365 1372 -687 -1840 -3853 -3803 226 3450 3055 2085 1379 -1695 -4212 -2340 533 1090
2344A090J018R50j425k890j050N70j83N21K776J796j185j341j069k180j399K055
2360a946L621J451j99l84k266m004l62K974J874J318J435p75l818j989R78O03
2376a489J79K630J816j636j257J70j499j649O16K285J255O42J100j221l760j957
2392c775R52J320K274K706O91k909l566r23N19P91K896K952r02k648j070o95j053
2409b440P71K342J089j028P07M10k122j832L84M3J97K574K432o59k564j809j306
2426b811q83K193M247J173j439j436k300k205M2L159K521l03l58k86k270j703
2442b659J174Q68N1Q99J663J62j485q83o27j964PL192K248J52l69j441l317j979
2460d308J789L113J543O75O8k743l274J65J679J209J053J495k19k243r72O31o75
$$ plain form
2344 1090 2108 3058 1633 -1257 -2307 -1737 -1920 -1399 1377 3173 1988 647 -422 -2602 -4001 -1946
2360 -1946 1675 3126 2927 2543 277 -3727 -4089 -1115 759 2077 3512 2737 -1081 -3070 -2092 -1489
2376 -1489 -1310 1320 3136 1500 243 413 -1086 -2735 -2119 166 1421 2063 3163 1942 -1818 -3775
2392 -3775 -2823 -1503 771 3477 4168 1259 -2307 -3230 -2711 -1920 976 3928 3026 378 -692 -1387 -2440
2409 -2440 -1669 673 1762 734 1441 1851 -271 -2103 -1719 -1676 -1479 1095 3527 2868 304 -1505 -2811
2426 -2811 -3694 -1501 2746 3919 2480 1044 -1256 -3461 -3419 -260 2261 1958 1600 1314 -956 -2659
2442 -2659 -1485 -617 -566 333 1996 2158 673 -210 -837 -2801 -2794 398 2646 2798 2429 988 -2329 -4308
2460 -4308 -2519 594 2137 2812 2880 137 -3137 -2972 -1293 -84 969 2464 2245 2 -970 -339 -1014
2477a014q60J679J400r7N92K76k021k858r2J615J299J880J877j215l681j805J33
2494b892R67K134K655P89k129k505o76k07r1J955J857l87p50O8o83j815n04J373
2512h41M43K35K270Q93k266j948m70q13N60K970K565q33k064j276j763j264K165
2529a437L013N88l17o78j468j775k50J611J027K99P89O29j222j389m19l05m13
2546a717J074K377R18j339r32j041k425j8K758K071K70J55p54k806j923J681J644
2563gL60J530R81k054j815n7l76j87J162J690L69o42k70q46j734m80J165J649
2581D38J102N50m2j582k546n53J618Q64J036J885n09k463j354K6k70L49K567J269
2599B385j328o90R3k037j038J766J315K33J022N07j476k210k29M20rJ673J848
$$ plain form
2477 -1014 -1874 -195 1205 1108 1700 1976 -45 -2903 -2995 -1380 -81 1799 3676 2461 -1220 -3025 -2892
2494 -2892 -1925 209 2864 3653 1524 -981 -1657 -1864 -1955 0 1857 1470 720 788 105 -1710 -2214 -841
2512 -841 -398 -163 2107 3000 734 -1214 -1684 -2497 -1937 1033 3598 2765 701 -575 -2338 -3602 -1437
2529 -1437 1576 2164 1847 1169 -299 -2074 -2324 -713 314 613 1402 2031 809 -580 -999 -1304 -1717
2546 -1717 -643 1734 2652 1313 381 -660 -3085 -3103 -345 1726 1996 2151 1397 -1409 -3332 -1651 -7
2563 -7 353 1883 2864 810 -1005 -1062 -1438 -1625 -463 1227 1596 954 684 -162 -1896 -2376 -1211 438
2581 438 1540 2090 2048 466 -2080 -2633 -1015 -151 885 2770 2261 -202 -1556 -1530 -1800 -1451 1116 2385
2599 2385 1057 367 460 -1577 -2615 -849 466 699 1721 2228 752 -1458 -1687 -1267 -1276 397 2245
2616B245j94j272j276r68n36M02J437J900J29q13n27j128j545K15J845J096J62
2633A172O39j74k428j460J027J61L65K344R27j746j177k54r55p07J897J881p4
2650A438k91K17j534j728M34P06N76J242Q74j85j470j581m03k1P27J594J666k00
2668B061j659j268o01o67P53K409J160q60l60n57j847o44J586P60j95R56R47j605
2686C69j417L22m29o46J528J843K7m45m22j573j393L71J731J511N13K7j243j877
2704a203r57M86J484J037M48L00p93j950l92Q85j24J87J468N16o96k52J08j512
2722i60j288J432J332J26J181M22k307j995K8N57J045J703J370j066k113r10j34
2739a577K16J168J487K40m66r10n19k60n14K52J056L05Q1Q24l20j633j109L66
$$ plain form
2616 2245 2051 779 -497 -1465 -2001 -1599 -162 1738 1867 1054 527 -601 -2146 -1931 -86 1010 1172
2633 1172 1811 1637 -791 -2251 -1224 -1063 -698 1646 2573 827 -350 -604 -1559 -2266 -369 1512 1438
2650 1438 1147 1364 -170 -1898 -1464 -758 -182 1060 1934 1749 279 -1302 -1705 -1726 -999 595 2261 2061
2668 2061 402 -866 -1467 -2134 -1381 1028 2188 1328 968 411 -1436 -2080 -494 266 71 1027 1974 369
2686 369 -1048 -726 -1155 -1801 -273 1570 1597 1152 730 -843 -2236 -1865 -134 1377 1890 1917 674 -1203
2704 -1203 -2160 -1674 -190 847 1295 1595 802 -1148 -1540 -655 -779 -592 876 1392 696 444 552 -960
2722 -960 -2248 -816 516 642 1823 2245 -62 -2057 -2029 -1472 -427 1276 2646 1580 -533 -1443 -1577
2739 -1577 -1361 -193 1294 1534 1068 158 -361 -621 -1135 -883 173 478 559 1383 1063 -570 -1679 -1313
2757a313K80O98K033Q76j670j682m34r08M54K439J585p65r80p61j100p35J242
2774g41J343Rq2L39p15p94K3M2j98J78R00J149J66r66q63j065p39Q12J962J344
2794B104m35o52j406j922k14K171J406J16M09o41j823o95R08N37O8Q35N57r02
2812D21m14K91o52j064M25Q93N32Q16L07q10j741j068M65J125J319J126Q3j586
2830D68j678n64P17P36J079J031l25j818l35R1n17L06R73M00k48L03K67j035j057
2849a206K55K99J09J482J189p17j397j022m87l4J234J751N07j105p95j102p34
2866a773M28J284J072n1l14k20n88p83K28N94p4M39P81J77r57o52k08o30m7J456
2886A62J412l62m58o27j514n55J036J423N97R2k0j073j402N1P88N07N98O47m16
$$ plain form
2757 -1313 -1033 -335 1698 2574 904 -778 -1212 -2120 -1666 773 2358 1593 613 -148 -1248 -1983 -741
2774 -741 602 611 529 868 153 -641 -618 -576 -774 -596 304 1453 1619 653 -210 -1275 -2014 -1202 760 2104
2794 2104 1669 1017 -389 -2311 -2525 -354 1052 1168 1577 936 -887 -1582 -674 -137 -69 766 1323 421
2812 421 7 298 -354 -1418 -993 -100 432 1248 1555 745 -996 -2064 -1599 -474 845 1971 2054 468
2830 468 -1210 -1774 -1057 -321 758 1789 1464 -354 -689 -598 -1115 -809 164 564 316 619 886 -149 -1206
2849 -1206 -951 -652 -543 939 2128 1411 14 -1008 -1495 -1529 -295 1456 1963 858 63 -1039 -1773
2866 -1773 -1345 -61 1011 960 646 426 -162 -945 -717 -123 -197 242 1023 1200 243 -409 -617 -1247 -1294 162
2886 162 1574 1212 754 127 -1387 -1942 -906 517 1114 1206 1186 113 -1289 -1238 -450 57 655 1302 886
2905H86o80o55k02j82j05Q83Q66k7m4j02j109r79J80Q81R29N96L58m06j715p41
2925a368L47N03N40J017M11r30j071j59j71o5P16J104P0l85Q8q46q32m1P62N91
2945B81L70M78R6j230r88k1J92L06J082O76l35p95o01k70n00N23J337M34j80n2
2965H03o06r45m53N39P79L68N24J43r00j102q3J24M9Q44J044l1q97l67m20l92
2985i79l7J335M52j06J28j90r97o93K42N52M11N61O57n34j296k63k53KQ96J110
3005I98L34o62o57m21p10j7J180O29P2J89m22o62p32M2M05K46K93P34J4q25m00
3026c72l26l66K42J159R05k00m92m52r80o88R60J030L46K52k71p91j096K9O06
3045e05N37K41N28q5o76k95nm39P3M21P44J94qk78n99r88k6Q98O23M69N58q05
$$ plain form
2905 886 206 -449 -651 -833 -938 -55 811 784 740 638 -471 -1450 -1270 -389 540 1136 1494 1088 -627 -1368
2925 -1368 -1021 -518 22 1039 1450 520 -551 -710 -881 -946 -230 874 944 559 647 -199 -1031 -1072 -310 281
2945 281 651 1129 1225 -5 -993 -1014 -822 -516 566 1242 907 112 -489 -759 -1259 -736 601 1035 855 803
2965 803 197 -748 -1201 -662 117 485 1009 1152 252 -850 -933 -809 -760 84 1128 1097 200 -167 -587 -979
2985 -979 -1016 319 771 665 793 603 -394 -1087 -845 -293 118 679 1336 802 -494 -757 -1010 -1008 -112 998
3005 998 1332 670 13 -408 -1118 -1135 45 674 746 935 513 -149 -881 -839 -434 -188 105 839 853 28 -372
3026 -372 -698 -1064 -822 337 1242 1042 550 98 -882 -1570 -610 420 766 1018 747 -44 -1140 -1111 -505
3045 -505 32 273 801 716 40 -255 -260 -699 -626 -205 539 733 725 447 -152 -1140 -1166 -268 355 824 1382 577
3067E77j283p07L08P42N30Q15K71j084o70j52Q4R4O99M18lm83K4r9p75n0K78J69
3089b97M26P06K52q11r83k73kM14J233P56k45p79j151l32j18J132J031J46q30
3108B75R8m55m55o3N56K36l7K77M1j59m59j16l23k70O91R62J45k83n20p49o96
3129a304J45J081J116M1l21o58r72m60Q34O24N48M1j12m88n82n5L10j2N4N94J54
3150E78j93J04m15o50m95M62P31L72L02K50j154j024lN29Q85O66M21p26j000m77
3170h37L10O7N37O37k3n57j49q9k92j24P3M52J66J33M32l03p56l88mL03O31P53
3192I72K56q64q87l76j04M18R13O65k06p10l71k89k38L53Q17J45k33K08j50n83
3212b64r1J02m4M5O37M52k00n13l24o50j68P61P73K65k4n61p11l90k9Q03O50Q4
$$ plain form
3067 577 -706 -1413 -1105 -363 167 982 1253 169 -501 -653 -569 -475 224 642 639 156 180 81 -694 -744 -466 -297
3089 -297 129 835 1087 276 -707 -980 -982 -568 665 1421 1176 397 -754 -1086 -1204 -72 959 1105 275
3108 275 373 -82 -537 -600 -44 192 155 432 473 314 -145 -261 -584 -854 -163 799 944 661 141 -608 -1304
3129 -1304 -1159 -78 1038 1079 758 100 -872 -1332 -498 126 674 715 603 115 -467 -522 -212 -224 -170 424 578
3150 578 385 489 74 -576 -1071 -609 122 494 796 1046 -108 -1132 -1135 -606 279 945 1366 640 -360 -837
3170 -837 -527 -460 77 714 691 134 -15 -104 -396 -520 -447 5 171 304 736 433 -323 -711 -715 -412 219 972
3192 972 1228 364 -523 -899 -1003 -585 328 993 787 77 -294 -583 -821 -468 349 494 261 469 319 -264
3212 -264 -355 -253 -297 -252 385 837 637 124 -200 -850 -1018 -257 516 781 757 196 -515 -905 -934 -131 519 603
3234F03O6k73p13m41L48J19K61K28L35j41m33j86j8n44L17O56K02L65r6n32o40
3255e17l44L73N87L15M23J8q34o81p5J18L57O22L20k68l64k52j93j96J39N93M44
3276E85k28O2j27n18l53J5M81J78M15L00m61n94l03l7M2N46N88K07m65k71k90
3297b28m31N1P24L53N1l0j73m10m81j1L87J59L64K51j07n73l42k11J09L72M60
3318B84N00l43k73j84l80l14M48M76J94j00J81k70p00j52K62K68K23M47J27n94
3338A00m59k8k19K07N47O04j34l00l08n50m6K69M19K16J72j52j14o16r8K12O2
3359b16P2M85L24k79l97l17j72j42M43P54J73k89j58n61n52K73N10L87J4J58k35
3380B75m97l33K43J83J4L56K87k83p4k31k21j69J9N46K37J61K8l41n89m02K62
$$ plain form
3234 603 669 396 -317 -758 -410 -291 -30 198 533 392 -41 -227 -245 -789 -472 184 386 751 655 123 -517
3255 -517 -861 -488 99 414 837 855 21 -660 -735 -617 -260 362 682 414 50 -202 -395 -591 -452 141 585
3276 585 357 419 292 -226 -579 -564 -83 95 510 810 349 -245 -548 -585 -543 3 591 798 333 62 -228
3297 -228 -659 -608 116 469 520 490 317 -93 -574 -585 -198 -39 325 576 469 -104 -446 -657 -548 -176 284
3318 284 784 441 168 -16 -396 -710 -262 214 408 308 489 219 -481 -633 -371 -103 120 567 694 100
3338 100 -359 -387 -606 -399 148 752 618 318 10 -540 -586 -317 102 318 490 338 224 -392 -490 -278 -216
3359 -216 -144 341 665 386 -11 -328 -500 -642 -199 555 728 439 281 -280 -832 -559 -49 338 352 510 275
3380 275 -222 -555 -312 -129 -115 241 528 245 171 -60 -281 -450 -431 115 352 513 541 200 -389 -791 -529
3401e29M54N33K55j55n13o71n1L50L06L29L53k47m29j80j4j0N0K69Q9r9J15O8
3423B73m68k64j7N5L53M62L65k33o01m59RR9M83O46P8m67l50m77O5mN88M18l21
3446B33k09J0j92j78J03J29J32M9K16J28k50k60j19l72J65O81K96J6k31o46k09
3467e08k76M92P89K1j05j41o26l52K83L77K77m2K03r0l02n7r0p2j27J62L31J61
3489C08M3j77l75m60O4M89M07M10j4m33q11j27J70M38L90J74J00n40m73K9J25
3510b63Q9L60K6lq7m8j00j81k11J76L24%M08J03n72l63k28J19L20N62K09o0o80
3533a00l32q8q5N41N10K0l01j72j26j96q6M65J62j13J02J54k09k76j01j49M6L43
3555IL95J15k93k86k60k70J44O87L50m2j62m98k66j56K53L58J09K34P4m73l35
$$ plain form
3401 -529 -75 458 713 558 45 -626 -677 -327 -21 308 661 414 -15 -195 -209 -219 -169 100 189 90 205 273
3423 273 -195 -459 -476 -421 -68 394 759 526 -75 -534 -525 -426 57 703 781 314 -36 -513 -448 -452 136 554 233
3446 233 24 34 -158 -336 -233 -104 28 77 293 421 171 -89 -208 -580 -415 266 562 578 347 -299 -508
3467 -508 -784 -292 497 518 413 272 -354 -706 -423 -46 231 189 392 302 0 -57 -147 -219 -346 -184 147 308
3489 308 351 174 -201 -661 -597 -108 299 709 695 262 -549 -676 -506 -68 322 496 596 56 -417 -388 -263
3510 -263 -174 186 212 209 122 74 -26 -207 -418 -242 82 82 490 593 21 -342 -570 -451 -131 431 640 580 -100
3533 -100 -432 -520 -605 -64 446 466 165 -7 -133 -329 -415 50 212 99 201 355 146 -130 -231 -380 -334 9
3555 9 404 519 226 -60 -320 -590 -446 241 591 549 387 -111 -377 -533 -280 78 187 421 495 22 -313
3576c13l3J86jJ06J94K89k62p7j65l62OJ95L79L08j35L6l68l72m7L50L36J49O
3599D05k30k80k01oM4J94L37J27k85o8j23j93LJ27J47K31L6J17l69k97j92J68
3621c08J65K64J63k8j82k84j31n9K13L37K74j8k73j99k13q4P8M03J57p2J00j78
3643A25l67j22R8J67R7K98Q8l59j90n9m6lL36K13j7k3j43k17j04j12K76K56M6
3666B38J16j37k10l52O6l1K65L40J22q2l95j48n5j18K26K84J73j43j03o8l00j39
3688d51L36J59O1J09qp6m35J23l7M7L51J88M9k60k12j62k58J07M81L06Jj34k19
3711F6l51k05K93K97J78o3k9j32k61J99p0p7K48R0J19j03p2o5k55k51K93L30P9
3734B58L5m0m21l17R0J49L81J12K07k03m40q9K3O6J05L22M6j05j19j69p8J6J60
$$ plain form
3576 -313 -346 -160 -161 -55 139 428 166 89 -76 -438 -432 -237 142 450 315 351 -17 -389 -436 -86 250 399 405
3599 405 175 -105 -306 -312 -268 -74 263 390 105 37 -86 -279 -276 -149 -2 229 265 382 13 -284 -476 -308
3621 -308 -143 121 284 256 74 -210 -341 -400 -187 150 424 406 133 -66 -279 -363 -285 118 275 203 303 125
3643 125 -242 -364 -266 -99 -2 296 384 25 -165 -224 -270 -273 63 276 259 236 93 -124 -228 -340 -64 192 238
3666 238 354 217 7 -345 -279 -310 -45 295 417 335 -60 -208 -263 -381 -155 129 302 159 56 -12 -312 -451
3688 -451 -115 44 105 214 206 130 -305 -182 -219 -172 179 367 416 156 -56 -218 -476 -369 112 418 419 285 66
3711 66 -285 -490 -197 100 278 215 186 54 -207 -8 -78 -155 93 183 302 199 127 62 -193 -444 -151 179 258
3734 258 293 253 -168 -485 -395 -246 135 247 454 251 -189 -278 -255 -189 -84 238 284 179 60 -109 -187 -171 -11
3757a1Q9j4N2J39r1k91k13N7J39J84M35l6l35k85q4k33L55L22M06k88j44l29j63
3780c39k2J35L13K6r7P6m9j12o8L3R9l6K56Q9L8l70k20j06L2J78L12L10k49k17
3804A2j9m44J18M22K09nj23j31k13K0L8J32L8r4J88J1j07q1o5j87J58J04J83J43
3828C07n4k39j71k86J82K66K75K8k3l97k41jK46J49P4K24j95k19j21L8n0k5K49
3851A6J45j4l6N9k44l3n6O4J06O9K32Pl86k73N0J8L27K51J16l11k90j29R6kL86
3876A68K13q9l24R2j58j48J44J58r9M9K46M5k17j98p7M2j31K57L04n5j85j20k46
3899c29L2K61J89K47k00q1j74j58L6K19m0Q3J01p1j86o3Q2j05pJ78J51L3j64J17
3923A51l41j04O8K93J87j2N1k24k60j61J91R1J04J17J03j67k37p2K8K17P3R2O0
$$ plain form
3757 -11 78 64 116 255 164 -127 -340 -283 -144 40 475 439 104 -181 -265 -498 -143 179 585 297 153 -176 -339
3780 -339 -361 -226 87 113 16 92 43 -69 -137 -104 -5 -41 215 304 342 -28 -248 -354 -322 -144 168 478 229 12
3804 12 -7 -451 -333 89 298 293 170 39 -174 -154 -116 16 54 -40 148 159 52 -29 -94 -281 -123 -19 164 307
3828 307 253 14 -157 -443 -261 5 280 308 285 -112 -353 -354 -108 41 115 339 144 -75 -196 -158 -208 -233 16
3851 16 161 147 111 170 -74 -107 -163 -99 7 76 308 315 -71 -344 -294 -276 51 302 418 107 -183 -312 -216 -218 168
3876 168 381 292 -32 60 -98 -246 -102 56 -43 6 252 297 80 -118 -195 -153 -284 -27 277 222 37 -83 -329
3899 -329 -297 -36 153 400 200 119 -55 -213 -177 42 2 85 186 115 -71 -134 -52 -157 -164 14 165 198 34 151
3923 151 -190 -294 -226 67 254 242 293 69 -191 -352 -161 -70 34 151 254 87 -150 -222 -194 23 96 188 248
3946B48j68K5j26j51n5J73Q0P6J38q8j70k62Q2J05M9K25K00k31j05k24J1j05L25
3969E2J67K0j44j18N4k21q9J40K79nj29K02j49l08M3J54oP5K52L0l23j15P8o8
3993a29j8K06J02m6O6j28k78l1O7J86L3R1N2M7l86r4M6J33J18PK45l43Qm7j28
4018b21J70P0Q0O6j03r0p1k45J81J59k2J8J54n4r1j11j34P6l2L80O3J2j56k19
4042a20o3k7J45J94N7KPk67j09j11K56J54k3L1N5k02j39J81j25K7O2K8P0%Q5k64
4068i6j61Q8J64O1N7Q4r0k45j09J51J68J05J52q8j82l12J15o9K45P9n5Q4j3k30
4092i7N8j22n1K20J06K8O6o6j16k39o4J12K2L70J09j47k95L6k65J57J25L08p1
4115A84j14j17O8j39L0J77j1j8p4N6j0j77j42L09k08K01J18J65j96j08j36j78
$$ plain form
3946 248 80 105 -21 -172 -227 -54 26 102 240 152 -18 -280 -198 -93 -44 181 381 150 45 -179 -168 -273 52
3969 52 219 239 95 -23 31 -190 -279 -139 140 135 6 208 59 -249 -206 -52 -58 17 269 299 -24 -139 -61 -129
3993 -129 -147 59 161 115 181 53 -225 -256 -189 -3 30 121 173 220 -166 -260 -214 -81 37 44 289 -54 -46 -93 -221
4018 -221 -51 19 99 165 62 -28 -99 -344 -163 -4 -26 -8 146 92 1 -110 -244 -168 -200 180 243 255 99 -120
4042 -120 -183 -210 -65 129 186 188 195 -72 -181 -292 -36 118 95 126 181 -21 -160 21 -104 -77 -15 13 83 83 168 -96
4068 -96 -257 -169 -5 56 113 197 107 -138 -247 -96 72 177 329 241 59 -253 -138 -207 38 117 62 146 133 -97
4092 -97 -39 -161 -212 8 114 142 208 142 26 -213 -277 -165 -143 227 336 189 -106 -70 -335 -178 -53 255 184
4115 184 70 -47 21 -118 -88 89 78 60 -14 42 32 -145 -287 22 -186 15 133 298 102 -6 -142 -320
4137c20J55J00K50M9j15j05k87r3L17J57J30l0j52q3q3j4M1Q0o3P4J6J8J5q8k2
4162e3j54R7J58J32j8q6j23l00J23J58K00M8K4j20k29j77K89J79j55J35j06pp8
4185f3RK1p1P6KQJ05PM1k45j56L2J35O0K42j08l9k95RR7J4K78K4J23m56lk1M5
4213a29Q6K67n6j74l7JJ7j24J64j36M6O2J92n7%q5j58j42J72K44N0j23Rj32j15
4238a58l9J99K22o9n6l5k00j50J97J23NNo3N5r5p8K22k45L3J71J49n6j6j51j23
4263a53K8k2K14J04K8p2r5k48L3K46l7J97ro6j68o3n8J7P3J04Q3k20K02r9j32
4288a13q4J02J68N3p5p1J20j34j20J2J08n2R1K21l4l28P7k46K31J46R9n0l6j33
4312d8J7o2p1J09J22o6O0O1k08q9J6O9L3J54j5M2k05Ql1k2J9J36R0q5M6n4k11
$$ plain form
4137 -320 -165 -65 185 234 119 14 -273 -366 -49 108 238 208 56 -27 -110 -124 -83 -3 -66 8 24 42 57 -31 -53
4162 -53 -207 -110 48 180 162 76 -47 -347 -224 -66 134 182 206 86 -143 -320 -31 148 -7 128 22 15 -63
4185 -63 -54 -33 -104 -28 -26 -18 87 94 135 -110 -266 -234 -99 -39 203 95 56 -239 -230 -133 -119 159 183 306 -150 -153 -174 -129
4213 -129 -43 224 168 -6 -43 -42 -25 -149 15 -121 -75 -13 179 122 122 37 -121 -263 -91 153 203 80 89 -43 -158
4238 -158 -197 2 224 155 99 64 -136 -286 -89 34 39 44 -19 36 -59 -137 85 -160 -127 44 193 137 121 -30 -153
4263 -153 -125 -147 67 171 199 127 32 -216 -183 63 26 223 214 148 -20 -83 -141 -124 -51 53 136 -84 118 19 -113
4288 -113 -197 -95 73 126 51 -20 100 -34 -154 -142 -34 -86 5 226 192 -136 -59 -305 -74 72 171 121 85 -48
4312 -48 -31 -93 -164 -55 67 1 61 122 -86 -175 -159 -90 -57 97 82 124 -81 -73 -104 -126 -107 29 119 34 80 26 -185
4339a85k1J19K35j51L6J24j66j18K2k4J6J66N7O1o3k56J74j61n8K51MK9p8N3j71
4364a05j59J84NJ21m7M7p3j61J21M6j39Q0K33J25l14m2k4m8l1K16J31l2m0j70
4388g6k1j4j3P7J37q8O1J6j00m9K9m5Q1nJ12n1M3m7j47j44N6K92n5L9kk6l23M
4416b59K32N4Q0Q2l9k32k2Q2Km1P1J01j7j17J28j12m5L8NR9l2O2O2j75j97J19
4442g1n8J07K68k4k28q1r8L5J12J42J06m5j39p8K6J0K8K9J4r2N7M9j46p6J20m3
4468g6k1J04J32oPj64p4p2J72Q3J28k8j44k06l7M4K38J2Pj07k2po9k7K31j78o3
4495a43K78o0o4k5M8j37j08J73J99q0Q1n6k58j11J33J24J33K8m9p8k32N3J50N5
4519E4J74j52j09P2q7MK0m3J9J37k26J91J5K3k22J11o0NJ48K8J65k97p2n4P3J59
$$ plain form
4339 -185 -206 -87 148 -3 33 157 -9 -127 -105 -129 -113 53 110 171 108 -148 26 -135 -193 58 62 91 13 66 -105
4364 -105 -264 -80 -75 46 -1 46 -27 -188 -67 -21 -160 -80 153 278 -36 -78 -102 -150 -181 35 166 134 94 -76
4388 -76 -97 -111 -124 -47 90 2 63 79 -21 -70 -41 -86 -5 -10 102 51 94 47 -100 -244 -188 104 49 88 86 60 -263 -259
4416 -259 -27 27 107 189 150 -82 -104 -22 -20 -61 10 111 94 -23 105 -7 -52 -14 -9 90 58 120 182 7 -190 -71
4442 -71 -129 -22 246 222 -6 -87 -185 -150 -38 104 210 165 26 -52 -26 -16 12 41 55 -37 20 69 -77 -153 -33 -76
4468 -76 -97 7 139 133 140 -24 -98 -170 2 85 213 185 41 -165 -202 -158 80 92 99 -8 -30 -37 -106 -133 98 -80 -143
4495 -143 135 75 11 -14 34 -103 -211 -38 161 81 162 106 -152 -263 -130 -6 127 155 106 28 -204 -151 -1 54
4519 54 228 76 -33 39 -48 -44 -24 -67 -48 89 -137 54 69 92 -130 -19 -79 -74 74 102 267 -30 -102 -156 -83 76
4545G6J27M2j63j18o3J4j36L16l8r9o3P1j2P8r4P0l0nj7K57k24J5j2j31j8N3L37
4572B33j43q4q1j8j07M9L52q3n9Pn8o4L3m7J98j36%N3J05j53M0q1k8K4Q2J05j12
4599B7P6L8k62j39K38Q4J07q3J4j83j50J61J14qjK05k72m5M1P3n8k5Q7N1o0j01
4625g1R6k7j80J82j1N4k2M9K7k85J06R1l0O8J33j10j48rQ5p5J01j0J36p3k15K37
4651I9k34K2O2L9j9Q2j2K5j52q3J29j07J70KJ44j22r5L0k6k8M2K26k02l1O2j07
4677h4j7l4P2P9R6K0j02k7k5k4Q0q9J32J09o4j58l6On1N5Q4R4j29j29J64j52R2
4704c8J08j5j06J02%Mj23O6M0q5K9J67l5j15m2pnJ09J08m3j6j45L8j10L1K8R7
4731D2k3j7M2N9j15oR6j56K7J92j23J3K3J1k36L3J76Q9p8L5J1j62p9j7K69j11
$$ plain form
4545 76 203 245 82 -36 -99 -85 -221 95 57 -42 -105 -34 -46 32 -62 8 -22 -27 -44 213 -11 4 -8 -139 -157 -104 233
4572 233 90 6 -75 -93 -200 -151 201 118 59 66 8 -56 -23 -70 128 -8 -8 45 150 -3 37 -44 -72 -48 34 139 27
4599 27 103 141 -121 -260 -22 62 169 86 100 -83 -233 -72 42 34 33 238 -34 -79 -38 35 -23 -48 39 90 30 -71
4625 -71 25 -2 -182 0 -11 43 21 70 97 -188 -82 9 -21 47 180 70 -78 -87 -2 -77 24 14 150 77 -138 99
4651 99 -135 -113 -51 -12 -31 51 39 64 -88 -171 -42 -149 21 23 167 45 -50 -20 -46 -74 -32 194 -8 -39 23 -84
4677 -84 -101 -135 -63 16 112 132 30 3 -22 -46 34 -55 77 186 122 -36 -72 -66 -117 -62 22 116 -13 -142 22 -130 -38
4704 -38 70 55 -51 51 51 55 -68 -2 38 -47 -18 149 114 -1 -43 -50 -55 54 162 119 103 -42 -4 -114 -83 -55 42
4731 42 19 2 44 103 -12 -18 78 -78 -51 141 18 31 54 65 -171 -138 38 127 49 84 95 -67 -146 -163 106 -5
4757eL5K9j43p4O8J29ln4Q8p7o6J20L5l9j40N8K1n9Q2J26n3j84m9J64j0O6J39
4784B04l3k04j19J43P4k7L2Q6q5j74J48m5n3J90p0k54J05J43k2p1L4p7j16P0J74
4809E3K31j47j33pj3k12K54J61l6j80l4K6p5L8K34q7p7O5k7j20J34j9R7k19l5
4834a28J69N1K9j71J47k77%J32K06j33L5M8l14J7K23M5K4j7o8j02o6P0J49N7j84
4859e8J45m3j45J37R5j56j95K61n9rQ3J53j80j09M5m3L2K21Nj0k11j16K03j10
4883f4J62R0p8j89JQ3p9J10rQ2j85K9Q4J46j98L3M0p6pJ73Q9j86J2j50nk5J78
4910F1Kkr6O0r9o5J64P8l2m8k7o7J15o1J28l2j02l6J76k01N4rM7p4j05K55M2j22
4938DL1k8j14r8K57J29j88N5l5j77L6J08P9j38P8N8r6j19K41r1q6R8N4n3p7O8
$$ plain form
4757 -5 30 59 -84 -158 -90 39 36 -18 70 -7 -73 47 82 43 -97 -39 -18 -77 5 131 78 -106 -155 9 -1 65 204
4784 204 171 -33 -152 -9 65 38 70 156 71 -103 45 0 -53 137 67 -187 -82 61 39 -32 2 -75 -191 -121 53
4809 53 284 137 4 -3 -16 -228 26 187 151 -29 -63 -37 -112 -74 160 73 -4 61 34 -86 48 29 126 -93 -128
4834 -128 41 92 121 -50 97 -180 -180 -48 158 25 60 108 -206 -189 34 79 103 86 18 -84 -150 -80 69 126 -58
4859 -58 87 44 -101 36 131 -25 -220 41 -18 -27 56 209 29 -80 -35 -78 -46 175 180 170 -41 -157 46 -64
4883 -64 98 188 110 -79 -78 5 -74 36 27 109 -76 -47 37 183 -15 18 58 -18 -25 148 237 51 63 -87 -92 -117 61
4910 61 63 61 -35 25 -74 -139 25 103 71 23 -4 -71 44 -17 111 79 -23 -59 117 -84 -30 -39 8 -66 -171 84 126 4
4938 4 35 7 -107 -205 52 181 -7 48 13 -164 -128 -20 59 -79 -1 57 -39 -158 83 -8 -94 4 58 5 -72 -4
4964dJ54k94J43qK6K8M9J3j03q3p0J19j1K6J04j4r7j38Q8nP1Q3o7k1J26J6j66
4991c5PK8J53j34L0j4L3j58j3J62j90K87L6l8j22o2J20j42p6J01N2j0K7q7J04
5016E9j77K3J38NlN7j07m7M5Rk8oO7J23j13j63J11J23j95Q8l5M1n3Q9o9j35M0
5043a13J05K3j05K64j66j5q1N8j59J63K29j46j5mk6M4j56R3R2n1q0O6j4l9J47
5068A14r6O5r8rJ56j94R8J34k16j10J92l6J13j88J61n7j54Q7N9K2L3Q6j49k53
5092b40J71J38Kk6kj10J3m6K23j22j9M3r2J14j50J95Q0k71M3lR8q1J67m8j37n7
5118a17J15n2P0M4L0m0k08J25L3M4M2Pm1r2l3J63j13ML6o0j99K05J01L9j14N6
5144D5j55O0p6K93rj05j13LL8Q2kM6J3l04P3O8K1J23J0j30QK4R1k3j20J51j37
$$ plain form
4964 -4 150 -144 -1 -9 17 45 94 107 4 -79 -149 -30 -41 -15 89 75 -22 -160 -72 -77 -6 77 10 -11 115 131 -35
4991 -35 -28 0 153 19 49 35 68 -90 -103 59 -131 156 192 154 32 -30 90 -52 -128 -27 25 15 42 -45 59
5016 59 -118 -95 43 48 45 102 -5 -52 -7 2 -26 -32 35 158 45 -118 -7 116 -79 9 -26 15 -38 51 -18 -153 -113
5043 -113 -8 15 -90 174 8 -7 -88 -30 -189 -26 203 57 42 38 12 56 -100 -7 85 34 -46 20 6 -33 114
5068 114 18 83 -15 -24 132 -62 36 170 -46 -156 36 0 113 -75 86 29 -125 -38 21 43 76 162 13 -240
5092 -240 -69 69 71 45 43 -67 -54 -100 123 1 -18 25 -67 47 -103 92 172 -99 -56 -59 39 -42 125 77 -60 -117
5118 -117 -2 -54 16 60 90 50 -158 -33 0 44 86 93 52 -40 -73 90 -23 -19 17 -43 -242 -37 64 103 -11 45
5144 45 -110 -50 -126 167 158 53 -60 -57 -19 63 61 107 120 -184 -111 -43 -22 101 111 -19 -11 13 104 81 -39 112 -25
5171b5j56J43R2%J1j19N1l08K03K19Oo7k8M8k60O6K46J36j81j8j05r4J26J58k9
5196A15j75l1J19m6L4K5L1r4nlJ23P1j30Q3j80k11K46P9j45K11Q8k66j37J58O0
5221B0m2J06L0j43p8J33j6K4l0K0o8JR3P9k5k02J57j35R2p7J86n9m9n8l0k5J18
5248B2J03J2j17q1o6P8Q8n6L05l72N6M0p2J05N8n7j19RJ30k5k6m3Kj8j35K69o4
5275B6K7r4M6m5p0R4J61j31N5j4o4j14O0R6O0j19J05K1k45J42K5j31N6Q5j7k2
5301gN0J11o2j56L0L4j7pN9P9j52l1k3J60r7Q7J93k15j71J50j19jJ39J22j85j6
5327d5J64j02j80N4K12j56k4R5Mq3l6J25k2l5n8P9J52j59k4J49k20J19K6O3j74
5352g6M4N5o5L0JN8j61J75Ro8j40P0J24o4j50K37N1k43J18P4r0o1M2K2n5K6P4
$$ plain form
5171 -25 -181 -38 54 54 65 -54 -3 -311 -108 111 117 50 22 70 -190 -124 122 258 77 59 -46 -140 -14 144 115
5196 115 -60 -91 28 -18 16 41 72 -22 -27 -30 93 164 34 117 -63 -274 -28 51 -94 117 205 -61 -198 -40 20
5221 20 -22 84 114 -29 -107 26 10 34 4 24 -44 -43 50 129 104 -98 59 -76 16 -61 125 66 17 -41 -71 -96 22
5248 22 125 137 20 -61 -127 -49 39 -17 288 -84 -28 12 -60 45 103 46 -73 -64 66 41 15 -28 -26 -44 -179 90 26
5275 26 53 -41 5 -40 -110 -16 145 14 69 55 -9 -123 -63 33 93 -26 79 100 -145 -3 22 -109 -53 32 15 -7
5301 -7 43 154 92 -64 -34 0 -17 -24 35 114 -38 -69 -92 68 -29 58 251 36 -135 15 -104 -105 34 156 -29 -45
5327 -45 119 17 -163 -109 103 -53 -77 18 22 -61 -97 28 6 -29 -87 -8 144 -15 -39 110 -110 9 35 98 -76
5352 -76 -32 23 -42 -12 -11 47 -114 61 70 2 -138 -68 56 -8 -158 79 130 -113 5 79 -11 -72 -30 -8 -63 -37 37
5379C7P5j66O6K8j74J68J02r9j53Q6O4mp4K26j40r5m4J17q5QJ83l6q1l6n1O1q1
5406i8J35j8Pj38K09n1r3J19r9o0rK06rL2r5m2q8q0J26J67j89k2J89j84M9mJ08
5433F8J32j60J8p8K2o4R7l2j01K7J10m4qJ30k7j36o9J98M2n4L3l1j32j9J69M1
5459A32j11K8K2j47K4M6L5K6qN5j36o5K08k0o0p0M9n3PJ56M2j41j1q2O3j9J09
5486G9J02j19k01J19L9n2P0J7P7k27lJ25poNn3j34J57L9O9o5J5m4j38J29%J29
5513A22j01p7Q7j77P3R8J81j89L3j14o1J08J31L2k24l5K31j86K7K05l2r9j36O7
5537c6n1J59j2J58j09m30L47K2o6J68j1j78q8m2J92JJ9P8j02j69N3J55J2m1On4
5563a9j22J16J16J6j26m2R0j79J93N4mk6j77J63k25N8J04J21r8q1PO2l7R7ln2
$$ plain form
5379 37 112 -54 12 40 -134 34 136 37 -116 -30 34 30 -44 182 42 -53 -97 20 -65 -57 126 90 9 -27 -78 -17 -98
5406 -98 37 19 26 -112 97 46 -47 72 -27 -87 -96 110 101 133 38 -4 -92 -172 -46 121 -68 -90 99 -85 -36 -40 68
5433 68 200 40 58 -20 2 -62 35 3 -98 -71 39 -5 -13 117 90 -46 -115 83 125 71 104 73 -59 -78 91 132
5459 132 21 49 71 -76 -52 -6 29 55 47 102 -34 -99 109 89 29 -41 8 -45 -38 118 160 19 8 -74 -11 -30 79
5486 79 181 62 -139 -20 19 -33 37 54 131 -96 -99 26 19 13 18 -35 -169 -12 27 96 31 46 2 -136 -7 -7 122
5513 122 21 -56 31 -146 -73 25 206 17 50 -64 -125 -17 114 146 -78 -113 118 -68 -41 164 132 33 -103 -36
5537 -36 -87 72 60 218 109 -321 26 48 -18 150 139 -39 -127 -169 23 24 43 121 19 -150 -97 58 70 29 35 -19
5563 -19 -141 -25 91 107 -19 -61 29 -150 43 97 93 67 -110 53 -172 -114 -10 111 13 -68 -61 1 -36 61 58 6
5589Fj26Q0P2rj7No6p2K39r2q9k3J21n5j87J04J95L5j06j1j17l3K52J00k27o1
5615h2J02Lo4KJ02P8j91o1R7j27J36N7rr0p5J28jn2J46p1k7o5P7J17l9M9M5k10
5643b5l2K4l4J29p9O6j00Q6K1k9p2K9J57m5l7r2QO0j01N1J64j60N3J6j34KR8K6
5671E0o6P9qo5J3o2N8m3K5J15j2j42lN2k7nP5M1j94NQ5J7r4J7K78j97K1L3P2j20
5701bL0M9n1l0K07p4j93KJ37j09o6J93J2p1r2J83k2k48K64j14k4P2k3Q0K7k21
5727h4J56k8l9K7J27k38O1O3j8M7l8j4R5k21J46m1J3R6l3l1n9L5O4j0n6mk00J27
5755e7o8P2K05k03R8j38J2mO5J19j34l5L7N1n3qLJ9P1O9j68J28kK5j55j18J05
5782f4J23j0p2M7j18o3K11O4j1j08O5j62m1J31R2Mq4n7J02j62k5K43j04J3Rn7
$$ plain form
5589 6 -120 -40 32 23 6 11 -55 -127 112 20 -69 -92 29 -26 -213 -109 86 121 15 4 -113 -146 106 206 -21 -82
5615 -82 20 23 -41 -39 63 141 -50 -111 -14 -141 -5 52 43 -47 -122 6 5 -47 99 28 1 -64 13 130 91 140 185 -25
5643 -25 -57 -33 -67 62 -17 49 -51 35 56 27 -45 -16 141 96 59 -33 -25 35 -66 -15 149 -11 42 58 -76 -74 24 50
5671 50 -16 63 55 -10 3 -59 -1 -44 -19 96 84 -58 -61 -9 -36 -41 34 75 -119 -114 -29 -12 -106 -89 189 -8 13 46 118 -2
5701 -2 28 77 26 -4 203 129 -64 -62 75 -34 -100 93 105 34 -58 125 103 -145 119 5 -19 53 30 110 137 -84
5727 -84 72 44 5 32 159 -79 -18 45 27 74 36 22 117 -104 42 1 14 110 77 46 -13 22 86 76 20 16 -184 -57
5755 -57 -125 -53 152 -51 47 -91 -79 -83 -18 101 -33 -68 -31 20 -33 -41 -38 -19 52 121 -47 81 79 104 -51 -169 -64
5782 -64 59 49 -23 24 -94 -157 54 118 107 -1 64 -98 -139 -8 84 88 4 -53 49 -113 -138 105 1 14 23 -34
5808c4j08K62ll3j12q6P2k9J49J36m6k81J05j04R5J8K9O4k28M2l5J14L4R1l3j73
5834i4L8K9R9j9m6O4j79MN2J80q7%J8k12R1J62m2N5k46J31j11l2J93R6Lj72J5
5861a0l4Q1m6J37p7j16j8O1j7L8L5op1J04l6P4q4j5J7k60J31L04j09J6Q1j60p7
5888e7m6Q0R6j19Q8j5k17J01J06J2Mj9J8k9k43L66nl05J20N3j1M7O0N8k32p3K39
5915G7q6P3N5l3n2j01P8j8P3j03J09l0j35J41J20o6r1J32j54o0k5J32K4l5l0j15
5941a20L1O6J06N2r9l4l6l2PO0J63j13j29J22lj49J70J2m6j18L3pm3J43Q7q6k01
5968a64K35K5r1J17j19j19R9k6J03M8j71P6J4r8P8N6j26k1J33o9L3n8Q7M1j07
5993b4J00j99J55p0M8O7k27J47J36j20j53R4J65j45rJ91j55M9k8J4J2p3O7j0q9
$$ plain form
5808 -34 -142 120 117 84 -28 -114 -42 -71 78 214 168 -113 -8 -112 -17 1 30 94 -134 -92 -127 -13 21 112 79 -94
5834 -94 -56 -27 72 53 7 71 -108 -104 -52 128 41 41 59 -153 -62 100 58 113 -133 -2 -113 -145 48 144 147 -25 -10
5861 -10 -44 37 -9 128 51 -65 -83 -22 -39 -1 34 28 -43 61 25 99 15 0 17 -243 -112 192 83 99 180 20 -57
5888 -57 -103 -23 73 -46 42 27 -190 -89 17 29 33 14 32 3 -240 126 121 -184 -64 -11 -22 25 85 143 -89 -162 77
5915 77 -9 64 119 86 34 -67 11 -7 66 -37 72 42 -93 48 168 102 11 143 -11 -71 -96 36 60 25 -5 -120
5941 -120 -89 -23 83 135 36 2 -34 -66 -59 1 164 51 -78 44 41 -108 62 74 28 -90 -57 -64 -107 36 123 37 -164
5968 -164 71 96 5 122 3 -116 -17 -43 60 108 -63 13 27 -71 7 63 -63 -84 49 -20 13 -45 42 83 -24
5993 -24 76 -123 32 -38 10 77 -150 -3 133 13 -140 -46 119 -26 -35 156 1 50 22 36 48 -25 42 32 -57
6018e7J6Q7o5Q7o2M9o3q4J22L0j12R3L9j90j9J32p2M3m8J70j32pJ31J24k42j48
6044a78K00j03N4Q9Ok20J90q8RJj4O0Mo5mR2q5M7J04j03j47J68jj1p3J45n4j03
6072h0l1J34M9k54P9J32j24P7R9O9j60q7N0R7j37M7J68j92R9M8j67kQ2M1k7M2
6098E2j7J0p7N3Q3j01J10j55J49o4j7N9j39l0P4R1o6j7Ll4j23J44J50q0p7N1O2
6125I4j66P4P2o0j04L6J73k38J14R5p9r2Q8N7j40N8J55j30j54J35K6p4Q7l0M5
6150D2j77N9J44j28R3M8n5j66n4J48P2j0Kpj33m3J13L8Q9r6J01o6L0P4r0N1%j74
6178i5J10j55Q9K08p6kj56O6j49J80J11n0r1l8%j5J58N0o2j46m4J45Lm6j1J13
6204I7j60l3J07N8o8O6Kj19j36J95O3kJKj93J08j05J58J14k06l9J6K9MJ50m7j17
$$ plain form
6018 -57 -41 46 -19 68 6 55 -8 -92 30 60 -52 41 80 -110 -129 3 -69 -26 -74 96 -36 -43 88 212 -30 -178
6044 -178 22 -81 -27 62 68 -152 38 -50 -41 -40 -54 6 10 -55 -59 33 -52 -5 99 -4 -151 17 16 5 -68 77 23 -80
6072 -80 -111 23 72 -182 -103 29 -95 -18 81 150 -10 -97 -47 50 -87 -40 128 -64 35 83 -84 -86 -4 37 10 52
6098 52 35 45 -32 21 104 3 113 -42 107 43 26 85 -54 -84 -10 81 15 -2 1 -33 -156 -12 138 58 -19 32 94
6125 94 -72 2 74 14 -90 -54 119 -119 -5 90 11 -81 7 64 -76 -18 137 7 -147 -12 14 -60 27 -3 42
6150 42 -135 -76 68 -60 33 81 26 -140 -194 -46 26 16 18 11 -122 -165 -52 -14 75 -21 80 14 44 118 28 79 79 -95
6178 -95 15 -140 -51 157 81 79 -77 -11 -160 20 131 81 -10 -48 -48 -63 95 145 83 -63 -107 38 41 -5 -16 97
6204 97 -63 -96 11 69 1 67 69 -50 -186 9 72 70 71 73 -120 -12 -117 41 155 -51 -90 -74 -45 -41 109 62 -55
6231e5MQ7o0K4J32j8p7on6K2J45o1o9q4K4p1M5RM5J33k76J89jM0kn9L2q6l1J78
6261I7o4L1M0p2pj18N7j6R4m3J0P1j17J54M0l65K42r9Q9q9Q6j8N1p7K9M2j33R7
6289A2J22r7j70O6R7k2j9J30j28k1j9J59j04lm1J2k4p6K13q2j35J41Jj92Q3P6
6315b1J18j38Jk4j47J27J80J9o4l0N5j63K2J41M5n4p5K8o3J4P5J97l49OO9k7K
6342e6L0J27K8j93m6J68p5J6J03j07L1j4J11j65l7R2J1lp0Q6m6q0K23k56J00j01
6368a23J66p6j2l4J10r6P1R6L7k31Q7N0o1L6n0n7O7j81J39J28j91J66O7j03N0
6393E5j6N7p7K0N0o4q0K15j44l3l2K7m5n8P5J09Kj09O1o7R8j14J65p0M5n9L5r8
6421e2P4N4j09j2R7Oo0k0Oj9O0k3j5J71k06M9j4Q4m1N4j59J14p1M7O1j05Q2M9
$$ plain form
6231 -55 -51 36 -24 0 132 114 37 31 -25 -3 142 81 12 -72 -48 -119 -74 -65 -20 113 -163 26 25 65 63 4 36 -50 -81 97
6261 97 33 64 104 32 25 -93 -36 -52 42 -1 9 80 -37 117 157 -208 34 -65 24 -65 21 3 54 -23 6 48 -85 12
6289 12 134 37 -133 -67 30 8 -11 119 -9 -30 -49 110 6 3 -38 -26 -50 -126 87 5 -130 11 12 -180 -97 -21
6315 -21 97 -41 -40 -64 -211 -84 96 115 51 21 76 -87 -65 76 121 67 -8 20 -43 -29 46 243 -106 -100 -31 -58 -56
6342 -56 -26 101 129 -64 -110 58 -17 -1 102 -5 26 12 123 -42 -79 13 24 21 -49 37 -9 -89 134 -122 -22 -123
6368 -123 43 -33 -45 -79 31 -65 6 102 139 -92 -5 45 -16 20 -30 -87 -20 -201 -62 66 -125 41 108 5 55
6393 55 39 96 19 39 89 25 -55 160 16 -17 -49 -22 -67 -125 -50 59 61 -48 13 -54 44 -70 95 25 70 11 46 -52
6421 -52 22 76 -33 -45 52 58 -2 -22 -16 -35 25 2 -13 158 -48 1 -13 71 30 84 -75 39 -32 15 76 -29 53 102
6449A02k29J6J62m5Nn3P7m3o4J05O2j57NJ67j51L7O0Mq9M3Ko4m6J32M7j57L4q0
6477a18O0j1R2J29k70J07J2J15j13mJ63j62j93J42J7L3Q6r6j5l5k2J87Nj19R2
6502H2m7K1k1m9J37q8n7N4q1K9oJ51j75K5Q8m8J6L4J12k63k8J55k2O0k0K9q9m2
6530d3j01J51M1P7m9m7j19R8Lk7K3j0n5Om4J07L4q2J34k14k4J47Q1n7l2K4l9j30
6558a47J42J22l5M2j50o6J19j40J73l5p9j3J07L4j39J50m2n9K1q3Q5M1p4J88k04
6583d2j83K99Qq4N8M9j59k4L7M8M9m2K6j18R9J9k8k5O9m1J5j34J10Qp5q1J4J6
6611a12P1K6J12j25q7O4L4J1O0JJ04j64j35J46M3m8N0m3j23QO2J23m1P8k6r6L
6638dm7m4J52O3m9o2j17J40N2Jj55J6O5PM4p0N4q5J15Ol26K75n1K5j5P0M4p9k
$$ plain form
6449 102 -127 -111 51 6 11 -42 35 -8 -72 33 95 -62 -57 110 -41 -4 56 60 -29 14 16 -48 -94 38 85 -72 -38 -118
6477 -118 -58 -69 23 152 -118 -11 1 116 3 -1 162 0 -193 -51 -34 -1 85 -11 -26 -61 -83 104 109 -10 82
6502 82 35 56 35 -14 123 35 -22 32 -49 -20 -26 125 -50 -25 63 15 31 65 177 -86 -114 41 19 79 59 88 -1 -43
6530 -43 -144 7 48 125 76 29 -90 8 11 -16 7 -3 -58 -52 -96 11 45 -37 97 -117 -141 6 87 30 -2 22 -17 -147
6558 -147 -5 117 82 124 -26 -92 27 -113 60 25 -54 -67 40 74 -65 85 43 -16 5 -78 7 48 -26 162 -42
6583 -42 -225 74 82 -2 56 105 -54 -78 -41 7 56 14 40 -78 21 40 12 -13 56 15 30 -104 6 14 -61 -142 -128 -112
6611 -112 -41 -15 97 -28 -115 -51 -17 -6 54 55 159 -5 -140 6 49 1 51 8 -115 -107 -45 78 37 115 89 -7 -4
6638 -4 -51 -95 57 120 71 9 -108 32 84 85 -70 -54 11 18 62 -8 46 -39 76 82 -244 31 -20 5 -10 60 104 25 23
6667B3J1p0j3N3J11q3j43K01O8k03J04j62O0L8J7O4o1J04q1J5j0j33J8J14m0r3
6693i1QK7J31q2J2l7LR0l5M9l2k2o7O6k2L7q8oR6j02J30m1j7l3j3L2J3J04nj67
6723f2P2q6J01r5P3j4J45j58K1p3Q8j01P1J06o9l1O8p8n5P1N4q8J59j52K0J01
6749H8j52J25M4p4n8J2J9n1J00n7q9J23L2p1J05j51N5N6k11Q6J18jj7P8p5j26
6775i2J55J9j54R9Nr0p6K05Qj74M7Q2J8j48N5jp6J90j18K8J1J79q9l4p6KN0j04
6803g9J61j36q5M4K7L8j04J70n9P5m6k1O5j18N7Q8p0J5j42R2p4N4J18m4k4j77
6829a75J15J11Mj69J00K3j37K26J7j03k1L9m4oJ53pj67K0J18j17%J0K5M2q1J5
6855iPnPK2R5j92P4J8P2j71N6O0m5M4J27j54j1J31k49R3O4p2R5n0On2j24J91M3
$$ plain form
6667 23 34 -36 -49 4 115 32 -111 90 158 -45 59 -103 -43 -5 12 76 15 119 38 53 43 -90 -72 42 2 -91
6693 -91 -83 -56 75 -7 5 -32 -29 61 26 75 43 21 -46 20 -2 35 -53 -59 37 -65 65 24 7 -26 -39 -7 6 110 105 -62
6723 -62 10 -76 25 -70 3 -11 134 -24 -3 -76 12 -89 -18 88 19 -12 56 -22 -77 -6 48 -40 119 -33 -13 88
6749 88 -64 61 105 31 -27 -15 4 -47 53 -4 -93 30 62 -9 96 -55 0 56 -155 -69 49 48 31 109 34 -92
6775 -92 63 82 -72 27 32 -58 -134 71 79 -95 -48 34 52 -96 -41 -42 -118 72 -46 -18 -7 172 83 49 -27 -25 25 -79
6803 -79 82 -54 -139 -95 -68 -30 -134 36 -23 52 6 -15 50 -68 -11 77 7 22 -120 -28 -102 -48 70 26 2 -175
6829 -175 -60 51 55 -114 -14 9 -128 98 115 12 -9 30 -14 -20 133 126 -41 -21 97 -20 -20 -10 15 57 -24 -9
6855 -9 -2 -7 0 22 117 -75 -1 17 89 -82 -26 34 -11 33 160 6 -5 126 -123 -30 34 -38 57 7 13 -39 -163 28 71
6884G1q4n9j2l3N8N9L0k5n0O1j4M2p6J49oj71KPJ27M7j46J53q9r8P6M7j5m8R1
6913I4o2o4j06R5J27k12K00q9o7J25Q2j24M8j4mj49Q5NJ12r4N5lk9OrJ02j33M9
6941B6j36J44m7K3R1r7kN6j01R2q6p6J43j18R2M4l2J07k0m5j01l8J59Nj01M6n1
6968b3j46K41m9L0N1m6l5j04P5J10k2q8k4m8N8N6J0J2m5m6k9rJ7J52j2j42M9l4
6996d1K5r3K14q7m2q7J35O1p0j23K03j20Q4k5r7J53j03l9J9k2J26N0l6j25M3m3
7022d0l6J03K7l4j6Om3m6P8j9j05K07r1m1R5j02J03m1O6o5Q9r6j48J93m0o9rN3
7050b1OjN9L2j34l0j2ML7J00j36N7P2m5j3K5J8o4J62j97L3q3J47p4OP4L7J01j28
7079C2l2k9R4j39O6l4K0P4L3p5Q5j50M4l9k7n0K01J2j78Jo4K23p1N8m0p7RL1J12
$$ plain form
6884 71 -13 -72 -84 -117 -59 0 30 5 -45 16 2 44 -32 117 111 -60 -58 -51 76 123 -23 130 41 -57 19 66 51 3 94
6913 94 32 -32 -138 -43 84 -128 72 -17 -84 41 123 -1 47 33 29 -120 -35 -30 82 -12 43 40 11 17 8 110 -23 26
6941 26 -110 34 -13 10 101 4 2 58 -43 49 -37 -113 30 -88 4 48 16 123 103 58 -43 -81 78 83 -18 28 -23
6968 -23 -169 72 23 53 104 58 23 -81 -6 104 82 -6 -30 -78 -20 36 46 58 13 -33 -62 -71 -54 98 86 -56 -7 -41
6996 -41 -16 -109 105 18 -24 -111 24 85 15 -108 95 -25 59 34 -63 90 -13 -52 -33 -55 71 121 85 -40 3 -40
7022 -40 -76 27 54 20 4 10 -33 -79 -1 -20 -125 82 -9 -50 45 -57 46 5 71 6 95 -1 -149 44 4 -65 -74 -21
7050 -21 -15 -16 43 75 -59 -89 -101 -97 -60 40 -96 -39 33 -12 -25 0 18 -46 116 -81 -48 -131 16 -58 -52 22 59 160 32
7079 32 0 -29 65 -74 -8 -42 -22 52 85 10 95 -55 -11 -50 -77 -127 74 86 -92 -91 -155 68 -3 55 15 -62 -53 -22 90
7108I0j9RJ8m6j64J15OK1J9o5n7K6k9P6J4L8M0j03o2J3J57L2j33N9j03J31r2P6
7136F7o7J0q8m2J86j35M0O3o2j33K03M4L6j12J33j24q2R1Q4j12mJ03k48P2K28
7161A51o0m5p0Pk7J5JJ51j02r8M3kQ7j06J57j28k5K4l1J04j17J91n9j24J70j69
7187f2J02m4O3k0j70J28p0P1J03J0r4q8JJ56K5q9J8K5j22J6N6l3K5J1n7J08j16
7214d7Q3p9m7N4J10N3j51l4J19qp3p4M1Q9j00K04j09Qp8QN9m6M7n7j1j18J60m6
7242d3j07Q2N9N8kn1j3Q8R8k77R1K5n0J38m1l3p4M7K1l4P2pk7P6o3j30J57j03
7270d3p3R6rl9N9J47n0k2q2O4o4n9J35L1j27r3J15nk8R8j11P7j26n7K24k04K39
7297I3q4r7L4R8j9J4m6O6n3kKM6m9R2kr3J1m3K11j3r7o8j27L7O5J28qj11r2NN7
$$ plain form
7108 90 71 80 98 52 -112 3 9 30 49 -16 -73 -47 -76 0 14 52 92 -11 -73 -60 97 129 -4 55 -48 83 -9 67
7136 67 0 10 -78 -120 66 -69 -29 34 -28 -161 42 86 122 10 143 19 -63 28 112 0 -4 99 -149 -77 151
7161 151 91 46 -24 -17 -44 -29 -28 123 21 -77 -34 -36 51 -55 102 -26 -51 -27 -58 46 -71 120 61 -63 107 -62
7187 -62 40 -4 59 39 -131 -3 -73 -2 101 111 17 -71 -70 86 111 22 40 65 -57 -41 15 -18 7 18 -39 69 -47
7214 -47 36 -43 -90 -36 74 127 -24 -58 61 53 -20 -94 -53 36 -64 140 31 39 -39 -31 28 -18 29 -28 -39 -157 3 -43
7242 -43 -150 -68 -9 49 47 -4 -17 71 169 -108 -17 8 -42 96 55 22 -52 -5 16 -18 54 47 20 96 33 -97 60 -43
7270 -43 -116 -20 -29 -68 -9 138 88 66 -16 48 -16 -75 60 91 -36 -129 -14 -19 -47 51 -60 17 -109 -166 58 -146 93
7297 93 9 -88 -54 44 25 39 -7 59 6 4 6 52 3 95 93 0 11 -32 179 166 69 1 -126 -89 -24 104 96 -15 -107 -102 -45
7328d5pJ0Q9k47J34J22o1q6J36k8p4P7N5k2o1j41J61l0j4J21o1lj17J02pm4j8
7355e9Q9J3j7m4J6o0M7l8kN3k4jp0M8O8j12R5k3q8Q8N0N9n0m4p1J57r0p2J52O
7385G6j09P3l5L6K1j05r7K03q4o6L0M4J10o7M3p5j16K28j55l5Q8q2k4R8p8P9n1
7412e0L7n6J4J33P9j49p4O8R1r0N9q2n4J62j38R9L5j58N8mM3nj5J8k0no2J28k23
7441a61L03j49N5J7p7q1j6J01Q5j13m1NqO0M3r0j03J81m1M0l8P7j08K5P2j01J05
7468D2n0Km0k2R4l7K5k0P0j25Q0j32J70r2N4p6J31o5o9R6l1n5M6j2R4n3r6J22
7496E1j33J18r1p9J88q6p3J39n1j4O0m4J16j22O0m2m7M7l8k6PJ93j94O7J1L3j70
7523a20R3J0K9O8j01J25j10l7L4P5m5j5J5Lj27N6Q3q2rK37k14J6P0j40J64j55
$$ plain form
7328 -45 -52 -42 47 -200 -66 56 -5 -91 45 17 -57 20 75 53 -8 -149 12 -18 -32 89 28 25 -92 10 3 -41 -59
7355 -59 30 43 26 -18 -2 -62 -15 -53 -55 -2 -26 -27 -97 -49 19 -93 2 -21 -109 -21 29 88 38 -6 -77 80 -10 -82 70 76
7385 76 -33 40 5 41 62 -43 -140 63 -21 -87 -57 -13 97 30 73 -2 -118 110 -45 -80 8 -74 -98 0 -78 1 -50
7412 -50 -13 -69 -55 78 157 8 -66 2 93 3 62 -20 -74 88 -50 49 84 -74 -16 -20 23 18 3 21 1 -4 -66 62 -161
7441 -161 142 -7 48 65 -12 -93 -109 -8 77 -36 -77 -72 -80 -20 23 -67 -170 11 -30 10 -28 49 -59 -34 38 -63 42
7468 42 -8 -6 -46 -68 26 -11 14 -6 64 -61 19 -113 57 -35 19 -57 74 9 -60 36 5 -50 -4 -16 78 25 -71 51
7496 51 -82 36 -55 -134 54 -32 -105 34 -17 -31 29 -15 101 -21 39 -3 -50 -3 -41 -67 -60 133 -61 6 17 50 -120
7523 -120 -27 -17 12 80 -21 104 -6 -43 -9 66 21 6 21 24 -103 -47 36 -46 -55 182 -32 -16 54 -86 78 -77
7549g7N9Pq1J43Ql4j01NP3J4j04R5J20j49k9K6l8L7K8M2oq3J14k0nqj0j03k1J00
7579BJ5j11J30K6m6N4j13N3M3r8lm1M3Q0K7O7j86L9l5M5Q9p1m4j34J99p7O6p6
7607e7KR6j6L7q7L1r9J36J9ml2Rl1mO5k5nn7Q8j38P6o1K0nj04K65j3j58%J53j28
7638b7NK3R0q4m6N2j1rlQ7j0o3NR4j60N7P3q6J26j60J42j04O9q6P0qJ52j66J7
7667C9n7N5q9O9nj8k5m7M3N5j49J92m7p9K8K4O7q7O8mj6N9j02l0R4j69J75r7J74
7696A21j30R6j09m4M8J21m8j37O9%J0J9j05k1K7Q8J7k0O0j10R1j34Q2K8j1O0m6
7723B2p5O1p3M5L3j14J73j0j33N5K5o3P2o4j01J87j02J6J32k2N1j54o7J38n3l7
7749e8Q2j4L4r3MJ11j17O2LJ08rr4m7N1K4j26J06p2o3J01M3j70J26o1J14p7L7
$$ plain form
7549 -77 -18 -11 -92 51 59 25 -76 -71 2 16 -88 7 127 -22 -51 -25 -63 -26 2 44 38 -45 69 49 44 36 26 -77 -98 2
7579 2 17 -94 36 62 16 70 -43 10 53 -45 -48 -89 -46 34 61 128 -58 -19 -54 -9 80 9 -35 -169 30 -47 19 -57
7607 -57 -55 41 25 62 -25 6 -93 43 62 58 26 35 4 0 65 40 35 -22 66 -72 4 -57 -37 -42 -146 119 106 -52 -52 101 -27
7638 -27 -22 1 91 7 -39 13 2 -7 -10 77 67 4 9 103 -57 0 73 -13 113 -47 95 -9 60 -26 44 36 188 22 39
7667 39 -18 37 -52 17 12 -6 -31 -78 -35 20 -129 63 16 -63 -35 -11 56 -31 37 33 17 76 -26 -56 38 -131 44 -53 121
7696 121 -9 87 -22 -66 -18 103 55 -82 -13 -13 -3 16 -89 -110 -83 5 22 2 62 -48 43 -91 -9 19 8 68 22
7723 22 -53 8 -65 -20 13 -101 72 62 -71 -16 9 -54 18 -46 -147 40 -62 -46 86 64 115 -39 -106 32 -21 -58
7749 -58 24 10 44 -49 -45 66 -51 11 14 122 113 19 -28 23 47 -79 27 -45 -108 -7 36 -134 -8 -69 45 -32 5
7776Ej9K1q4R5M3j25J25p6J68j79J9j6j6O0L7L4k12mO9o5P8J11J39j71j4o8l3
7803g8J15O2p4JpL4j30P1j0K7Q8k25J32l8O6q5J14j67R7p0Q0q4M8K5Jl3j5J3J00
7832E8o8n5O4n4K6P3n8j8P6j0k7l0R2q3J11r3NP8j21M2O9j31m4R7J5n2J05q8L
7861a8N5Ko3RP3o2L6l3L2l2R1o7k0NN2n2K5L2o9J4j6o8l5J52P3o3m4q3J71j6J4
7892I5r4q8J7J96j13o2j2J59o2o8J2pO6rOo8l0J4R6k4k6R5m9Jj07OM3P6j77J02
7922a2o7J13j48J51m9M4n6K1l8J5P8r8Q1l2J0j0J08m9o8o3J77j25J7L0M7j27p
7949e7J04M8j33j5L3M0K7k2K2k1j54J23k5j4J0M2r6n2O3j06J25K12j40n5pR9j2
7976C9m4P6j61J31Jj05l8J35l7j4o0N5R6q1N0J2pk3q0p5K05p0Q4j18R4j47L4k8
$$ plain form
7776 5 -14 7 -77 18 61 -64 61 -15 153 -26 -7 -23 -39 21 58 92 -120 -124 -55 -120 -42 69 208 37 23 -45 -78
7803 -78 37 99 25 26 19 53 -77 -6 -16 11 99 -126 6 -32 34 -51 63 -104 -7 -77 3 -81 -33 -8 -7 -40 -55 -42 58
7832 58 -10 -65 -1 -55 -29 44 -14 -32 44 34 7 -23 69 -14 97 4 9 87 -34 8 77 -54 -98 -1 14 -38 67 -21 -18
7861 -18 37 39 -24 -15 58 -4 32 -1 31 -1 90 23 3 8 60 8 33 65 -4 10 -6 -74 -109 43 116 53 9 -74 97 81 95
7892 95 1 -87 -70 126 13 -49 -61 98 36 -32 -20 -27 39 30 36 -32 -62 -48 48 24 -2 93 44 45 -62 -56 -13 63 -114 -12
7922 -12 -79 34 -114 37 -12 32 -24 -3 -41 -26 52 -46 35 3 13 3 111 62 -6 -69 108 -17 0 30 77 -50 -57
7949 -57 47 95 -38 -53 -20 20 47 25 47 26 -128 -5 -30 -44 -34 8 -88 -140 -77 -183 -58 154 14 -41 -48 51 39
7976 39 -5 71 -90 41 42 -63 -101 34 -3 -17 -77 -22 74 -7 43 55 48 25 -55 -130 75 5 89 -29 65 -82 -48 -76
8004g6J58j26J1R6j5pj27R2k0Q3l2K0p7J6Q0m2n9L6j5opO7j2j0N7j38PM0Pj04
8034a03rQ3L2O9p3mn6J6jN9J4n0M2j24J10j3k9MrQ0J33k09j00J55o5nO8J21r9
8063C7j46R9l3J10o9J05j19qn4K1nP8J11o7j28Q4N1k20P1m0Q2L3o2M5J9J7j3m3
8091d4M9J0PP2j62O6On2L9r8J38Qq4J55j12n8J01J2o6L5J7q6Q8o8pJ16j59P6J08
8120A07k24K00l3p3RK0l1N4l8j1K6L3oOr0K3J44j64l9M3P6j1Q9j13R5J1p0k0P1
8149H4n5m2n8M6J5J40j54m5J59P6j70P9m1o4K9j02R7jN3j3j6k1j06P7l0K5j1p
8177e6OJ7p1J93j81O6J2k1K4K7j27J77p9n7
$$ plain form
8004 -76 82 -44 -33 63 48 41 -86 6 -14 69 37 57 -20 -4 76 34 -25 11 -4 -10 -17 50 38 28 85 -53 -46 -6 1 -103
8034 -103 -112 -29 3 72 -1 -5 -61 -45 -46 13 27 -23 19 -105 5 -8 -37 -33 -42 38 171 -38 -138 17 -48 -53 15 136 37
8063 37 -109 -10 -43 67 -2 103 -16 -24 -78 -57 -62 16 127 60 -68 16 67 -153 -82 -122 -40 -7 -69 -24 -5 12 -1 -44
8091 -44 5 15 22 94 -68 -2 4 -48 -9 -107 31 39 -45 110 -2 -60 41 53 -13 22 39 -47 41 -27 -34 82 -77 -1 107
8120 107 -117 83 50 -23 -14 6 -25 29 -9 -20 6 39 33 39 -51 -28 116 -48 -87 -44 32 21 110 -3 92 103 33 13 84
8149 84 29 -13 -71 -25 -10 130 -24 -69 90 166 -4 75 34 -30 -1 -103 -6 -7 46 33 17 -4 -110 -33 -63 -38 -49 -56
8177 -56 -50 -33 -104 89 -92 -26 -14 -35 -11 16 -111 66 -13 -70
8191g0
$$ Imaginary data points
##PAGE= N=2
##DATA TABLE= (X++(I..I)), XYDATA
0@%%%%%%%%%%%Qj6J6j6J6k4L2l2M0n5O3p2Q8j04J20j36J60j84K08k40K73l13L59
34A91m06M55n11N74o42P16p96Q86r82J086j205J333j470J621j788J972k173K392
52A253k634K907l213L553l939M384m897N498o215P088q180R584j1473J4168j8347
67a0463K5752m2778J54164L6334k84806k5065j2292k499J39919K27523n76j16332
79H8881q2252r4991j18130N3060J55388R3464L1254J8337o9856j27599r3209K561
91a43092P0020Q1624P4540Q4805q464j48344j34249j5629J614L4660J71566J51899
103B20950o5053j22235n4347j15824r1839J36546J82137K5257J0687K2467j37309
114A1437j73928J6209Q5351J7189Q1156J29898k4260j25482o1352m5148n8151
$$ plain form
0 0 0 0 0 0 0 0 0 0 0 0 0 8 -8 8 -8 8 -16 16 -16 24 -31 32 -40 48 -56 64 -72 88 -96 112 -128 145 -168 191
34 191 -215 240 -271 303 -339 377 -419 467 -515 571 -634 699 -771 850 -938 1034 -1139 1253
52 1253 -1381 1526 -1687 1866 -2073 2311 -2586 2912 -3303 3785 -4395 5189 -6284 7884 -10463
67 -10463 15289 -27489 126675 163009 -121797 -146862 -159154 -161653 -21734 205789 205213 88881
79 88881 6629 -88362 -206492 -153432 1956 95420 126674 145011 75155 -52444 -145653 -143092
91 -143092 -73072 8552 83092 167897 159433 11089 -123160 -138789 -137175 -102515 69051 220950
103 220950 155897 33662 -20685 -136509 -228348 -91802 90335 115592 126279 148746 11437
114 11437 -162491 -146282 -60931 -43742 37414 167312 143052 17570 -43782 -88930 -147081
125a47081L5996J28991J03994K3224l9809q1617j10147q6269K3902J31017J16668
136I8869L9735M826n8823j61754j07509O2906Q2559M1652J12296P3693j17274
147G1176j31640r741k9019m1921J08622J48473k023m1109N074r0095j38658J2911
159a37950R9862M9868O5810Q0956m0117j39672r1444j3224J9565P0289J20625
170H4568P4193m0627j03812q2636m2808j5139N4869J30836P5251l7915l9780l8305
182A8695j10617o3261Q4674Q8796K0427N9686M6453j05471j32922n127J4443q049
194i2273J03800J35359j7912q9223m2932o6810p8518M3078J29633O9550O927j188
206I9491n7432j15595n9724L7851O8007O0252N9484L0871n3854j10449n7866Q295
$$ plain form
125 -147081 -111085 17906 121900 145124 105315 23698 -86449 -172718 -148816 -17799 98869
136 98869 138604 143430 84607 -77147 -184656 -121750 -39191 2461 114757 188450 71176
147 71176 -60464 -70205 -99224 -141145 -32523 115950 113927 72818 77892 -12203 -150861 -137950
159 -137950 -38088 11780 77590 158546 118429 -21243 -112687 -125911 -106346 -36057 84568
170 84568 158761 118134 14322 -68314 -111122 -126261 -71392 59444 134695 96780 57000 18695
182 18695 -91922 -155183 -70509 18287 38714 98400 144853 39382 -93540 -98667 -84224 -92273
194 -92273 11527 146886 128974 39751 -3181 -69991 -148509 -105431 24202 93752 100679 99491
206 99491 42059 -73536 -133260 -95409 -27402 32850 92334 123205 69351 -41098 -98964 -90669
218i0669J1835N2060J14933N0964o6559o7692l6311p2093l2688J03082J10554
229G7416P022J103K078j04349j12852K1475O6989L0110O7151P9187l8002j12503
241a5175n1595j3577k2362M8282J17588N5643l2419m5363n2058p7007l7906O1413
253f4536R7146M3557J0647J0o6116j05947k9868N0724M4521M3999P5963J8631
265A18731q9753p9073j2896k4656r35R9829R4722j1604m0287k7032p7269q0770
277a30993L4470R9072M7674K7094L0538n2627j15370m7011K9655L3284M8710Q1380
289H5876L1793o5703p6136k8099k6349j0114O9085R0642J7766k7820k1667n2413
301a3139q4258j3571P5998O0509L0006M4887q139j02869q3286L671K7068L4874
$$ plain form
218 -90669 -78834 -26774 88159 139123 72564 4872 -31439 -103532 -136220 -33138 77416
229 77416 84438 85541 87619 -16730 -129582 -108107 -41118 -11008 56143 135330 97328 -15175
241 -15175 -66770 -80347 -102709 -54427 63161 118804 86385 41022 -11036 -88043 -125949 -64536
253 -64536 32610 76167 86814 86824 20708 -85239 -115107 -64383 -19862 24137 100100 118731
265 118731 28978 -50095 -62991 -87647 -88582 11247 105969 94365 54078 27046 -50223 -130993
277 -130993 -96523 2549 50223 77317 107855 55228 -60142 -107153 -77498 -44214 4496 85876
289 85876 117669 51966 -24170 -52269 -78618 -88732 -19647 70995 88761 60941 39274 -13139
301 -13139 -97397 -110968 -34970 25539 55545 100432 92293 -10576 -93862 -90191 -63123 -28249
313b8249Q5237O9146m1970q6571l9217l0963k7066N4247R8299L0889k3594j4661
325D5527l7333p8580l0587N4256N0002K3376M9026K2686o8367q2989k1470K508
337g1945J1251P1131R2259M002o8368n1440m6776n1305K7309J02408O3872m092
349G8306j6107l7004q1788m9676M3322O0680K4809L6953L0983m5440p6975k5667
361e7604K319o818L5624Q6045L5771m0528l7053l6502o9187k0265P7867Q1150
373E0819K2990O486j6566q5220q3883J5031O1717L8341M8747M3699l8554q5097
385b1490l7991R86j586K9078P2812L8048k7798k9090k1717n4046l8813L7481O6323
398A2197L4391K0721J3208m9597r3894l2839L6327L5923M8728P0950L891q3183
$$ plain form
313 -28249 56988 126134 84164 -2407 -41624 -72587 -99653 -45406 52893 83782 60188 45527
325 45527 8194 -70386 -100973 -46717 3285 26661 75687 98373 30006 -52983 -74453 -71945
337 -71945 -60694 10437 102696 106698 38330 -13110 -59886 -111191 -83882 18526 82398 78306
349 78306 62199 25195 -56593 -106269 -62947 -2267 22542 59495 90478 45038 -31937 -57604
361 -57604 -55285 -62103 -26479 59566 95337 54809 17756 -18746 -87933 -108198 -30331 50819
373 50819 73809 80295 63729 -21491 -105374 -90343 -28626 9715 58462 102161 63607 -21490
385 -21490 -59481 -58495 -60081 -31003 41809 79857 52059 22969 1252 -52794 -91607 -54126 12197
398 12197 46588 67309 80517 30920 -62974 -95813 -59486 -23563 25165 96115 100006 16823
410A6823o7934j4032q308J7374Q2414O3004k5451m0243j7331m7938m4612L2391
422e3843O1185K3102J6338K5752k5385p5933l9931R693J1879L4763P3644L7127
434I8391m2485o4226m0232k9923l957O4813Q6128J6862l3790k9739m9432n9166
446h6756R165P0515M3457Q481J8891r772p0935m7814J6621J1586P862N7948N1494
459H0743k2970m6928k5099l7210l6107L6465Q1904L6893l216q550m8513p8065
471g0653k1792M9001N3200L2769L0531j517o5233o5838l597J9161J4926M6068
483A7026N3391o775m8340k6709j8899l6246N524O6858M3984l11N808j6268p1899
496c2856n1062K3582M2834K9326M6255L0829m8436p6309k4376K229N695M9551
$$ plain form
410 16823 -51111 -65143 -73451 -56077 26337 89341 63890 23647 6316 -41622 -86234 -53843
422 -53843 7342 30444 46782 72534 47149 -28784 -68715 -59022 -47143 -12380 61264 98391
434 98391 55906 -8320 -48552 -78475 -82432 -17619 68509 85371 51581 21842 -27590 -86756
446 -86756 -77591 -7076 36381 44862 63753 53981 -16954 -64768 -48147 -36561 -28699 29249 80743
459 80743 57773 10845 -14254 -51464 -87571 -51106 30798 67691 64475 55925 7412 -70653
471 -70653 -92445 -43444 9756 42525 73056 71539 6306 -59532 -63129 -43968 -29042 17026
483 17026 70417 63642 15302 -11407 -30306 -66552 -61028 5830 49814 49503 55311 39043 -32856
496 -32856 -83918 -60336 -17502 11824 58079 88908 40472 -35837 -60213 -57984 -52289 -2738
508b738O8672R749m2514l4066k5491l6498k057N6948M8218N084L264n745n1936
521i110n4900K809L3281K1923L5661M6088j3684o7194l7960p652j1110K7042P4108
534C9302L9018k6302l3492k5923m7658k4529M8517N9498J4658P143K607m6313
546F526o1346q516K8731K0086K9612M7524L537n2822l9824j2833j7767Q467O0187
559A1562N0905n653k4617k0196m5137m3639K3608N8538K6235J3515J5696l0222
571C0595o6437k8337J9430J9050K5063N1578K2250m2177m4975j6796k1321n600
583e7677M8843N7662P972j9199j4462l7086n1970K620N1383L0851J4511K3856
595E7304j0220n9590m1427P648J3150J4428M9140M0233k4180m3098j9589k6461
$$ plain form
508 -2738 65934 75683 33169 -897 -26388 -62886 -64943 -7995 40223 45307 48571 42826 -9110
521 -9110 -64010 -61201 -27920 -5997 29664 75752 62068 -5126 -43086 -50738 -61848 -34806 39302
534 39302 78320 52018 18526 -7397 -55055 -79584 -31067 28431 43089 50232 52839 6526
546 6526 -54820 -63336 -34605 -14519 15093 62617 66154 13332 -26492 -39325 -57092 -48625 11562
559 11562 62467 56814 32197 12001 -33136 -76775 -53167 5371 31606 45121 60817 30595
571 30595 -35842 -64179 -44749 -25699 -636 50942 73192 31015 -13960 -30756 -52077 -57677
583 -57677 -8834 48828 56800 37601 23139 -13947 -65917 -63297 -11914 18937 33448 57304
595 57304 47084 -12506 -53933 -46285 -33135 -18707 30433 70666 46486 3388 -16201 -42662
607d2662k2266L3119O1182K2988q105p988l2089n8239j6181M0627L5842K0688
619B6916K7866J462m9821m9525m565J2525J0125L8281M6226o517l9734j9832j9721
632b6314l1003R922N4407L3465j717K449j3095n8110l9025K4890L3554J9757L7426
645D6606K2468l9792n7737j7125L054M453L7825N3576M240l4822k2675k0902k9921
658e0752J400M2918L5084M594K813j925l9648m5141K752K5250J6326L0753L8420
671F2844r950n4297l4242o669p921K1634O4016L1508k7684k7911k1563l9688j3872
684f3795M4996M6317O140J748K324l6663m4899K626K1712P276K2055L6412K002
697D8251l4812k7593j3204j8633J790M7337M4821J25j7377k0228m1235l6145J9310
$$ plain form
607 -42662 -64928 -31809 29373 52361 44256 36268 4179 -54060 -70241 -29614 6228 26916
619 26916 54782 56244 6423 -43102 -47667 -35142 -25017 13264 59490 52973 13239 -6593 -26314
632 -26314 -57317 -47395 7012 40477 38760 41209 28114 -29996 -69021 -44131 -10577 9180 46606
645 46606 69074 29282 -28455 -45580 -42526 -38073 -248 53328 57568 22746 71 -20831 -50752
658 -50752 -49352 -6434 28650 33244 36057 34132 -5516 -50657 -47905 -22655 -6329 24424 62844
671 62844 52894 -1403 -35645 -42314 -50235 -28601 35415 66923 39239 11328 -10235 -49923 -63795
684 -63795 -18799 27518 33658 35406 37730 1067 -43832 -41206 -19494 -12218 9837 46249 48251
697 48251 13439 -14154 -27358 -45991 -44201 3136 47957 48082 30705 10477 -30758 -66903 -47593
710d7593N3429K7948P136Q186k7371n8686j7383K6953J5738J5519L6906J1226
722E2008l7325k9608k362j5460j2240L5134M1758K417m788j466l3999m5255j589
735e2775L4919K8182K2347K3843j2641n5295l7881M321J5586K3260M0859K4532
747E9257k6091m3027j5132p078j0576K5140M5951Q140j5321N0j2718m0714j5283
760d7402K7357K0235Q710L0898J4531m1243m3141o855j968O294M4269M4807p240
773D9252l6721k3827k2205k0646K1193N1339K2490p906p503j6755l5888j8229
785d5406K1664K4580O578J6836J9164k1075l8021j0279j920q093K0835M8178J6947
798D9988k3107j8952j9242l7561n547M7575L8708M799K290j0906m5370l5645J4864
$$ plain form
710 -47593 5836 33784 40920 49106 21735 -36951 -54334 -27381 -11643 3876 40782 52008
722 52008 14683 -14925 -17287 -32747 -44987 -9853 31905 34322 29534 28068 -5931 -51186 -52775
735 -52775 -17856 10326 32673 56516 43875 -11420 -49301 -44980 -29394 -6134 34725 59257
747 59257 33166 -9861 -24993 -32071 -42647 -17507 28444 36584 21263 21313 8595 -32119 -47402
760 -47402 -20045 190 8900 39798 54329 13086 -30055 -36910 -38878 -32584 11685 56492 49252
773 49252 12531 -11296 -33501 -54147 -32954 18385 40875 32969 25466 8711 -27177 -45406
785 -45406 -23742 838 7416 24252 43416 22341 -15680 -25959 -27879 -35972 -15137 33041 49988
798 49988 26881 7929 -11313 -48874 -54421 -6846 31862 36661 38951 28045 -17325 -52970 -38106
811c8106L0432J3231K0062K0971k0655m0179j1896J834n334J2743L7315J9277
823C9695j4441j3100r468l0602k1033K5109L5962J3046R793M951l1262m7006q567
836d6923K3275J5721K1623L3327l827m2796k5577j773n717P682L8331K7583j2295
849B8634j6629n065k4117k6234J5300L1901J1069R058J4337j5169m2910k0182
861d0007J1416Q781J5811L8823J5657l0822l0850j1031j3205j977L5156L9236
873C6988O8j7116p910k3287l1270O979L2822J5826O724J3548o064l6151k4873
886c3716O906P135O706L1330K6280j5719k8214j2391j4125j4187J9655M2152J3864
899C5676j0947l884j7268l8609q982K9218K0301Q268J8759L828l3639l1603J518
$$ plain form
811 -38106 -7674 5557 25619 46590 25935 -14244 -26140 -24306 -29640 -16897 20418 39695
823 39695 25254 12154 2686 -27916 -48949 -23840 12122 25168 34961 39912 8650 -38356 -46923
836 -46923 -23648 -7927 13696 47023 43196 400 -25177 -26950 -32667 -24985 13346 40929 28634
849 28634 12005 6940 -17177 -43411 -28111 3790 14859 23917 38254 23085 -19825 -40007
861 -40007 -28591 -19810 -3999 34824 50481 19659 -11191 -22222 -35427 -37404 -2248 36988
873 36988 37056 19940 12030 -11257 -42527 -35548 -2726 13100 19824 33372 27308 -8843 -33716
886 -33716 -26810 -19675 -12969 18361 44641 28922 708 -11683 -25808 -39995 -20340 21812 35676
899 35676 24729 20845 3577 -35032 -44014 -14796 5505 13773 32532 36360 2721 -28882 -27364
912b7364N454K352K8848L1161p414k4743j2659j5038j7895R384L5825K0695l245
925B5361k190j0633l3288k0563J6083K2366J0561J6315J4616j9691l6905r046
937b7014N742l173J7813L8915P411k4124j4003j0878k5660l951L5741K7231j054
950B2996K768l387l4527k7101J1314J8966R882J8837J7193j3254l0764j3106n42
963b0725m083J1349L1194J6094j0799j4407j0790k1155j6308J8706L3338R834
975B2248J920N316k2757l9204n019K2000J1911J4036K7063j420l7379j9910L428
988a7767p217M063L4234J8693j3146r515m139k1257j7933J2850K2741Q524R233
1001A9364J1352j3266l1109j5933M341J0029J5866K5776J4470k0951l0833j0835
$$ plain form
912 -27364 -21910 -19558 9290 40451 33037 8294 -4365 -19403 -37298 -27914 7911 28606 25361
925 25361 23171 12538 -20750 -41313 -25230 -2864 7697 24012 38628 18937 -17968 -27014
937 -27014 -21272 -24445 -6632 32283 39694 15570 1567 -9311 -34971 -38922 -3181 24050 22996
950 22996 25764 22377 -12150 -39251 -27937 -8971 911 19748 36941 23687 -7077 -20183 -20725
963 -20725 -24808 -13459 17735 33829 23030 8623 -2167 -23322 -39630 -20924 12414 22248
975 22248 24168 29484 6727 -32477 -37496 -15496 -3585 10451 37514 36094 -1285 -21195 -17767
988 -17767 -24984 -20921 13313 32006 18860 9345 5206 -16051 -33984 -21134 1607 10131 19364
1001 19364 30716 17450 -13659 -29592 -25251 -15222 644 26420 40890 19939 -10894 -21729
1013b1729n414j785K5922L3834J97j8984p250j2966k5334M035L1938J0085k153
1026A0396J5359j407l2094j6246P625m28L197K8307K1576j2969j9765j0995j8563
1039b6007j1162K2031L2075J2310l625j0570j9929k4654n162K3583K3048N791
1051A7729M952K60k2159k3911K633J1266q06J0397K5309n59k1487m517n715k3706
1065c0314J057L2145J7187n14O166q106l6409k0440J7348J8521J1330K1402O692
1078C6065k7251k8082o095M104P816J8269J9927K23j7212j1995n681r761k101
1091b1774J6955J8369K370k3L426j6974k9252k99J8021O068J4031K5002p475l5112
1105f667j6121J416l713J2781L5229J1619k0386j2491p591j9247k099K4267J6596
$$ plain form
1013 -21729 -27143 -28928 -3006 30828 31025 12041 4791 -8175 -33509 -29474 2464 12549 10396
1026 10396 25755 24348 -7746 -23992 -16367 -16795 -13598 14709 36285 23316 3551 -7444 -26007
1039 -26007 -37169 -15138 16937 29247 25622 15052 -4877 -29531 -34693 -11110 11938 17729
1051 17729 22681 22941 782 -23129 -20496 -9230 -10036 361 25670 25111 3624 -893 -6608 -30314
1065 -30314 -29257 2888 20075 19561 25727 17621 -18788 -39228 -21880 -3359 7971 29373 36065
1078 36065 8814 -19268 -25363 -21259 -13443 4826 24753 24976 7764 -4231 -9912 -19673 -21774
1091 -21774 -4819 13550 15920 15897 19323 2349 -26903 -27202 -9181 -3113 10918 35920 28445 -6667
1105 -6667 -22788 -21372 -25085 -12304 22925 34544 14158 1667 -5924 -25171 -27270 -3003 13593
1118A3593L57K492M13j5577j8750j615P375L965J0920J8326M824j6384j9451q647
1132a8159n346Q20K4274K8249k014j6726r054j7894j8793J3815L0867Q971k326
1145A6684M711j2362k9863m545J6757K699M254K0907M727j7934j0515k667j0890
1158a8037n285J8330K1089M018k013m778j8964k0955k60J8518J8155R409N384
1171B4611o109k6126k0391O680J2296O967J6475J3968j3346k1965l681q95r067
1184b0583J0048K5424L567q526L441p611k4745o420J5320R765O671J5891L557
1197B5799k3024k0601j676J012O133K1378J7814m580j7059j2410p847o868O876
1210a5053K2380J2897n038m088n066j7734j2934R888J4992L439Q376J2455j2264
$$ plain form
1118 13593 13950 16442 16855 1278 -17472 -19087 -11712 -7747 3173 21499 26323 9939 -9512 -18159
1132 -18159 -23505 -22685 1589 29838 27824 11098 2044 -15850 -34643 -20828 10039 19010 16684
1145 16684 21395 9033 -20830 -25375 -8618 -5919 -1665 19242 23969 6035 -4480 -7147 -18037
1158 -18037 -23322 -4992 16097 20115 18102 13324 -5640 -26595 -26855 -8337 9818 19227 24611
1171 24611 18502 -7624 -28015 -21335 -9039 -2072 14403 28371 15025 -6940 -10621 -11516 -20583
1184 -20583 -10535 14889 18456 9930 13371 5760 -18985 -25405 -10085 -320 6351 22242 25799
1197 25799 2775 -17826 -19502 -18490 -12357 9021 26835 22255 5196 -7214 -15061 -21929 -15053
1210 -15053 7327 20224 15186 11098 6032 -11702 -24636 -14748 244 3683 12059 24514 12250
1223A2250k4284l944K605l864J3082K5546L794j5308q651q015j6202l04K3228
1236f7J5368m43J749m677k0315j4613N079J1811P648J0095J0696o676j9960r603
1250a3908K26j590O959K0254J1787r074j1638m955j2918j0424J5252K0389K347
1263A2707Q22L267j4605k1867p97J2110M749Q341J7365p34k0104j0808j831o591
1277a7976L880K0807J4094m097q598o547j3883j1940R123J9009P463K358K983
1290A6676r304j9662q016Q763P272M730J4492P637j4424j4382j943n699m522J4826
1304c556J9428J252o865k306j2132j9082J879J9019R434N085Q091o083k1418j2444
1318a9698N275O690N799J4628R590j1270j4628l658m068n146Q862J6778N226m700
$$ plain form
1223 12250 -12034 -15978 -13373 -17237 -4155 21391 25185 9877 1226 -6789 -22991 -23295 -67
1236 -67 15301 14858 16607 11930 -8385 -22998 -17919 -6108 1540 11635 22331 15655 -4305 -13908
1250 -13908 -13682 -15272 -8313 11941 23728 14654 3016 -1939 -14857 -25281 -10029 10360 12707
1263 12707 13529 16796 2191 -19676 -20473 -8363 -3614 4727 22092 21358 1254 -9554 -11385 -17976
1277 -17976 -14096 6711 20805 16708 8110 1563 -12320 -24260 -15137 3872 11335 13693 16676
1290 16676 7372 -12290 -20306 -11543 -4271 459 14951 22588 8164 -6218 -8161 -13860 -18382 -3556
1304 -3556 15872 17124 10259 7953 -4179 -23261 -21382 -2363 7071 12156 20247 14164 -7254 -19698
1318 -19698 -14423 -7733 -1934 12694 22284 11014 -3614 -7272 -11340 -16486 -7624 9154 14380 9680
1332I680p58n504j7517p218J2084J0330N256J1265L603j7419j8938j685M458L518
1346h845J5207J7539n836j7555p299n237o648P564J8693P513n385k221k893j4043
1360i446p990Q836P895K102R042Q344q404j6234o082n21k309J0286K0862N353
1374B1734j2043r709q469j1918R00J9434J5506o80l687l813j4831j2208Q098J1951
1388B65K682M947P440n307j3905m734J356m590J797J6523R849n402m752m963j4538
1403a3332r084J1601J7587O441K199N50j5020j9927O3J2126P419Q116R462m439
1417A3762j6714q733K544l13J462J2599Q906n128m422k36q320j0882K766J2380
1431c29O284L935P371n554k0238r705N350N267Q262J5702N158j5165j5318k717
$$ plain form
1332 9680 8922 3418 -14099 -21317 -9233 1097 6353 17618 21221 3802 -15136 -16821 -12363 -8845
1346 -8845 6362 23901 18065 510 -6789 -12026 -18674 -11110 7583 15096 9711 7490 4597 -9446
1360 -9446 -17436 -8600 -705 1397 10439 18783 10379 -5855 -11937 -12458 -14767 -4481 16381 21734
1374 21734 9691 -18 -8487 -20405 -19505 -71 15435 14755 11068 7255 -7576 -19784 -11686 265
1388 265 2947 7894 15334 10027 -3878 -8612 -7256 -11846 -10049 6474 16323 10921 6169 1206 -13332
1403 -13332 -22416 -10815 6772 13213 15412 15962 942 -18985 -18922 -6796 623 8739 18201 13762
1417 13762 -2952 -11685 -9141 -9454 -7992 4607 13513 8385 3963 3727 -4593 -15475 -12709 -329
1431 -329 5955 9890 17261 11707 -8531 -18236 -12886 -7619 643 16345 21503 6338 -8980 -11697
1445a1697j604L59J5323J4205m098q157k087o808r190L271J0984L742P99O599
1459A1641Q4j3265r284K38L37L394J3393J2058m265j3598p827n809n021J0157
1473g767J9686N789o939n362p671j2877j553J4433R339j014L848J474j2900r695
1487a1209L857J501j814Q876J1703j266p819l174o293j0247K808J5366R270J096
1501A2655n74o978j4981q982P244J2206N986N006L120j0616j4975j637N273J738
1515e515N525J1740J709j0566m335J54q832l502J2478Q904q62K803J040j2929
1529b188j3233K644P815L869R249R416p156j4828n921o92N62P870J2951M932p239
1544H051p925l587o014l297Q477J0812J615j273J080n571j2848k825Q197K890
$$ plain form
1445 -11697 -13301 -12942 2381 16586 12488 4331 2244 -4564 -13754 -10483 501 4243 5042 11641
1459 11641 11725 -1540 -10824 -10586 -10249 -6855 6538 18596 14331 733 -7094 -12903 -17924 -7767
1473 -7767 11919 17708 10769 5407 -2264 -15141 -16694 -2261 7078 6064 9912 11386 -1514 -11209
1487 -11209 -7352 -5851 -7665 1211 12914 11648 3829 655 -5638 -15885 -13077 2289 11559 12655
1501 12655 12081 5103 -9878 -18860 -11616 590 6576 11582 14702 4086 -10889 -12526 -7253 -5515
1515 -5515 10 11750 13459 2893 -1442 -1288 -10120 -13622 -1144 7760 6898 9701 10741 -2188
1529 -2188 -15421 -12777 -4962 -1093 8156 17572 10416 -4412 -10333 -11025 -10463 -2593 10358 15290 8051
1544 8051 126 -3461 -9475 -12772 -4295 6517 8132 6859 7939 2368 -10480 -13305 -5108 -2218
1558b218L243J1845K079j3781q457P6l676Q30J4690J0928n301o466k185j0047
1572h440p749Q485J1454K673K043J832p088j1402l532M452L983M485Q544L238
1586A2978p481r071l285j780j049P587J2644J708p266k272m897j1389K97J2933
1600c43O038j25M723o57j3938q372N382K635J000J1447P574q245q365k367n209
1615h822l610Q319J1722K755k914k232o586r660j353P682P448L634K594L36p634
1630A679j0679m10M768Q92N486J0420p09j0229m366j608o729P84J4003P528m100
1645F730j34j883j3357o460R005P283K148O232K706r497j0430J4J734L67O592
1660A050Q510n57n414l860l514m766j218P113Q605J453m03P0p881j1073K77Q588
$$ plain form
1558 -2218 1025 12870 14949 1168 -7289 -7213 -10889 -10059 4631 15559 10258 3792 1607 -8440
1572 -8440 -16189 -7704 3750 6423 8466 10298 3210 -8192 -11724 -7272 -3289 1196 9740 12978
1586 12978 5497 -3574 -6859 -8639 -9688 -2101 10543 12251 4985 2713 -2184 -13573 -13276 -343
1600 -343 5695 5570 10293 9636 -4302 -12674 -7292 -4657 -3657 7790 15364 7119 -1246 -3613 -8822
1615 -8822 -12432 -4113 7609 10364 7450 5218 -1368 -11028 -12381 -4699 2749 6383 8977 9313 1679
1630 1679 -9000 -9410 -4642 -3750 1736 12156 11447 1218 -3148 -4756 -11485 -10701 3302 10830 6730
1645 6730 6596 4713 -8644 -15104 -6099 1184 3332 9564 12270 2773 -7657 -7643 -5909 -5542 1050
1660 1050 9560 9003 3589 -271 -3785 -8551 -9769 -2656 5949 7402 6999 7069 -812 -11885 -11608 -3020
1676c020M905M214P552l092j4964o211L597k55L698J3049L578r398n227o93n815
1691h082k504R073P346j502P64K496o552q212k06K479J890N370P518J335q087
1706C126q278l076j631K273J0272R570j648q053m947m509n258N112J2653K805
1720H411l586J334k892j0433j741O829J034o36P502M436p246n426J45n022l822
1735a1113Q718R857J353j527k683q151q735J335R753P241K611J105m486j0342
1749e064n901L687N886K613L690M257m728q208q5R30m167K083R240K772k713J020
1765E312j644j0523n166P118N953K515O598J424j1530r762K75K901L426Q341O766
1780A2004m628r110l100q48j350L921P388K465k745j612j22m466n313K337M622
$$ plain form
1676 -3020 1885 6099 13651 10559 -4405 -10616 -7019 -7274 -3576 9473 13051 3653 -1574 -2267 -8082
1691 -8082 -10586 -1513 5833 4331 5095 7591 1039 -7173 -7379 -4900 -3010 2360 9878 11213 3126
1706 3126 -5152 -8228 -9859 -7586 2686 12256 10608 2555 -2392 -6901 -12159 -7047 5606 8411
1720 8411 4825 6159 3267 -7166 -8907 -2078 -1044 -1680 5822 10258 3012 -2414 -2269 -7291 -11113
1735 -11113 -2395 7462 8815 7288 4605 -3546 -12281 -10946 -1193 6048 8659 9764 5278 -5064
1749 -5064 -10965 -7278 -1392 1221 4911 9168 4440 -3768 -3853 -2923 -7090 -5007 4233 7005 4292 5312
1765 5312 3668 -6855 -12021 -4903 1050 3565 10163 11587 57 -9705 -9430 -6529 -3103 5238 12004
1780 12004 7376 -1734 -4834 -5682 -7032 -3111 4277 6742 3997 2385 2263 -2203 -7516 -5179 -557
1795e57O66L703N930l223r765m183L75m08M966J1818L284q429n789k782n863J221
1811i036J1120O981k175k531j672o846n127M401N528J47K092L948k138o190k689
1826d187j66j511J170P811O184k539m220k928o462l851O071R407L016j203q13
1841E779o231r318J33P844L144J691M654j426p986l766K020m22m59O017N565k393
1857D846k517j18m905o020K233O656L450K053K142l619r573m538L761L857L790
1872A498O382J691o929p309r28N88K70N386P105j332m714p71k577n242M52N967
1888d63L085J55K789K90p352n639J659J766J497O705N093l510o942l064j492j848
1904g271M423Q722J694l579j746l236n883r81N711M579P18J732J096n542o132
$$ plain form
1795 -557 109 3812 9742 6519 -3246 -7429 -7054 -7462 -2496 9322 12606 4177 -1612 -4394 -10257 -9036
1811 -9036 2084 9065 6890 4359 2687 -4159 -9286 -4885 643 790 2882 6830 4692 -1498 -4187
1826 -4187 -4353 -5864 -4694 3117 9301 6762 2542 -386 -6848 -10699 -4628 4779 7795 6592 5779
1841 5779 -452 -9770 -9637 -1793 1351 3042 7696 6270 -1716 -5482 -3462 -3884 -4343 1674 7239 4846
1857 4846 2329 2211 -2694 -8714 -6481 175 3625 5678 7820 4201 -5372 -9910 -6149 -2292 1498
1872 1498 7880 9571 2642 -4667 -5595 -5007 -4737 649 7754 6422 1708 937 -1640 -6882 -6430 -463
1888 -463 2622 2777 5566 5856 -1496 -7135 -5476 -3710 -2213 4492 9585 6075 -867 -3931 -5423 -7271
1904 -7271 -2848 5874 7568 3989 2243 -993 -6876 -7857 -2146 2433 3151 4883 5979 437 -5695
1919e695O11J821M39M501O009r47n430l199j660l299J239P680M332j729r72k086
1935A615o136l896L600N555J881J976K641m180p469j171J928J36L402O407J124
1950G413n035l528j549l351p89O814N187p67n89p50n353m786J703M513J977K212
1966C322L514j831o694k811P53n96J828O094L790k874l874k237l403l040M914
1981c145P126J179n64k67m639o390n7N263K622J464L697m83o718l322J328q86
1997c792M02M909L959j515k508p64l223m348J852N797K462J342J400k944o784
2012c755l366K659L483K585M283J503n628n725m92K21L61M416M857o83l748p33
2028B38j109m192MN087J898L65K665L8n464m663M07J580J232N472M619l256o025
$$ plain form
1919 -5695 -5084 -3263 -2824 1677 7686 6739 1309 -1890 -3550 -6849 -5610 2070 6402 4673 3701 1615
1935 1615 -4521 -8417 -4817 738 2619 4595 7236 3056 -4413 -5584 -3656 -3520 -118 6289 7413
1950 7413 2378 -1150 -2699 -6050 -6839 -25 5162 4395 3806 3056 -2297 -7083 -5380 -867 1110 3322
1966 3322 6836 5005 -1689 -4500 -3747 -4343 -2515 3579 7369 4495 621 -1616 -5019 -8059 -3145
1981 -3145 3981 5160 4596 4329 -310 -6700 -6757 -1494 1128 2592 6289 5806 -912 -4234 -2906 -3792
1997 -3792 -3390 1519 5478 3963 1455 691 -2532 -6880 -5028 769 3231 4573 5973 3029 -3755
2012 -3755 -7121 -4462 -979 1606 5889 7392 1764 -3961 -4453 -4232 -3871 545 5402 4719 971 238
2028 238 -871 -5063 -5059 28 1926 2291 4956 4994 -470 -5133 -4726 -3146 -1914 3558 8177 4921 -1104
2045a104k753j801n04M698O555J540l440k768k059l405q7M946L221n91M76N74
2061C498l023l843JJ368p31K303N360O56m080k215k289l653J046O864M881o30
2077E513j713k486o035l235M863N200J332J147O7m434m751J60K630M65J313L480
2093C516K48k679j091n29l007j265L091M515J190L32j58m737o106N46M224L198
2109A288K992K360k811o998l111K037J880K091M855J080m326k868K36j261j024
2124c580K786L194l9n29J611j806m877j373J709J062K625M506P09m686m961j052
2140d701j29J571N958M321k262m063k442k183j091K950M994J112k074r5j060l783
2156b977r06K466O01M3L065K348k096l482r78j522j662L870N981O96k192j897
$$ plain form
2045 -1104 -3857 -5658 -6162 -1464 5091 6631 3191 423 -1636 -5041 -5128 -182 3039 2448 2924 3498
2061 3498 475 -3368 -3367 -1999 -2730 -427 4933 5589 1509 -706 -2995 -6648 -5602 1262 6143 5513
2077 5513 3800 1314 -4721 -7956 -3093 2107 3439 4586 4653 219 -4532 -4372 -1742 -1277 36 3516
2093 3516 3764 1085 -6 -535 -3542 -4807 -1716 2799 3989 4321 4163 -574 -6680 -6134 -1910 1288
2109 1288 4280 6640 3829 -3169 -6280 -4243 -2363 -272 4583 5663 1337 -1531 -1295 -2556 -3580
2124 -3580 -794 2400 2361 1832 3443 1637 -3240 -4613 -2904 -1842 783 5289 5998 1312 -3649 -4701
2140 -4701 -4830 -3259 2699 7020 4758 695 -1747 -3930 -5021 -2071 2923 4035 1961 1866 806 -2977
2156 -2977 -3883 -1417 -816 -773 2292 4640 2544 -938 -1916 -3438 -5100 -1230 4751 5447 3255 1358
2172A358l580m061J125N444L490m6r3j720n117k139K642K252J046J933J381j842
2188B073l221m30m2j560J035M002J833r78m51j684m015k535L032M268J287J504
2204D118M99m710m948N32K583J394K904L060j628m640j541M46j244J048M065J531
2220C469j609m06o03k938k186J415K566J210J763J850k273m578j573P07R20K743
2236D77L553J313l536l521o74j277j11M212L491r17j385o01k447l082J288L461
2252B44O86O23K419j053m146j533N57k55J247L779J995k065k473j183k223j072
2268d453K941L675R59n16p15k225l311n22K870K081R02J970K8l715k681O2L23
2285b327L25L006L454j329k971p79j494k271J714M146J082l10N11j622l612j467
$$ plain form
2172 1358 -2222 -6283 -5158 286 3776 3730 3637 1917 -3200 -5339 -2697 -445 601 2534 3915 2073
2188 2073 -1148 -1578 -1620 -3180 -2145 1857 3690 2712 2261 577 -3438 -5973 -2941 1327 2614 4118
2204 4118 4617 -93 -5041 -4509 -1926 -532 2372 5432 3804 -836 -2377 -1931 -3175 -2127 1938 3469
2220 3469 1860 1454 851 -2087 -4273 -2858 -292 918 2681 4531 2258 -2320 -3893 -3186 -2266 477
2236 477 4030 5343 1807 -1714 -2388 -3665 -3776 436 3927 3010 1625 1024 -1423 -4505 -3217 244
2252 244 930 1553 3972 2919 -1227 -2760 -2203 -2458 -1211 2568 4563 2498 25 -1158 -3381 -4453
2268 -4453 -1512 2163 3122 2606 1891 -334 -3645 -4167 -1297 784 1686 3656 3684 -31 -2712 -2650 -2327
2285 -2327 -2002 1004 4458 3129 158 -621 -2115 -4386 -2672 1474 2556 2246 2757 1135 -2477 -3944
2301c944K272J459P00K704Q24k770k798q24m80J91K390L467M77k071j482j806
2317a691k376M25L651K636L28l38q16l084k744J601K261L77J672J861k004k958
2333a199n80p9q94J067L533J382j489k65j193l488r74K654K492J417J124k14l402
2350a08l432o6J998J303K291J867j356l140j625J30ON20K654J986j440q45J01
2367H44k003k269J373K091R21J164J624j551m162j543R80L69K346L622L12l152
2383I66k622r60o80J003L251K534j004j438o95j766j276J228J656N00K52J130
2399B079J74k541j697J48n38M07L253K555q41k290j744j947j156K608M376J035
2415C881j296j055k480k885O08K986J656K61M95o28k558j248J175P4l77J804J915
$$ plain form
2301 -3944 -1672 -213 487 3191 4015 1245 -1553 -2377 -2857 -2666 -276 3191 3668 1597 115 -1691
2317 -1691 -4067 -3642 9 2645 2973 2635 1819 -1265 -4009 -2408 -147 230 1902 3763 1759 -1199
2333 -1199 -1779 -1858 -2752 -1685 1848 3230 1741 1476 283 -3205 -4179 -1525 967 2384 3508 3294 -108
2350 -108 -3540 -3606 -1608 -305 1986 3853 2497 -643 -2268 -2138 -2132 -1612 1042 3028 1588 743 844
2367 844 -1159 -3428 -2055 36 957 2121 3745 2194 -1968 -3511 -2531 -2162 184 3806 4118 966
2383 966 -1656 -2616 -3296 -2293 958 3492 2488 1050 355 -1411 -2687 -1459 197 697 949 2079
2399 2079 2253 -288 -1985 -1837 -2375 -1968 1285 3840 2999 709 -1035 -2982 -4138 -1530 2846 3881
2415 3881 2585 1530 -950 -3835 -3227 -241 1415 1676 2171 1543 -1015 -2263 -1088 -1014 -1391 413 2328
2432B328n02p30n48j379k252J96L029K068M07M98j889l873j734J851K394J695
2448A559J435J58l013k952L17J008O07J827J598o60j664k56j89j392l73J633J254
2465H97n1J310L44k808k670pJ133J322K446K253j515l735j600J9K31K381L268
2482C218J76k152j759p95j105J43K535J285p19J35L69j384j480j14M25J16J173
2499F7K303O40j965j743j077j242Q14L328K358n24j837j563k055j252K140L019
2515A411N41l06K17j849k320L14J465K40L45J629M88j644n19k69j559n59J837
2532e38K024O18m0p64k048k497K50K468J754J050N08j510k635j477Q48J620P50
2549C81J468J006j867k073L41m07q01J068K105K16o67N49q63k548m96J596P93
$$ plain form
2432 2328 1826 1096 548 -831 -3083 -2887 142 2210 2617 3115 1226 -2647 -4381 -2530 -136 1559
2448 1559 2994 3152 139 -2813 -2496 -1488 -881 946 2544 1884 220 -36 -225 -1617 -1990 -357 897
2465 897 846 2156 2500 -308 -2978 -2985 -1852 -530 1916 4169 2654 -1081 -2681 -2662 -2431 -50 3218
2482 3218 3394 1242 -517 -1312 -2417 -2274 261 1546 827 962 1331 -53 -1533 -1647 -1222 -1106 67
2499 67 2370 3010 1045 -698 -1775 -3017 -2203 1125 3483 2959 1122 -441 -2496 -3748 -1608 1411
2515 1411 1952 1646 1863 14 -2306 -1992 -527 -287 58 1687 2175 531 12 -257 -1816 -2375 -538
2532 -538 1486 2104 2064 1300 -748 -3245 -2995 -527 1227 2277 2785 1275 -1360 -2837 -1989 -369 381
2549 381 1849 2855 988 -1085 -744 -1151 -1952 -884 1221 1437 770 1319 456 -2092 -2588 -992 -199
2566a99R73K077k16k545j863l23K02R65K318J526r70j847j101r39k16J146J764
2583G52J215n68p94j81j531j220J203J262K98J069J024j444k258l93K92l39J243
2600c70K871m9j873n30j123j580O22K398J269j87L32p48k106j149Q57Q91P19J292
2618A536M82q37j509j173j31K47O75J825J217j045j197p97r48o73J464K181K62
2635A579l79N17j493k509M83J407J9R85J876o30j980j137K3r33P35K478R91n64
2653A468m11j105j817k85J250J596P88J28k21r42j627o17P56P55N89O97P76r70
2671H08j602k89j06q62J526K298K4o71j24j450j997M21K133Q85L49J001j130k766
2689a552o41J023K36J012J536R4j262r70k20n12M4R11J032M49J16k83q32j176
$$ plain form
2566 -199 774 2851 2635 90 -1773 -2096 -1894 -929 1389 2915 1945 98 -1003 -1942 -2158 -1012 752
2583 752 1967 1399 605 424 -1107 -2327 -1124 138 436 1505 2529 1085 -1173 -1566 -1274 -1613 -370
2600 -370 2501 2452 579 49 -1074 -2654 -2032 366 1635 1448 1780 1032 -1074 -2223 -1366 -475 244 1536
2618 1536 2018 1181 -328 -1501 -1632 -1385 -710 1115 2332 1287 90 -707 -1655 -2328 -864 1317 1579
2635 1579 1200 1717 224 -2285 -1802 -395 -376 609 2485 1855 -125 -1262 -1239 -2172 -1437 1041 2032 1468
2653 1468 1057 -48 -1865 -2150 -900 696 1484 1612 1391 449 -1178 -1795 -1039 -284 305 1002 1778 808
2671 808 -794 -1083 -1189 -2051 -525 1773 1797 1126 1002 -448 -2445 -2024 109 994 1343 2344 1214 -1552
2689 -1552 -2193 -1170 -934 78 1614 1708 446 -524 -744 -1256 -1212 -301 731 1180 1296 1013 181 -995
2707i95r99P01J534O96O80N78j931k263j08Q39N81J576J918r22k391p11R3o30
2725a754J084K253j09r18K23o00j424PO89J70J66J108Q50r97j225n25q34L29J327
2744a80J849O89j039j572j114o81L46K071J644j61r80p34j143r54J075J449k19
2761C46Q6R30p07j345J13P0p93K62J771Q54l55j70q44j969p38J706J292J160M68
2780B137q33k068j568K18J452J306P17L53q16j584o52O24M17J76N74O61l57o32
2798A25M35o45j391J37J183M67N40J074q57k076j004M99P11J162K016O3k214j257
2816a032m40k5R46J487O73o01q38n57l93m04N18N69L56J12N54R1q93j122j3J75
2836h37J98J491J451q50j455r10p47j94J362K090K95r73p96p68j269N18J711M28
$$ plain form
2707 -995 -1994 -1293 241 937 1617 2195 264 -1999 -2107 -1268 -687 889 2807 1885 -506 -1217 -1124 -1754
2725 -1754 -670 1583 1474 556 779 179 -1245 -1238 -549 -379 -213 895 1745 748 -477 -1002 -1836 -1507 -180
2744 -180 1669 2358 1319 -253 -1367 -2048 -1702 369 2013 1852 872 138 -1005 -1959 -884 565 346
2761 346 432 1362 655 -690 -577 -507 -1300 -1038 733 1587 1232 1062 218 -1751 -2489 -783 509 1669 2137
2780 2137 1304 -764 -2332 -2114 -662 644 1361 1714 898 -686 -1338 -714 -297 -121 453 1114 757 125
2798 125 560 -85 -1476 -1339 -156 311 851 1925 1068 -1008 -2012 -1513 -802 360 2376 2439 225 -1032
2816 -1032 -1472 -1497 -551 936 1609 1008 170 -387 -780 -1184 -666 -97 259 371 925 1016 123 -999 -1012 -837
2836 -837 -639 852 2303 1453 -2 -912 -1659 -1853 -491 1599 1894 921 125 -643 -1912 -1394 317 745
2854G45m5K30l19q60n87M36k9p6P18R10j30m00k96j117p94K27J351J345J07m29
2874I87p17j610q11J142J426O29M62k00j114j532P4Q84Q6N82R67m21r07j3k87
2893c73p31m1J040P11Q8L87j36j384j036L21M57Q94J086L45o57j550p79J96L27
2912h35P92J351L0q42p10m86k34j59Q57J015M1k03K64o42j255J93L59L60M92R25
2932A313Qj160r76k48j97L90J387Q82l48q05n11p49l18O87J312K24o0K27q95j085
2952i22j15M43L81N55O24K63q77q68k03k15j22J150R52l1l28m50p80p33K54J097
2972G5O43O5K89l42j282m20J84L87K95Q73N86p30q85l05m71j65R68J099L67m97
2992G34k48q12p11M0P50P53J58K49j47j115n47J92K46P6O53P59j59p13m33l30
$$ plain form
2854 745 700 930 611 -249 -836 -400 -429 -505 213 1123 993 593 297 -820 -1614 -1387 -36 1309 1416 987
2874 987 270 -1340 -2151 -1009 417 1046 1508 1308 194 -1338 -1264 -380 -294 288 1255 834 -73 -86 -373
2893 -373 -1104 -1145 -105 606 694 1081 945 -439 -1475 -1154 -697 197 1283 1628 971 -579 -1358 -1162 -835
2912 -835 -43 1308 1338 496 -214 -700 -934 -1093 -236 779 820 617 881 239 -1016 -823 -464 -104 388 1313
2932 1313 1321 161 -815 -1063 -1260 -870 517 1399 1051 246 -265 -1014 -1332 -645 667 891 831 1058 163 -922
2952 -922 -1037 -594 -213 342 966 1229 352 -516 -719 -934 -1056 94 1046 1015 687 237 -543 -1276 -1022 75
2972 75 718 783 1072 730 -552 -972 -788 -401 -106 767 1353 623 -262 -567 -1038 -1203 -235 864 1231 734
2992 734 486 -326 -1037 -997 -247 506 664 913 766 -349 -896 -704 -458 -382 271 1030 871 158 -275 -605
3012f05n23L28J212P03j17l36m83j075n10Q57R74J85M27n0r36j053J4M01L11M97
3032B21N55J35p48l12q0n57o0Q49N50J49K60k73r34r80O0P48O34Q71L57p89j162
3053e06n90J1N05P12Q53K84r54o24j13k78J41O95M30j05k05J69k48r22r1L88%
3074d48N03R91m1p12p15m35k97N73J144R67m65p59o99p29k8Q95R54R5k32k73o29
3095c40m11o8P23j24Q5N27M71o67j03r5o40l90P37J148j18m32K49j229p40K20
3115a197J117Q67K52j32p08j182l98Q92O51K42M37j64o27l34L3O5j97J23M62K06
3135D08q0K56m46q47l07L91M85P00M69J71j210j096J42L87N57R13L78o11r55m06
3155g01J07P8L42Q25j14l92q2j16k63j66J44K08K10M46K89j61q96m19q9l8R48
$$ plain form
3012 -605 -1128 -800 412 1115 998 662 179 -896 -1406 -549 425 610 1037 987 51 -1002 -988 -587 -276 221
3032 221 776 911 163 -149 -229 -786 -846 3 553 702 962 689 -245 -1225 -1165 -417 217 1088 1445 656 -506
3053 -506 -1096 -1085 -580 132 985 1269 315 -309 -422 -700 -559 136 566 461 256 425 177 -745 -836 -448 -448
3074 -448 55 1046 1005 293 -422 -857 -1154 -581 563 1530 1065 306 -393 -1122 -1150 -255 699 794 562 289 -340
3095 -340 -751 -819 -96 -220 -135 392 863 196 93 -2 -642 -1032 -295 853 735 303 552 -677 -1417 -1197
3115 -1197 -80 787 1039 907 199 -983 -1381 -489 162 404 841 677 50 -284 -251 -186 -383 -260 202 408
3135 408 328 584 138 -709 -1016 -625 -140 560 1029 1200 -10 -1106 -964 -577 -20 893 1271 660 -295 -701
3155 -701 -594 -516 -174 651 537 145 63 -53 -316 -482 -338 -130 80 526 815 654 -242 -661 -750 -788 160
3176A60R61R0p14q58m81k39M71R76N80k50m72k98n06j8K47N85J59j7K00j95n05
3197a24j88P3l68J99P43M33k51k62n79m77k86O15J066J71J63m25r36n85K21P27
3217g0O07J69j2j88q57j36J21P0L4M87K27j00j33k33l19n04J84Q46J39L00K52
3238H84o89o76m09L13N72M86K57q9o33o54K2o9K83P77L07k49k14k34k97l20K86
3259c46N33O5J38K60k62o02l17PK37K16P06K86m73n98l34k72K4O88O19R0l33k24
3281A08l18m77M3O37M04m4R7J9o53k84q1J45K35M48L95k03m99k12l03k31N00N67
3303B93K84n4j78l16n25k02L98M71K31P7J37m69o01k22O6L79K87N60l4l90m09
3324b17k30k72K66O91L28m3p1k74m47l96L26L86J56K56Q9l12n24k19J48m0K75
$$ plain form
3176 160 1121 1211 497 -361 -842 -1081 -610 366 946 696 224 -74 -580 -598 -351 234 393 376 576 381 -124
3197 -124 -312 -239 -607 -408 335 768 517 255 -324 -801 -1087 -472 594 765 928 503 -433 -1018 -797 -70
3217 -70 537 706 694 506 -351 -487 -366 -296 -262 225 452 352 219 -14 -333 -837 -653 193 332 632 884
3238 884 195 -481 -890 -577 -5 481 738 649 16 -638 -616 -685 -402 375 682 433 219 -15 -312 -632 -346
3259 -346 187 252 390 650 388 -214 -531 -524 -287 -71 635 921 448 -150 -484 -756 -732 -44 575 665 332 108
3281 108 -210 -687 -644 -7 397 353 450 469 -184 -468 -549 -404 -169 279 674 471 -28 -240 -543 -774 -274 293
3303 293 577 523 345 29 -496 -698 -300 171 402 479 616 147 -454 -676 -610 -231 56 616 582 192 -217
3324 -217 -447 -719 -453 238 566 523 452 178 -269 -665 -339 47 203 459 548 236 -288 -507 -359 -399 -124
3345a24O04O5r9k71k11o32Q6M06N92K77j37k09m85o52J35O13J64K25K88l63n23
3366b51k35J48J26Q8M11K26q8k61k0l94l13K07L82L20K05q9m03o06l28L73M19
3387h3M70L15n6o04m12k63J36L58M93K85k92l35j05k13j35K66J62J34J40N4L2
3408C47m85l03j72K38L16M97M23l35n55m56j59P0N77P74j33l11l41m04k88K81
3428d19N15K94j35K9l61j00j73K25j9o5L73L57q5j78k83k88k34j7P85K63J72k27
3450D29n19o20j17N09N66K99Kj11n60m49L64J70J17J73L2n1k27j02J20k82j04
3471c61K56K03K53J18j78m39m64r9L93N05L08J79l26p47k22M5M39L37L60p3n52
3492f5k16o9l7J10K76K00o0k3J70l16j37j53l8L76R5L81J42m55n54p9L2K11N97
$$ plain form
3345 -124 480 545 446 175 -36 -668 -582 -176 416 693 556 347 -138 -790 -655 -42 122 347 635 272 -251
3366 -251 -486 -338 -212 -124 287 513 425 164 144 -250 -563 -356 26 346 551 462 59 -547 -875 -502 -83
3387 -83 387 702 646 42 -370 -633 -497 -139 354 639 347 12 -93 -306 -441 -175 -13 121 261 315 347
3408 347 -138 -441 -613 -375 -59 438 861 526 -29 -485 -644 -574 3 777 644 333 -8 -412 -700 -419
3428 -419 96 390 255 284 -77 -177 -350 -125 -144 -209 164 521 436 258 -25 -313 -547 -564 221 484 656 429
3450 429 -90 -710 -827 -318 248 547 549 438 -122 -571 -207 -37 80 253 285 234 7 -95 25 -257 -361
3471 -361 -105 98 351 469 291 -148 -612 -711 -318 187 495 674 348 -399 -621 -576 -137 200 560 487 -65
3492 -65 -281 -350 -387 -277 -1 199 139 116 286 -30 -167 -320 -358 18 113 494 636 181 -373 -452 -420 -209 388
3515C88L50k81m60l35k42j54P35N00j23k01m6k69k32J57K01O2J25l9L01l97p6
3536c6j02k64L8K87M78R4k67j16l25m33K26M86L16J88j52k42n49q4J85L75J46
3557B49O9L8m17k05J92k18J4P0K41J74m5rj15m83J3K37L52J37L14k10n18k87j24
3580e31K95K38L64J60k86n01m6N7m2L53J87J13k73m8k7k63l7J76J16K70J47m2
3602C80k62m31J4m6J50L32L03m0l08j92j48p9J74M09K19j71k18j21j06k62K57
3623a46J13K40J6K3j01l74n2QN6J41M51J8j44k47k41m8p0L74L17l4K6j20k79l28
3647d01m9L93J11J31J18m8l08l28J2J99J22M31R7k12k15j63j66j53L18K33L05
3668D27j87j02j99k71J2K82N1J08J34o1o2k81j24m7J01L34K41K3k01k34l43j03
$$ plain form
3515 388 738 457 -3 -338 -580 -734 1 501 378 177 131 -138 -370 -213 -12 50 175 136 437 40 -36
3536 -36 -138 -402 -364 -77 401 495 228 112 -213 -646 -420 66 382 570 418 176 -373 -457 -272 103 249
3557 249 318 356 -61 -266 -74 -292 -278 -208 33 207 162 153 38 -445 -432 -195 157 294 608 398 -120 -407 -531
3580 -531 -236 2 366 526 240 -261 -307 -250 -292 61 248 361 88 40 13 -250 -287 -111 5 275 422 380
3602 380 118 -313 -299 -345 -195 137 440 400 92 -100 -248 -327 -153 256 475 304 86 -35 -141 -403 -146
3623 -146 -33 207 223 246 145 -229 -281 -273 -217 -76 375 393 249 2 -239 -287 -357 17 334 300 326 206 -73 -401
3647 -401 -450 -57 54 185 303 255 -53 -381 -369 -170 -48 383 480 268 53 -110 -276 -429 -111 122 427
3668 427 240 138 -61 -332 -320 -38 13 121 255 194 132 -149 -273 -320 -219 115 356 379 178 -56 -399 -502
3690e02L55K30L38j40R3l44l12r8J95J18J80O9Qj02k45j84K06o8J98J76J37j01
3712B07o6k22k94K0L00J97J44O1l0m70l39J06J32K71L15P0k75j93j65o5ML01K93
3735C02n0p5r8o1j54j73J74J72P6Q2J21k79k11r5j33K34K61K81Q7l83k84p5j31
3758d12K48L92K03k00j78j69j75LK52K55Nj03N6k05J4q8lj6k9L74Q9jl07m5l22
3783c62P6R3M01J06O4l25k64k74J17M08J42O2o8O3m13l6J02Q6j5J97J3n6j45Q7
3807E9j15k47M4J82K38J09J4k02m38k02K54K76K65K53j53k81l23j11K55J75J37
3828A89O7j40k41r2P8k7R3P0J46j03K49K5l11k01m1Q7Q5K81K38k10k16l27%R0
3852b11J36M07r3k03j93k26j10K11K94K47j89O2k83R1n6m9J47p5J59J85p6j84
$$ plain form
3690 -502 -147 83 421 281 374 30 -282 -380 -185 -67 113 182 190 88 -157 -341 -135 -203 -5 171 308 207
3712 207 141 -81 -375 -355 -55 142 286 347 317 -153 -492 -386 -254 17 332 402 127 -66 -231 -296 -292 9 302
3735 302 252 177 79 18 -136 -309 -135 37 113 195 316 37 -174 -269 -402 -168 93 374 461 78 -206 -281 -412
3758 -412 -164 228 431 231 53 -116 -291 -288 -36 219 224 121 177 -28 -14 -102 -105 -121 -150 224 313 312 5 -40 -362
3783 -362 -286 -193 208 314 378 53 -211 -485 -368 40 182 244 176 239 -174 -210 -108 -22 -37 160 173 117 -28 59
3807 59 -56 -303 -259 -77 161 270 284 82 -356 -558 -304 -28 237 490 337 56 -267 -378 -123 52 189
3828 189 256 116 -125 -217 -139 -166 -73 -3 143 40 289 314 3 -198 -239 -152 -67 214 452 242 26 -301 -301 -211
3852 -211 -75 332 239 36 -157 -383 -493 -282 12 259 70 132 -151 -60 -116 -165 -18 -93 66 251 175 -9
3874ij44q6o3K4L89K68j37j0k85j82j27K00L58R5n7q6k14k26L0K42J22n7J69j02
3898A12j7j64p0o2J3J04K99Npq1k88j97K11R9J63J09M2j73l80r6J44J75K21K02
3922C64p3k58j69j07J16N5J54J77j59J9N4l02M3J2J4M9J85q7R9j36l43pJ09J54
3946c7K31J08k01j16k44j0J07j3M47L0j82p8j59o2r1K00O8Q1OJ46k08r9n3R0o2
3971a01K23J47o3j45q7j43pJ33J42J53j2o4o0l25k0M8J9K99lJ21j80j34j2jp3
3996a45K29K25r5j16o0j29j86J12J2L92j09Q5j7k45j03R7Q8LR9%Q4l19Ll8o6J95
4022dJ5K37j10j24rj33j54J45K20%P0Q7k81r0O7R5k8J88m1j26J5j96R0j17L0J75
4048B1J25J23j74m6j96j11L8L00K5J31K4j74j55k19J78P8J24J68n1j79j48K3j56
$$ plain form
3874 -9 -153 -239 -302 -278 111 379 242 232 -53 -235 -362 -162 196 291 234 148 -66 -292 -262 -20 102 45 214 112
3898 112 95 -69 -139 -201 -188 -84 215 220 213 132 -156 -353 -142 -43 120 229 271 98 -282 -378 -234 -59 162 364
3922 364 291 33 -136 -243 -127 -72 82 259 100 119 173 -129 -86 -74 -60 -11 174 87 186 50 -293 -300 -191 -37
3946 -37 194 302 101 -15 -259 -269 -162 -175 272 302 120 42 -117 -179 -270 -70 -2 79 85 231 23 -76 -129 -39 -101
3971 -101 122 269 206 61 -26 -169 -176 -43 99 252 240 176 116 -209 -229 -181 -162 137 134 255 75 -59 -71 -72 -145
3996 -145 84 309 214 98 38 -91 -277 -165 -153 239 130 215 198 -47 -150 -53 35 38 137 137 221 -98 -95 -133 -199 -4
4022 -4 11 248 138 14 5 -128 -282 -137 83 83 153 240 -41 -131 -64 31 3 191 150 24 39 -157 -67 -184 -154 21
4048 21 146 269 95 49 -147 -258 -220 80 105 236 260 86 -69 -288 -110 -32 92 260 209 30 -118 -95 -251
4071b51K37Q9r3J22q8Q8q4j60J3k1P7J00J47Q9j43k96K5l3J95l9K89l6j52j92
4095a17r7o3L61J56P4j70n6k25n7O3Q6J36m5K1O8j34o3M5j88J7K10K22N4r5k79
4120g6j22j2P3K26K34j58n4j26j08j22J41J70J00lj01p4j21P6O0l1o8J23P7j47
4144d3R6K7k57M9k9J87J49O3j5k63k41MJ79P7K68N5k60r1j49MJ12O1K12m8m2j30
4170b5J82k90J2O1J55q%J65j49j97ol6j00K72K64jj61k72j77L7J19K70K38j38
4194B15j81j70k3P8R5O2j5l6j15K01j96L5J0J22o9L5J93q8o9k41m0N0N9K69K5
4219B06q0k7j92k5l1J42J91j22P9j08k02j6P3J35J7m0J09L5k59L3o0PP2J7J88
4244A42r2J48k77n7p0K9J50J14O7J91l90j86J8J71N2J38q3j0j20p3ok3J24K57
$$ plain form
4071 -251 -14 75 -18 104 16 104 20 -140 -127 -148 -71 29 176 265 122 -174 -149 -182 13 -26 263 227 75 -117
4095 -117 -214 -277 84 240 314 144 88 -137 -194 -131 -45 91 46 67 135 1 -62 -17 -205 -188 22 244 298 203 -76
4120 -76 -198 -210 -137 89 323 165 111 -15 -123 -245 -104 66 166 163 62 -12 -133 -57 3 -28 -96 27 104 -43
4144 -43 53 80 -177 -128 -157 30 179 242 227 -36 -277 -273 -94 -17 251 306 46 -45 -194 -190 -78 -17 195 147 105 -25
4170 -25 157 -133 -121 -60 95 87 87 252 103 -94 -100 -136 -236 36 300 299 138 -134 -311 -274 -155 115 353 215
4194 215 34 -136 -159 -81 14 76 61 25 -90 111 -85 -50 -40 82 13 48 241 153 84 -157 -197 -147 -88 181 206
4219 206 126 99 -93 -118 -149 -7 184 62 141 33 -169 -185 -112 23 40 0 109 144 -115 -82 -142 -135 -63 -46 142
4244 142 50 198 -79 -136 -206 -177 -27 87 154 345 -45 -231 -213 -42 10 148 65 55 -65 -138 -144 -167 -43 214
4268B14j07p6M8Nj50k1q0K25k1n2J58p6j21q3kJ2J37Q9R6j38j87P4j83J25J63
4293D9P4j02j4R3j62j29J05N2l6J01J34Kj33j34K9Kj29K42J45j12j28nJ7j56J52
4318d3J16K7M1l4j02j75O0J51j1m5K38k8k82o0O9o8Q5J64K7ppj99M8j78J37J29
4344E3l4R9l2j9j32j50L00L4j55J32J74k12l8Oj78N6O0J68L6o4q1k7j65R3N0K2
4370dK9J32j45K1k44O2J75j15Q9K00j53k3k9q2L5M6J23N7j43O4q3j83J2J13J17
4395G1%M5K5j00r9j42J76J24o9N5oj37p2O4l8J6R1J56p8l1J2r4o8L2R2k6M5P5
4423A19Q8k73q0N5M1J85J15Rk72o4k31K52K6K8L71j86j57L0p1p0Q2O8J0Pk6M8
4449A04j01p3L5m6l0Q5J42ko3p7j95k3P7K98R6n9l2j81j21M5K60K7q7j48J03j22
$$ plain form
4268 214 107 31 79 84 -66 -87 -167 58 37 -15 143 67 -54 -137 -139 -127 10 99 195 57 -130 -56 -239 -114 49
4293 49 123 21 7 100 -62 -191 -86 -34 -70 31 165 167 34 -100 -71 -69 -198 44 189 77 -51 -56 -39 -195 -43
4318 -43 73 100 141 107 5 -170 -110 41 30 -15 223 195 -87 -147 -78 -146 -61 103 130 123 116 -83 -35 -213 -76 53
4344 53 19 118 86 67 -65 -215 85 119 -36 96 270 58 20 26 -152 -96 -36 132 168 104 23 -4 -169 -76 -26 -4
4370 -4 25 157 12 33 -211 -149 26 -89 0 200 47 24 -5 -87 -52 -6 117 174 31 95 12 -171 -159 -46 71
4395 71 71 116 141 41 -58 -200 -24 100 31 86 80 -57 -129 -65 -103 -87 4 160 82 51 63 -31 -99 -67 25 -1 44 119
4423 119 207 -66 -146 -91 -50 135 250 259 -13 -77 -308 -56 -30 -2 369 183 26 56 -15 -85 -3 65 75 82 56 104
4449 104 3 -70 -35 -81 -111 -26 116 114 51 -26 -221 -244 -167 131 227 168 136 -45 -166 -121 139 166 79 -69 34 -88
4475h8L4L4P9j49k8K09j19M5J04q2j74J6K01j10J60o6q6j27j11P2J86J60j30K10
4499B40k14k24Q4J83p0R4O1j53j66K27N3o5j78M0K8k3M5K10q8q7j48O9L9M9J94
4524B00k8k18l2q1R9k2L18j64j23M4j20O3q6P4J28m9q2J20m4r6Q0Mj15p1K09J10
4550A18Rq8O4j50o8R5K24k7n7j78jp6L5K25m0n4Lo8nK0K6N8n2J6q5j3L5J03q3
4579a4j34Q2J99j16P2k0j35j25k9K60J87j58R8Qj09j21l8J09J4kO9jj96J36q6
4604e0J1o9J94N8k27J22N1j97MK53j32n6O3J97k06j0k9j28J15PJ93j38p3L7p0
4629h0j9j7J79K3Kk29J97j04O3k4J20p8O1Pr0p1L8l9l9M9J38J9p0l9P9q5l0N3
4657A4N4R0j24K7j56o2O4Q9l4L0J11pj40j22J3J63Q5m0L7P2j18m6l4%KO7l4k5
$$ plain form
4475 -88 -54 -20 59 -90 -118 91 -28 17 121 39 -135 -119 82 -28 132 66 -20 -147 -258 -186 0 160 30 240
4499 240 26 -198 -114 69 -1 93 154 1 -165 62 115 50 -128 -88 -60 -83 -38 172 84 -3 -151 -82 -43 6 200
4524 200 172 -46 -78 -159 -60 -82 236 72 -51 -7 -127 -64 -150 -76 52 3 -79 41 -3 -99 -19 -15 -130 -201 8 118
4550 118 127 39 103 -47 -115 -20 204 177 120 -58 -59 -135 -100 125 85 31 34 -34 -39 -19 7 65 13 29 -56 -69 -34 69 -14
4579 -14 -148 -66 133 17 89 69 -66 -191 -220 40 227 69 167 175 66 -55 -93 16 30 28 97 96 -100 36 -50
4604 -50 -39 -108 86 144 -83 39 90 -107 -103 150 18 -38 25 222 16 6 -23 -151 -36 -29 164 26 -47 -10 -80
4629 -80 -99 -116 63 86 88 -141 56 -48 15 -9 111 33 94 101 11 -60 -22 -61 -100 -51 87 106 36 -3 76 -9 -39 14
4657 14 68 158 34 61 -95 -157 -93 -4 -38 -8 103 96 -44 -166 -153 10 95 55 92 164 46 0 -34 -34 -32 35 1 -24
4685b4J20j99L7j4J02l0l2J11M1j77l0J26r9p3m8L09m7j0j15j1o6O3O9O1JjO4
4712A28k14n1J27P7j69J16J2m6M1l5oo5L4J20Ro2L3j16o3K6Q7P7J6k4N7k49j16
4739b56J80N1J26j1j02rn8j3P7P4q0Q8j65m4K38p2j01j34J96K1q1J10N3r6k1j68
4765a97J58j0K02r1R6j52r3P0m8J09Q6N1j45p6l1M2p8P3P8j64M1J99j0l4p5j12
4791a11K3M2P9N4j7Mq6j08nK05M9N6k17L9j27o2J51P3J48j39m4q2J07k5Q8j7j21
4818d3J06N2j02O1M3j41j68L8J93K8M5J0k9k53n9J38J83l0M5k9k23p2J34R8J2
4843C7KJ1p1j15J80J4l0j67QJ9K09O0o3j47nmM2O2n8K30j28k29Q8l5L7J10J14
4870A71n3j67j12J52j25K4Q0j2K8O8O0l3k18N2K4J4N7N6Q2j40J3r8r4O8K43M3
$$ plain form
4685 -24 96 -103 -66 -80 22 -8 -40 71 112 -65 -95 31 -68 -141 -189 120 73 63 -52 -63 -129 -66 3 64 65 64 128
4712 128 -86 -137 -10 67 -102 14 26 -20 21 -14 -20 -85 -51 69 78 16 49 -67 -130 -104 -17 60 76 52 109 -140 -256
4739 -256 -76 -25 101 90 -12 -21 -79 -92 -15 59 -21 67 -98 -142 96 24 -77 -211 -15 6 -75 35 88 -8 -29 -197
4765 -197 -39 -49 153 62 158 6 -87 -17 -65 44 130 181 36 -40 -71 -29 -107 -34 44 -120 -79 120 110 76 1 -111
4791 -111 -88 -46 33 87 70 74 -12 -120 -125 80 129 185 -32 7 -120 -182 -31 42 190 51 7 -75 32 7 95 78 -43
4818 -43 63 115 13 74 117 -24 -192 -154 39 67 112 122 93 -160 -219 -81 102 72 117 88 -135 -207 -73 25 37
4843 37 39 50 -21 -136 44 58 28 -139 -131 -112 97 157 94 -53 -58 -62 -20 42 -16 214 86 -143 -55 -90 -53 57 171
4870 171 118 -49 -161 -9 -134 -110 -30 -42 -14 54 114 81 -137 -85 -61 -47 10 66 148 8 21 -77 -171 -103 140 183
$$ [...]
8191a17
##END NTUPLES=NMR FID
##END=
