##TITLE=31P_LR_724-R2-CR16 
 64 sc cdcl3
 26.2.2025
##JCAMPDX= 6.0         $$ Bruker NMR JCAMP-DX V2.0
##DATA TYPE= NMR SPECTRUM
##DATA CLASS= NTUPLES
##ORIGIN= UXNMR, Bruker Analytische Messtechnik GmbH
##OWNER= root
$$ XWIN-NMR		Version 3.5
$$ Wed Feb 26 15:47:01 2025 Russian Standard Time (UT+4h)  new_Human@DPX200
##.OBSERVE FREQUENCY= 81.013821
##.OBSERVE NUCLEUS= ^31P
##.ACQUISITION MODE= SIMULTANEOUS
##.ACQUISITION SCHEME= undefined
##.AVERAGES= 64
##.DIGITISER RES= 17
##SPECTROMETER/DATA SYSTEM= spect
##.PULSE SEQUENCE= zgpg30
##.SOLVENT NAME= Acetone
##.SHIFT REFERENCE= (INTERNAL, Acetone, 0, 198.062)
##AUDIT TRAIL= $$ (NUMBER, WHEN, WHO, WHERE, WHAT)
$$ ##TITLE= Audit trail, XWIN-NMR		Version 3.5
$$ ##JCAMPDX= 5.01
$$ ##ORIGIN= Bruker BioSpin GmbH
$$ ##OWNER= new_Human
$$ C:/Bruker/XWIN-NMR/data/yarkov/nmr/P31/2/pdata/1/auditp.txt
$$ ##AUDIT TRAIL=  $$ (NUMBER, WHEN, WHO, WHERE, WHAT)
(   1,<2025-02-26 15:45:04.98 +0400>,<new_Human>,<DPX200>,
      <created by zg, POWCHK disabled, PULCHK disabled
       configuration hash MD5:
       00 E9 B6 7A A2 85 ED C7 34 08 36 98 17 FE 4E 26
       data hash MD5: 32K
       F2 7A 32 4A 94 B8 97 83 90 4C FD 5E 68 CC 55 5F>)
(   2,<2025-02-26 15:45:19.64 +0400>,<new_Human>,<DPX200>,
      <Start of raw data processing
       efp BC_mod = 2 LB = 1.5 FT_mod = 6 PKNL = 1 PHC0 = 1791.274 PHC1 = 41.49541 SI = 64K 
       data hash MD5: 64K
       BF 65 44 F7 73 97 9E 25 DF AD B5 35 15 C5 4B 48>)
(   3,<2025-02-26 15:46:23.78 +0400>,<new_Human>,<DPX200>,
      <pk PHC0 = 5.388675 PHC1 = -7.400005 
       data hash MD5: 64K
       D4 D4 F2 E6 A0 58 92 40 AA 56 94 5E 3D 97 43 DC>)
$$ ##END=
$$ 
$$ hash MD5
$$ 17 85 1E 7B 02 04 F6 A6 C6 69 E6 96 B1 5C 3B 75
##$RELAX= 
##$RELAX= 
##$RELAX= 
##$RELAX= 
##$RELAX= 
##$RELAX= 
##$RELAX= 
##$RELAX= 
$$ Bruker specific parameters
$$ --------------------------
##$DU= <C:/Bruker/XWIN-NMR>
##$EXPNO= 2
##$NAME= <P31>
##$PROCNO= 1
##$TYPE= <nmr>
##$USER= <yarkov>
##$AMP= (0..31)
100 100 100 100 100 100 100 100 100 100 100 100 100 100 100 100 100 100 
100 100 100 100 100 100 100 100 100 100 100 100 100 100 
##$AQSEQ= 0
##$AQ_mod= 1
##$AUNM= <au_zg>
##$AUTOPOS= <>
##$BF1= 81.014009
##$BF2= 200.13
##$BF3= 200.13
##$BF4= 200.13
##$BF5= 200.13
##$BF6= 200.13
##$BF7= 200.13
##$BF8= 200.13
##$BYTORDA= 1
##$CFDGTYP= 0
##$CFRGTYP= 5
##$CHEMSTR= <none>
##$CNST= (0..31)
1 1 145 1 1 1 1 1 1 1 1 1 1 1 1 1 1 1 1 1 1 1 1 1 1 1 1 1 1 1 1 1 
##$CPDPRG= <waltz16>
##$CPDPRG1= <>
##$CPDPRG2= <waltz16>
##$CPDPRG3= <>
##$CPDPRG4= <mlev>
##$CPDPRG5= <mlev>
##$CPDPRG6= <mlev>
##$CPDPRG7= <mlev>
##$CPDPRG8= <mlev>
##$CPDPRGB= <>
##$CPDPRGT= <>
##$D= (0..31)
0 1 0 0 0 0 0 0 0 0.06 0 0.03 2e-05 3e-06 0 0 0.0002 0 0 0 0 0 0 0 0 0 
0 0 0 0 0 0 
##$DATE= 1740570304
##$DBL= (0..7)
120 120 120 11 120 120 24 19 
##$DBP= (0..7)
150 150 150 150 150 150 150 150 
##$DBP07= 0
##$DBPNAM0= <>
##$DBPNAM1= <>
##$DBPNAM2= <>
##$DBPNAM3= <>
##$DBPNAM4= <>
##$DBPNAM5= <>
##$DBPNAM6= <>
##$DBPNAM7= <>
$$ [...]
##$SUBNAM2= <"">
##$SUBNAM3= <"">
##$SUBNAM4= <"">
##$SUBNAM5= <"">
##$SUBNAM6= <"">
##$SUBNAM7= <"">
##$SUBNAM8= <"">
##$SUBNAM9= <"">
##$SW= 400.765351723535
##$SWIBOX= (0..15)
0 1 3 0 0 0 0 0 0 0 0 0 0 0 0 0 
##$SW_h= 32467.5324675325
##$TD= 32768
##$TD0= 1
##$TE= 0
##$TE2= 300
##$TE3= 300
##$TEG= 300
##$TL= (0..7)
0 120 53 12 22 120 120 120 
##$TP= (0..7)
150 150 150 150 150 150 150 150 
##$TP07= 0
##$TPNAME0= <>
##$TPNAME1= <>
##$TPNAME2= <>
##$TPNAME3= <>
##$TPNAME4= <>
##$TPNAME5= <>
##$TPNAME6= <>
##$TPNAME7= <>
##$TPOAL= (0..7)
0.5 0.5 0.5 0.5 0.5 0.5 0.5 0.5 
##$TPOFFS= (0..7)
0 0 0 0 0 0 0 0 
##$TUNHIN= 0
##$TUNHOUT= 0
##$TUNXOUT= 0
##$USERA1= <user>
##$USERA2= <user>
##$USERA3= <user>
##$USERA4= <user>
##$USERA5= <user>
##$V9= 5
##$VALIST= <valist>
##$VCLIST= <CCCCCCCCCCCCCCC>
##$VD= 0
##$VDLIST= <DDDDDDDDDDDDDDD>
##$VPLIST= <PPPPPPPPPPPPPPP>
##$VTLIST= <TTTTTTTTTTTTTTT>
##$WBST= 1024
##$WBSW= 4
##$XGAIN= (0..3)
0 0 0 0 
##$XL= 0
##$YL= 0
##$YMAX_a= 45727
##$YMIN_a= -50194
##$ZGOPTNS= <>
##$ZL1= 120
##$ZL2= 120
##$ZL3= 120
##$ZL4= 120
##$ABSF1= 0
##$ABSF2= 0
##$ABSG= 0
##$ABSL= 0
##$ALPHA= 0
##$AQORDER= 0
##$ASSFAC= 0
##$ASSFACI= 0
##$ASSFACX= 0
##$ASSWID= 0
##$AUNMP= <proc_1d>
##$AZFE= 0.1
##$AZFW= 0.5
##$BCFW= 0
##$BC_mod= 2
##$BYTORDP= 0
##$COROFFS= 0
##$CY= -3
##$DATMOD= 1
##$DC= 0
##$DFILT= <>
##$DTYPP= 0
##$F1P= 0
##$F2P= 0
##$FCOR= 1
##$FTSIZE= 65536
##$FT_mod= 6
##$GAMMA= 0
##$GB= 0
##$INTBC= 1
##$INTSCL= 9.790993e-09
##$ISEN= 30
##$LB= 1.5
##$LEV0= 0
##$LPBIN= 0
##$MAXI= 10000
##$MC2= 0
##$MEAN= 0
##$ME_mod= 0
##$MI= 50
##$NCOEF= 0
##$NC_proc= -3
##$NLEV= 6
##$NOISF1= 182.463
##$NOISF2= 159.3651
##$NSP= 0
##$NTH_PI= 0
##$NZP= 0
##$OFFSET= 198.0616
##$PC= 4
##$PHC0= 1796.663
##$PHC1= 34.09541
##$PH_mod= 1
##$PKNL= yes
##$PPARMOD= 0
##$PSCAL= 0
##$PSIGN= 0
##$REVERSE= no
##$SF= 81.0140089999434
##$SI= 65536
##$SIGF1= 159.3651
##$SIGF2= -187.1042
##$SINO= 113.3802
##$SIOLD= 16384
##$SREGLST= <1H.CDCl3>
##$SSB= 0
##$STSI= 65536
##$STSR= 0
##$SW_p= 32467.5324675325
##$SYMM= 0
##$S_DEV= 0
##$TDeff= 32768
##$TDoff= 0
##$TI= <>
##$TILT= no
##$TM1= 0
##$TM2= 0
##$TOPLEV= 0
##$USERP1= <user>
##$USERP2= <user>
##$USERP3= <user>
##$USERP4= <user>
##$USERP5= <user>
##$WDW= 1
##$XDIM= 65536
##$YMAX_p= 464655420
##$YMIN_p= -7234543
$$ End of Bruker specific parameters
$$ ---------------------------------
##NTUPLES= NMR SPECTRUM
##VAR_NAME=  FREQUENCY,     SPECTRUM/REAL,   SPECTRUM/IMAG
##SYMBOL=    X,             R,               I
##VAR_TYPE=  INDEPENDENT,   DEPENDENT,       DEPENDENT
##VAR_FORM=  AFFN,          ASDF,            ASDF
##VAR_DIM=   65536,         65536,           65536
##UNITS=     HZ,            ARBITRARY UNITS, ARBITRARY UNITS
##FACTOR=    0.49542278885378, 1,            1
##FIRST=     16045.7642231865, 0,            0
##LAST=      -16421.768244346, 0,            0
##MIN=       -16421.768244346, -7234543,     0
##MAX=       16045.7642231865, 464655420,    0
$$ Real data points
##PAGE= N=1
##DATA TABLE= (X++(R..R)), XYDATA
$$ [...]
43454a01826p0756o3870J4004O8442N8172N2299Q3796P6395j3501r6296p7769
$$ -101826 -172582 -236452 -222448 -154006 -95834 -43535 40261 116656 103155 6859 -70910
43443g0910l27L3798J2746k92J7475L4379L5168L2174K5483J0753O171K0196J8183
$$ -70910 -71237 -37439 -24693 -24985 -7510 26869 62037 94211 119694 130447 136618 156814 174997
43430A74997k4307o1752l6205K3881L4437j7727n4875l1390l465l4508q9649q6664
$$ 174997 150690 88938 52733 76614 111051 93324 38449 7059 3594 -30914 -120563 -207227
43418b07227k0166L3071K5671p083j5848j722J1914K2669L0982K0183p741j5246
$$ -207227 -227393 -194322 -168651 -175734 -191582 -193304 -181390 -158721 -127739 -107556 -115297 -130543
43406a30543R759J7435k5174o0033j5330P3584J05892O1950J6358R335M610j5486
$$ -130543 -120784 -103349 -128523 -188556 -203886 -130302 -24410 37540 53898 63233 67843 52357
43394E2357j8472q544l4859p5210k9088J10330J93580J14361l0654q9502p1432
$$ 52357 33885 25341 -9518 -84728 -113816 -3486 190094 304455 273801 184299 112867
43383A12867q4041j24660r3568R201N9108N46o7431m4709L2579O5004K8066j9080
$$ 112867 28826 -95834 -189402 -180201 -121093 -120547 -187978 -232687 -200108 -135104 -107038 -126118
43371a26118j9957K6956P8315Q6401M7620J1651J8752M1346K5413k6653o5306
$$ -126118 -146075 -119119 -40804 45597 93217 104868 123620 164966 190379 163726 98420
43360I8420p5399q9801j18950j22452o6339K9481J10876J31760Q5240K1766J5058
$$ 98420 23021 -66780 -185730 -308182 -374521 -345040 -234164 -102404 -17164 4602 19660
43349A9660O9383Q9783L777j12850j12758K3253J47919J30888Q523q5009p9432
$$ 19660 89043 178826 182603 69753 -43005 -19752 128167 259055 267578 182569 103137
43338A03137j7190K2283K300n3370r1594p7554k0755M3369Q6816R6952P2278K9954
$$ 103137 85947 108230 110530 57160 -34434 -111988 -132743 -89374 -2558 94394 166672 196626
43326A96626q61j2373k3020l4325k1538Q333J497n5320q6965l3602M5121M9306
$$ 196626 195765 183392 160372 126047 104509 112842 114339 59019 -27946 -61548 -16427 32879
43314C2879j3745n1514l1791p208k227J9383N8951N4564j4044p1948m7512L1751
$$ 32879 19134 -32380 -64171 -71379 -73606 -54223 4728 59292 45248 -26700 -74212 -42461
43302d2461Q2825O5591O658m2139m8661l0195m0557r5732j27414o5653M3964Q0494
$$ -42461 40364 105955 112613 70474 21813 -8382 -48939 -144671 -272085 -337738 -293774 -213280
43290b13280J3432m9622j1378Q5203J21380N5428l4963m9121K4430R4713P1981
$$ -213280 -199848 -249470 -260848 -175645 -54265 1163 -33800 -82921 -58491 36222 108203
43279A08203j6976n5342K515N8469J5847o7064o4007K1616O4124Q526o3931p5102
$$ 108203 91227 35885 38400 96869 112716 45652 -18355 3261 67385 75911 11980 -63122
43267f3122m2878r244K2195M4459L5606J8811M2813P7677L4788p4280j15378k8300
$$ -63122 -106000 -115244 -93049 -48590 -12984 5827 48640 126317 161105 86825 -28553 -56853
43255e6853O5618L6122o8821j06864m3016L5937O5623O2627N4216L3281p318m5958
$$ -56853 8765 44887 -23934 -130798 -173814 -137877 -72254 -9627 44589 77870 70552 24594
43243B4594n2927k5167K198r410l9463j5696O9997J04662L720j28276j18292J5730
$$ 24594 -28333 -53500 -51302 -60712 -100175 -115871 -45874 58788 62508 -65768 -184060 -168330
43231a68330Q8030L4297j0752K7953L5692o1155j31923o0370M4818M0297K75O5147
$$ -168330 -80300 -46003 -56755 -28802 6890 -54265 -186188 -246558 -201740 -161443 -161168 -96021
43219i6021J58744J04710m8423q4992J6192M8792o0071j21047q974J17410P2362
$$ -96021 62723 167433 119010 34018 50210 99002 38931 -82116 -91090 26320 98682
43208I8682o0461p2540M0869Q9224j5868j40388j26778K676R1955M4914p5241
$$ 98682 38221 -34319 6550 95774 79906 -60482 -187260 -184584 -92629 -47715 -122956
43197a22956j31295o9179L3663P8863O4788N5001O6282N7014J3473k6779l9975
$$ -122956 -254251 -323430 -289767 -210904 -146116 -91115 -24833 32181 45654 18875 -21100
43186b1100l6463j5230K8241M8063j0621j04003j18593l3900M3628M7268L9550
$$ -21100 -57563 -72793 -44552 3511 -7110 -111113 -229706 -263606 -219978 -172710 -133160
43175a33160P0722O3826n0021j70934j45056L473R8087N9383q934o411K4991J0861
$$ -133160 -62438 1388 -48633 -219567 -364623 -361150 -263063 -203680 -212614 -219025 -194034 -183173
43163a83173j5690J9662R2282J10246O0229K3599M4524O9505M4056l601j9135
$$ -183173 -198863 -179201 -86919 23327 83556 107155 151679 221184 265240 261639 242504
43152B42504p167n864j4881r127k787l6415j03248j43880j20764n3481K1397P8025
$$ 242504 235337 229473 214592 205465 202678 166263 63015 -80865 -201629 -255110 -233713 -155688
43140a55688Q9475M6383m234o72L8598L0995l5550o4576M791R4062R7107L2553
$$ -155688 -66213 -19830 -24064 -24736 13862 44857 9307 -55269 -50478 43584 140691 173244
43128A73244j203K2269M4104L0534Q79m2661j16783j82936j63051n4183M6836
$$ 173244 172041 194310 238414 268948 269827 227166 110383 -72553 -235604 -289787 -242951
43117b42951O3250K2740m378N526L2077N3333N2296J8778k7210m4646k2732Q934
$$ -242951 -179701 -156961 -161339 -155813 -123736 -70403 -18107 671 -26539 -71185 -93917 -84983
43105h4983L2992O4681J01023R6318K3571p1170j13222q2790k7603k649j7706
$$ -84983 -51991 12690 113713 210031 233602 162432 49210 -33580 -61183 -63832 -81538
43094h1538m0413l9485k0942j2615j1275K4314J01836J50670R9914j6028q8080
$$ -81538 -121951 -161436 -182378 -194993 -206268 -181954 -80118 70552 170466 154438 66358
43083F6358o4698K751M4908M3214R309l7953n9591k4088L3620M4004J0174P696
$$ 66358 1660 4411 49319 92533 101842 63889 4298 -19790 13830 57834 68008 75704
43071G5704N2237N8989j5347q4296o5499j8290l9011q4530l8322P5431R8640j6407
$$ 75704 127941 186930 171583 87287 21788 3498 -35513 -120043 -158365 -82934 15706 -701
43059g01j13771n3698Q6794J28681L1495q4891j17441p6732j9604K2644L8911
$$ -701 -114472 -168170 -81376 47305 78800 -6091 -123532 -200264 -219868 -197224 -158313
43048a58313L2978L7819P7828J11283P4005j2867n4813k3778r41l8059o4864o567
$$ -158313 -125335 -87516 -9688 101595 175600 162733 107920 84142 83201 45142 -19722 -26289
43036b6289Q3333J04823O8736N6845N9803r117j35085j76536o7995O6988P8806
$$ -26289 57044 161867 230603 287448 347251 338134 203049 26513 -41482 25506 104312
43025A04312j7034q9037o5174J9346J00773J35526J03286L1190r152J3215L5370
$$ 104312 87278 -1759 -66933 -47587 53186 188712 291998 323188 314036 327251 362621
43014C62621r073p9890q2842j1383M2268J6517m9791q9963r2450q4863p4463l8860
$$ 362621 353548 273658 190816 179433 221701 238218 188427 98464 6014 -78849 -153312 -192172
43002a92172L1067R8683J06991M4101l4492p3211q1762q8574o3690K5253R9514
$$ -192172 -161105 -62422 44569 88670 54178 -19033 -100795 -189369 -253059 -227806 -128292
42991a28292L7902j19803j79399o2981P0936P4218K8040O8813J27229M4717j25946
$$ -128292 -90390 -210193 -389592 -452573 -381637 -307419 -279379 -210566 -83337 -38620 -164566
42980a64566j64540j7622J23824J13269K7307k751K5583M8160M8221K9612j8021
$$ -164566 -329106 -346728 -222904 -109635 -82328 -85079 -59496 -11336 36885 66497 48476
42969D8476o2299l5745M4418O8283J533m8681m639N4873K4736o4326j09505q7076
$$ 48476 -13823 -49568 -5150 63133 64666 15985 11346 66219 90955 26629 -82876 -169952
42957a69952m6995j7182Q99o957l2625j8718O1724J43204J49098Q8529J6286m5454
$$ -169952 -216947 -234129 -233230 -240187 -272812 -291530 -229806 -86602 62496 151025 167311 121857
42945A21857q4194o2394J6505O5202K0440n3042n1489J5321M8174N144o1291r5149
$$ 121857 37663 -24731 -8226 56976 77416 24374 -27115 -11794 36380 41524 -19767 -114916
42933a14916q7365m7845N298L8606L9610M2486P0344Q4791M7647o393k3429j6249
$$ -114916 -202281 -250126 -244828 -206222 -166612 -124126 -53782 31009 78656 72263 48834 32585
42921C2585k2438j8657L0565P0118J2834j02256j26237o141J25033J19650L264
$$ 32585 10147 -8510 22055 92173 105007 2751 -123486 -129627 -4594 115056 118320
42910A18320p7996n3128P151J2242k7671l5435J1247M2680n727r6822j31295o9826
$$ 118320 40324 -12804 -5653 6589 -21082 -56517 -45270 -2590 -8317 -105139 -236434 -306260
42898c06260K8228Q7401R1295O5766L3235O154o730p022J858K9216P0737P9197
$$ -306260 -278032 -190631 -99336 -33570 -335 5819 -911 -7933 -6075 23141 93878 173075
42886A73075J4632q1773j26907j06742p6159n1184N556Q0115R4803L5209j4421
$$ 173075 187707 105934 -20973 -127715 -203874 -255058 -249502 -169387 -74584 -39375 -53796
42875e3796p859k315l2045l2200L2009P1625J1471p3052o8063R736O7992Q6674
$$ -53796 -61655 -63970 -96015 -128215 -96206 -24581 -13110 -86162 -154225 -144489 -76497 10177
42863A0177R2069N6321m1425j10988n3191O9864J06809L4318l5390m5621m8388
$$ 10177 102246 158567 117142 6154 -47037 22827 129636 163954 128564 82943 34555
42852C4555o6121m5169K4233O3571K1610n7081j06045j01995m6925L4952P9511
$$ 34555 -31566 -76735 -52502 11069 32679 -24402 -130447 -232442 -279367 -244415 -164904
42841a64904M1979k9437n5457l9807l1994j1582P0299J58064J41034L3886l6191
$$ -164904 -122925 -152362 -207819 -247626 -279620 -291202 -220903 -62839 78195 112081 75890
42830G5890l2611m6598j04058r9987J0551J06995P9323j3616n7528m8683m5948
$$ 75890 43279 -3319 -107377 -207364 -196813 -89818 -10495 -24111 -81639 -130322 -176270
42819a76270m6449j5221K6626M0142M2302N7469M9285j2126o4351l0264M9305
$$ -176270 -222719 -237940 -211314 -171172 -128870 -71401 -22116 -34242 -98593 -128857 -79552
42808g9552N8139k4765q2991j2618J42444K38260J91573O3092k7333m7271o9034
$$ -79552 -21413 -46178 -129169 -141787 657 238917 430490 493582 466249 418978 349944
42797C49944j31955j59908q0258L6277N9470p494l9566J1410N9770M7145K6038
$$ 349944 217989 58081 -22177 14100 73570 66076 26510 37920 97690 144835 170873
42786A70873L5595K2355m3484q6305m7753M073j4288n9169l4347M5640P2620J012
$$ 170873 206468 228823 185339 99034 51281 55354 41066 -18103 -52450 -6810 65810 66822
42774F6822r8482j32063p1884L3649R7584O5112k3721p3919n4524k4367k2328
$$ 66822 -31660 -163723 -235607 -201958 -104374 -39262 -62983 -136902 -191426 -215793 -238121
42763b38121r722M0615Q0352O5495K5305n657m7089j00951j01821j8053P1788
$$ -238121 -247843 -207228 -126876 -61381 -36076 -41733 -88822 -189773 -291594 -309647 -237859
42752b37859Q8587O7273P0218O0646k2540j20548j16362j6533N1486K2571l2079
$$ -237859 -149272 -81999 -11781 48865 26325 -94223 -210585 -227118 -175632 -153061 -185140
42741a85140k6002L5313Q8135Q8122L9685j1917k1524m237k2347q0990r7169k8111
$$ -185140 -211142 -175829 -87694 428 40113 28196 6672 2435 -19912 -100902 -198071 -226182
42729b26182M1293K3211k8973r505O2297Q2378M5223M3284Q8280P8630k6391j28098
$$ -226182 -184889 -161678 -190651 -200156 -137859 -55481 -10258 33026 121306 199936 173545 45447
42717D5447j31619o3430L038M5164O0664K5279n2436r7483n4648L4551R1413R5002
$$ 45447 -86172 -149602 -146564 -101400 -40736 -15457 -67893 -165376 -220024 -185473 -94060 942
42705I42P0467K3696n3852j34229j59566j03976l467P8575J04259Q1678M1140
$$ 942 71409 95105 41253 -92976 -252542 -356518 -359985 -281410 -177151 -95473 -54333
42694e4333Q0l5591m2992M857Q1334J07145M6073l9225p0593n2973l6133k2021
$$ -54333 -54253 -89844 -132836 -127979 -46645 60500 106573 67348 -3245 -56218 -92351 -114372
42682a14372J6230N5121M5598K052j5624K97P671O587L8400Q9865R2997L6534
$$ -114372 -98142 -43021 2577 4629 -10995 -10698 -3027 3560 41960 131825 224822 261356
42670B61356j4525l3307o9473j36300j54032o5318O7245J42045J37665R2457K3543
$$ 261356 246831 213524 144051 7751 -146281 -211599 -144354 -2309 135356 227813 251356
42659B51356o2286j17605r0785k558O6662O1414o613q2177j03956m3938N6665
$$ 251356 189070 71465 -19320 -21878 44784 106198 99585 17408 -86548 -130486 -73821
42648g3821J10663P4289l551m2888j9760K8948N7320L9948k0520q3035q9333k7678
$$ -73821 36842 111131 107580 64692 44932 73880 131200 171148 150628 67593 -21740 -49418
42636d9418M2614N5892R758n0088q5596q0899l4325K6396M7146P780l8889k9486
$$ -49418 -6804 49088 58846 8758 -76838 -157737 -192062 -165666 -118520 -110740 -149629 -179115
42624a79115K5181O1977N7582M5072M1687K2393j5153j8373M1620R8695O3270
$$ -179115 -153934 -91957 -34375 10697 52384 74777 59624 41251 82871 181566 244836
42613B44836m3525r5320k4226P8553P8415k1438q6801l7451N1302O3182n545o1886
$$ 244836 201311 105991 81765 160318 238733 217295 130494 93043 144345 207527 201982 140096
42601A40096m7725N508L8905K8313j4219n7879o8529l8551j099J0167N065J2327
$$ 140096 92371 97879 136784 165097 150878 92999 24470 -14081 -15180 -5013 52 12379
42589A2379K6874J8666j7927o0569r1743r7956n8020J8235O1228J7329n7011n2696
$$ 12379 39253 57919 39992 -20577 -112320 -210276 -268296 -250061 -188833 -171504 -228515 -281211
42577b81211L4803Q6095K2158q6520j20068n9072K1556O6075Q1169Q2812O0370
$$ -281211 -246408 -160313 -138155 -224675 -344743 -403815 -382259 -316184 -235015 -152203 -91833
42566i1833O214n2135o9627k9158L6858P4986O3103K6105l984k3732m0961m8242
$$ -91833 -85619 -137754 -207381 -236539 -199681 -124695 -61592 -35487 -39471 -63203 -104164 -152406
42554a52406l9694k9588k3462N31M3096N2948J498m4801m137Q6199J03958J4773
$$ -152406 -192100 -221688 -245150 -244619 -201523 -148575 -147077 -191878 -196015 -109816 -5858 8915
42542H915p7447p5889p671L9363L0252p194l4911k9529Q271M5649N1404M2704
$$ 8915 -68532 -144421 -152092 -112729 -82477 -89671 -124582 -154111 -145840 -100191 -48787 -6083
42530f083N4885P2161N1740J0796Q505L9566L9294M688J419K6717q049j07936
$$ -6083 48802 120963 172703 183499 192004 231570 270864 275552 276971 303688 295639 187703
42518A87703j42122m4677N9236L9684l8466l8761J9215J7947l7252l5787K5282
$$ 187703 45581 904 60140 99824 61358 22597 41812 59759 22507 -13280 12002
42507A2002K8819m7250p4087J8089J20523J08530O429q6972j37160j52444j08720
$$ 12002 40821 -6429 -80516 -62427 58096 166626 173055 86083 -51077 -203521 -312241
42496c12241K865J05343J11252M4712P383L5978O6943M0988k3441p3735q7752
$$ -312241 -309376 -204033 -92781 -48069 -40686 -4708 62235 103223 79782 6047 -81705
42485h1705p3663m2891r761L931r292k4206q498L3238O1604N5820M2138M7435
$$ -81705 -155368 -198259 -208020 -204089 -213381 -237587 -246085 -212847 -151243 -95423 -53285 -5850
42473e850M6684N31o1864n9638J8228P2580K6981n1878m2708N2479J11214O9121
$$ -5850 40834 41365 -20499 -80137 -61909 10671 37652 -14226 -56934 -4455 106759 175880
42461A75880j057j8621j3298m9748r6161n7614P2403J72831J32744j6005j37539
$$ 175880 174823 156202 142904 93156 -3005 -60619 11784 184615 317359 301354 163815
42450A63815j44403p6312k3609p968K2212Q6842J21910O5146m7483j23967j31330
$$ 163815 19412 -56900 -80509 -88477 -66265 20577 142487 207633 160150 36183 -95147
42439i5147j07799p3983r166P2550J02349N3308n123P71N0296P2629M5847m205
$$ -95147 -202946 -276929 -286095 -213545 -111196 -57888 -63011 -62240 -11944 60685 106532 102327
42427A02327o1318j06914q7284K2204J38128J46459N9660K866K8077M4066k6356
$$ 102327 41009 -65905 -153189 -130985 7143 153602 213262 216128 244205 288271 261915
42416B61915j18239j26926n9960L306M3917R0427J12675M8450o7065j13417n0851
$$ 261915 143676 16750 -43210 -39904 4013 94440 207115 255565 188500 75083 24232
42405B4232K4483K7180p353j0083P509m913m3486p1708q8118j01277p7885O855
$$ 24232 48715 75895 68542 58459 65968 61055 17569 -54139 -142257 -243534 -321419 -314564
42393c14564R5321J03488L7693j7298j8407p01L027M069Q570m371l3729m2285
$$ -314564 -219243 -115755 -78062 -95360 -113767 -114468 -111441 -107372 -98802 -103173 -136902 -179187
42381a79187j4651J7113K5476K1965K3013K3158J8037J3626N40l6849p3905n8635
$$ -179187 -193838 -176725 -151249 -129284 -106271 -83113 -65076 -51450 -50910 -87759 -161664 -220299
42369b20299J1055P4132R1328Q7589Q1805L9174n3157j16844o5414O3738J33629
$$ -220299 -209244 -135112 -43784 43805 125610 164784 111627 -5217 -70631 -6893 126736
42358A26736P0424n4468j23343j08656p6439p6503p6259k1047O8976J07256N3756
$$ 126736 197160 142692 19349 -89307 -165746 -242249 -318508 -339555 -270579 -163323 -109567
42347a09567k3453l2999K2781O2882M5207J4190K5198O9234R1915N7825j7365
$$ -109567 -133020 -166019 -143238 -80356 -35149 -20959 4239 73473 165388 223213 205848
42336B05848p8108p1099p7O6494O9092K5279j0513l3898q1546j45824j66211j16907
$$ 205848 127740 56641 56564 123058 192150 217429 206916 173018 91472 -54352 -220563 -337470
42324c37470m4148K536K7168N6627R3771J16813R6174J5194r0868j35080p1497
$$ -337470 -381618 -379082 -351914 -295287 -201516 -84703 11471 26665 -64203 -199283 -270780
42313b70780L2188P9621P8561J02433J40165R9389l0791j36797j33035n6063K3177
$$ -270780 -238592 -158971 -80410 22023 162188 261577 230786 93989 -39046 -95109 -71932
42302g1932P4640O5430l6352j60616j61684j8875J04091Q1801n597k3402J4936
$$ -71932 2708 68138 31786 -128830 -290514 -309389 -205298 -123497 -129094 -152496 -137560
42291a37560J7566j2100j0845P364r729k9413J4852Q8966J04172O2981L2494O733
$$ -137560 -119994 -132094 -142939 -135575 -145304 -174717 -159865 -70899 33273 96254 128748 135481
42279A35481o6808j44681j18678M118Q7040N2910k8576o8523o5910n1982k2497
$$ 135481 68673 -76008 -194686 -190568 -103528 -50618 -79194 -147717 -213627 -265609 -288106
42268b88106K8630P4519Q9586P3202K9527k8627o1030l9658L648K3934L3855O3721
$$ -288106 -259476 -184957 -95371 -22169 7358 -21269 -82299 -121957 -118309 -94375 -60520 3201
42256C201Q4485N2136j612j5626q853m0209q1889n1107L8186P8798L6377p311
$$ 3201 87686 139822 138210 122584 113731 73522 -8367 -59474 -21288 57510 93887 86576
42244H6576J181J6132M15o476K4419N2051M4345L4177M6072M0777j4256p8306
$$ 86576 87757 103889 104304 97828 122247 174298 218643 252820 298892 339669 325413 247107
42232B47107r1280n3834j9405l4208r5080j39603r5299J9391Q1344J6757p7345
$$ 247107 155827 101993 82588 48380 -46700 -186303 -281602 -262211 -180867 -164110 -241455
42221b41455n9615N2665J26633J21780J07549R2745J0287j11445j38836m3270
$$ -241455 -301070 -248405 -121772 8 107557 200302 210589 99144 -39692 -82962
42211h2962M3198M3202L9912Q8590R2685j5281j18943q7757J4484M0271j2587
$$ -82962 -39764 3438 43350 131940 224625 209344 90401 2644 17128 57399 44812
42200D4812l4593k006J0305k2539m9082m6375l8202k2820J8645N5645M0050q409
$$ 44812 10219 8213 18518 -4021 -53103 -99478 -137680 -160500 -141855 -86210 -46160 -54569
42188e4569k8324j1087N685J5952L7786M9743J7397l0226l2310N53o897p7699
$$ -54569 -82893 -93980 -88295 -72343 -34557 15186 32583 2357 -29953 -29400 -36297 -113996
42176a13996j39269j14083r361R5396J22872O2116j9605m0308O611N0234M0786
$$ -113996 -253265 -367348 -376709 -281313 -158441 -96325 -115930 -156238 -149627 -99393 -58607
42165e8607N796j3560k5757n0000o8045o2123n0968l8687J7401J25215J95170
$$ -58607 -52811 -66371 -92128 -142128 -210173 -272296 -323264 -361951 -344550 -219335 -24165
42154b4165J38692J026q1780m8755K7402M5926j0272p5558q1726k8376K1726K3912
$$ -24165 114527 115553 33773 -14982 12420 58346 48074 -27484 -109210 -137586 -115860 -91948
42142i1948R393K2790K8826l6715j30236j27116j3768O9094L7274m561O0526J60654
$$ -91948 -82555 -59765 -30939 -67654 -197890 -325006 -338774 -269680 -232406 -236967 -176441 -15787
42130a5787J44178J7915p1437o0147k5817k3929o005N9060R2661Q359j48275k29769
$$ -15787 128391 146306 74869 14722 -11095 -35024 -41029 18031 110692 119051 -29224 -258993
42118b58993j50471J6894J23653J12461O8042Q1340J14187P2063k3270n0830J3193
$$ -258993 -409464 -392570 -268917 -156456 -88414 -7074 107113 179176 155906 105076 118269
42107A18269M7251k1590j03021r7308m5027k6001j5266M2480J00463P9474P039
$$ 118269 165520 143930 40909 -56399 -101426 -127427 -142693 -100213 250 79724 86763
42096H6763l4590m5322p2448r0331m1316M0779P1520N0626L9885L9975J1614j1828
$$ 86763 52173 6851 -65597 -155928 -197244 -156465 -84945 -34319 5566 45541 57155 45327
42084D5327L2092R5472O4336n3283j17915o0446K6299L3018l0049q3030q1919
$$ 45327 77419 172891 237227 183944 66029 5583 31882 64900 34851 -48179 -130098
42073a30098l5134K6006O3564N7972K5459j4621o5277j10187r5952j4382N1033
$$ -130098 -165232 -139226 -75662 -17690 7769 -6852 -72129 -182316 -278268 -292650 -241617
42062b41617L4699q316P178N8230O2674J5917k4389m4140n8379m0257K4016O0089
$$ -241617 -206918 -215234 -208056 -149826 -87152 -71235 -95624 -139764 -198143 -238400 -214384 -154295
42050a54295M002p6511q2305m0173j9461L1443J82904L18499K50728K5449j13235
$$ -154295 -150293 -226804 -309109 -349282 -368743 -337300 -154396 164103 414831 440280 327045
42039C27045p8018l4856r9055j57359q4451N1489J13757Q6996L9560Q078M96J7540
$$ 327045 249027 214171 115116 -42243 -126694 -75205 38552 125548 165108 173186 173682 191222
42027A91222J8193l7590q8312l8206O1525N8061n0030r0957l849N6176j3485q7897
$$ 191222 209415 171825 83513 45307 106832 164893 114863 23906 20057 76233 62748 -25149
42015b5149l4302O9144Q1586K0079j6822j9454j7989J7413Q5364Q0028m2571j38467
$$ -25149 -59451 9693 91279 111358 94536 75082 57093 74506 159870 239898 197327 58860
42003E8860p3681N8050Q3610J7836l877J9844k3439j24061j41379l9032M8185
$$ 58860 -14821 43229 126839 144675 140798 160642 137203 13142 -128237 -167269 -119084
41992a19084J8796o1219p2890N487R8704J21008M8985m8045o6910L397O1925M4119
$$ -119084 -100288 -161507 -234397 -228910 -130206 -9198 39787 -8258 -75168 -71771 -9846 34273
41980C4273J0571K1084J9531n0530j09671n9014L9780N2613j0879k8223K1963
$$ 34273 44844 65928 85459 34929 -74742 -133756 -93976 -41363 -52242 -80465 -58502
41969e8502M0970n785m5118m3185m5336n3550j3395M8464K3453r2077j48405n2997
$$ -58502 -17532 -23317 -68435 -111620 -156956 -210506 -223901 -175437 -151984 -244061 -392466 -445463
41957d45463Q7744J21672N2216m892J692K0289J165l9538n6312k6925L2553Q2722
$$ -445463 -357719 -236047 -183831 -188723 -187031 -166742 -165577 -205115 -261427 -288352 -255799 -173077
41945a73077R3203O5432J7408l9367q6675q9645m3145o903l7362r5875q9403l461
$$ -173077 -79874 -14442 2966 -36401 -123076 -212721 -255866 -262769 -300131 -396006 -485409 -488870
41933d88870P4595Q2213O5101R5121J54112J56290P2799j7879k3893M2296P7734
$$ -488870 -414275 -332062 -266961 -171840 -17728 138562 211361 193482 169589 211885 289619
41922B89619K2276o6153r8943p3867m5021j3777N6906J31168J15783Q421q0113
$$ 289619 311895 245742 146799 72932 27911 14134 71040 202208 317991 326412 246299
41911B46299r0725r0334j26642j29363m1171O2772Q9603O6549N4532K2717o0298
$$ 246299 155574 65240 -61402 -190765 -231936 -169164 -79561 -13012 41520 64237 3939
41900C939j03628k1511Q7914O7874m0575n9401K8345M9349o3479j49078p2760
$$ 3939 -99689 -121200 -33286 34588 -5987 -65388 -37043 12306 -51173 -200251 -273011
41889b73011O6672R7369J9956k9622J2549P9731Q6804J8252p6849j25145q5323
$$ -273011 -206339 -108970 -89014 -118636 -106087 -26356 60448 78700 1851 -123294 -208617
41878b08617J369M4408J2408k8697j0897M4248O3761K1852l5188m7624k970N4849
$$ -208617 -207248 -162840 -150432 -179129 -190026 -145778 -82017 -60165 -95353 -142977 -145947 -91098
41866i1098O9371L0332j8366l7002l3894l4238l8344m0216n0471o1542l0313N3443
$$ -91098 -21727 8605 -9761 -46763 -80657 -114895 -153239 -193455 -243926 -305468 -335781 -282338
41854b82338J19349R7020J3675m7349n3106k6769J3086M8277L5271l5165q4096
$$ -282338 -162989 -65969 -52294 -99643 -152749 -179518 -166432 -118155 -82884 -118049 -202145
41843b02145l3885P4494J33490J07906M0964l6544j06413j15401m2651J8152l1285
$$ -202145 -236030 -161536 -28046 79860 120824 84280 -22133 -137534 -180185 -162033 -193318
41832a93318j27533j24313j9200M9795L1915K1961O6392Q1694K3755k0056J0153
$$ -193318 -320851 -445164 -464364 -414569 -382654 -360693 -294301 -212607 -188852 -208908 -198755
41821a98755L6541r586n3059l76R6423J20614O6789K2873K4727L4024L0106K8715
$$ -198755 -162214 -171800 -224859 -225235 -128812 -8198 58591 81464 106191 140215 170321 199036
41809A99036K3951r151n9086q5823q0209o7558n7984l5648K357K8783J6886k2543
$$ 199036 222987 213836 154750 68927 -11282 -78840 -136824 -172472 -170115 -141332 -124446 -146989
41797a46989m1972o227N5170P2836L3124N836L6597O4274J4371p2535r8078n8757
$$ -146989 -188961 -195188 -140018 -67182 -34058 -28222 8375 72649 87020 14485 -83593 -142350
41785a42350l5553n0405m8234j6769l029k611M2387J14843J20036M5317m811K1353
$$ -142350 -177903 -228308 -276542 -293311 -296340 -298951 -256564 -141721 -21685 23632 18821 40174
41773D0174M3779o36n4403n5972m3019n6706n1214Q957N9531M2877J5802M7640
$$ 40174 83953 83317 28914 -27058 -70077 -126783 -177997 -169040 -109509 -66632 -50830 -3190
41761c190Q9622N6053k9098p7258p3428o1079l7413K0741O0817O623j01210j30098
$$ -3190 86432 142485 113387 36129 -37299 -98378 -135791 -115050 -54233 -47610 -148820 -278918
41749b78918l6311P2171Q2065J1432l7773j3936M2961P5665Q1244Q7714Q1089
$$ -278918 -315229 -243058 -160993 -149561 -187334 -201270 -158309 -82644 -1400 86314 167403
41738A67403J2015j00074j35475k4210J17230J10870l4201j27490o9520K1530
$$ 167403 179418 79344 -56131 -80341 36889 147759 113558 -13932 -83452 -61922
41728f1922J2404n1831n4451R52K6608Q473M768K5244K5092L333Q078M2855N0578
$$ -61922 -49518 -101349 -155800 -154848 -128240 -119767 -114999 -89755 -64663 -61330 -53252 -10397 40181
41715D0181N756l8475j8690N6909J15054R8492L3000l36K9474N6088J0928p0636
$$ 40181 45937 7462 -11228 45681 160735 259227 292227 291891 321365 377453 388381 317745
41703C17745j02616p7513n7475n8258m3756k6248n6097j04593p7765L1405J20409
$$ 317745 215129 137616 80141 21883 -21873 -48121 -104218 -208811 -286576 -255171 -134762
41692a34762J28415R2133L5947n5485j31171r6188J6987N9356o79k6154M1742
$$ -134762 -6347 85786 121733 66248 -64923 -161111 -144124 -84768 -85447 -111601 -69859
41681f9859P7445O067n2509k605N2772R503m3360l88N6001K1119j8452M7680J13340
$$ -69859 7586 13653 -38856 -41461 11311 20814 -22546 -22934 33067 54186 35734 83414 196754
41668A96754K3808j27528j26454J5113R4243M7762l300r043m0841r1628o4346
$$ 196754 220562 93034 -33420 -18307 75936 123698 120398 111355 70514 -21114 -85460
41657h5460K4932M9823k020j3146L8681M5982j4926m0293K47J8276n867R021N4198
$$ -85460 -60528 -10705 -12725 -25871 12810 58792 43866 3573 3820 22096 16229 25250 79448
41644G9448J7754q8834j05989L728P4738J6581l7277K6551J04849O6862k5100
$$ 79448 97202 8368 -97621 -93893 -19155 -2574 -39851 -13300 91549 158411 133311
41633A33311l6810K4649O1624M5504J889o6081j29221j06985L404P4774L1815
$$ 133311 96501 121150 182774 228278 230167 164086 34865 -72120 -68716 6058 37873
41622C7873k4102J3781P5474M2552m0257m1874L3427O4657K0536p642K3591M2005
$$ 37873 13771 27552 103026 145578 105321 63447 96874 161531 182067 174425 198016 240021
41610B40021j4646j06251j54676j33326p0243q105K4856L1492L5219M3121M0319
$$ 240021 225375 119124 -35552 -168878 -239121 -247226 -222370 -190878 -155659 -112538 -72219
41599g2219K8536L1624M9100M9939K7449Q278o249m3371q6252p4110l380N0279
$$ -72219 -43683 -12059 37041 86980 114429 122707 116458 73087 -13165 -87275 -90655 -40376
41587d0376M5647K6886J9780k4772j17292j55809o2710P2212R2846j4137j07949
$$ -40376 5271 32157 51937 27165 -90127 -245936 -308646 -236434 -143588 -157725 -265674
41576b65674p8086L9324J28699J18972L4529m2171n5034k8379j8581k1642J5857
$$ -265674 -343760 -304436 -175737 -56765 -22236 -64407 -119441 -147820 -166401 -188043 -172186
41565a72186Q9723J18366N9678k5274o5775o8323o2308l0969L9303R9002R4116
$$ -172186 -82463 35903 95581 70307 4532 -63791 -126099 -157068 -117765 -18763 75353
41554G5353M4391N793o560q986o597q080l5224o9346m4424M8333J09339O0216
$$ 75353 119744 125537 118977 109991 103394 95314 60090 -9256 -53680 -5347 103992 164208
41542A64208k7030k3224O6375J05786K4525q4309r5594j5402L9738j396q2764
$$ 164208 137178 113954 180329 286115 310640 226331 130737 115335 155073 153677 70913
41531G0913j05658n8668j9893l3933m6988k11O7902P9795M2065K6586M8539N5256
$$ 70913 -34745 -93413 -113306 -147239 -194227 -194438 -126536 -46741 -4676 21910 70449 125705
41519A25705L0777J3422L014m5300j12846j09532j4693P2172P2693L2249K3026
$$ 125705 156482 169904 172918 127618 14772 -94760 -109453 -37281 35412 67661 90687
41508I0687K7988o393o4450q1336l2243M7369R8599P1277l3579j34727j40943
$$ 90687 118675 112282 47832 -33504 -65747 -18378 80221 151498 117919 -16808 -157751
41497a57751o5230m082M345J6196O1424Q7983O1496K5163J6699J1570j1822l4458
$$ -157751 -222981 -227063 -222718 -206522 -145098 -57115 4381 29544 46243 57813 45991 11533
41485A1533n3987q8266j00819l2724O7768P6696r954n4898q01M5124J3891q513
$$ 11533 -42454 -130720 -231539 -264263 -196495 -119799 -129753 -184651 -185452 -140328 -126437 -134950
41473a34950L8397O4020L415m4885j652K9070n3698j41252q6630L7877O2149J700
$$ -134950 -96553 -32533 -29118 -74003 -75655 -46585 -100283 -241535 -328165 -290288 -228139 -226439
41461b26439J867O6388O5776j6141n8084j8847J3060m605j4320N968J0015j955
$$ -226439 -224572 -158184 -92408 -108549 -166633 -185480 -172420 -177025 -191345 -185377 -175362 -177317
41449a77317K1384O4329N6875Q283l801K5137K8227L402J0637L8966J7345m2815
$$ -177317 -155933 -91604 -34729 -26446 -30247 -5110 23117 26519 37156 76122 93467 50652
41437E0652n6455j7063r23j9673r943K9663L4801P509O093J1071l8674q5808j5830
$$ 50652 -5803 -22866 -23789 -43462 -53405 -23742 11059 18568 24661 35732 -2942 -88750 -104580
41424a04580J15865J23516q907q1759m3P5112O91j18920j16102j4907M8364L7394
$$ -104580 11285 134801 125894 44135 44092 119204 119895 975 -115127 -130034 -81670 -44276
41412d4276O187k3768m5716j4357O7914R3806n05j07667r1961Q629M8824q210
$$ -44276 -38089 -61857 -107573 -121930 -54016 39790 39285 -68382 -160343 -151714 -102890 -111100
41400a11100o5615m9364K1507R8496J41354J11879J4649p2605p8565k5167K1244
$$ -111100 -176715 -226079 -204572 -106076 35278 147157 161806 89201 10636 -14531 6713
41389F713M3117N2334L1264k4885n3583n452N7596M3620j7027j0498P4662J13141
$$ 6713 49830 102164 133428 108543 54960 49508 107104 150724 133697 123199 197861 311002
41377C11002K1527j21776j82465j31180m6796n81Q845J7906L8549M8666K6502
$$ 311002 332529 210753 28288 -102892 -149688 -150269 -141424 -123518 -84969 -36303 -9801
41366i801j9920o0885p3525n3191o781M6080P2770N5203J6224o529p608n318J279
$$ -9801 -29721 -90606 -164131 -217322 -224103 -178023 -105253 -50050 -33826 -40355 -47963 -53281 -52002
41353e2002K2266L2997R66l9705j2914P5150J10094J8879j13294j43756n4233
$$ -52002 -29736 3261 4227 -35478 -48392 26758 136852 155731 42437 -101319 -155552
41342a55552M1640N8125K8040J9076K7965P252l7493m2717J2767N8836K6474m6593
$$ -155552 -113912 -55787 -27747 -8671 19294 26546 -10947 -53664 -40897 17939 44413 -2180
41330b180o3153m506N2867O3956O9840R1263O4206m3205j30782r0354K0593M7682
$$ -2180 -65333 -69839 -16972 46984 116824 208087 272293 229088 98306 7952 28545 76227
41318G6227m0497j21108j06019m3629o186J6969O2671J09891J10879O0677m632
$$ 76227 35730 -85378 -191397 -235026 -241212 -224243 -161572 -51681 59198 119875 115243
41307A15243m7350m5981o176L6528N3966N7717O1306L9272k1291o3970l6228J0456
$$ 115243 67893 21912 15736 52264 106230 163947 225253 264525 243234 179264 143036 153492
41295A53492r892o8408n6324L0798O8792n951r8889r8833k1295M4977N6427K7464
$$ 153492 143600 75192 18868 49666 118458 112507 13618 -85215 -106510 -61533 -5106 22358
41283B2358j0553k0462J3873M6226J6273m7612n5019R90K3214l2051q0049m3783
$$ 22358 11805 -8657 5216 51442 67715 20103 -34916 -33926 -10712 -42763 -122812 -166595
41271a66595K8722N0274K1025q0Q628K4862K6385M85m4748n8765k117O6900M7186
$$ -166595 -137873 -87599 -66574 -66654 -58026 -33164 -6779 -6294 -51042 -109807 -111924 -45024 2162
41258B162m5732q4423k8040J0538l9382p3772J7934J56971J75422M8007r5657
$$ 2162 -43570 -127993 -156033 -145495 -184877 -258649 -240715 -83744 91678 139685 44028
41247D4028j48840j11651k9230N2312Q2357M3413j0777j4601K4054M6074K6673
$$ 44028 -104812 -216463 -245693 -193381 -111024 -67611 -78388 -92989 -68935 -22861 3812
41236C812q534l0093k5799J354K5677J9461J241J7723N9594N9269j02m8126l9348
$$ 3812 -4722 -34815 -60614 -59260 -33583 -14122 -12881 4842 64436 123705 123603 75477 36129
41223C6129k2326m3134n9245j9023M1463N7312L4986J9902J2857q506k7212j6815
$$ 36129 13803 -29331 -88576 -107599 -66136 -8824 26162 46064 58921 50415 23203 6388
41211F388n33j7563n7046p6251n8714j7869K4858M0693J5809r818J7227P2473
$$ 6388 5855 -11708 -68754 -145005 -203719 -221588 -196730 -156037 -140228 -150046 -132819 -60346
41199f0346P7069K5681j767K3243L8585K1609L4893R0365R8773K7044k5095M637
$$ -60346 16723 42404 40637 63880 102465 124074 158967 249332 348105 375149 350054 354691
41187C54691K4067n1839j44929j44190q2596n0793l5462J2680M0097k3844j10154
$$ 354691 378758 326919 181990 37800 -44796 -95589 -131051 -118371 -78274 -102118 -212272
41176b12272r3001J8487J07021J17151P3484r710j04065j17017j0666Q7684M2567
$$ -212272 -305273 -286786 -179765 -62614 10870 1160 -102905 -219922 -230588 -142904 -100337
41165a00337p9100j10034l6383K4221M8009J09956J82392J35474l6076j66904
$$ -100337 -179437 -289471 -325854 -301633 -253624 -143668 38724 174198 138122 -28782
41155b8782j45278l5677N6427J01333R2788J6218q4957j24931r3443o0438n1967
$$ -28782 -174060 -209737 -153310 -51977 40811 57029 -27928 -152859 -246302 -306740 -358707
41144c58707l0266Q45l549j6466L7485J27699J27659J2613q8721q2669k1876J7797
$$ -358707 -388973 -388128 -391677 -408143 -370658 -242959 -115300 -102687 -191408 -274077 -295953 -278156
41132b78156M2175O3025M1473k0809m1747J2556N2461j377q6258q5079M937O9509
$$ -278156 -235981 -172956 -131483 -152292 -194039 -181483 -129022 -130399 -216657 -301736 -296799 -227290
41120b27290K4635q3158j24988l1654J10361J41687L6112m5864K0705J31913J06187
$$ -227290 -202655 -285813 -410801 -442455 -332094 -190407 -154295 -200159 -179454 -47541 58646
41109E8646l7663j17659p4720l6771q1750j18340n9015M3099J01147J09633Q7669
$$ 58646 20983 -96676 -171396 -208167 -289917 -408257 -467272 -424173 -323026 -213393 -125724
41098a25724K8570k9427j862J01322J45727N7400o6693j07505p9970n9221m9502
$$ -125724 -97154 -126581 -128443 -27121 118606 176006 109313 1808 -78162 -137383 -186885
41087a86885k0769L477j0323l3253k5580r356j9749l3380j0344L3667N1505K7171
$$ -186885 -207654 -204177 -214500 -247753 -273333 -282689 -302438 -335818 -346162 -312495 -260990 -233819
41075b33819j9700n4414l8090L1010Q7482P9226O2351J12731J59973O1970j36668
$$ -233819 -253519 -307933 -346023 -315013 -227531 -148305 -85954 26777 186750 248720 112052
41064A12052k03193m8515J16924Q1626o7359j04572o421N9861K1118k5364j1581
$$ 112052 -91141 -139656 -22732 58894 -8465 -113037 -119458 -59597 -38479 -63843 -75424
41053g5424J856l5884o3288n928J03970J66043J27996K8003n3912o8542l5328
$$ -75424 -73568 -109452 -172740 -178668 -74698 91345 219341 247344 193432 124890 89562
41042H9562j0977j7618k2629K283L8758N9879P1101Q1893P2149K2750m7248j02245
$$ 89562 78585 60967 38338 40621 79379 139258 210359 292252 364401 387151 339903 237658
41030B37658j21431r0878r658O7924N1335p2496j85246j61218k5745P3179M9396
$$ 237658 116227 25349 15691 83615 134950 62454 -122792 -284010 -309755 -236576 -187180
41019a87180k5992l4832L0963P2420L0432l1897k7184K2229J8306n8072j12243
$$ -187180 -213172 -248004 -217041 -144621 -114189 -146086 -173270 -151041 -132735 -190807 -303050
41008c03050p5453M486N2696O6419O9725M8863K938j4429J9200L9003j4m0331
$$ -303050 -378503 -374017 -321321 -254902 -185177 -136314 -133376 -147805 -128605 -89602 -89616 -129947
40996a29947l0261j8478l8372j0812J02853J67305O4555q7312j06718m1772n5610
$$ -129947 -160208 -178686 -217058 -227870 -125017 42288 106843 19531 -87187 -128959 -184569
40985a84569j03384q259J79525K13957O1802l6911J9549M0670q4822j72468o9005
$$ -184569 -287953 -296212 -116687 97270 159072 122161 141710 182380 97558 -74910 -143915
40974a43915P4228O2572k9843k8996M1621N5004K2011K1683J5825n7980j17206
$$ -143915 -69687 -7115 -36958 -65954 -24333 30671 52682 74365 90190 32210 -84996
40963h4996o2294K2319k270q0812n0619Q0521J43273O5826m9886r5012n1414N4977
$$ -84996 -147290 -124971 -127241 -208053 -258672 -178151 -34878 30948 -18938 -113950 -165364 -110387
40951a10387J66254J85221P9423l7019l8108L6576N0846k6086j03400j17338q3819
$$ -110387 55867 241088 320511 283492 245384 281960 332806 306720 203320 85982 2163
40940B163l2489J3030J9847o612j787N8786R9224N5911k2028o1908p4155q7667
$$ 2163 -30326 -17296 2551 -4061 -5848 52938 152162 208073 186045 124137 49982 -37685
40928c7685p0978r640L1389J4774M73K0585N679o4367p7396J7685Q1942J727j12288
$$ -37685 -108663 -118303 -86914 -72140 -71667 -51082 -45403 -109770 -187166 -169481 -87539 -85812 -198100
40915a98100j12078n2857n1119m5371O9809J92275J54661L0834K8763J33457J35234
$$ -198100 -310178 -363035 -414154 -459525 -389716 -197441 -42780 -11946 16817 150274 285508
40904B85508q254j15099r4035n1139m7055k186R2002J00148k9678j59816j70919
$$ 285508 277254 162155 68120 16981 -30074 -32260 59742 159890 130212 -29604 -200523
40893b00523j08437m9023J4575P9279P8931J0038k5351K0359O1591K9351k3503
$$ -200523 -308960 -357983 -343408 -264129 -185198 -175160 -200511 -180152 -118561 -89210 -112713
40882a12713l6688m2537p3021p2919P495J12151J49273J07218M6134J8819L2492
$$ -112713 -149401 -191938 -264959 -337878 -330383 -218232 -68959 38259 84393 103212 135704
40871A35704M9414J7611n5890q2958j1601O6805K3710j12457j77757q9318O2277
$$ 135704 185118 202729 146839 63881 52280 119085 142795 30338 -147419 -236737 -174460
40860a74460J46412J25983M7024k1988k8863J9052N1266K2787k3217l3245k8663
$$ -174460 -28048 97935 144959 122971 94108 113160 164426 187213 163996 130751 102088
40849A02088m5648n8804m5079m3607o1436j9515R5130J40488K9384r2015n7449
$$ 102088 56440 -2364 -47443 -91050 -152486 -172001 -76871 63617 93001 986 -56463
40838e6463M2023J3646j00254r9114J9707O0883k2254n9508K3432Q5552L2942
$$ -56463 -14440 -794 -101048 -200162 -180455 -119572 -141826 -201334 -177902 -92350 -59408
40827e9408l0643l824N6107O4631L6311J0531o843J1586Q2593J11669o901j81483
$$ -59408 -90051 -93875 -37768 26863 63174 73705 66862 78448 161041 272710 265809 84326
40815H4326k05717o4477M8354L8938J5339M2325L5928k7073l1515N0375P8822
$$ 84326 -121391 -185868 -137514 -98576 -83237 -40912 -4984 -32057 -63572 -13197 65625
40804F5625m065o1574j2796J9408n5916j18677m8542O3504P4479Q848l1478l8371
$$ 65625 61560 -14 -12810 6598 -49318 -167995 -216537 -153033 -78554 -69706 -101184 -139555
40792a39555l8841J162P8038Q4134k5728j22366q5665J7216N9537M1785K6792
$$ -139555 -178396 -177234 -99196 -15062 -40790 -163156 -248821 -231605 -172068 -130283 -103491
40781a03491N411m3343o2816j3624L6408K5786L490J9556K2673k6912n6154n591
$$ -103491 -98080 -141423 -204239 -217863 -181455 -155669 -152179 -132623 -109950 -136862 -193016 -198607
40769a98607N0650K8814k0271q294L9636M4945Q679j4448l548M2077J20499J71425
$$ -198607 -147957 -119143 -139414 -147708 -108072 -63127 -54448 -68896 -72444 -30367 90132 261557
40757B61557J09193k8011q5879j8618L2192l5151j22882j04309j6117L5143L7199
$$ 261557 370750 342739 256860 238242 270434 235283 112401 8092 -8025 27118 64317
40746F4317K9331N492l4809m0315q36J7137o137p399J8959j907n0372k081J28511
$$ 64317 93648 99140 64331 24016 23180 40317 34180 26781 45740 43833 -6539 -8620 119891
40733A19891J46714o393j18255l7713P3589J3947j30208j50996n3684J0389K2035
$$ 119891 266605 260212 141957 104244 177833 191780 61572 -89424 -143108 -132719 -110684
40722a10684P0505J37005J19432K0931o2304r0104p6431j5929N8867M6700o5047
$$ -110684 -40179 96826 216258 237189 174885 84781 8350 -7579 51288 97988 32941
40711C2941j26875m4585O2921O6909L5729O6945P4029m8544j86836j65432l5190
$$ 32941 -93934 -138519 -75598 -8689 27040 93985 168014 119470 -67366 -232798 -267988
40700b67988K4112n440j0088K1195J7579O938N5629R7172L6436m6289j5673O4953
$$ -267988 -243876 -249316 -259404 -238209 -220630 -213692 -158063 -60891 -24455 -70744 -86417 -21464
40688b1464L2762q0690r6493R024Q6679P6218N4658L7702l5402j15957p1287P7371
$$ -21464 11298 -69392 -165885 -156861 -70182 6036 60694 98396 62994 -52963 -124250 -46879
40676d6879J46178N5878o8457r9099m9843J1263N2969N8999L0100J3421L3119
$$ -46879 99299 155177 86720 -12379 -62222 -50959 2010 61009 91109 104530 137649
40665A37649K2869o6278j45991j06586N557O4774N8793N6931N0583j1693q3578
$$ 137649 160518 94240 -51751 -158337 -152780 -88006 -29213 27718 78301 66608 -16970
40654a6970p8798k3497R3L655L4636M3750k0096o2201K1251J32341J02371k7270
$$ -16970 -95768 -119265 -119172 -115517 -80881 -37131 -57227 -119428 -98177 34164 136535 109265
40642A09265p1296l062L1455k1272o2599m6046l7648n8579m7164N826L8768M0672
$$ 109265 37969 34907 66362 45090 -17509 -63555 -101203 -159782 -206946 -201120 -162352 -121680
40630a21680N3207O3423K5746l1603m3043j1517K6819P5334J10773M9085j01396
$$ -121680 -68473 -5050 20696 -10907 -53950 -65467 -38648 36686 147459 196544 95148
40619I5148j80903j10300l0852n5346o3439N5697J55848P9267m1188j2728O5684
$$ 95148 -85755 -196055 -226907 -282253 -345692 -289995 -134147 -54880 -96068 -108796 -43112
40608d3112N063r0356p094J51607J22116m0384n5416P7596R6615l1458p0505K7696
$$ -43112 -38049 -128405 -135499 16108 138224 97840 42424 120020 216635 185177 114672 142368
40596A42368N5025l0237l4224O2908M7303r9359j26295K6575J04338P26n7544
$$ 142368 197393 167156 132932 195840 243143 143784 17489 44064 148402 149128 91584
40585I1584N1040J10573l1597j87545j64785o3351k8476K47Q6533J19231M0389
$$ 91584 142624 253197 221600 34055 -130730 -194081 -222557 -222310 -135777 -16546 23843
40574B3843k041P8781J33747N2216l2311N724O1993J6219n5520n8698n4400q9257
$$ 23843 21802 100583 234330 286546 254235 259959 321952 338171 282651 223953 169553 80296
40562H0296o7914M2903R8682K1863n4120l2656j6417p1529p2173M9085J33589
$$ 80296 12382 55285 153967 175830 121710 89054 72637 1108 -71065 -21980 111609
40551A11609O2719l2619j3712L1504j7093r0239q7888o2049o6060k1539R2490
$$ 111609 174328 141709 127997 159501 142408 52169 -35719 -97768 -163828 -185367 -92877
40540i2877J24516K854j01779m7362M8719L5332j7127J7219Q3950P3177J5153
$$ -92877 31639 34493 -67286 -114648 -65929 -30597 -47724 -30505 53445 126622 141775
40529A41775k0740n7750r3938l7034R9507J37758J9102p0504j0757N3699n680
$$ 141775 121035 63285 -30653 -67687 31820 169578 188680 118176 107419 161118 155438
40518A55438o8131r139O0196J5146m6403j1173K3640m0536q0514K4354J41623
$$ 155438 87307 78168 138364 153510 107107 95934 119574 79038 -1476 22878 164501
40507A64501J00017k6114p6430p0626r1317q2225R359O4075j1787r1633m4777
$$ 164501 264518 238404 161974 91348 31 -82194 -72835 -8760 -20547 -112180 -156957
40496a56957L3675K0386l309O2076J14068M9456j1114N7173J32027O2260n1778
$$ -156957 -123282 -102896 -106205 -44129 69939 119395 108281 165454 297481 359741 307963
40485C07963n0191O09k6665n4819K7525J07591L7665p9845o8268J8356K8110j2479
$$ 307963 257772 258381 231716 176897 204422 312013 349678 269833 201565 219921 248031 235552
40473B35552j4273m5614j68113k28701r5936P0041P0153Q415P6483J77436J02623
$$ 235552 221279 175665 7552 -221149 -317085 -247044 -176891 -168476 -91993 85443 188066
40462A88066o8285r5328J1216N0141J020K873M1984j2538j17944j06121J8634
$$ 188066 119781 24453 35669 85810 86830 89703 131687 119149 1205 -104916 -86282
40451h6282R8155Q8156O6644M2537j5316m0960J9466O3356K559n5411q749K3049
$$ -86282 11873 100029 166673 209210 193894 152934 172400 235756 238315 182904 174155 197204
40439A97204p6762j64789p3632P4133P7771Q953M2345J05027K6163j09450r6472
$$ 197204 120442 -44347 -117979 -43846 33925 42878 85223 190250 216413 106963 10491
40428A0491K2358M9623j2000j0385N2682O2137K8661J9783j6877j06709r6069
$$ 10491 32849 82472 70472 60087 112769 174906 203567 223350 206473 99764 3695
40417C695Q5071K14354J26333L7706J82663L62217K51082n5893k19999j96974
$$ 3695 88766 303120 429453 467159 649822 1012039 1263121 1207228 987229 790255
40407G90255j79140j74072p4232Q839q5079k03282j13221N5835L5237q4911l5449
$$ 790255 611115 437043 362811 371650 286571 83289 -29932 25903 61140 -23771 -59220
40396e9220J16848J11710M76J6355Q5447k1571j85484j16695Q4650R1416m0918
$$ -59220 57628 169338 169814 186169 271616 250045 64561 -52134 32516 123932 83014
40385H3014N345J77921J38415q5767j41727j1497j8305j75301j49439Q5830J73381
$$ 83014 88359 266280 404695 318928 177201 165704 147399 -27902 -177341 -91511 81870
40374H1870K0341o5092K6183L9501j01637j41561j574P7560J5591J4746J07149
$$ 81870 102211 37119 63302 102803 1166 -140395 -141969 -64409 -48818 -34072 73077
40363G3077P9816o4650p5193M7250L0073j24777j09926R6592J57603j4432j22800
$$ 73077 152893 88243 13050 60300 90373 -34404 -144330 -47738 109865 95433 -27367
40352b7367n6786m3108j27402p1287J18383J30997n0079o9195J44165K26625M6228
$$ -27367 -84153 -127261 -254663 -325950 -207567 -76570 -126649 -195844 -51679 174946 221174
40341B21174p4162K2784P1773n2805r2678O0230J38501K3572l9082N2019O6997
$$ 221174 147012 169796 241569 188764 96086 156316 294817 318389 279307 331326 398323
40330C98323m9097l2251J54002J91021J0131n2673J01054J33617p3513j75204
$$ 398323 349226 316975 470977 661998 672129 619456 720510 854127 780614 605410
40320F05410j1212J06947J6034J2261K65891M90819M63911L30756J74890j41896
$$ 605410 594198 701145 717179 729440 995331 1486150 1950061 2280817 2455707 2313811
40310B313811n06210n36492k52115j24664k62668k35604P3503J99275l7878j75192
$$ 2313811 1807601 1271109 1018994 894330 631662 396058 469561 668836 630958 455766
40300D55766K7937J42678j02719l02283j34602O9178k717q4656O7117J73700J9860
$$ 455766 483703 626381 523662 221379 86777 155955 153238 68582 135699 309399 329259
40289C29259r0365O0149J60248p117j27851J1311R5648o8742j40831O9099J78496
$$ 329259 238894 299043 459291 452174 324323 335634 431282 362540 221709 290808 469304
40278D69304l6856j81946J0266J71190K3393r7374N6311J46058m1782j29331R5020
$$ 469304 432448 250502 260768 431958 455351 357977 414288 560346 518564 389233 484253
40267D84253K14555K239r3315J78305L36523Q5525q4948J81185M48349L66761
$$ 484253 698808 701047 607732 786037 1122560 1208085 1123137 1304322 1752671 2119432
40257B119432L06313M72437L50968k52414o09557k89790J8249k56067n34313k23381
$$ 2119432 2425745 2898182 3249150 2996736 2387179 2097389 2115638 1859571 1325258 1101877
40247A101877J47204m8368l46986j28683J90038J6827k45773l0455K47403K0494
$$ 1101877 1249081 1200713 853727 725044 915082 931909 686136 655681 903084 923578
40237I23578k90732j18727J18203j13300l28500L6327M32870J90421j88645L445
$$ 923578 632846 514119 632322 519022 190522 226849 659719 850140 661495 664940
40227F64940L19172Q1461k46916P298L47711P4307k96441l4713L26449K8075l69731
$$ 664940 984112 1065573 818657 825955 1173666 1247973 951532 916819 1243268 1271343 901612
40216I01612n1950M23861J92238k30047k21L45995k09l97333K0836N22957J23129
$$ 901612 849662 1273523 1465761 1235714 1235493 1581488 1581279 1183946 1204782 1727739 1850868
40205A850868m27994m5079N30202J59613l80209J26386Q53084M51913k69826J15788
$$ 1850868 1422874 1377795 1907997 2067610 1687401 1813787 2666871 3118784 2848958 2964746
40195B964746Q04549L25143m37419J14289J042480O02948k37133L97445J484676
$$ 2964746 3769295 4094438 3657019 3771308 4813788 5416736 5179603 5577048 7061724
40186G061724J011333J12384J027511K548685K219869J387402K826411N121125
$$ 7061724 8073057 8185441 9212952 11761637 13981506 15368908 18195319 23316444
40178B3316444N289560N057120P733066J0997198J0972245J1331050J8326700
$$ 23316444 28606004 33663124 41396190 52393388 63365633 74696683 93023383
40171I3023383K8754759L5783193M5493995O9021925R3298124Q1349449J7930592
$$ 93023383 121778142 157561335 203055330 272077255 365375379 446724828 464655420
40164D64655420n9949660r8356104q4865586n2894246l3689639k6853832j9624224
$$ 464655420 404705760 306349656 221484070 168589824 134900185 108046353 88422129
40157H8422129j1711420r557991j1132813r928956o419797n150310n588079m259572
$$ 88422129 76710709 67152718 56019905 46090949 39671152 34520842 28932763 24673191
40149B4673191j999274j863335k919311k278959p05481p82234j805302j398784
$$ 24673191 22673917 20810582 17891271 15612312 14906831 14124597 12319295 10920511
40141A0920511j76217l02241j212555r05695J00726o7631r59989q22204n357p5364
$$ 10920511 10744294 10442053 9229498 8323803 8424529 8356898 7396909 6574705 6569348 6493984
40131F493984p04271m94220J95856O8257n13737l45836K22679J15590k91046m3330
$$ 6493984 5789713 5295493 5491349 5559606 5045869 4700033 4922712 5038302 4747256 4703926
40121D703926M21275K53728o631M52098J036252R78807Q70908J310923J646481
$$ 4703926 5125201 5378929 5372298 5824396 6860648 7839455 8710363 10021286 11667767
40112A1667767J631943K382885M148808N622664P095576J0798364J5384867J4115298
$$ 11667767 13299710 15682595 19831403 25454067 32549643 43348007 58732874 72848172
40104G2848172L239820j0615241j6903656j3564234p724879n058950m341746k902175
$$ 72848172 76087992 65472751 48569095 35004861 27279982 22221032 17879286 14977111
40096A4977111j495222j534410j916916j297786n28617o18947p08169L6407O35966
$$ 14977111 13481889 11947479 10030563 8732777 8204160 7585213 6877044 6913451 7549417
40087G549417J33624o45735o92878m91911p28046q82847m20070L4628j06780k89597
$$ 7549417 7683041 7037306 6344428 5852517 5124471 4241624 3821554 3856182 3749402 3459805
40077C459805L7097L76355K24590j1479J9646j05994n64479p09830k76923q17
$$ 3459805 3496902 3873257 4097847 4086368 4106014 4000020 3435541 2725711 2448788 2447971
40067B447971l03476n19442j64851J74479j2897k42944m2354J69689j7429k05663
$$ 2447971 2144495 1625053 1460202 1634681 1621784 1378840 1336486 1506175 1488746 1283083
40057A283083l8990Q1992j48229k82429m438K16690K3403j52423M0892J92557
$$ 1283083 1244093 1326085 1177856 895427 890989 1107679 1131082 978659 1019551 1212108
40047A212108l4530k32641n9742J02718o6287j97596n559J19322q8485j86402
$$ 1212108 1177578 944937 885195 987913 921626 724030 718471 837793 749308 562906
40037E62906J23196L56207J16651j72833p3932R0358n9270k07419J859K42810
$$ 562906 686102 1042309 1158960 986127 912195 1002553 943283 735864 737723 980533
40027I80533J37439l1860Q5399K23366P5264m8660J92471M90902M42828K34892
$$ 980533 1117972 1086112 1171511 1394877 1470141 1421481 1613952 2104854 2547682 2782574
40017B782574J65333M0503l27938n80242m02871j41351j96325l26927j77542K2924
$$ 2782574 2947907 2988410 2660472 2080230 1677359 1536008 1339683 1012756 835214 858138
40007H58138o7322k26755j15434O6341R29j12170K5163J91572P4789j02693j2937
$$ 858138 790816 564061 448627 514968 515897 403727 428890 620462 695251 592558 579621
39996E79621J31829n718k18207j36249P9043N4746j14596j14779k2679q0997j70301
$$ 579621 711450 705732 487525 351276 430319 485065 370469 255690 233011 152014 -18287
39985a8287p3799M0483m6157j13584R5071L18152K00731n1211l5301J38390J08058
$$ -18287 -92086 -51603 -97760 -211344 -116273 201879 402610 351399 316098 454488 562546
39974E62546n9210o1097K7217n2570j70352l8784J92853J71136k4192n3154N5692
$$ 562546 503336 442239 469456 416886 246534 207750 400603 571739 547547 494393 550085
39963E50085K2458j04298n4018J18923J38593K9534J9079N5567o5006k29339j74095
$$ 550085 572543 468245 414227 533150 671743 701277 720356 775923 710917 481578 307483
39952C07483O159J7501r5749o7183O6333N4790o5505n7320L7636r143j39160j06820
$$ 307483 313642 331143 235394 168211 234544 289334 223829 166509 204145 195002 55842 -50978
39940e0978L5580K7670j01291q7560Q0672J74680J54641J61730J62398K6783j21942
$$ -50978 -15398 12272 -89019 -176579 -95907 78773 233414 395144 557542 584325 462383
39929D62383o4708Q8586N5403j20993j55017k1349N2040K1503L6519P6432n597
$$ 462383 397675 486261 541664 420671 265654 244305 296345 317848 354367 430799 425202
39918D25202j33211j03268K6862L3891o2450o6670M787q198n0777L7269J51981
$$ 425202 291991 188723 215585 249476 187026 120356 125143 116945 66168 103437 255418
39907B55418P4815j02990j17505L218K7583l1200J2316R7340K0046j34698j17990
$$ 255418 330233 227243 109738 112956 140539 109339 121655 218995 239041 104343 -13647
39896a3647J3604J2303p0592P712J70025J27771o1221p3341P9924P7784r1236
$$ -13647 -43 12260 -58332 -50620 119405 247176 185955 112614 192538 270322 179086
39885A79086r8781R7867J60622j4305j24569k1527O9088K0932J1137R8768O9377
$$ 179086 80305 178172 338794 324489 199920 178393 247481 268413 279550 378318 447695
39874D47695j27905k26884j04499J6369p586j3495R6605J49201M8224l3530R767
$$ 447695 319790 92906 -11593 4776 -2810 -16305 80300 229501 277725 244195 253962
39863B53962L4858l3887n0304L1253K5743j23373j95028p4300M5417K0388q375
$$ 253962 288820 254933 204629 235882 261625 138252 -56776 -131076 -85659 -65271 -73646
39852g3646P6600J40363P1032q871n51j9596j36237j92497p6208O5640P5296K1807
$$ -73646 2954 143317 214349 205478 204927 185331 49094 -143403 -219611 -153971 -78675 -56868
39840e6868K0632L4302J2798K2173Q4014Q8002l826o5095k9717r71l5542l7585
$$ -56868 -36236 -1934 10864 33037 117051 205053 201227 136132 106415 105444 69902 32317
39828C2317L2908O9319L0909K0936O6939N7413k3242m4332J0538k642r4483q7656
$$ 32317 65225 134544 165453 186389 253328 310741 287499 243167 253705 251063 156580 68924
39816F8924M7182R8484k1745j16075m6015M7328K3320k9853j3207p940p8777j20740
$$ 68924 116106 214590 192845 76770 30755 78083 101403 71550 58343 50403 -28374 -149114
39804a49114o1021O490K2333O5515J36014Q9075q1125j57279m3226P3216N0370
$$ -149114 -210135 -203645 -181312 -115797 20217 109292 28167 -129112 -172338 -99122 -48752
39793d8752R414N7175P6103j6710p1793K1403J15883P1963J804L5058P2204n725
$$ -48752 -39338 17837 93940 77230 5437 26840 142723 214686 216490 251548 323752 318027
39781C18027r7981p7257j9844k9722l2263M6316R2895J3328o9221l0730L2009
$$ 318027 220046 142789 122945 93223 60960 107276 200171 213499 144278 113548 145557
39770A45557J615l9045Q98J4349q6978j51838l4312J25136J19826J0569j9054
$$ 145557 147172 108127 109025 123374 36396 -115442 -149754 -24618 95208 105777 86723
39759H6723J3559k4416j03865j01977l9945j5365j909O2558J00961K9796m7788
$$ 86723 100282 75866 -27999 -129976 -169921 -185286 -187195 -124637 -23676 6120 -41668
39748d1668j070R0459P6931j510j8576q693p3152j44846r0940L4541P6410M0196
$$ -41668 -42738 47721 124652 123142 104566 95873 22721 -122125 -213065 -178524 -102114 -61918
39736f1918M1269O9192L3641k3964R92N3417j574j19195j28805k3320L0663l0020
$$ -61918 -20649 48543 82184 58220 59212 112629 111055 -8140 -136945 -160265 -129602 -159622
39724a59622q5339m5305L5679P9473P3212K6540l7223n3675Q149O8506M1584k3839
$$ -159622 -244961 -290266 -254587 -175114 -101902 -75362 -112585 -166260 -158111 -89605 -48021 -71860
39712g1860k3426K9447L5380k0732n4618k0090M0852P3038N8843J4241j8740j3431
$$ -71860 -95286 -65839 -30459 -51191 -105809 -125899 -85047 -12009 46834 61075 42335 28904
39700B8904j1990o5763j17529n9296P8767J45513J02729P0193R7388Q8625J6275
$$ 28904 16914 -48849 -166378 -225674 -146907 -1394 101335 171528 268916 357541 373816
39689C73816j0507K6640n761j21768j37951j544P2597l4398j21919k6295P4910
$$ 373816 363309 389949 384188 262420 124469 122925 195522 161124 39205 12910 87820
39678H7820j6236j45399o9666J13878J43184L4504L730O2244L6791p9600j21276
$$ 87820 71584 -73815 -143481 -29603 113581 148085 151815 214059 250850 171250 49974
39667D9974n4436N22J4819N3754P5372j3844j38997j39475l4753K3938J5965L1080
$$ 49974 -4462 -3940 10879 64633 140005 126161 -12836 -152311 -187064 -163126 -147161 -116081
39655a16081M7485k1591j08824o8822O2818J18283O4703M464l2079p4233o7373
$$ -116081 -68596 -90187 -199011 -267833 -205015 -86732 -22029 -17565 -49644 -123877 -191250
39644a91250K9410R2307J8276n2101L6335J36918L4601j34436p9129J22218J24271
$$ -191250 -161840 -69533 -51257 -103358 -67023 69895 104496 -29940 -109069 13149 137420
39633A37420q9306j66185J6423J61859P0987o7317n8951k718k0880k5920M3186
$$ 137420 48114 -118071 -101648 60211 131198 63881 4930 2212 -18668 -44588 -1402
39622a402M9934o7656j23601N351J40821R3768k7240k8556L9586Q851r8393j23893
$$ -1402 48532 -19124 -142725 -137374 3447 97215 69975 41419 81005 89856 -8537 -132430
39610a32430m1694L6612O1836P8792J01132R4217N5212J3503j8420l5896l0552
$$ -132430 -174124 -137512 -75676 3116 104248 198465 253677 267180 248760 212864 182312
39599A82312k0601k8586j9480M7703J08536N6649p5776j41283r5274m1171m0036
$$ 182312 161711 133125 113645 161348 269884 326533 250757 109474 14200 -26971 -67007
39588f7007l7865j0592j1653l7319j5065L5726J0467p2667o5538N4744J27247
$$ -67007 -104872 -115464 -127117 -164436 -179501 -143775 -133308 -205975 -271513 -216769 -89522
39577h9522P6771L3046Q4977J22519M6217n4652p0546m9047o2697n6376K2894
$$ -89522 -12751 20295 105272 227791 274008 219356 148810 99763 37066 -19310 3584
39566C584Q1921K3096q1077j00000l6462K2432N3379P3228N3852j9794p9443o5888
$$ 3584 85505 108601 27524 -72476 -108938 -86506 -33127 40101 93953 74159 -5284 -71172
39554g1172k3784j8099l1555k5069j8615l1650k2028L8752J00783J08698O9171
$$ -71172 -94956 -113055 -144610 -169679 -188294 -219944 -241972 -203220 -102437 6261 75432
39543G5432N279o9990j05454m5139N8150Q2348J9694j3498K2232L9854J6484M6560
$$ 75432 80711 10721 -94733 -139872 -81722 626 20320 6822 29054 68908 85392 131952
39531A31952J36473J44626K7299n3063N714O3123j9647j31270j01509L818k844
$$ 131952 268425 413051 440350 387287 393001 456124 436477 305207 203698 207516 204672
39520B04672j18363j66994p7893M9013J25582J52253J27078L4168p1776r7918
$$ 204672 86309 -80685 -158578 -109565 16017 168270 295348 329516 257740 159822
39510A59822m3348J812p856k3664N361O1276Q8606N5253j8333p2653o9363m0728
$$ 159822 116474 118286 110430 86766 92127 153403 242009 297262 278929 206276 136913 96185
39498I6185m2804p0037p6532o4592o5047m4833N2735J77385K08095J29231L8908
$$ 96185 53381 -16656 -93188 -157780 -222827 -267660 -214925 -37540 170555 299786 338694
39487C38694k4254j07685j82673j37835J6853J21086J05116P8489J03611P7349
$$ 338694 314440 206755 24082 -113753 -96900 24186 129302 207791 311402 388751
39477C88751n4684j57383j16881k6043j6381n4976n1173k1327k467N5651J60776
$$ 388751 334067 176684 59803 33760 17379 -37597 -88770 -110097 -112564 -56913 103863
39466A03863J81757M6267r6106q1550J7009K6654m6333o5469q707K5465K118k5947
$$ 103863 285620 331887 235781 154231 171240 197894 151561 86092 77385 102850 104968 79021
39454G9021l5629l8879k0996J2863Q21o1947p0419J9677Q9958N3995J3684O8175
$$ 79021 43392 4513 -16483 -3620 -2799 -64746 -135165 -115488 -25530 28465 42149 110324
39442A10324J15466L2853q4618q2815k2306n4085j24806o9447P0836R8390k810
$$ 110324 225790 258643 174025 91210 68904 14819 -109987 -179434 -108598 -10208 -13018
39431a3018m8516K1497N8473j6986q4416l8095N7913R8445P0228O187o3111q4578
$$ -13018 -61534 -40037 18436 1450 -82966 -121061 -63148 35297 105525 111712 48601 -35977
39419c5977l0205K6862O780k9028K9860J34812J38570M3727n734J8819o734j11718
$$ -35977 -66182 -39320 -32540 -61568 -31708 103104 241674 285401 279667 298486 291752 180034
39407A80034j59312q4314m043q446j9897L8005R3127O1746q09p016J0828k5965
$$ 180034 20722 -63592 -67635 -76081 -95978 -57973 35154 96900 96091 89075 99903 73938
39395G3938r5418j10987n3449K1165O7907Q0961O7900M5303L2883K4951Q54k6289
$$ 73938 -21480 -132467 -185916 -164751 -96844 -15883 52017 97320 130203 155154 156008 129719
39383A29719j9199J8571M3268M2216M2506M2823N985o4986j08794q6858l2477
$$ 129719 110520 129091 172359 214575 257081 299904 305889 240903 132109 45251 12774
39372A2774l243k3908p8057j17625r0765k314P1748P4119M1260L8467N8846N1193
$$ 12774 9531 -14377 -92434 -210059 -300824 -303138 -231390 -157271 -116011 -77544 -18698 32495
39360C2495J1374k4558m4097m6411q435O2203Q7595J9114o7603o8589J144N2605
$$ 32495 43869 19311 -24786 -71197 -79632 -17429 70166 89280 21677 -46912 -45768 6837
39348F837O9029R7022J27448J02380K4583m3275p4337q3657o6473k0864K394l4229
$$ 6837 75866 172888 300336 402716 427299 384024 309687 226030 159557 138693 141087 106858
39336A06858p7285o2043k1263j8512l2196j1604J8000K0093L8212R4011Q6494
$$ 106858 29573 -32470 -53733 -72245 -104441 -116045 -98045 -77952 -39740 54271 140765
39325A40765m8130j67980j08344M4757Q1351Q645J9609J44498J95548Q4831m8989
$$ 140765 92635 -75345 -183689 -138932 -57581 -48936 -29327 115171 310719 395550 346561
39314C46561q5911p2536o0561j1103O2162N4743l8373q1518l0476j4584r3234
$$ 346561 260650 188114 127553 116450 178612 233355 194982 113464 82988 68404 -24830
39303b4830j28646k5529Q6979O4102k0175j4212N8992O5263p456m6037j171N8128
$$ -24830 -153476 -179005 -92026 -27924 -48099 -62311 -3319 61944 54488 8451 7280 65408
39291F5408O2941J7147l8096o4730m6414o395J7269K6534M4615M4797j9337j05039
$$ 65408 128349 145496 107400 42670 -3744 -10139 7130 33664 78279 123076 103739 -1300
39279a300j05360j0879N9211K9127l2806l6624K385K0656J0288L876J2613K4064
$$ -1300 -106660 -117539 -58328 -29201 -62007 -98631 -96246 -75590 -65302 -61426 -48813 -24749
39267b4749J9240k0817p6386p4307J3763Q9242M6300n7264p7927j1189J4320m0056
$$ -24749 -5509 -26326 -102712 -177019 -163256 -74014 -27714 -84978 -162905 -174094 -159774 -199830
39255a99830p4398l9269j996N927L6954Q3758O0463k3158m3142K5554N5517o726
$$ -199830 -274228 -313497 -315493 -309566 -272612 -188854 -128391 -151549 -194691 -169137 -113620 -120346
39243a20346m6325L369L7886j6847n9794l00P4822O1599K1998N6049J13560Q7129
$$ -120346 -166671 -163302 -125416 -142263 -202057 -202357 -127535 -65936 -43938 12111 125671 212800
39231B12800l422o2456p5681q9648j03594r1018o4500l1708L8320J29721J51197
$$ 212800 209378 146922 71241 -18407 -122001 -213019 -277519 -309227 -270907 -141186 10011
39220A0011O9856k1446m4240l8162n1186m2251J9329O8072M7792M804j682J7315
$$ 10011 79867 58421 14181 -23981 -75167 -117418 -98089 -30017 17775 22579 20897 38212
39208C8212M7347J03945J45080Q5795m4025j07362p8596p7973j30081j02648K3695
$$ 38212 85559 189504 334584 420379 376354 268992 190396 112423 -17658 -120306 -96611
39197i6611O2710o4644j61604p3166N3104K7385p0376o7301Q58R846K712P0304
$$ -96611 -33901 -98545 -260149 -333315 -280211 -252826 -323202 -390503 -389645 -379799 -377087 -306783
39185c06783J21591L4483r0005q2168P039K8435K1574J00822J71990O9542j10636
$$ -306783 -185192 -150709 -240714 -322882 -315843 -287408 -265834 -165012 6978 76520 -34116
39174c4116j32191j0582L4068k7723j8059Q3761R7832p788m7751M3594J03358
$$ -34116 -166307 -176889 -142821 -170544 -188603 -104842 -7010 -14798 -62549 -18955 84403
39163H4403L9486l7623n5473q1975j12038k7006J36739J53042l5606j82696j05957
$$ 84403 123889 86266 30793 -51182 -163220 -190226 -53487 99555 63949 -118747 -224704
39152b24704M8687P5293J8329K4979P3486N5552o308j8656M813m910k4249P870
$$ -224704 -176017 -100724 -82395 -57416 16070 71622 65314 46658 51471 46561 22312 30182
39140C0182N7213N1955J1378l546q521m9812r1000n6578M4068J26676J41201J03292
$$ 30182 87395 139350 150728 147182 138661 88849 -2151 -58729 -14661 112015 253216 356508
39128C56508M6077l806k8936l7260m7310m6850j6326P971k8493r3257r3625k4230
$$ 356508 402585 398779 369843 332583 285273 238423 222097 230068 201575 108318 14693 -9537
39116i537J6084j8077n3454l1334L449K397J153L9352P6000N4008j3136p2472
$$ -9537 6547 -11530 -64984 -96318 -92869 -90472 -89319 -49967 26033 80041 66905 -5567
39104e567r4380p0440j0213L5499J7227k9856k2656L9157P1878N0224M3178Q1119
$$ -5567 -99947 -170387 -180600 -145101 -127874 -157730 -180386 -141229 -69351 -19127 24051 105170
39092A05170R9721N7601L894j7530l1774n6982o3378m9310n7222p5794l7054M7395
$$ 105170 204891 262492 266386 248856 217082 160100 96722 47412 -9810 -85604 -122658 -75263
39080g5263O9466j842n7421k8167J459m8459j02399n2208O1055J07549M9271m1725
$$ -75263 -5797 -7639 -65060 -93227 -91768 -140227 -242626 -294834 -233779 -126230 -76959 -118684
39068a18684r4611q3040q536P9510R5765K1749n3004n3340j9926k2292l9664j1242
$$ -118684 -213295 -296335 -304871 -225361 -129596 -107847 -160851 -214191 -234117 -256409 -296073 -307315
39056c07315N0985Q6252Q1485O5654M1452n408n4887p2307n7786l0135Q886N2363
$$ -307315 -256330 -170078 -88593 -22939 18513 13105 -41782 -114089 -171875 -202010 -193124 -140761
39044a40761O5647L0616j6481k9150q253R565l291m2282o4751j8746P7401J14077
$$ -140761 -75114 -44498 -60979 -90129 -98382 -88817 -92108 -134390 -199141 -217887 -140486 -26409
39032b6409K4436r3676r7552j5407p76p6539r8405r478N7162J4712j9885O4799
$$ -26409 -1973 -95649 -193201 -208608 -209384 -285923 -384328 -393806 -336644 -321932 -341817 -277018
39020b77018J63846J22407j147k6271O0120R3171m785j15503j09152j2491N4919
$$ -277018 -113172 9235 8088 -18183 41937 135108 130323 14820 -94332 -106823 -51904
39009e1904L5478j9851k5453M0400J05956Q8037J073o0603n3209k7871k7295k2710
$$ -51904 -16426 -36277 -61730 -21330 84626 172663 173736 113133 59924 32053 4758 -17952
38997a7952R307L4676L6335N2828Q4331N4347n9689j48976j17710k3521K5865
$$ -17952 -8645 26031 62366 115194 199525 253872 194183 45207 -72503 -96024 -70159
38986g0159L9258Q8257J47730J24815K4277m0179p604N3903N0942k5085j10104
$$ -70159 -30901 57356 205086 329901 354178 313999 306395 360298 411240 386155 276051
38975B76051j42921j14698o5883l5783j6717J6232M2581K3036j6258r252L2940
$$ 276051 133130 18432 -47451 -83234 -99951 -83719 -41138 -18102 -34360 -43612 -10672
38964a0672L2200r471K871P7292Q1616m5766j64623j30933j5182J6592m4563o8657
$$ -10672 21528 12057 14928 92220 173836 128070 -36553 -167486 -182668 -166076 -210639 -279296
38952b79296o097N9840O1124K0579j4933j8046L1630J17463J59614R6758k5794
$$ -279296 -285393 -225553 -164429 -143850 -158783 -176829 -145199 -27736 131878 228636 202842
38941B02842j14336j36730j10358l6993O5182J17028O3007l6550q4041p2908n1807
$$ 202842 88506 -48224 -158582 -195575 -130393 -13365 49642 13092 -70949 -143857 -195664
38930a95664j4772O8289J53683J67176J19337P8383N3754K929p0992j22465j40573
$$ -195664 -210436 -142147 11536 178712 298049 376432 430186 433115 362123 239658 99085
38919I9085j37143r1065N444Q1757O7089O20l1098k6739l7450m5313M334P6382
$$ 99085 -38058 -129123 -123679 -41922 25167 25787 -5311 -32050 -69500 -114813 -110479 -34097
38907c4097P6633J07o3300o4716l3960P688O5712J08458Q7254K0331l0939n6773
$$ -34097 42536 42643 -20657 -85373 -119333 -111645 -45933 62525 149779 170110 139171 82398
38895H2398q2474q4363k5315M9219O2653L8837O7257J45628J74045J09384J8022
$$ 82398 -76 -84439 -109754 -60535 2118 40955 108212 253840 427885 537269 555291
38884E55291l1545l2897r48L9524L4809l4052q7930m9814K0842Q601p4537j17751
$$ 555291 523746 490849 489901 529425 564234 530182 442252 392438 413280 421881 347344 229593
38872B29593r7405q6018q8203l0435P3777J09643M3490k8669m9201o8110j02394
$$ 229593 132188 46170 -42033 -72468 1309 110952 154442 125773 76572 8462 -93932
38861i3932p6266L5784J39178J58982J31670R9605L5315o4447j25995j10945p7663
$$ -93932 -170198 -134414 4764 163746 295416 395021 430336 365889 239894 128949 51286
38850E1286p0045n2080j0521l630l8713k3920P3433J39854Q6083o346k1227R268
$$ 51286 -18759 -70839 -81360 -84990 -123703 -147623 -74190 65664 151747 145401 124174 133442
38838A33442j4892p8230q5582l0744M706m686p613R696p59m9151p5698m0444K1039
$$ 133442 118550 40320 -45262 -76006 -71300 -75986 -83599 -73903 -74662 -123813 -199511 -239955 -218916
38825b18916N3640M7142K6864J4252J4812K8755N8534R7811J10893N0641o9238
$$ -218916 -165276 -118134 -91270 -77018 -62206 -33451 25083 122894 233787 284428 215190
38814B15190j46670r8249J7725O2803O170m0199J732O4383N6973J0800J5478O6821
$$ 215190 68520 -29729 -12004 50799 56969 16770 18502 82885 139858 150658 166136 232957
38802B32957P3826k785r8076j27842p0147L5391J20785J22313K8174r1650j36130
$$ 232957 306783 303998 205922 78080 7933 43324 164109 286422 314596 222946 86816
38791H6816p5282J3893L2621k5824p2361l9387L0403M7256K176k9177o458K7018
$$ 86816 11534 25427 58048 32224 -40137 -79524 -49121 -1865 311 -28866 -35324 -8306
38779h306L4929M5630P8339R0227N2271M565k1225n3460r1875o7366K4076N9027
$$ -8306 26623 72253 150592 240819 293090 297655 276430 222970 131095 63729 87805 146832
38767A46832k5303r5112k2060Q9613O7319l3838k9879O0270M7971p3899r8086
$$ 146832 121529 26417 4357 93970 161289 127451 97572 157842 205813 131914 33828
38756C3828L2757J08239l356j44418j40422n8936l5001l4801K1136O1666p061
$$ 33828 66585 174824 171468 27050 -113372 -172308 -207309 -242110 -220974 -159308 -166369
38745a66369r8155o5242O0593J35666J30081J13056P7442l4745j65496j79192
$$ -166369 -264524 -329766 -269173 -133507 -3426 109630 187072 152327 -13169 -192361
38735a92361o6971L7698N5015L7427M0051L8286P010j8544l561L0575M2744K0399
$$ -192361 -259332 -221634 -166619 -129192 -89141 -50855 -43845 -62389 -65950 -35375 7369 27768
38723B7768k3406o5976q1382n5871K272P4478J34204J40948P7589l103k9614j7755
$$ 27768 4362 -61614 -142996 -198867 -196595 -122117 12087 153035 230624 227521 197907 180152
38711A80152n1723j44095k02218j62734o8394K2304J00376J40961R1739q534k0753
$$ 180152 128429 -15666 -217884 -380618 -449012 -426708 -326332 -185371 -93632 -102166 -122919
38700a22919R7266J96823J44755J8243k6162J6202L5231J890j9420j0567j3514
$$ -122919 -25653 171170 315925 334168 308006 324208 359439 361329 341909 331342 317828
38689C17828k8469k0593j0404m3863q6149n5907L7711R3819O3079N780o243K3001
$$ 317828 289359 268766 258362 214499 128350 72443 110154 203973 267052 272832 266589 289590
38677B89590L9667Q054n4155q6437m6812K6344N4822L2048K6413N5203M7161k9322
$$ 289590 329257 337311 283156 196719 149907 176251 231073 263121 289534 344737 391898 362576
38665C62576j01859j16729j21902j53805j48295n7931M2142O9831O4223Q9051
$$ 362576 260717 143988 22086 -131719 -280014 -337945 -295803 -225972 -161749 -72698
38655g2698J03538N2864k343J6275N5892K4200l9610l4775J9457K5591j7235l3709
$$ -72698 30840 83704 81361 97636 153528 177728 138118 103343 122800 148391 131156 97447
38643I7447k6328n3364q6307m6732L7052O3117K6928R827J8762m228l0636K4266
$$ 97447 71119 17755 -68552 -115284 -78232 -15115 11813 21640 40402 36174 5538 29804
38631B9804J19702J13114j3805j19680j25176j06287j21573j08063j9565P1012
$$ 29804 149506 262620 248815 129135 3959 -102328 -223901 -331964 -351529 -280517
38621b80517Q9986P1925P2973P1361L0752j4714j0491L6920P8022P4570J1934
$$ -280517 -190531 -118606 -45633 25728 56480 41766 31275 68195 146217 220787 232721
38610B32721q6490j41978q5002M3106J17917Q0584j572l7302j4344J5243K681
$$ 232721 146231 4253 -80749 -37643 80274 160858 159286 121984 107640 122883 125564
38599A25564n3876r8585o4917L2214R1234N8758J0744K9716P0401M3870k9362
$$ 125564 71688 -26897 -91814 -59600 31634 90392 101136 130852 201253 245123 215761
38588B15761o4756n5828m8475k9029K7999N6720l569o1057N902J19577R2968o6598
$$ 215761 151005 95177 46702 17673 45672 102392 98823 37766 43668 163245 256213 189615
38576A89615j53923q2215O279q756o2163o0241k4677P87L4388P1086N3003r308
$$ 189615 35692 -46523 -40244 -49000 -111163 -171404 -196081 -195294 -160906 -89820 -36817 -46125
38564d6125k4085J7161J1258o3366q9316j9878K5149k9221p2212K54J01498J02698
$$ -46125 -70210 -53049 -41791 -105157 -194473 -214351 -189202 -218423 -290635 -290381 -188883 -86185
38552h6185M1750L5925Q1599Q5768L0024k3766m1478l0852k62J6531l9118j49091
$$ -86185 -44435 -8510 73089 158857 188881 165115 123637 92785 92523 109054 69936 -79155
38540g9155j93960j09404J3330O4201O3330Q1791J02539O8458j730n1000p6096
$$ -79155 -273115 -382519 -369189 -304988 -241658 -159867 -57328 11130 9400 -41600 -117696
38529a17696q5531l3699R5276J96663J55346J1223r0832q9365m7078k4663j2613
$$ -117696 -203227 -236926 -141650 55013 210359 221582 130750 41385 -5693 -30356 -42969
38518d2969Q347J8445o973n4031p7696m8121N326J5428k6116l1229N6889J43213
$$ -42969 -34622 -16177 -23150 -77181 -154877 -202998 -197672 -182244 -208360 -239589 -182700 -39487
38506c9487J00009k4742o6376l665J8645m6464o4696K4028P3029j9276j09542
$$ -39487 60522 35780 -30596 -34261 -15616 -62080 -126776 -102748 -29719 -48995 -158537
38495a58537l0416J37366K02591J57578J32479J38168O9074o9711j37889p2298
$$ -158537 -188953 -51587 151004 308582 441061 579229 648303 578592 440703 368405
38485C68405L4751Q5828P4070J5451q7849j87632j98011j01914J9738Q5888Q7089
$$ 368405 403156 488984 563054 578505 490656 303024 105013 3099 22837 108725 195814
38474A95814N4326J1444l0640o5837q2367n6536J0981N4518Q084p6437o9013M6705
$$ 195814 250140 261584 230944 165107 82740 26204 37185 91703 99787 23350 -45663 1042
38462A042J29838Q8533J3146J6565N4444K1715o2370r6609o1858j7707J6547O0911
$$ 1042 130880 219413 232559 249124 303568 325283 262913 166304 104446 86739 103286 164197
38450A64197R4202Q1220M5974K6740L108m4837o3791j1939M4350K5315k8638k9760
$$ 164197 258399 339619 385593 412333 415441 370604 306813 294874 339224 364539 335901 306141
38438C06141P431Q353k1811k5879j8462n3428j02419r4046m7056l7841n7065k6547
$$ 306141 313572 321925 300114 274235 255773 202345 99926 5880 -41176 -79017 -136082 -162629
38426a62629N2442R1942N9323J5407N052O592l934j9023k9208k3576J5631O0007
$$ -162629 -110187 -18245 41078 56485 61537 68129 64195 45172 15964 -7612 8019 68026
38414F8026K8315q9695j65915r0841N9281J23696P3212M946k9894n7393p0852
$$ 68026 96341 6646 -159269 -250110 -190829 -67133 6079 11025 -18869 -76262 -147114
38403a47114k8980M0764N7095O484m4896n1356j7404M4679J04247J00403K4585
$$ -147114 -176094 -135330 -78235 -71751 -116647 -168003 -185407 -140728 -36481 63922 88507
38392H8507l9613m2573n2183j09192j08624K5617J53362R8070o2940j04554l411
$$ 88507 48894 6321 -45862 -155054 -263678 -238061 -84699 13371 -49569 -154123 -157534
38381a57534N0803j7020o7339p481O8725P1043N1493O9190P7074L1941j5046k0802
$$ -157534 -106731 -123751 -191090 -198571 -129846 -58803 -7310 61880 138954 170895 155849 135047
38369A35047l0749q0770j14419o8378L0417J01597Q8552j5857j52102k02781j02006
$$ 135047 104298 23528 -90891 -159269 -128852 -27255 61297 45440 -106662 -309443 -411449
38358d11449O2793J38865Q9427O373l4210l4613j7290j557j5556m6184k3051N9515
$$ -411449 -348656 -209791 -120364 -113991 -148201 -182814 -200104 -201661 -217217 -263401 -286452 -226937
38346b26937Q2998j5321r7274j6026J33320J43639J0651q4790o3145q102K6211
$$ -226937 -143939 -159260 -256534 -272560 -139240 4399 15050 -69740 -132885 -140987 -114776
38335a14776O3015P8080K5911k8971M852O7302M2897k2085p655M8981M4654M2840
$$ -114776 -51761 26319 52230 23259 28111 95413 138310 116225 108570 157551 202205 245045
38323B45045J44860K26159J17417m1943R672J96467K34137J45835J90804L33145
$$ 245045 389905 616064 733481 691538 701210 897677 1131814 1277649 1468453 1801598
38313A801598L13306K32739M59363R18835J188375J394271K117023L047802K734788
$$ 1801598 2114904 2347643 2807006 3725841 4914216 6308487 8425510 11473312 14208100
38304A4208100M63299k336222l542890k796137j537354r06760o96185l91040j29829
$$ 14208100 14671399 12335177 8792287 5996150 4458796 3552036 2855851 2464811 2334982
38295B334982k04401l97361l60138j81547j33394j83466j37465j7320K0386l5097
$$ 2334982 2130581 1733220 1373082 1191535 1058141 874675 737210 719890 740276 705179
38285G05179r1944j26911j34664o3134N7194Q4920q752o3354J2511R4315O7800
$$ 705179 613235 486324 351660 288526 345720 430640 421888 358534 371045 465360 533160
38274E33160P690M012l77o1690j02788p0587n8906j29366j67993p3389N4856P2878
$$ 533160 540850 544862 544485 482795 380007 309420 250514 121148 -46845 -120234 -65378 7500
38262G500J4451K018M1980N7776L9899K7180J4021o473J4794Q8186J16880L3990
$$ 7500 21951 23969 65949 123725 163624 190804 204825 198352 213146 301332 418212 452202
38250D52202p3553r1079m8262m7837r1535r9331n0717R173O5309J27001J56116
$$ 452202 378649 287570 239308 191471 99936 605 -50112 -40939 24370 151371 307487
38239C07487J02282m059p6473q2243o4573o7916r3797j19028j18610q2969l2906
$$ 307487 409769 405710 329237 246994 182421 114505 20708 -98320 -216930 -299899 -332805
38228c32805L836L2508O6490P3228J7766m2348n352J09993J57071O6221m9358
$$ -332805 -328969 -296461 -229971 -156743 -138977 -181325 -186677 -76684 80387 146608 97250
38217I7250o1733o521l537p1785j22208r4322j4916N8765R1895Q3779O6344O9973
$$ 97250 35517 28996 25459 -46326 -168534 -262856 -277772 -219007 -127112 -43333 23011 92984
38205I2984P2718K6282n2973q3269l4226K6080L5611J4865l078l5644q3381p9746
$$ 92984 165702 191984 139011 55742 21516 47596 83207 98072 94994 59350 -24031 -103777
38193a03777R984R9186P7752l5374j15117q4754J4538R0703Q7174J8798m2127
$$ -103777 -93793 5393 83145 47771 -67346 -152100 -137562 -46859 40315 59113 16986
38182A6986l5996Q861J1834l3553l7164M6213J30017J16467L9131K998K8335M2939
$$ 16986 -19010 -10149 1685 -31868 -69032 -22819 107198 223665 262796 265794 294129 337068
38170C37068M530n4052r2953j04496q5144l3397J8338K4319j2959m3861l7511
$$ 337068 341598 287546 194593 90097 4953 -28444 -10106 14213 1254 -42607 -80118
38159h0118o860L0778P0309Q6833L7198p4681j65012j44971k5855Q2936R2966
$$ -80118 -86978 -56200 14109 100942 138140 63459 -101553 -246524 -272379 -189443 -96477
38148i6477L0359j1441O523L3627J5300l2750n5806k8413L1809Q3386P4453j4824
$$ -96477 -66118 -77559 -71036 -37409 -22109 -54859 -110665 -139078 -107269 -23883 50570 35746
38136C5746j14807j11714L233R4930N9155l2406n1139r830j8406q0852q2452J5917
$$ 35746 -79061 -190775 -187542 -92612 -33457 -65863 -117002 -126832 -145238 -226090 -308542 -292625
38124b92625J07708R9096K4933l3413m7934k2004L9960R8686R8329N5681M9357
$$ -292625 -184917 -85821 -60888 -94301 -142235 -164239 -124279 -25593 72736 128417 177774
38113A77774Q8008Q1987j0025j00387r6609k2684M4713Q1172Q6546K8417r7363
$$ 177774 265782 347769 337744 237357 140748 118064 162777 243949 330495 358912 261549
38102B61549j98029j66214j7987J12365J11818q865j37475j63143p2864M4987
$$ 261549 63520 -102694 -120681 -8316 103502 94637 -42838 -205981 -278845 -233858
38092b33858J06049J17090J23372J13485N3947j5795k7331m364k2053n5506j0142
$$ -233858 -127809 -10719 112653 226138 280085 264290 236959 232595 210542 155036 144894
38081A44894Q7319R1320k5453j05684n4939R813l0015r0938m2501N7004N4980
$$ 144894 232213 323533 298080 192396 137457 147270 117255 26317 -16184 40820 95800
38070I5800m2575q8437k8018M3861N0302J7959j0994l5490m8781k9420N710J3757
$$ 95800 53225 -35212 -63230 -19369 30933 48892 37898 2408 -46373 -75793 -70083 -56326
38058e6326k801k150K3210M2480M9158O4149Q1794P2915L8989J0973j755j6200
$$ -56326 -59127 -61277 -38067 4413 53571 117720 199514 272429 311418 322391 320636 304436
38046C04436l7938n8548p8599r7510r6440o2621j1819L5573P1075P4764K4067
$$ 304436 266498 207950 129351 31841 -64599 -127220 -139039 -103466 -32391 42373 66440
38035F6440m9191o8075j2085M8778N8706M9485O3817P5224M3380j1426m8335o4818
$$ 66440 17249 -50826 -62911 -14133 44573 94058 157875 233099 276479 265053 216718 151900
38023A51900o5327l5670K187j3114p4992q7029j6227L0785k7136j04631q4231
$$ 151900 86573 50903 53090 39976 -35016 -122045 -138272 -107487 -134623 -239254 -323485
38012c23485J5L9979L3454M6363O4232L5687J1305P2005J49268R2459q3635j88150
$$ -323485 -323470 -283491 -250037 -203674 -139442 -103755 -92450 -20445 128823 221282 137647 -50503
38000e0503j20861J210L1870j8890m8942j2126O0284J14145J01106R703j00272
$$ -50503 -171364 -170154 -138284 -157174 -206116 -218242 -157958 -43813 57293 66996 -33276
37989c3276j41565r2186l006P5275J15715R0139J062p4844n9647J6568N7824L6086
$$ -33276 -174841 -267027 -270033 -194758 -79043 11096 12158 -62686 -122333 -105765 -47941 -11855
37977a1855m256m8171j04603j17752j8232J28426J62916N6137l8960j1309N7876
$$ -11855 -16111 -64282 -168885 -286637 -304869 -176443 -13527 42610 3650 -7659 50217
37966E0217M2470m1173q9822p5238m6766k1708K6391Q6701J00799M2224m3537
$$ 50217 92687 51514 -38308 -113546 -160312 -182020 -155629 -68928 31871 74095 30558
37955C0558r0055p5339l0130N343K3647M1731N5277L4600j6747m2095j0183K8430
$$ 30558 -59497 -134836 -164966 -159623 -135976 -94245 -38968 -4368 -21115 -63210 -73393 -44963
37943d4963J9780J465M3481J22071J42126P7592O90l2938m0521m0364j3086L4418
$$ -44963 -25183 -23718 19763 141834 283960 361552 362242 329304 288783 248419 235333 269751
37931B69751M5964O70m3174l5420j1318k7134n7831k5122P8552J53157J07619
$$ 269751 315715 316385 273211 237791 226473 199339 141508 116386 194938 348095 455714
37920D55714j6859r0057o2364k6311o1249q5081K8811K17127K60194Q1784j31842
$$ 455714 438855 348798 286434 260123 198874 113793 142604 359731 619925 701709 569867
37909E69867j83834j01008j8643L6564J11988J79191J73583J25173J17090J63416
$$ 569867 386033 285025 266382 302946 414934 594125 767708 892881 1009971 1173387
37899A173387K37908L57220N32673P31159R80664J352367J672307J456413M47109
$$ 1173387 1411295 1768515 2301188 3032347 4013011 5365378 7037685 8494098 8941207
37890H941207q81594j697803j687400j257828q85140o30518l87761k21638k23938
$$ 8941207 8059613 6361810 4674410 3416582 2531442 1900924 1513163 1291525 1067587
37881A067587k85542k55579j70623j34556j13073k8010O6792P6146L1066J6088
$$ 1067587 782045 526466 355843 221287 108214 80204 146996 223142 254208 270296
37871B70296K1519K096j0989J5677K4972k7542p2916m9453k2851o3274j06262
$$ 270296 291815 293911 282922 298599 323571 296029 223113 173660 150809 87535 -18727
37860a8727o8039m33O927j3824J1802M9462K9844o321J6247O1075N5798M0246
$$ -18727 -86766 -87199 -80272 -94096 -82294 -32832 -2988 -9309 6938 68013 123811 164057
37848A64057Q4886J33063R5887N0252J55989L89538N27836M10355R1959k57918
$$ 164057 248943 382006 477893 528145 684134 1073672 1601508 2011863 2103822 1845904
37838A845904m85914m99072l13337p4658O1769P4917L7957j2843p5065j07747
$$ 1845904 1359990 860918 547581 472923 534692 609609 647566 634723 559658 451911
37828D51911q3820o5845j04745j17829j1427J25795J21247j5823j03646o1235
$$ 451911 368091 302246 197501 79672 68245 194040 315287 299464 195818 134583
37818A34583M323L484j7224q817j2981n4301p2499l4568j878j5294j4581N3503
$$ 134583 138906 142390 125166 116349 103368 49067 -23432 -58000 -59878 -75172 -89753 -36250
37806c6250J31661J32238N9605j0310k7017Q75K6512n317r9939j71996j26456
$$ -36250 95411 227649 287254 276944 249927 250802 277314 271997 172058 62 -126394
37795a26394N405Q3453L3854o7320j12941r0159m6183n38N0039Q4483P2248J8827
$$ -126394 -120989 -37536 -3682 -71002 -183943 -274102 -320285 -320823 -270784 -186301 -114053 -95226
37783i5226l4344m6003o826M4757M7970o417m4631K93Q4788J03042L0696m9035
$$ -95226 -129570 -175573 -182399 -137642 -89672 -96089 -140720 -140427 -55639 47403 78099 29064
37771B9064o5821l9096k0019j9939k0491p922K0696M9589M0968j8315p2406n1235
$$ 29064 -36757 -75853 -95872 -115811 -136302 -144224 -123528 -73939 -32971 -51286 -123692 -174927
37759a74927L1602Q9901P4179J5910l4936n4794k7332N0518J25809J18674K6141
$$ -174927 -143325 -53424 20755 36665 1729 -53065 -80397 -29879 95930 214604 240745
37748B40745n3813l8793L3812N8615O7o1390l2425O4820J04860J7881j04329j20752
$$ 240745 186932 148139 181951 240566 240633 179243 146818 211638 316498 334379 230050 109298
37736A09298l2881K8801P948j0708K3102J9408q7827j87069j31818L9990J65213
$$ 109298 76417 105218 113166 102458 125560 144968 57141 -129928 -261746 -221756 -56543
37725e6543J78539J39255Q0840j4133j05080j08404l3805J8428R842j65J7499
$$ -56543 121996 261251 342091 327958 222878 114474 80669 99097 108939 108774 126273
37714A26273J2763l8880q4731q0030m3708p170K1003K7798J137l2744l6898j8747
$$ 126273 139036 100156 15425 -64605 -108313 -115483 -94480 -66682 -65545 -98289 -135187 -153934
37702a53934k159K3175N9697N9756P261j8782L8575J01218P7389K1331L0815O4110
$$ -153934 -156093 -132918 -73221 -13465 -6204 -24986 13589 114807 192196 213527 244342 308452
37690C08452L0711j0034N1340J32320N7995j18288j55909r473R5225K6029p5616
$$ 308452 339163 329129 380469 512789 570784 452496 296587 287114 382339 408368 332752
37679C32752p0544k6613k5835j889Q0410R4020l4218j57001j25563j6083K4929
$$ 332752 262208 235595 209760 207871 288281 382301 348083 191082 65519 49436 74365
37668G4365O287j881l2354j10773j26072m502J14783P7051l2030l3866M8687O7553
$$ 74365 80652 78771 46417 -64356 -190428 -194930 -80147 -3096 -35126 -68992 -20305 47248
37656D7248K8170M9140J02758M9458q4248j08029K4132J25069N0663j12497k01451
$$ 47248 75418 124558 227316 276774 192526 84497 108629 233698 284361 171864 -29587
37645b9587j75671r6276j9600K8047M6145O4174R4937R3444L0924k5729m319M0256
$$ -29587 -205258 -301534 -321134 -293087 -246942 -182768 -87831 5613 36537 10808 6489 46745
37633D6745J647r6538j25408m9305K8451K5181l1705q3875j03524o8360K3711
$$ 46745 48392 -48146 -173554 -222859 -194408 -169227 -200932 -284807 -388331 -456691 -432980
37622d32980J10206J25893R9361R5485R3090L7492j9512J8807J05707Q8980m8035
$$ -432980 -322774 -196881 -97520 -2035 91055 128547 109035 127842 233549 322529 274494
37611B74494j48665j21642n3347k4972J6848J14413J70271Q9635m9339r5496l1866
$$ 274494 125829 4187 -49160 -74132 -57284 57129 227400 317035 267696 172200 140334
37600A40334L1073K7912j346p707k120j8681o0402r2338p0436J3661J07567J40049
$$ 140334 171407 199319 197973 190266 188146 169465 109063 16725 -53711 -40050 67517 207566
37588B07566R5860K3577l0369n8493o4086m4264j2798J104r870k5704l4568m4702
$$ 207566 303426 327003 296634 238141 174055 129791 116993 118097 108227 82523 47955 3253
37576C253o3721r0624j13244r3699J336J19222J32892L116j31549j21334q346
$$ 3253 -60468 -151092 -264336 -358035 -356699 -237477 -104585 -101469 -233018 -354352 -362698
37565c62698N2432K9703K7573P8007Q7049J6553l5676P57N5483M4233K652R411
$$ -362698 -310266 -280563 -252990 -174983 -87934 -71381 -107057 -106300 -50817 -6584 -3932 5479
37553E479N6966P9324N0100j0345p3154r7602m4885O0285J33235J27172P4776
$$ 5479 62445 141769 191869 181524 108370 10768 -34117 26168 159403 286575 361351
37542C61351J7799l0489l9489K3172R8950O8946p2689j82650j67805j10249j12327
$$ 361351 379150 348661 309172 332344 431294 500240 427551 244901 77096 -33153 -145480
37531a45480j27111n5338P4105J45753J25157O9642J4694l7924n2869J901O7086
$$ -145480 -272591 -327929 -253824 -108071 17086 86728 101422 63498 10629 12530 79616
37520G9616N0556k7790n0795K5473J06365Q8405j5286j06579j10535l3066N3047
$$ 79616 130172 102382 51587 77060 183425 271830 256544 149965 39430 6364 59411
37509E9411O9459N280p4069j08892j09001j05805q4976k5778K7367J1593m7260
$$ 59411 128870 134150 60081 -48811 -157812 -263617 -348593 -374371 -347004 -335411 -382671
37498c82671n3895K0858R4753Q8221K6425o844K0701O2112N8806J0970k2675N610
$$ -382671 -436566 -415708 -320955 -232734 -206309 -213153 -192452 -130340 -71534 -60564 -83239 -77629
37486g7629O7572Q5468L3514k1105r291L9411L7134l6674j06171j00504l5278
$$ -77629 -10057 75411 108925 87820 78529 117940 155074 118400 12229 -88275 -123553
37475a23553K5064M8861N4077O2756O6346L9977j8485p3599q4971n1819j1266
$$ -123553 -98489 -49628 4449 67205 133551 173528 155043 81444 -3527 -55346 -66612
37464f6612O400P26k0246n2973p9710p0846k7399P876O426o185O287L4927M6903
$$ -66612 -60212 -59486 -79732 -132705 -212415 -283261 -310660 -302784 -296358 -302543 -296256 -261329 -214426
37451b14426L9019L2287L1781L1931M4929P6675Q4802J8560q9649j28718l7620
$$ -214426 -175407 -143120 -111339 -79408 -34479 42196 126998 145558 55909 -72809 -110429
37440a10429J06475J68276J02507j6762r9921j22744r8452l2129N2122Q3423J6341
$$ -110429 -3954 164322 266829 250067 150146 27402 -71050 -103179 -51057 32366 48707
37429D8707q0223q3173K2816J18438J12932N3733K2783O679m6000j04842j02385
$$ 48707 -31516 -114689 -91873 26565 139497 193230 216013 222692 176692 71850 -30535
37418c0535n5440k5803R409J12756K19369J72215l3665j88942j34929K5011Q0018
$$ -30535 -85975 -111778 -102369 10387 229756 401971 368306 179364 44435 69446 149464
37407A49464j0452j06857j01861k6301L9017N9589M5767J9429j489j2415j4937
$$ 149464 139012 32155 -69706 -96007 -56990 2599 48366 67795 66306 53891 38954
37396C8954M278N3186Q5630L4090p8953j30626n1555O8597R3052Q125q4629j06286
$$ 38954 43232 96418 182048 216138 137185 6559 -44996 23601 116653 124778 40149 -66137
37384f6137o1464P608N7765N2726o111o5639p7119m6600j884M8578Q6730O9408
$$ -66137 -127601 -119993 -62228 -9502 -15613 -81252 -158371 -204971 -206855 -158277 -71547 -2139
37372b139m388o1541m9729j3736j3730k4663M159M3314L1481j0688j4102J8995
$$ -2139 -6527 -68068 -117797 -131533 -145263 -169926 -165767 -122453 -90972 -101660 -115762 -96767
37360i6767K7138K414m075K4348N9823R3363J16181O7194q6228k33672k19818
$$ -96767 -69629 -67215 -71290 -46942 12881 106244 222425 289619 203391 -30281 -250099
37349b50099o1940O3767P2304O4403J26189J79128J17747j5631r9193r9042p0221
$$ -250099 -312039 -248272 -175968 -111565 14624 193752 311499 295868 196675 97633 27412
37338B7412m7242k6853j9397l1966k9246J4921N6341M3836J4474M2648J10614
$$ 27412 -19830 -46683 -66080 -98046 -127292 -112371 -56030 -12194 2280 44928 155542
37327A55542J19800L7780n0778o7357m0878m0039o1098m8234K030K9645R603n374
$$ 155542 275342 313122 262344 194987 154109 114070 52972 4738 6768 36413 46016 40642
37315D0642K4426M5698j3142j12294j27742k3406Q0227N8073n3991j11727n0831
$$ 40642 65068 110766 97624 -14670 -142412 -165818 -85591 -27518 -81509 -193236 -244067
37304b44067M9070Q4774M8847R588J4795M4226M5322J515m1958l2928J3510L1668
$$ -244067 -194997 -110223 -61376 -51788 -36993 7233 52555 54070 12112 -20816 -7306 24362
37292B4362J546k3705q854O949j1545k3842J5047O5327O1935J8859j0060l2895
$$ 24362 25908 2203 -6651 298 -11247 -35089 -20042 45285 107220 126079 116019 83124
37280H3124q4716j24801q1695J3922N7507L0381J4466M0496M5965P863j0183J4302
$$ 83124 -1592 -126393 -208088 -194166 -136659 -106278 -91812 -51316 -5351 2512 -7671 6631
37268F631J1688m4015o6855k747O5594M7336j6926m2828m4533p5449r3830j7009
$$ 6631 18319 -25696 -92551 -95298 -29704 17632 706 -42122 -86655 -162104 -255934 -272943
37256b72943J22130J94363J44819M5582k2390n1434o4373o8468o8702o8169m6440
$$ -272943 -150813 43550 188369 233951 211561 160127 95754 27286 -41416 -109585 -156025
37245a56025J1176O3428M9200k1274o6420l6537K8514N7118K4552l4399o0711
$$ -156025 -144849 -81421 -32221 -53495 -119915 -156452 -127938 -70820 -46268 -80667 -141378
37234a41378j7931O5565J05775M9865n0124q8379k9653N4139P3085J0130p9109
$$ -141378 -159309 -93744 12031 61896 11772 -76607 -106260 -52121 20964 31094 -48015
37223d8015j23037q6310K739O9790O4242J3889j1118J6959O1818P8913N9267J9774
$$ -48015 -171052 -257362 -254623 -184833 -120591 -106702 -117820 -100861 -39043 39870 99137 118911
37211A18911j6212k7369j4347r812l6129n9721l2305K3855L0190l1350p6088l0198
$$ 118911 102699 75330 60983 51171 15042 -44679 -76984 -53129 -22939 -54289 -130377 -160575
37199a60575O3394J06076P3675K1788j5255n4409r5070j00916p2044n8436o3666
$$ -160575 -97181 8895 82570 104358 89103 34694 -60376 -161292 -233336 -291772 -355438
37188c55438j5192J04796J75894Q9291o9967j17265k4579O0843O3400P8032J58907
$$ -355438 -370630 -265834 -89940 -649 -70616 -187881 -212460 -151617 -88217 -10185 148722
37177A48722J78535L0098j57707j78973m7595M2221J1178l4846k3326j4980m9308
$$ 148722 327257 357355 199648 20675 -26920 15301 26479 -8367 -31693 -46673 -95981
37166i5981o2173k1575K960k0082j3491N6157Q9230J8931n6402k8270M1516L2591
$$ -95981 -158154 -179729 -176769 -196851 -210342 -154185 -64955 -46024 -102426 -130696 -89180 -56589
37154e6589k9665l4628J0632K181o4650p9236q51P9242Q2783L2894k7172r1845
$$ -56589 -86254 -120882 -110250 -108069 -172719 -251955 -252806 -173564 -90781 -57887 -85059 -176904
37142a76904j34868r6549J9607J17080J21989O5546J3364k1388n0265n6583k6239
$$ -176904 -311772 -408321 -388714 -271634 -149645 -84099 -70735 -92123 -142388 -198971 -225210
37131b25210R320J2504m741o149J0073J5009l645k9538m3174l4858r60M9318Q5777
$$ -225210 -215890 -203386 -208127 -214276 -204203 -189194 -192839 -222377 -265551 -300409 -301369 -252051 -166274
37118a66274P6925K7521j2438O615O9981R5889K3476j00408j58918r9607O707
$$ -166274 -89349 -61828 -74266 -67651 2330 98219 121695 21287 -137631 -237238 -230531
37107b30531O0231M5673K0381K3735M1061M1784J8389r024j4156j298j2891o4514
$$ -230531 -170300 -124627 -104246 -80511 -39450 2334 20723 11699 -2457 -3755 -16646 -81160
37095h1160q7678q630J16396J44372N2163j5740L1456Q5628K2687q1529p0069
$$ -81160 -168838 -177468 -61072 83300 135463 119723 151179 236807 259494 177965 107896
37084A07896L4787O4851k7699j08395p3744K5496R9901J24709R5231N125r0874
$$ 107896 142683 207534 179835 71440 -2304 23192 123093 247802 343033 348158 257284
37073B57284j05382m6613j1769k7251j7764L3790L6061m3936j03296p2147k9247
$$ 257284 151902 105289 93520 66269 48505 82295 118356 74420 -28876 -101023 -130270
37062a30270n3239q2327l8079K1581Q862k3041L4257J46317J76638R7707J8440
$$ -130270 -183509 -265836 -303915 -282334 -273472 -296513 -262256 -115939 60699 158406 176846
37051A76846O273J2381j1854l8288l3157j7449k1450l8644m8226m1786k2507j2153
$$ 176846 183119 195500 183646 145358 112201 94752 73302 34658 -13568 -55354 -77861 -90014
37039i0014m1963r5078r1407Q904J19963J24956L3783l6311k3113K3931M3880
$$ -90014 -131977 -227055 -318462 -309558 -189595 -64639 -30856 -67167 -90280 -66349 -22469
37028b2469L2905N615l1318n4104l9946j6032k3450l9446j5938J6874r806o1086
$$ -22469 10436 16051 -15267 -69371 -109317 -125349 -148799 -188245 -204183 -187309 -197115 -258201
37016b58201k4358R3603J34799K3517r8514p4593L6318O3035j7919p4208l5723
$$ -258201 -282559 -188956 -54157 -30640 -129154 -203747 -167429 -104394 -122313 -196521 -232244
37005b32244K8334N4137O7375Q8525P3622P739l8245j5612J3064k5296q2212n4046
$$ -232244 -203910 -149773 -82398 6127 79749 87488 49243 33631 46695 21399 -60813 -114859
36993a14859M7319R5109K9604n4005m2252M1515Q1492K9282n0103q1613o4965
$$ -114859 -67540 27569 57173 3168 -39084 2431 83923 113205 63102 -18511 -83476
36982h3476m2202l0681j8080L207K4485L1754J4860j9481l7428p646M5313N0695
$$ -83476 -125678 -156359 -174439 -171232 -146747 -114993 -100133 -119614 -157042 -164688 -119375 -68680
36970f8680j8617r6615j01474l7480K4997N1341O7423Q7893Q3327L6807j7940
$$ -68680 -87297 -183912 -285386 -322866 -297869 -246528 -179105 -91212 -7885 28922 10982
36959A0982m1141l1102j803M2787Q3838P7192O777p8711j17572r8493m2686L8637
$$ 10982 -30159 -61261 -63064 -20277 63561 140753 147530 68819 -48753 -147246 -189932 -151295
36947a51295J21761J43078O4764m7060q3061l1254J3973p340m8600n2835m2188
$$ -151295 -29534 113544 178308 131248 48187 16933 30906 23566 -25034 -77869 -120057
36936a20057n8492p8667n7430q925K5799N6819J11839J50370J02978o339o7655
$$ -120057 -178549 -257216 -314646 -323571 -297772 -240953 -129114 21256 124234 117895 50240
36925E0240l1846L1938N0237L5750K7151J8323J179Q247M6835N1806k0666j03881
$$ 50240 18394 50332 100569 136319 163470 181793 182972 191219 238054 289860 269194 165313
36913A65313j09149o0780m7586p0643m9771K4221N7894q80q5912j15173q5172
$$ 165313 56164 -4616 -52202 -122845 -172616 -148395 -90501 -91381 -177293 -292466 -377638
36902c77638k5541N5431J30983J41867Q3372L7303N3251O6539R115o5622o4694
$$ -377638 -403179 -347748 -216765 -74898 8474 45777 99028 165567 174682 109060 44366
$$ [...]
##END NTUPLES=NMR SPECTRUM
##END=
