##TITLE=31P Pdec_DE-78H4_c 
 D2O, 64 sc
 19.2.2025
##JCAMPDX= 6.0         $$ Bruker NMR JCAMP-DX V2.0
##DATA TYPE= NMR FID
##DATA CLASS= NTUPLES
##ORIGIN= UXNMR, Bruker Analytische Messtechnik GmbH
##OWNER= root
$$ XWIN-NMR		Version 3.5
$$ Wed Feb 19 15:48:53 2025 Russian Standard Time (UT+4h)  new_Human@DPX200
##.OBSERVE FREQUENCY= 81.013821
##.OBSERVE NUCLEUS= ^31P
##.DELAY= (6, 6)
##.ACQUISITION MODE= SIMULTANEOUS
##.ACQUISITION SCHEME= undefined
##.AVERAGES= 32
##.DIGITISER RES= 17
##SPECTROMETER/DATA SYSTEM= spect
##.PULSE SEQUENCE= zgpg30
##.SOLVENT NAME= CDCl3
##.SHIFT REFERENCE= (INTERNAL, CDCl3, 0, 243.863)
##AUDIT TRAIL= $$ (NUMBER, WHEN, WHO, WHERE, WHAT)
$$ ##TITLE= Audit trail, XWIN-NMR		Version 3.5
$$ ##JCAMPDX= 5.01
$$ ##ORIGIN= Bruker BioSpin GmbH
$$ ##OWNER= new_Human
$$ C:/Bruker/XWIN-NMR/data/yarkov/nmr/P31/2/audita.txt
$$ ##AUDIT TRAIL=  $$ (NUMBER, WHEN, WHO, WHERE, WHAT)
(   1,<2025-02-19 15:46:09.37 +0400>,<new_Human>,<DPX200>,
      <created by zg, POWCHK disabled, PULCHK disabled
       configuration hash MD5:
       00 E9 B6 7A A2 85 ED C7 34 08 36 98 17 FE 4E 26
       data hash MD5: 32K
       B1 2E 3E BE 1F B3 E0 67 0C 8B 3F B2 E7 75 24 00>)
$$ ##END=
$$ 
$$ hash MD5
$$ E7 B3 95 90 A7 5D 61 83 08 B4 5C 93 60 30 D9 56
##$RELAX= 
##$RELAX= 
##$RELAX= 
##$RELAX= 
##$RELAX= 
##$RELAX= 
##$RELAX= 
##$RELAX= 
$$ Bruker specific parameters
$$ --------------------------
##$DU= <C:/Bruker/XWIN-NMR>
##$EXPNO= 2
##$NAME= <P31>
##$PROCNO= 1
##$TYPE= <nmr>
##$USER= <yarkov>
##$AMP= (0..31)
100 100 100 100 100 100 100 100 100 100 100 100 100 100 100 100 100 100 
100 100 100 100 100 100 100 100 100 100 100 100 100 100 
##$AQSEQ= 0
##$AQ_mod= 1
##$AUNM= <au_zg>
##$AUTOPOS= <>
##$BF1= 81.014009
##$BF2= 200.13
##$BF3= 200.13
##$BF4= 200.13
##$BF5= 200.13
##$BF6= 200.13
##$BF7= 200.13
##$BF8= 200.13
##$BYTORDA= 1
##$CFDGTYP= 0
##$CFRGTYP= 5
##$CHEMSTR= <none>
##$CNST= (0..31)
1 1 145 1 1 1 1 1 1 1 1 1 1 1 1 1 1 1 1 1 1 1 1 1 1 1 1 1 1 1 1 1 
##$CPDPRG= <waltz16>
##$CPDPRG1= <>
##$CPDPRG2= <waltz16>
##$CPDPRG3= <>
##$CPDPRG4= <mlev>
##$CPDPRG5= <mlev>
##$CPDPRG6= <mlev>
##$CPDPRG7= <mlev>
##$CPDPRG8= <mlev>
##$CPDPRGB= <>
##$CPDPRGT= <>
##$D= (0..31)
0 1 0 0 0 0 0 0 0 0.06 0 0.03 2e-05 3e-06 0 0 0.0002 0 0 0 0 0 0 0 0 0 
0 0 0 0 0 0 
##$DATE= 1739965568
##$DBL= (0..7)
120 120 120 11 120 120 24 19 
##$DBP= (0..7)
150 150 150 150 150 150 150 150 
##$DBP07= 0
##$DBPNAM0= <>
##$DBPNAM1= <>
##$DBPNAM2= <>
##$DBPNAM3= <>
##$DBPNAM4= <>
##$DBPNAM5= <>
##$DBPNAM6= <>
##$DBPNAM7= <>
##$DBPOAL= (0..7)
0.5 0.5 0.5 0.5 0.5 0.5 0.5 0.5 
##$DBPOFFS= (0..7)
0 0 0 0 0 0 0 0 
##$DE= 6
##$DECBNUC= <off>
##$DECIM= 4
##$DECNUC= <off>
##$DECSTAT= 4
##$DIGMOD= 1
##$DIGTYP= 9
##$DL= (0..7)
0 0 52 120 120 21 21 25 
##$DP= (0..7)
150 150 150 150 150 150 150 150 
##$DP07= 0
##$DPNAME0= <>
##$DPNAME1= <>
##$DPNAME2= <>
##$DPNAME3= <>
##$DPNAME4= <>
##$DPNAME5= <>
##$DPNAME6= <>
##$DPNAME7= <>
##$DPOAL= (0..7)
0.5 0.5 0.5 0.5 0.5 0.5 0.5 0.5 
##$DPOFFS= (0..7)
$$ [...]
##$SUBNAM1= <"">
##$SUBNAM2= <"">
##$SUBNAM3= <"">
##$SUBNAM4= <"">
##$SUBNAM5= <"">
##$SUBNAM6= <"">
##$SUBNAM7= <"">
##$SUBNAM8= <"">
##$SUBNAM9= <"">
##$SW= 400.765351723535
##$SWIBOX= (0..15)
0 1 3 0 0 0 0 0 0 0 0 0 0 0 0 0 
##$SW_h= 32467.5324675325
##$TD= 32768
##$TD0= 1
##$TE= 0
##$TE2= 300
##$TE3= 300
##$TEG= 300
##$TL= (0..7)
0 120 53 12 22 120 120 120 
##$TP= (0..7)
150 150 150 150 150 150 150 150 
##$TP07= 0
##$TPNAME0= <>
##$TPNAME1= <>
##$TPNAME2= <>
##$TPNAME3= <>
##$TPNAME4= <>
##$TPNAME5= <>
##$TPNAME6= <>
##$TPNAME7= <>
##$TPOAL= (0..7)
0.5 0.5 0.5 0.5 0.5 0.5 0.5 0.5 
##$TPOFFS= (0..7)
0 0 0 0 0 0 0 0 
##$TUNHIN= 0
##$TUNHOUT= 0
##$TUNXOUT= 0
##$USERA1= <user>
##$USERA2= <user>
##$USERA3= <user>
##$USERA4= <user>
##$USERA5= <user>
##$V9= 5
##$VALIST= <valist>
##$VCLIST= <CCCCCCCCCCCCCCC>
##$VD= 0
##$VDLIST= <DDDDDDDDDDDDDDD>
##$VPLIST= <PPPPPPPPPPPPPPP>
##$VTLIST= <TTTTTTTTTTTTTTT>
##$WBST= 1024
##$WBSW= 4
##$XGAIN= (0..3)
0 0 0 0 
##$XL= 0
##$YL= 0
##$YMAX_a= 6566
##$YMIN_a= -2653
##$ZGOPTNS= <>
##$ZL1= 120
##$ZL2= 120
##$ZL3= 120
##$ZL4= 120
##$ABSF1= 60
##$ABSF2= -190
##$ABSG= 5
##$ABSL= 3
##$ALPHA= 0
##$AQORDER= 0
##$ASSFAC= 0
##$ASSFACI= 0
##$ASSFACX= 0
##$ASSWID= 0
##$AUNMP= <proc_1d>
##$AZFE= 0.1
##$AZFW= 0.5
##$BCFW= 1
##$BC_mod= 2
##$BYTORDP= 1
##$COROFFS= 0
##$CY= 9.86611175537109
##$DATMOD= 1
##$DC= 1
##$DFILT= <>
##$DTYPP= 0
##$F1P= 182.462994727601
##$F2P= 168.069089081705
##$FCOR= 0.5
##$FTSIZE= 0
##$FT_mod= 0
##$GAMMA= 1
##$GB= 0
##$INTBC= 1
##$INTSCL= 1
##$ISEN= 30
##$LB= 1.5
##$LEV0= 0
##$LPBIN= 0
##$MAXI= 11.51145
##$MC2= 0
##$MEAN= 0
##$ME_mod= 0
##$MI= 1.244541
##$NCOEF= 0
##$NC_proc= 0
##$NLEV= 6
##$NOISF1= 0
##$NOISF2= 0
##$NSP= 1
##$NTH_PI= 0
##$NZP= 1
##$OFFSET= 243.8632
##$PC= 1.4
##$PHC0= 1711.718
##$PHC1= 147.4954
##$PH_mod= 0
##$PKNL= yes
##$PPARMOD= 0
##$PSCAL= 0
##$PSIGN= 0
##$REVERSE= no
##$SF= 81.0140731611343
##$SI= 65536
##$SIGF1= 0
##$SIGF2= 0
##$SINO= 80
##$SIOLD= 65536
##$SREGLST= <31P.CDCl3>
##$SSB= 0
##$STSI= 0
##$STSR= 0
##$SW_p= 25641.0256410257
##$SYMM= 0
##$S_DEV= 0
##$TDeff= 0
##$TDoff= 0
##$TI= <>
##$TILT= no
##$TM1= 0
##$TM2= 0
##$TOPLEV= 0
##$USERP1= <user>
##$USERP2= <user>
##$USERP3= <user>
##$USERP4= <user>
##$USERP5= <user>
##$WDW= 1
##$XDIM= 64
##$YMAX_p= 0
##$YMIN_p= 0
$$ End of Bruker specific parameters
$$ ---------------------------------
##NTUPLES= NMR FID
##VAR_NAME=  TIME,          FID/REAL,        FID/IMAG
##SYMBOL=    X,             R,               I
##VAR_TYPE=  INDEPENDENT,   DEPENDENT,       DEPENDENT
##VAR_FORM=  AFFN,          ASDF,            ASDF
##VAR_DIM=   16384,         16384,           16384
##UNITS=     SECONDS,       ARBITRARY UNITS, ARBITRARY UNITS
##FACTOR=    3.08e-05,      1,               1
##FIRST=     0,             0,               0
##LAST=      0.5045964,     0,               0
##MIN=       0,             -2653,           0
##MAX=       0.5045964,     6566,            0
$$ Real data points
##PAGE= N=1
##DATA TABLE= (X++(R..R)), XYDATA
$$ [...]
##PAGE= N=2
##DATA TABLE= (X++(I..I)), XYDATA
790H15n73l3P35l08q05K7jk83L04n24l0J260j119J063n64k42P64j48J97k15Ll28
$$ 815 242 209 944 636 -169 -142 -143 -426 -122 -646 -676 584 -535 528 -36 -278 486 338 535 320 323 -5
812eJ89j03j251Q27j51Q60m10k85j19m8l70Q40K89%k0j22M6J90j16o40L69n82
$$ -5 184 81 -1170 -343 -494 366 -44 -329 -448 -496 -866 -26 263 263 243 121 167 357 241 -399 -30 -612
834f12Q87n49N03N55r06N28J9q87O3k53K308k273P46P0L10l72N00J60o57O01k558
$$ -612 275 -274 229 784 -122 406 425 -462 -399 -652 1656 -617 129 199 509 137 637 797 140 741 -1817
855a817K647j284j137J205n16J989r70J099j322n9n40J040L92p87J361k091M24
$$ -1817 830 -454 -1591 -386 -902 1087 117 1216 -106 -165 -705 335 727 -60 1301 -790 -366
872c66o85M5J217n60P28j28p99P19m42J417j049P79o07J73j454O17J241j112J115
$$ -366 -1051 -1006 211 -349 379 251 -548 171 -271 1146 97 876 269 442 -1012 -395 846 -266 849
891H49q21o13J503m83q09Q8l98J597p21M32p82N90j009n2R17p52N75N31j181L01
$$ 849 28 -585 918 435 -374 -286 -684 913 192 624 -158 432 -577 -629 288 -464 111 642 -539 -238
911b38N09k59n1l45K27K30P5n68R81m50L43j419J092J62n27J057j325J663j389
$$ -238 271 12 -39 -384 -157 73 148 -420 561 111 454 -965 127 289 -238 819 -506 1157 -232
930b32L52o51p31J214o3O86q54L39K58o03J043r77k0j188J105k22L62O81k080
$$ -232 120 -531 -1262 -48 -111 575 -279 60 318 -285 758 -219 -239 -1427 -322 -544 -182 499 -1581
949a581J834n50O07m79J066j970J666o02k73Q42l01L59j71n06L40k24J95n10M11
$$ -1581 253 -297 310 -169 897 -1073 593 -9 -282 560 259 618 447 -59 281 57 252 -258 153
968A53j025J241N00q44O89r58R03j094pK93n03k86O56R87p66O98l18L80l16p9
$$ 153 -872 369 869 25 714 -244 659 -435 -442 -149 -652 -938 -282 705 -61 637 319 699 383 304
988C04j051K25N52k39M61N15L42j716N42L57j36r24K83K134k622M61J043l43p1
$$ 304 -747 -522 30 -209 252 767 1109 -607 -65 292 156 -768 -485 1649 -973 -512 531 188 117
1007A17K24O95j981J136J14P56q20j430K557j882r5J002r25J394j875J567p11
$$ 117 341 1036 -945 191 305 1061 241 -1189 1368 -514 -609 393 -532 862 -1013 554 -157
1024a57r8O53j266K167k031O12n30J488p30j73m60J10J347j295P78k56n87m04
$$ -157 -255 398 -868 1299 -732 -120 -650 838 108 -65 -525 -415 932 -363 415 159 -428 -832
1042h32P81J052q98j64m62J082n19q55J03l97J725o05l91L51n36J277m33M23j191
$$ -832 -51 1001 103 -61 -523 559 40 -815 -712 -1109 616 11 -380 -29 -565 712 279 702 -489
1061d89P04L07p29R83m42M19j69J72k67q02J6K97L31r39L59K70M63j067R65r21
$$ -489 215 522 -207 776 334 753 584 756 489 -313 -297 0 331 -608 -249 21 484 -583 382 -539
1081e39J033j07j343J013o81L01n7K28p76M80J066j244J550r22K77n51O40p17
$$ -539 494 387 -956 57 -624 -323 -380 -152 -928 -448 618 -626 924 2 279 -272 368 -349
1099c49M91J133k070J210r00Q49q34m6R76m70k36n20N84L89q8M71j244K661j765
$$ -349 142 1275 -795 415 -485 364 -470 -516 460 -10 -246 -766 -182 207 119 590 -654 2007 242
1118B42J71o67O28Q82j946K181k240R98j143L55J370p30N52j333J965q45n16O11
$$ 242 413 -254 374 1256 -690 1491 -749 249 -894 -539 831 101 653 -680 1285 440 -76 535
1136E35j282K481k060N12n36K43p3K89o00j35L24o1M8m23J039l95k39L75r29L48
$$ 535 -747 1734 -326 186 -350 -107 -180 109 -491 -626 -302 -363 -315 -738 301 -94 -333 42 -887 -539
1156e39J144n85%K32o49K46K0l47O75l19K0j703J170J505m55j166R51K17j07K65
$$ -539 605 20 20 252 -397 -151 -131 -478 197 -122 -102 -1805 -635 870 415 -751 200 417 310 575
1176E75q54M04R2l19M14j050J361o65l78K66O85p54p16O90K67L38l90L65j30q03
$$ 575 -279 125 217 -102 312 -738 623 -42 -420 -154 531 -223 -939 -249 18 356 -34 331 201 -602
1196f02J173r24O07j307J230j68o63R62p34L89k96j203K546r57J047k130J844
$$ -602 571 -353 254 -1053 177 9 -654 308 -426 -37 -333 -1536 1010 53 1100 -1030 814
1213H14J3j581K121j157L84n66R01j012p0L75K34j39k186K364p36J83O14j92l10
$$ 814 827 -754 1367 210 594 28 929 -83 -153 222 456 317 -1869 495 -241 -58 556 364 54
1232E4K97j047M98k04n20P60J88m29K15K05Q18j406M47j03K07K1j2n85J62J73
$$ 54 351 -696 -198 -402 -922 -162 26 -403 -188 17 835 -571 -124 -227 -20 1 -11 -596 -434 -261
1252b61Q10k47K60n53p06J386r36q0M98M94k88o79j62M40J35Q00m12qj190J565
$$ -261 549 302 562 9 -697 689 -247 -327 171 665 377 -302 -464 -24 111 911 499 491 -699 866
1272H66j883J013L05j028N84J55M81q63M63n31j64J416j348J471j937J076J42
$$ 866 -1017 -4 301 -727 -143 12 493 -370 93 -438 -602 814 -534 937 -1000 76 218
1289B18m41P08r33Q66j044P19r67N11L19m50R65k58j206O27O83p51m18J957q81
$$ 218 -223 485 -448 418 -626 93 -874 -363 -44 -494 471 213 -993 -366 317 -434 -852 1105 224
1308B24N81n57l0P47j443N60M2m00K06R09r92j028J757j636J168r41P67J086r95
$$ 224 805 248 218 965 -478 82 124 -276 -70 839 -153 -1181 576 -1060 108 -833 -66 1020 25
1327B5R78n05j684M88Q62P03r30K17O51n48Jr56N28k40L11L06j8n8j07l80L38
$$ 25 1003 498 -1186 -698 164 867 -63 154 805 257 258 -698 -170 -410 -99 207 189 131 24 -356 -18
1348a8j87P38o48O3r85J415j174N7Q01J98J43j082J074o62j23N35M82K29j2j354
$$ -18 -205 533 -115 -52 -1037 378 -796 -739 62 260 403 -679 395 -267 -390 145 627 856 844 -510
1368e10N12M34q17l91M23P35m88k67o5R82j371R28q7l12N2N79J92o51M63r08J203
$$ -510 2 436 -381 -772 -349 386 -102 -369 -434 548 -823 105 18 -294 -242 337 529 -122 341 -567 636
1389F36n39K07K58m65J61j14N53o37L34M97j531J868j117J14n5J70O65K51p50
$$ 636 97 304 562 97 258 144 697 60 394 891 -640 1228 111 225 170 340 1005 1256 506
1408E06n56l34K90K71M26J30R3j95p10L04p20J250j439m43L094k445m96P88j52
$$ 506 -50 -384 -94 177 603 733 826 631 -79 225 -495 755 -684 -1127 1967 -478 -974 -186 -338
1427c38N60j296J460k3j23k99P85q83PP58q33N47p11P57p98M82k38q74N40L09
$$ -338 222 -1074 386 363 240 -59 726 -157 -150 608 -225 322 -389 368 -430 52 -186 -1060 -520 -211
1447b11K79k61l58R60j434J469j268K308j827N55m08m26N91j208M56N35N17M34
$$ -211 68 -193 -551 409 -1025 444 -824 1484 -343 212 -196 -622 -31 -1239 -783 -248 269 703
1465G03j729J786j627J162J9p86O58l69J261k122O85J127j509k90R28L22j736
$$ 703 -1026 760 -867 295 314 -472 186 -183 1078 -1044 -359 768 -741 -1031 -103 219 -1517
1482a517J121O23L57r80M20L21r35R62j338O06Q01m24j35m69J130l99O93r48L6
$$ -1517 -396 227 584 -396 24 345 -590 372 -966 -360 441 17 -118 -587 543 144 837 -111 -75
1501g5J452p38m01J26j516O69M63M78j085n6k8K47Q72K30K69J89n68l52J051p67
$$ -75 1377 639 238 364 -1152 -483 -20 458 -627 -683 -711 -464 408 638 907 1096 528 176 1227 460
1521D60j305P04N61j113Q24p1p3K58J3M82j188M95K11q15N75K77L53j140J45L81
$$ 460 -845 -141 420 -693 131 60 -13 245 258 740 -448 47 258 -557 18 295 648 -492 -347 34
1541C4N1L29q89N27n62Q63j056J373j582J55R74j428N66J75O35r92q6Q29j114
$$ 34 85 414 -475 52 -510 353 -703 670 -912 -757 217 -1211 -645 -470 165 -827 -913 -84 -1198
1560a198K142k75k87k79Q79j102r86J510j737J630q04N64L02k56J75p94p69R22
$$ -1198 944 669 382 103 982 -120 -1106 404 -1333 297 -507 57 359 103 278 -516 -1285 -363
1578c63M06M48p68J592j445J83J63j159N8J837j000N62q84l87O40r39J776q51
$$ -363 43 491 -277 1315 -130 53 216 -943 -885 952 -48 514 -370 -757 -117 -1056 720 -131
1596a31r63P92J79P07r15M85M66j446O26O69q27l32N39j769K612j454R28O43j294
$$ -131 -1094 -302 -123 584 -331 154 620 -826 -200 469 -358 -690 -151 -1920 692 -762 166 809 -485
1615d85P18J18N55l74p40L60O71m63j88K51l57k3o38P19l33r69J424k80J211k301
$$ -485 233 351 906 532 -208 152 823 360 172 423 66 43 -595 124 -209 -1178 246 -34 1177 -1124
1635a124J002R72j49q52M03K97m40L87n62k39k27M51J82L49J005k884J745J55
$$ -1124 -122 850 701 -151 252 549 109 496 -66 -305 -532 -81 101 450 1455 -1429 316 471
1653D71j388J064j683J838p54p70Q27O57p14l1J037m61k5k3%J507j273N86j476
$$ 471 -917 147 -1536 302 -452 -1222 -395 262 -452 -483 554 93 68 45 45 1552 279 865 -611
1672f11o7J155l8k92J81m66R29j024M60M99j015k06r1N16r0K76J755j351l82M21
$$ -611 -678 477 439 147 328 -138 791 -233 227 726 -289 -495 -586 -70 -160 116 1871 520 138 559
1692E59n61K17m24J79J8K38j210J239l56N94o0K30l77j055O80n64L91q53J519
$$ 559 -2 215 -209 -30 -12 226 -984 255 -101 493 433 663 286 -769 -89 -653 -262 -1115 404
1711D04j361O11L54k87R12j667M76r9J82R04r56P56o78J093k21k55J354j977J353
$$ 404 -957 -346 8 -279 633 -1034 -558 -657 -475 429 -527 229 -449 644 423 168 1522 -455 898
1730H98J65p00n12L13M81r97N58p42P75N94j536P09q19J912q59l48p77J277J28
$$ 898 1063 363 -149 164 645 -352 206 -536 239 833 -703 6 -813 1099 240 -108 -885 392 520
1749E20j067J316j151j1O80j537J480j249J939p13K08l46J95J39k238K171q89
$$ 520 -547 769 -382 -393 287 -1250 230 -1019 920 207 415 69 264 403 -1835 336 -553
1766e53O51j054J807j043k73J342k55j270M18l0M43k2M3p22J262j025J85q3O31
$$ -553 98 -956 851 -192 -465 877 622 -648 -230 -260 183 161 204 -518 744 -281 -96 -179 452
1785D52R6j406Q27l9M20J18L60o53j402J005J58Q74j510R02n84K60o5P80j539
$$ 452 548 -858 -31 -70 350 468 828 175 -1227 -222 -64 810 -700 202 -382 -122 -187 593 -946
1804i46J224L3K36J67j490J656j068N48m26k56L59J41R3p58Q01l02n66J318j016
$$ -946 278 311 547 714 -776 880 -188 360 -66 -322 37 178 271 -487 314 12 -554 764 -252
1823b52P50k73J00k88M50r19Q36n25L52L82p73L50j444N41O05L68O99j936J725
$$ -252 498 225 325 37 487 -432 404 -121 231 613 -160 190 -1254 -713 -108 260 959 -977 748
1842G48l65q86N74n48J698j866M99L35j030Q20P52q19o51J928R2q77l90o61J793
$$ 748 383 -503 71 -477 1221 -645 -146 189 -841 -21 731 -88 -739 1189 1281 404 14 -647 1146
1861A146m91r51J44O08r95l94M69M07J17l5L67p60M73k58Q1o97L45P05j208Q91
$$ 1146 655 -296 -152 456 -539 -933 -464 -57 60 25 392 -368 105 -153 -72 -769 -424 281 -927 -36
1881c6k21M13k30m7p15OJ486j013P30O12j397m34Q50L25o21M68J51k44M6n54N59
$$ -36 -257 156 -74 -121 -836 -830 656 -357 373 985 -412 -846 4 329 -292 176 327 83 129 -425 134
1902A34j20R36j102J25RL66O4j531J559N85l47n73n74J694j222p59P00O44j281
$$ 134 14 950 -152 -27 -18 348 412 -1119 440 1025 678 105 -469 1225 3 -756 -56 588 -693
1921f93j27J394j027N67q27K75j85J131j45r73N27k61L90o04J501o89J29o85l47
$$ -693 -820 574 -453 114 -713 -438 -623 508 363 -610 -83 -344 46 -558 943 254 383 -302 -649
1940f49R25j93q0L87j001m61J014p9o20R44N53p14J046j026J6j46K20M06k98j41
$$ -649 276 83 3 390 -611 -1072 -58 -137 -757 187 740 26 1072 46 62 -84 136 542 244 103
1960A03R89j015j42p9o97R57J81k20n90Q28q73j30O35m83P07n48O92p09K80j349
$$ 103 1092 77 -65 -144 -841 116 297 77 -513 315 -558 -688 -53 -536 171 -377 315 -394 -114 -1463
1980a463J584m57m61Q72n25J105r19l17N30l30N57n85J55n15J50J612j953J190
$$ -1463 121 -336 -797 75 -450 655 -264 -581 -51 -381 176 -409 -254 -769 -619 993 -960 230
1998B30o85P62j387N54P58m27O62r80J225r75L56N88n73L59r87Q57j763K240p0
$$ 230 -455 307 -1080 -526 232 -195 467 -513 712 -263 93 681 108 467 -520 337 -1426 814 744
2017G44r50n5J030q78j45J136l49l70p71J166l07m39Q32j255j02K277p77m49n42
$$ 744 -206 -261 769 -109 -254 882 533 163 -608 558 251 -188 644 -611 -713 1564 787 338 -204
2036b04L78l65n51R06m40P23rp91R72o14k04p6k58R97l75J95n96m70J815j961
$$ -204 174 -191 -742 164 -276 447 438 -353 619 5 -199 -275 -533 464 89 284 -312 -782 1033 -928
2056i28L87J2o44J018k36Q03O5N76j631N73k51L23k68L69J39r1o87O52R35j087
$$ -928 -541 -529 -1173 -155 -391 412 477 1053 -578 -5 -256 67 -201 168 307 216 -471 181 1116 29
2076B9j580K289p74k40J12M38n97K25J94n02Q30q38O3J775l259K018n50k11M76
$$ 29 -1551 738 -36 -276 -164 274 -323 -98 96 -406 424 -414 -351 1424 -1835 183 -367 -578 -102
2095a02J246o43j00M0j205N18j6L10J81j072J187k7o26M46k86P43l37m73O87j5
$$ -102 1144 501 401 441 -764 -246 -262 48 229 -843 344 317 -309 137 -149 594 257 -216 471 456
2115D56q46L56q57J334j080J007l91k96k08J040r82K53R70l54o58P68q97P32p22
$$ 456 -390 -34 -891 443 -637 370 -21 -317 -525 515 -467 -214 756 402 -256 512 -385 347 -375
2134c75k44J93L14Qj39P77J18j298m9J446j136OR03p42K2K17N64q96P24Q14j441
$$ -375 -619 -426 -112 -104 -243 534 652 -646 -695 751 -385 -379 524 -218 -196 21 585 -311 413 1227 -214
2155b14R86q96J080n44K13j412J046k95Q93j65j018P70r15J107r9r45J650j477
$$ -214 772 -124 956 412 625 -787 259 -36 857 692 -326 444 -471 636 537 -408 1242 -235
2173b35Q99j629J296n69J15J247j502J379j570J061j066j08Q63r88J254Q0j393
$$ -235 664 -965 331 -238 -123 1124 -378 1001 -569 492 -574 -682 181 -807 447 527 -866
2190h66L73O50p2J02K33j041M45k72M04N63n97O39p63Q43n37p79J352j168O23
$$ -866 -493 157 85 187 420 -621 -176 -448 -44 519 -78 561 -202 641 104 -675 677 -491 132
2209A32J53K74K2j141J137M75k33k55k1p19R30l03r60J98N79R7J95l5n53N5k33
$$ 132 285 559 581 -560 577 1052 819 564 543 -176 754 451 -509 -311 268 365 560 525 -28 27 -206
2230b06R84r06R90j487N62O4K40J072n69O80j579M38r87J230L71n02j59j490K476
$$ -206 778 -128 862 -625 -63 1 241 1313 744 1424 -155 283 -704 526 897 395 236 -1254 1222
2249A222p84l51J162j349k38lJ43J60k86J880j404O61j073R72j040q01J632m57
$$ 1222 438 87 1249 -100 -338 -341 -198 -38 -324 1556 152 813 -260 712 -328 -1129 503 46
2267D6O87j884J234n95n50J098r02J587j300J555j262N01m67l86J078j843J343
$$ 46 733 -1151 83 -512 -1062 36 -866 721 -579 976 -286 215 -252 -638 440 -1403 -60
2284f0q11J509l87m07k41L77o86Q71M9K02M43K15j110m49O19R62j196P10K44l79
$$ -60 -871 638 251 -156 -397 -20 -706 165 214 416 859 1074 -36 -485 134 1096 -100 610 854 475
2304D75l74N19n16Q1p53j41P79q91L57J205K97j443M05n52o73J793q31l12Q56
$$ 475 101 620 104 185 -568 -709 70 -821 -464 741 1038 -405 0 -552 -1225 568 -263 -575 281
2323B81k72o19O70K5L54o83Q26j225J453r54J319j700o3J364l91l97n05R35k083
$$ 281 9 -610 60 85 439 -244 582 -643 810 -144 1175 -525 -588 776 385 -12 -517 418 -1665
2342a665L212j519j91j323J586jp82P84n23K96P21m78l76J480j526l45O4R40j69
$$ -1665 1547 28 -163 -1486 100 99 -683 101 -422 -126 595 117 -259 1221 -305 -650 -586 354 185
2361A85K92r29P35m50L25N84j070N78m24l14N21O02J36j576J002q7k91MJ71n63
$$ 185 477 -452 283 -167 158 742 -328 250 -174 -488 33 635 771 -805 197 110 -181 -177 -6 -569
2381e69O16K12o38L84K3L02O12j250O76j176J655m32j013K2P41m36L53l56N06
$$ -569 47 259 -379 5 28 330 942 -308 368 -808 847 415 -598 -576 165 -271 82 -274 232
2400B32n48P06j18k9J15k08P4j220J344o24O89m14k38M42k89M94p66J77rP27K49
$$ 232 -316 390 272 243 358 150 224 -996 348 -276 413 -1 -239 203 -86 408 -358 -181 -190 537 786
2421G86k019J084P84l71O87j020J098o57l02j080J193M25n93O77j054N57K35o91
$$ 786 -1233 -149 635 264 951 -69 1029 372 70 -1010 183 608 15 692 -362 195 430 -261
2439b61L89r77L78p25J863lM9r23k8o18P96J188j291Q08j670J69J499j905O87
$$ -261 128 -849 -471 -1196 667 664 713 -210 -238 -856 -60 1128 -163 645 -1025 -856 643 -1262 -575
2458e75J000k62J047j600L66r47J364q15k19nO16L16n59N27r29J128m25P0q8J099
$$ -575 425 163 1210 -390 -24 -971 393 -422 -641 -646 -30 286 -273 254 -675 453 28 98 10 1109
2478A109j096Nn2O2k88P41q57J08N25j013M61k51J088n11k42P37j458J423j153
$$ 1109 13 18 -34 28 -260 481 -376 -268 257 -756 -295 -546 542 31 -211 526 -932 491 -662
2497f62L63L79l51O93l74j345J477J21k56r41J350k61l4M87o6O53j704n58O79
$$ -662 -299 80 -271 422 48 -1297 180 301 45 -896 454 193 159 646 580 1233 -471 -1029 -350
2516c50J429j544O74M8j019O42j430K160o66m68J55l15J620j088J98J9j05l21
$$ -350 1079 -465 209 257 -762 -120 -1550 610 -56 -524 -369 -684 936 -152 46 65 -40 -361
2534c61M89m86j496L019j054j94qj76J425o01m5j147n82J209M94J18m47L06o95
$$ -361 128 -358 -1854 1165 111 -83 -91 -267 1158 557 512 -635 -1217 -8 486 604 157 463 -232
2553b32O01K36K99j75j691Q01r1K42O12o22L68m69l76L81k65M41R0K38k90J16
$$ -232 369 605 904 729 -962 -161 -252 -10 602 -20 348 -121 -497 -116 -381 60 150 388 98 214
2573B14l10K51m01P19k29l23N63r80M97J41k24p00J273j229J015L85o19j194J028
$$ 214 -96 155 -246 473 244 -79 484 -496 1 142 -82 -782 491 -738 277 662 43 -1151 -123
2592a23J2j77R27j66M52m63k60k12J95r33O12M96j28k01J804j081p03l56J085
$$ -123 -111 -288 639 473 925 462 202 -10 185 -748 -136 360 232 31 1835 754 51 -305 780
2611G80j341L26K69k19J008q85J48j749K386n53l15J79j267K175p92Lm35P9m5
$$ 780 -561 -235 34 -185 823 -62 86 -1663 723 170 -145 34 -1233 942 150 153 -282 -203 -248
2630b48k05M0N31m4k62M05J663j493q9p9n09K90k53K74j236Q73Q08L8j51j045
$$ -248 -453 -413 118 74 -188 217 1880 387 298 219 -290 0 -253 21 -1215 -342 466 504 353 -692
2650f92K00M70q67J118J86j4l08P7K28j22K70j326R15k0k60O52o63M18j929J323
$$ -692 -492 -22 -889 229 415 401 93 170 398 276 546 -780 135 115 -145 507 -156 262 -1667 -344
2670c44Q05o08K77j081J748q28J36K33L64n99m50J31l38k64M80o22O39k11J018
$$ -344 461 -147 130 -951 797 -31 105 338 702 103 -347 -216 -554 -818 -338 -960 -321 -532 486
2689D86n04q76L90l8P02n50O28q61J685k377K153j212l17J277J68R12k523K9J109
$$ 486 -18 -894 -504 -542 160 -390 238 -623 1062 -1315 838 -374 -691 586 754 1666 -857 -828 281
2708B81o89L02J165j679K34P17q60J71K85j715L472k397m8P70p4N04m43M93o38
$$ 281 -408 -106 1059 -620 -386 331 -529 -358 -73 -1788 1684 -713 -761 9 -65 439 -4 489 -149
2727a49R48j003O74k51l79P60o22L84L81n23n15J70O11j74l12k29K92k04J60q36
$$ -149 799 -204 470 219 -160 600 -22 362 743 220 -295 -125 486 312 0 -229 63 -141 19 -817
2747h17J049j93q08L14O80k7K22P08j923J132j124P45J190j37j687J141p32j185
$$ -817 232 39 -769 -455 225 198 420 1128 -795 337 -787 -42 1148 1011 -676 465 -267 -1452
2765a452N27R40k32K95j211O88R76q70L71m50O05r22J753o83Q23p22n29N89k25
$$ -1452 -925 15 -217 78 -1133 -445 531 -339 32 -418 187 -735 1018 335 1158 436 -93 496 271
2784B71J10n45K86j280O65R06l21P85j249RQ30J39r59Q21K50l0p45k06J410j158
$$ 271 381 -164 122 -1158 -493 413 92 877 -372 -363 467 606 -353 468 718 688 -57 -263 1147 -11
2804a1q74J379q35J009n33j72J03N73l96J9k70k75K11J27r22K290j992R09q78
$$ -11 -885 494 -341 668 135 -37 66 639 243 262 -8 -283 -72 55 -867 1423 -569 340 -538
2823e38J03M70K62n20J95M11l15o61L81r7j72K81K2N03j190P53J91K03m16j384
$$ -538 -435 35 297 -223 -28 383 68 -593 -212 -309 -481 -200 -178 325 -865 -112 79 282 -134 -1518
2843a518K465r52o54M29j024J692n87J417p36r69J065j013j13J45J62Q11m83J49
$$ -1518 947 -5 -659 -230 -1254 438 -149 1268 532 -437 628 -385 -498 -353 -191 620 137 286
2861B86L2k59j55P9M45k79K44k62J178j206m00p29K774j100j230O43n84J021j415
$$ 286 318 59 -96 -17 428 149 393 131 1309 103 -297 -1026 1748 648 -582 61 -523 498 -917
2880i17J412l18p94Q45j244J591r29L88l99n55J406j334J008q49O36O52n58m97
$$ -917 495 177 -617 228 -1016 575 -354 34 -365 -920 486 -848 160 -689 -53 599 41 -456
2898d56m65J006o49Q20j177J866j353N0P92n39o6M31L96l98p29J057r44P47P5
$$ -456 -921 85 -564 256 -921 945 -408 -358 434 -105 -171 260 656 258 -471 586 -358 389 464
2917D64J56j63j467J515j322N26M22l50O23l56N52j063N63k11M31R1j288M99P57
$$ 464 620 457 -1010 505 -817 -291 131 -219 404 48 600 -463 100 -111 320 411 -877 -378 379
2936C79l20L66O6k32r49J014K02n59k33Q62o73J00l72K11L55m94k26J173q02K00
$$ 379 59 425 491 259 -690 324 526 -33 -266 596 -77 23 -349 -138 217 -277 -503 670 -132 68
2956F8O07j42N95j991O86k90J041L00o83r86n57J681l82L01O8n90R86j138K73
$$ 68 675 533 1128 -863 -177 -467 574 874 191 -795 -1352 329 -53 248 316 -274 712 -426 -153
2975a53K7K98j74P7P43j038k46o4m46P42N78n48J104j006j048J809k26N54j044
$$ -153 -126 172 -2 75 818 -220 -466 -530 -976 -234 344 -204 900 -106 -1154 655 429 983 -61
2994f1o14N74K01j21J709j508j085P43L34l94L22n55p0K86N64j58j31j291J666
$$ -61 -675 -101 100 -21 1688 180 -905 -162 172 -222 100 -455 -525 -239 325 167 36 -1255 411
3013D11q29n09L84O56K8m00M81k53M28p44o3O75m66J49K61o16K85l45l70N11J570
$$ 411 -418 -927 -543 113 141 -259 222 -31 397 -347 -410 265 -201 -52 209 -407 -122 -467 -837 -326 1244
3034A244j290J54R8m54K04q2J60o45j71J476j628R26P54M36n92K74J5r58M73r44
$$ 1244 -46 108 206 -248 -44 -126 34 -611 -782 694 -934 -8 746 1182 590 864 879 -79 394 -550
3054e50J571j116M42k79k63Q55j690J751l38p21O30K29k65j244J397k41r1Q01
$$ -550 1021 -95 347 68 -195 660 -1030 721 383 -338 292 521 256 -988 409 168 77 878
3072H78j172l7L56K7K0N50n07K93p04K32O47j21q27m3m94R58J90J68p91p9J237
$$ 878 -294 -331 25 52 72 622 115 408 -296 -64 583 462 -365 -408 -902 56 246 414 -377 -456 781
3093G81j05q63n20J191r11L94l27R45o69M2M61o03l90P4O13k84l06M39Q38j652
$$ 781 676 -187 -707 484 -427 -33 -360 585 -84 -42 419 -184 -574 -500 113 -171 -477 -38 800 -852
3113h52K44P2K62J141n95J77p32J13O83l86j70j04M84N1r00P62k09J214j492R81
$$ -852 -608 -536 -274 867 272 449 -283 -170 513 127 -43 -147 337 388 -512 250 41 1255 -237 744
3133G44j188n3L83K53l64j3P26j091J381j214P89ko57Q41n00O50p45J569k107
$$ 744 -444 -497 -114 139 -225 -238 488 -603 778 -436 353 351 -306 535 35 685 -60 1509 -598
3152e98Q51P20j582J044n27m23J25K35R57j016Q44j260N71o8k07J042n12Q8o18
$$ -598 253 973 -609 435 -92 -515 -390 -155 802 -214 630 -630 -59 -127 -334 708 196 284 -334
3171c34J157j145n0m55P71k02L77P45j568L94L33j028R75K15L3r79l5N33P02j154
$$ -334 823 -322 -372 -827 -56 -258 119 864 -704 -310 23 -1005 -30 185 218 -761 -796 -263 439 -715
3191g15M07m86K26J712j110K08m64L40r89L95R84L12n47p09J775j551J192q99
$$ -715 -308 -794 -568 1144 34 242 -222 118 -871 -476 508 820 273 -436 1339 -212 980 81
3209H1L2q52P33R44j544N28j384J477Q06j371J261p44P11j612k21J219J15M93
$$ 81 113 -739 -6 938 -606 -78 -1462 15 821 -550 711 -33 678 -934 -1155 64 179 672
3227F72q80J513j801J141Q6j20m45k22N01j627K343j265l42K7l64O53n47J110
$$ 672 -208 1305 -496 645 731 611 166 -56 445 -1182 1161 -104 -446 -419 -783 -130 -677 433
3245D33J73o78J293m26p1n46k02n35J008K65j212N63J03L04j185R00j2k90k43
$$ 433 606 -72 1221 795 724 178 -24 -559 449 714 -498 65 168 472 -713 187 175 -115 -358
3264c58l15N87O25n99J59l01Q30p78l0k88J41O3j79M53j771P52O41K60J37r08
$$ -358 -673 -86 539 -60 99 -202 628 -150 -180 -468 -327 -264 -443 10 -1761 -1009 -368 -108 29 -879
3284h79O67J693j212q88M38O82p49M28J82m80K19N20lj044O3J205j018L03p81
$$ -879 -212 1481 269 -619 -181 501 -248 180 362 -118 101 621 618 -426 -363 842 -176 127 -654
3303f54Q76o46J200o05n06J183j450J078J82K54Q77k005J301j064R2q53O21M68
$$ -654 222 -424 776 171 -335 848 -602 476 658 912 1789 -216 1085 21 113 -740 -119 349
3321C49J07k17n30O80j71j22j039j76J280r58J094k92O11o53m49N13l33K56N06
$$ 349 456 239 -291 389 218 96 -943 -1119 161 -797 297 5 616 -37 -486 27 -306 -50 456
3340D56L38q70J87P61j944J821j327P90J98o97R61j832J408p56L88p00j97J23
$$ 456 794 -76 111 872 -1072 749 -578 212 410 -287 674 -1158 250 -506 -118 -818 -1015 -892
3358h92Q20Q04J18q20m51J69q53J023o49J403p40K42P99j535O77q55P52L15o63
$$ -892 -72 732 850 30 -421 -252 -1105 -82 -731 672 -68 174 973 -562 115 -740 12 327 -336
3377c36J41J227m41l91k39rm69j4J458p35j612J972J87K73j531K23J275j445Q
$$ -336 -195 1032 591 200 -39 -48 -517 -531 927 192 -1420 552 739 1012 -519 -296 979 -466 -458
3396d58R92q5j312M36J87o7R41j145k3L94K7J40o59N86o1K86j232N13Q59j612
$$ -458 534 449 -863 -427 -240 -307 634 -511 -534 -140 -113 27 -632 -46 -107 179 -1053 -540 319 -1293
3416a293Q84n90O01k82J271p84Q34p72J78M15J9q12P65q84J826r82K8r82Q20q5
$$ -1293 -409 -999 -398 -680 591 -193 641 -131 47 462 481 -331 434 -450 1376 394 422 -560 260 175
3436A75l54J019j245n16N43J414Q8p64m21L48l93n88R0J855j063n11K38M7j77
$$ 175 -179 840 -405 -921 -378 1036 1124 360 -61 287 -106 -694 -604 1251 188 -323 -85 -38 -215
3455b15N44P20j787R61L65K6j172P13J1k19J4l79L37J73L72N21j231q29N80M07
$$ -215 329 1049 -738 223 588 614 -558 155 166 -53 -39 -418 -81 92 464 985 -246 -1075 -495 -88
3475h8L08j158P14m23P38p66K56J369j470N81n59J493o87o70n31m67J169l70Q50
$$ -88 220 -938 -224 -647 91 -675 -419 950 -520 61 -498 995 308 -362 -893 -1360 -191 -561 289
3494B89r61P92R3l04R61q69O76j54o08k33k77J8j94L45R03K09r96l98J236j609
$$ 289 -672 120 213 -91 870 1 677 523 -85 -318 -595 -577 -771 -426 477 686 -310 -708 528 -1081
3514a081J329k06q47J147q90J916j746m02N15M19J11p97J192j361J660q67L56
$$ -1081 248 42 -805 342 -548 1368 -378 -780 -265 154 265 -532 660 -701 959 92 448
3531D48K1j083P91N75r15n69N19P0Q48r16Q51o13p3J68l84M31k79o0j39N56j434
$$ 448 469 -614 177 752 -163 -732 -213 -143 705 -211 640 27 -46 122 -262 169 -110 -170 -309 247 -1187
3552a187P32O15j162J742n38O05j36m41q50M05Q02j415J298J8L26r90N57j96j1
$$ -1187 -455 160 -1002 740 202 807 671 230 -620 -215 587 -828 470 488 814 -176 381 185 174
3571A74j51p25Q31l58l58Q01j089R78j11J18L02k66M15r40N53j473J684l93j57
$$ 174 23 -702 129 -229 -587 214 -875 103 -8 110 412 146 561 -379 174 -1299 385 -8 -165
3590a65Q7r31J911r92J86K70Pk44m11m61K49M17k85n86J397n09n0m29J154r41
$$ -165 -78 -1009 902 -90 96 366 373 129 -282 -743 -494 -77 -362 -948 449 -60 -110 -539 615 -326
3610c26n27J213j223J672j594J18m47J137P89j026M33O16l25q23O26M84j350j94
$$ -326 -853 360 -863 809 -785 -667 -1114 23 812 -214 219 835 510 -313 313 797 -553 -747
3628g47k49M86L18J39p14O39J548j219q21Q08k80K92J34k34j18L43m46l55J482
$$ -747 -996 -510 -192 -53 -767 -128 1420 201 -620 188 -92 200 334 100 -18 325 -121 -476 1006
3647A006q85q65J101n54P01j019j095K097l11N6j333J505j464J753K59j388J229
$$ 1006 121 -744 357 -197 504 -515 -1610 487 176 232 -1101 404 -1060 693 952 -436 793
3664G93j239N87j272J344O41o73M04q30Q75j024J22J13o15J152j150J196j054
$$ 793 -446 141 -1131 213 854 181 585 -245 630 -394 -272 -159 -774 378 -772 424 -630
3681f30P49J20J48J69j148J586j277M95j302J241J101j425N93r49J312l06j88
$$ -630 119 239 387 556 -592 994 -283 212 -1090 151 1252 -173 420 -529 783 477 289
3698B89n34P43n15m56L92N3J171k540J738l42o23R80q98P79o88j08L46rJ01M28
$$ 289 -245 498 -17 -473 -81 -28 1143 -1397 341 -1 -624 356 -542 237 -451 -559 -213 -222 -121 307
3718C07j322J002n37q1J893j508r1k55J419J70j06l26j468J379m8k77m05Q2J88
$$ 307 -1015 -13 -550 -631 1262 -246 -337 -592 827 997 891 565 -903 476 428 151 -254 -172 16
3737A6L32q60P06L22p30j385J593L4q2o11P63o03NK77m19N08L02N96j025K22J84
$$ 16 348 -512 194 516 -214 -1599 -6 28 -54 -665 98 -505 -500 -223 -642 -134 168 764 -261 -39 145
3758A45j111K83K15J588j222Q82k17j022L62m4Q04r68J0O15j085N97L82K01j130
$$ 145 -966 -683 -468 1120 -102 780 563 -459 -97 -141 663 -305 -295 320 -765 -168 214 415 -715
3777g15R28M68j279j45J81L36m2P24j111J092n25K79M34q75J3j93K06O03K32l48
$$ -715 213 681 -598 -743 -562 -226 -268 456 -655 437 -88 191 625 -250 -237 -430 -224 379 611 263
3797B63J4J07p82J64L71j048R85N34m98j084P48j59L0k43K18O78O51j745J181
$$ 263 277 384 -398 -234 137 -911 74 608 110 -974 -226 -385 -355 -598 -380 298 949 -796 385
3816C85m08r29K131j304P26K3n95K10L02q65p66J519j85o32O35r96J370o14R26
$$ 385 -23 -952 1179 -125 601 624 29 239 541 -324 -1090 429 244 -388 247 -749 621 7 933
3835I33j264J113o64q78J387o10j1r25R73n20L03n52N83J327n41k82m75j76K21
$$ 933 -331 782 118 -760 627 17 6 -919 54 -466 -163 -715 -132 1195 654 372 -103 -279 -58
3854e8n54J50M09J86m37P06P14j836N99r97P38p63J004J190j291Q32p88R45n25
$$ -58 -612 -462 -53 133 -304 402 1116 -720 -121 -1118 -380 -1143 -139 1051 -240 592 -196 749 224
3873B24n46q0N72Q9o33M08n17K72K35J99m03j61J337k676J903M04n71O00R66j900
$$ 224 -322 -402 170 259 -374 34 -483 -211 24 223 -180 -341 996 -1680 223 627 56 656 1622 -278
3893b78J61Q83r27P08l29k22P8j70L74j73N3o24j09R2J680j505L95j46M7M08j152
$$ -278 -117 766 -161 547 218 -4 74 -96 278 105 158 -466 -575 -483 1197 -308 87 -59 -12 396 -756
3914g56J304r54J018j070L71J28n55P72n26K37K16p37R44o52L34n08J6M22j10
$$ -756 548 -406 612 -458 -87 41 -514 258 -268 -31 185 -552 392 -260 74 -434 -418 4 -106
3933a06J247j893K012k056P84o09O34O0q9N62m22L85n01M40K08r24O34n16N86
$$ -106 1141 -752 1260 -796 -12 -621 13 73 -16 546 124 509 8 448 656 -268 366 -150 436
3952D36p7l17j47k6l8m55J672j647M10J215r50m45L21j29l50K87Q43p51R1n35
$$ 436 359 42 -105 -131 -169 -624 1048 -599 -189 1026 76 -369 -48 -177 -527 -240 603 -148 -57 -592
3972e92J95K41m83l4O56Q32j11j185j151J911o83L51k21J27K36M72q45l2N12%
$$ -592 -397 -156 -639 -673 -17 815 704 -481 -1632 279 -404 -53 -274 -147 89 561 -284 -316 196 196
3992A96k08K93j6r80N90K96n94N97l94j151O6R37J064j025N55k86J200j334q18
$$ 196 -12 281 265 -715 -125 171 -423 174 -220 -1371 -1305 -368 696 -329 226 -60 1140 -194 -1012
4011a012R28j18J089k777J960n85O54R6rO0j168J417r42J35J61l25J005j551J160
$$ -1012 -84 -202 887 -1890 70 -515 139 235 226 286 -882 535 -407 -272 -111 -436 569 -982 178
4030A78j729J851j15k07o41j98R95m30N93o78J091k83l48o46l22J256m23J024
$$ 178 -1551 300 185 -22 -663 -861 134 -296 297 -381 710 427 79 -567 -889 367 -56 968
4048I68j065q94J523r17J122l09O70n99j545L83M15L11j89P65j07l69J49q52L08
$$ 968 -97 -991 532 -385 737 428 1098 499 -1046 -663 -248 63 -126 639 532 163 312 -540 -232
4067b32J266p51P6K74j352R20j11r67Q28O24k069J452k40k06N43J09o36J253r19
$$ -232 1034 283 359 633 -719 201 90 -877 -49 575 -1494 -42 -282 -488 55 164 -472 781 -138
4086a38k0o65K127k158j03J013J66P60j12q13j210J777j760J868O28k412J586
$$ -138 -158 -823 1304 -854 -957 56 222 982 870 57 -1153 624 -1136 732 1360 -1052 534
4103E34K45o13n6L04r82L36M91j364J414n11R42k86j19R99j546P95q85j04J073
$$ 534 779 166 110 414 -568 -232 259 -1105 309 -202 740 454 335 1334 -212 583 -302 -406 667
4122F67j053L17P2M94n92o67P13M98J067l266K506j531J462j090k62P03j50j82
$$ 667 -386 -69 3 497 -95 -762 -49 449 1516 -1750 756 -775 687 -403 -665 38 -112 -294
4140b94j63Q10p40M18n44L51J11L43j070K47%M09Q39k51l65k75P07k85l26j088
$$ -294 -457 353 -387 31 -513 -162 -51 292 -778 -531 -531 -122 717 466 101 -174 533 248 -78 -1166
4160a166O71J213j240R81j122L32R1l55O91p56P06K47j039k7M58j40R9J177j817
$$ -1166 -495 718 -522 459 -663 -331 -240 -595 96 -660 46 293 -746 -773 -315 -455 -356 821 -996
4179i96R42r60P25P29j359J344k81M03j322p4R09o37J99J352j44k85m91K77j99
$$ -996 -54 -1014 -289 440 -919 425 144 547 -775 -849 60 -577 -378 974 830 545 54 331 132
4198A32j10o10O28k21J189k41o57N09r40Q14r40L21Q7L57j53j312J324l06O16
$$ 132 22 -588 40 -181 1008 767 110 619 -321 493 -447 -126 -39 318 165 -1147 177 -129 487
4217D87k35j110L98o57J279p38J080M63k259J538J60K89j132M52J048j469J213
$$ 487 252 -858 -460 -1117 162 -576 504 967 -1292 246 406 695 -437 15 1063 -406 807
4234H07q51J242j949O05j06o52J411q50P40j462J055j08K71p16J398j246J264
$$ 807 -44 1198 -751 -146 -252 -904 507 -343 397 -1065 -10 -118 153 -563 835 -411 853
4251H53j391K5R63J002j513m52P62m58N31R55j607Q32r79Ll49k07J371p92M47
$$ 853 -538 -513 450 1452 -61 -513 249 -209 322 1277 -330 502 -477 -474 -823 -1030 341 -451 -4
4270dn64J012m91K90k81j200M29N47J036p20J03j10n52O42J98L56j349J45N92
$$ -4 -568 444 -47 243 -38 -1238 -809 -262 774 54 157 47 -505 137 335 691 -658 -513 79
4289G9q00J278q20O08o93J13K84K46k35l13R38l78P45j097n02P45j152J095r21
$$ 79 -721 557 -263 345 -348 -235 49 295 60 -253 685 307 1052 -45 -547 198 -954 141 -780
4308g80J05R57J71J30o65L58o27o29J174k97J04P9J51o86J230p13R44j301m46
$$ -780 -675 282 453 583 -82 276 -351 -980 194 -103 1 80 231 -455 775 62 1006 -295 -741
4327g41J164k00K54P6p50R42j111K82L03m42M64m75J090j207J000n51o87J757
$$ -741 423 223 477 553 -197 745 -366 -84 219 -223 241 -234 856 -351 649 98 -589 1168
4345A168j020M7P02j130k86J217r10k06J000j43M82m71j165L49j46N7J74j24Q85
$$ 1168 148 195 897 -233 -519 698 -212 -418 582 439 921 450 -715 -366 -512 -455 -281 -405 480
4364D80j650J708n44l26J032j549q6N43P37o99J801j481K11L21n67P40j341k53
$$ 480 -1170 538 -6 -332 700 -849 -935 -392 345 -354 1447 -34 177 498 -69 671 -670 -923
4382i23J108N8p3M46j093O78r1l49m04P84q60J61P34N40j483J373n1K04p72O26
$$ -923 185 243 170 616 -477 201 110 -239 -643 141 -719 -558 176 716 -767 606 555 759 -13 613
4402F13q74J55O98l00m50J322j139P4o85P93j22k40n58J002M40p65K08L54l65
$$ 613 -261 -106 592 292 -158 1164 25 99 -586 207 85 -155 -713 289 729 -36 172 526 161
4421A61K87k65m21n47K85l2J72k95J115j06m05M27m94M67l5N55m51r51O70O3P55
$$ 161 448 183 -238 -785 -500 -532 -360 -655 460 354 -51 376 -118 349 314 869 418 -533 137 200 955
4442I55j333Q51K75o30k50j10N48Q9K11k286J132l38K002j103j78J42l57J094
$$ 955 -378 473 748 118 -132 -242 306 395 606 -1680 -548 -886 1116 13 -165 -23 -380 714
4460G14r58Q51l66r30J177q43J95N85j68q10m72J061o14P71j087J168k89J245
$$ 714 -244 607 241 -689 488 -355 -160 425 257 -553 -1025 36 -578 193 -894 274 -15 1230
4478A230q55q73P08q53Q90J79k65k49n59R03o24K13Q80q15m65M31O45r96k74R
$$ 1230 375 -498 210 -643 247 426 161 -88 -647 256 -368 -155 725 -90 -555 -124 521 -475 -749 -740
4498g40O34L17J057j418L9Q57r29J78j120M02R10k34n69P30P17j064l83Q24J24
$$ -740 -106 211 1268 -150 -111 746 -183 -5 -1125 -723 187 -47 -616 114 831 -233 -616 208 332
4517C32k11J4L47K14o32q44J762k333J590m38o3j6l11k79J048r82J512r41J131
$$ 332 121 135 482 696 64 -780 982 -1351 239 -199 -262 -278 -589 -868 180 -802 710 -231 900
4536I00r38Q62j830P62o04Q70L18n59P09m43m93p81J299P5J14m05q3j59p25K197
$$ 900 -38 824 -1006 -244 -848 22 340 -219 490 47 -446 -1227 72 147 261 -144 -227 -386 -1111 1086
4556A086j136R7M06q87J381j488J025j058J07J491n99j83QJ72p11q6J356j611
$$ 1086 -50 47 453 -434 947 -541 484 -574 -467 1024 425 242 250 422 -289 -375 981 -630
4574f30J544o76RJ14m04l22l72O46n75K308j882J669j379Q7l60R5M73m85N26j168
$$ -630 914 238 247 361 -43 -365 -737 -91 -666 1642 -240 1429 50 137 -223 -128 345 -140 386 -782
4594g82L33k10P55N63j71O07o29r21K55j181P41L34J1p8OP27O3o80R33j311J690
$$ -782 -449 -659 96 659 488 1095 466 -455 -200 -1381 -640 -306 -295 -373 -367 360 423 -257 676 -635 1055
4615A055j801K61J020j226R46j087J523j009j10P59j03R71j350K29K03j89P28
$$ 1055 -746 -485 535 -691 255 -832 691 -318 -428 331 228 1199 -151 78 281 92 820
4632H20j350nO74l04J378j704k81P78M18m68Q25p37J426r01k22K65o29n20r20
$$ 820 -530 -535 139 -165 1213 -491 -772 6 424 -44 781 44 1470 569 347 612 -17 -537 -1457
4651a457K006m05j090J437j345K68Q2Q48q48J058n8j919J004J86M65L07n55J42
$$ -1457 549 144 -946 491 -854 -586 -504 344 -504 554 496 -1423 -419 -233 232 539 -16 126
4669A26j140J182K72l47o58o47J152L94L43j257K01J8n09j02L55J397j012L03
$$ 126 -1014 168 440 93 -565 -1212 -60 334 677 -580 -379 -361 -870 -972 -617 780 -232 71
4687G1K05p75J741p02k56N21j048K64r0J78Q6m48P84m93P64l22j288K292j440
$$ 71 276 -499 1242 540 284 805 -243 21 -69 109 195 -253 531 38 802 480 -808 1484 44
4706D4k90J105j18o63o2l98j48J26j89J648j425K1k26M8j28M92m9J169m1j569
$$ 44 -246 859 741 78 16 -382 -530 -404 -593 1055 -370 -349 -575 -527 -655 -163 -212 957 916 -653
4726f53j19P07k84P28j770K517j414j94J958j107P68m02j38q90l60L83j55J128
$$ -653 -772 -65 -349 379 -1391 1126 -288 -482 1476 369 1137 735 597 -293 -653 -270 -425 703
4744G03j285J392j217r0Q63l51k43L33k76l13J124r26j88J467j221N99p44o3R12
$$ 703 -582 810 -407 -497 366 15 -228 105 -171 -484 640 -286 -474 993 -228 371 -373 -436 476
4763D76r90J156j444L09j04J067m27N73k60p63P90m42j32M15q25J163l5m64K38
$$ 476 -514 642 -802 -493 -597 470 43 616 356 -407 383 -59 -191 224 -601 562 527 63 301
4782C01p70q2J179k56j128Q83O37j409O94m57Q45R49j412J196j722J484j090j43
$$ 301 -469 -551 628 372 -756 127 764 -645 49 -408 437 1386 -26 1170 -552 932 -158 -301
4800c01K43l17J516p95L28n12j071K29J33J685p24k34l20o53J567j582J243j279
$$ -301 -58 -375 1141 346 674 162 -909 -680 -547 1138 414 180 -140 -793 774 -808 435 -844
4818h44J290p14R18k61K32k75j232J161j02N90j31j304P08j489J551p91R23j29
$$ -844 446 -268 650 389 621 346 -886 275 173 763 632 -672 36 -1453 98 -693 230 101
4836A01j001L46k81J881k31n62j88M79Q0k116K419j622L22R60j451J31L78J088
$$ 101 -900 -554 -835 1046 815 253 65 544 624 -1492 927 -695 -373 587 -864 -733 -355 733
4854G33m53O21p31j82J873k085P7L5p27J178j01q16M57m02m29R15k57L36P4N93
$$ 733 280 901 170 -12 1861 -224 -147 -112 -839 339 238 -578 -121 -523 -952 -37 -294 42 116 709
4874G09l75q14R58o41K65o41PO82k73j220K689j523M73Q01j751J034j359O18L47
$$ 709 334 -480 478 -163 102 -539 -532 150 -123 -1343 1346 -177 296 1097 -654 380 -979 -361 -14
4893a4r2J167j831J389j172J055o84L31o7J83r7j099J529j127O56j023j48J941
$$ -14 -106 1061 -770 619 -553 502 -182 149 82 265 168 -931 598 -529 127 -896 -1044 897
4911H97j467L40l17R75q48L18N64r07L02J50Q04l70j147Q93n11k11O57M70p77
$$ 897 -570 -230 -547 428 -420 -102 462 -445 -143 7 811 441 -706 187 -324 -535 122 592 -185
4930a85q25J290j550J286J55o43N68L62o38J643j247m48r2L62j9Q68j609l22J681
$$ -185 -1010 280 -1270 16 171 -472 96 458 -180 1463 216 -232 -324 38 19 887 -722 -1044 637
4949F37r49Q40q42K94p33J283n22O63q59N78K4p66j64O90r27L51J19O8L65l09
$$ 637 -312 528 -314 -20 -753 530 8 671 -188 390 414 -352 -516 174 -753 -402 -283 -215 150 -159
4969a59J308j392L39K28q81L48p36K358j578O37o60Q73r22L09k12j217J715q12
$$ -159 1149 -243 96 324 -557 -209 -945 1413 -165 472 -188 685 -237 72 -140 -1357 358 -454
4987d54j155J555M30m86l85J395l68o10m1N28K73j630J784j786R77L58r19P30
$$ -454 -1609 -54 376 -110 -495 900 532 -78 -119 409 682 -948 836 -950 27 385 -534 196
5005A96j29l19K0R80n91o27L24n05J012m94j83k44k05K89m44J565j492L27J175
$$ 196 67 -252 -232 748 157 -470 -146 -651 361 -133 -316 -560 -765 -476 -920 645 -847 -520 655
5024F55m58j058N04J480k183J034n46J194p86K95N10n55J031q22l45K28k80N81
$$ 655 197 -861 -357 1123 -1060 -26 -572 622 -164 131 641 86 1117 295 -50 178 -102 479
5042D79j926J496O41j350J135l77j87m27J01l45k84J405q4J05j47l28L95k4j32
$$ 479 -1447 49 690 -660 475 98 -89 -516 -415 -760 -1044 361 277 382 235 -93 302 278 146
5061A46R3j50K81j069J477j285M43N26p06J059j800J708k124J100R6j94N60l58
$$ 146 239 89 370 -699 778 -507 -64 462 -244 815 -985 723 -1401 -301 -205 -399 161 -197
5079a97O86o95n3J118p55M33p30P36l35l68J040j037J396k801Q08L15O20M2r92
$$ -197 489 -206 -259 859 104 537 -193 543 208 -160 880 -157 1239 -1562 -754 -439 181 223 -769
5098g69J020j27N92j212J938j206m35P60o36L20M93q86M75p75L88L68j42l94P81
$$ -769 251 124 716 -496 1442 236 -199 561 -75 245 738 -148 327 -448 -60 308 166 -228 553
5117E53j100O85Q03j032L87m77k60j77L82j78k18J39O59O36o87p09J14J35J191
$$ 553 -547 138 941 -91 296 -181 -441 -618 -236 -414 -632 -493 166 802 115 -594 -480 -345 846
5136H46m40j404J374j128R03P9J38J83j118Q82k19L38M16m84m21p04J438q16J46
$$ 846 406 -998 376 -752 151 230 368 551 -567 315 96 434 850 366 -55 -759 679 -137 9
5155IP10j375O55m92N20L6K11r92O05L82J22L54j159J004j85j99j258M73P93r3
$$ 9 719 -656 -1 -493 27 63 274 -718 -113 269 391 745 -414 590 405 206 -1052 -579 214 121
5175A21m79M51l42pj08R85l82J73J87j121K09k31J410m59m84j206M9J182l96J293
$$ 121 -358 93 -249 -256 -364 621 239 412 599 -522 -313 -544 866 407 -77 -1283 -1234 -52 -448 845
5195H45j364J55P72l27K97p5o70P59L98j078P0J05R93q66n19J27O81r15M99q01
$$ 845 -519 -364 408 81 378 303 -367 392 790 -288 -218 -113 880 14 -505 -378 303 -612 -113 -914
5215i14J099l51J18l36N27L62k88p31l05N97O07k61j026j89J696j47j598J141
$$ -914 185 -166 -48 -384 143 505 217 -514 -819 -222 385 124 -902 -1091 605 458 -1140 1
5233An36P27N15o60l46k45P34kM92j908K262n03j206Q94J59q07R11j124N04m12
$$ 1 -535 192 707 47 -299 -544 190 188 680 -1228 1034 531 -675 219 378 -429 482 -642 -138 -550
5253e50J224q21J107K34j689O46n45P07o50M95N36m63K0o97J794j491m5M14K58
$$ -550 674 -147 960 1194 -495 151 -394 313 -337 158 694 231 251 -446 1348 -143 -188 226 484
5272D84n98l72n68j81K811n66q58l78l71M75L59k82O6L49q59n71J716o34J00o03
$$ 484 -114 -486 -1054 -1235 1576 1010 152 -226 -597 -122 237 -45 21 370 -489 -1060 656 22 122 -481
5292d81J098p15M45L43k035K127j115p22R33J06p21K83J618j328l15J307j38j100
$$ -481 617 -98 347 690 -1345 782 -333 -1055 -122 -16 -737 -454 1164 -164 -479 828 690 -410
5310d10k81N13j68P47j078J282j091O6k03R25r43K12K53q21M56Q81q37l38R13
$$ -410 -691 -178 -346 401 -677 605 -486 -420 -623 302 -641 -429 -176 -997 -541 340 -497 -835 78
5329G8K87j59O04j755J958j207O91j42K0j50p11J496k350Q65K75QJ99J55M27j59
$$ 78 365 206 810 -945 1013 -194 497 355 375 225 -486 1010 -1340 -475 -200 -192 7 162 589 430
5349D30n16n88J382j519J38Q59p26J726n45r97Q88m09L44O8J39j142J107m18n63
$$ 430 -86 -674 708 -811 -673 186 -540 1186 641 -356 532 123 467 535 674 -468 639 221 -342
5368c42M49j107J542q92M85j95p83J534n39K4o33K7j6k33J005j177P8J376l32
$$ -342 107 -1000 542 -350 135 -60 -843 691 152 176 -457 -430 -446 -679 326 -851 -773 603 271
5387B71j10L39n08p29Q63j073J205P9r6M96j555N81K54J28k45j06J242o44k31
$$ 271 161 500 -8 -737 126 -947 258 337 241 737 -818 -237 17 145 -100 -206 1036 392 161
5406A61K86q31J452p37q93O16K52K86q56J259r10P32o36N14m1j001J301j207N71
$$ 161 447 -384 1068 331 -562 54 306 592 -264 995 85 817 181 695 654 -347 954 -253 318
5425C18l50j8J290j835J192j447O3J355j855Q16O10K010j679M59o41k86O72j289
$$ 318 -32 -50 1240 -595 597 -850 -787 568 -1287 -471 139 2149 470 929 288 2 674 -615
5443f15J327j153N03M42j168P78j139J122o31L46J46Q3M31Q1r01Q8J583j473J35
$$ -615 712 -441 62 504 -664 114 -1025 97 -534 -188 -42 41 472 553 -348 -260 1323 -150 -15
5462a5R01j771J384j14L16Q30k338J819q58l86j241K460j040J091l96M46n63o23
$$ -15 886 -885 499 385 701 1531 -807 1012 154 -232 -1473 987 -53 1038 642 1088 525 -98
5480i8N42k75N69l7p91K1Q64j192N89m10N82k89m93J57Jl44R02J02J139k222J94
$$ -98 444 169 738 701 -90 -69 795 -397 192 -218 364 75 -418 -261 -260 -604 298 400 1539 -683 -489
5501d89P66r37M65q9L45j55P2m9n18K36N2J385j673M69o6n69K01J272n95Q28m38
$$ -489 277 -660 -195 -284 61 -94 -22 -71 -589 -353 -301 1084 -589 -120 -186 -755 -554 718 123 951 513
5522E13j081J505k832K013J1J41J140j494L20J9K88k11k39J75m13J82q12J240
$$ 513 -568 937 -1895 118 129 270 1410 -84 236 255 543 332 93 268 -145 37 -775 465
5540D65m33J007j617O21j115J112L30p97k48J718j322O45n67J9K45j7K35j457
$$ 465 32 1039 -578 43 -1072 40 370 -427 -675 1043 -279 366 -201 -182 63 46 281 -1176
5558a176J578j005J133j564J524L31j470R10m55m7r1m49R11L64N9k31m88K4L62
$$ -1176 402 -603 530 -1034 490 821 -649 261 -194 -241 -332 -781 130 494 553 322 -166 -142 220
5577B20K3mj019J103j354J014j3rJ14O05n48q07P97o64L85K85r66J208r09J258
$$ 220 243 239 -780 323 -1031 -17 -30 -39 75 680 132 -675 122 -542 -157 128 -838 370 -539 719
5597G19q95k17K06R0O5j662K448j322J508o51j109J553r85N64n23J450l33j155
$$ 719 -176 -393 -187 -97 -32 -1694 754 -568 940 289 -820 733 -252 312 -211 1239 906 -249
5615b49l1N60J239k074J167j144L83n60L96J564j520n15O79J363k323K050j380
$$ -249 -280 280 1519 -555 612 -532 -149 -709 -313 1251 -269 -784 -105 1258 -1065 985 -395
5632c95l99O45P39N8n47j635K193j110P30j428J869q86M54m96p8K19n91P79K37
$$ -395 -794 -149 590 648 101 -1534 659 -451 279 -1149 720 -166 288 -208 -286 -67 -658 121 358
5651C58K5j71j96m25k1L67j049J688K6j436J496q18j98m1L71r3P84n47J63k93
$$ 358 383 212 16 -409 -430 -63 -1112 576 602 -834 662 -156 -354 -395 -24 -117 667 120 283 -10
5671a0L98R13j407O88J41q98L88J87m27m66k42k75J303j044J252J11p64J819j138
$$ -10 388 1301 -106 582 723 -175 213 400 -27 -493 -735 -1010 293 -751 501 612 -152 1667 529
5690E29n42K97N99j253M18K04K42q8j809O75R84p74J47N38N22j604K394k569J798
$$ 529 -13 284 883 -370 48 252 494 406 -1403 -728 256 -518 -371 167 689 -915 1479 -1090 708
5709G08J72n99P06p21O61j454P99M80r55J256j055M05q29L04K96n83J691k316
$$ 708 880 281 987 266 927 -527 272 752 -203 1053 -2 403 -426 -122 174 -409 1282 -1034
5727a034J923k35l23K11M39j077k21O40j477J591R7j144o59J120O08j388K096
$$ -1034 889 654 331 542 981 -96 -317 323 -1154 437 534 -610 -1269 -149 459 -929 1167
5744A167n63r39r4Q68L49j266J83O84J51p07N84o0L2M57j385K27n19Q61L97m72
$$ 1167 604 -335 -429 439 788 -478 -295 389 540 -167 417 357 389 846 -539 -312 -831 30 427 -45
5764d5j7j08J51l51R58q47J63N15o00k61O46n52q26J156j99P18q64M99L86o55
$$ -45 -62 -170 -19 -370 588 -259 -96 419 -181 -442 204 -348 -1174 -18 -217 501 -363 136 522 -133
5784a33N53j086P75Q52J46j075K56j58k24K72P43k27j004M83O16j115m86K39L67
$$ -133 420 -666 109 961 1107 32 288 130 -94 178 921 694 -310 173 789 -326 -812 -573 -206
5803b06K51m05N64n12R87j56j130L51k59p86J532N64N0k20o76O50j414p86K304
$$ -206 45 -360 204 -308 679 523 -607 -256 -515 -1301 231 795 845 625 -51 599 -815 -1601 703
5822G03n09m9j18j24k32m16J382j362J042q93m9J349q79k76p3Q64n96J63J007
$$ 703 194 145 27 -97 -329 -745 637 -725 317 -576 -625 724 -155 -431 -504 360 -236 -73 934
5841I34j148o53J124l54Q85o05m40k94m46J487j296J144P11k505J394q2j60J26
$$ 934 -214 -867 257 -97 788 183 -257 -551 -997 490 -806 338 1049 -1456 -62 -144 -304 -178
5859a78J8N78l46P92j490Q63j093J681r45j09K81O24qn88J69J19m72m10O32J161
$$ -178 -160 418 72 864 -626 237 -856 825 -120 -229 52 676 668 80 249 368 -104 -514 118 1279
5879A279j331J096o84q82Q96M32n75j158J013k19J037p80L38r01Q12m47J7N06
$$ 1279 -52 1044 360 -522 374 806 231 -927 86 -133 904 124 462 -439 373 -74 -57 449
5897D49n78R43K06j815K653k894J167o85P95J084j297J071k690P98J119r85M50
$$ 449 -129 814 1020 -795 1858 -1036 131 -554 241 1325 28 1099 -1591 -793 326 -659 -209
5914b09J54m13M79l74L25J07k88j06M94N2n2k7j66L69l4M71p27r90P56n00J436
$$ -209 -55 -468 11 -363 -38 69 -219 -325 169 221 169 142 -24 345 311 782 55 -935 -179 -679 757
5935G57K33l47o6j307J590j60j239K88k86J39M0n89J906p73K49m27L93j702J160
$$ 757 990 643 577 -730 860 700 -539 -251 -537 -398 -358 -947 959 186 435 8 401 -1301 -141
5954a41j074M34R46K29J60o55Q95j026J47j46J74J39k05n92k18J656j723J981
$$ -141 -1215 -781 165 394 554 -101 794 -232 -85 -231 -57 82 -123 -715 -933 723 -1000 981
5972I81j63j481J255j408P45k77O03m12o53J198j480J390N9k01K00j63N67j233
$$ 981 818 -663 592 -816 -71 -348 255 -157 -810 388 -1092 298 357 156 356 193 760 -473
5990d73l77R19N01j351K12J007j124N09L83p50P71k29M86o20R02j040l53R22k08
$$ -473 -850 69 570 -781 -569 438 -686 -177 206 -544 227 -2 484 -136 766 -274 -627 295 87
6009H7l97m73J303J26n76k42o93M07j62l17R21l08J204j468J072o60r4N05n15
$$ 87 -310 -783 520 646 70 -172 -865 -458 -620 -937 -16 -324 880 -588 484 -176 -270 235 -280
6028b80M29O1L30n20n94O26O92p27k67Q91j8j91o34M10j99M67k14n57N55l31n87
$$ -280 149 210 540 20 -574 52 744 17 -250 641 623 432 -202 208 9 476 262 -295 260 -71 -658
6049f58N57l48M81O46q77J603j085Q43j601R74j114P20N69k114J933K04m41N77
$$ -658 -101 -449 32 678 -199 1404 319 1162 -439 535 -579 141 710 -1404 529 733 292 869
6067H69j261L01K27m95J74O20K00r66J566j916J593q47n45J71m93J070r79O99
$$ 869 -392 -91 136 -359 -185 435 635 -331 1235 -681 912 65 -480 -309 -802 268 -711 -12
6085a2j292K373O9j352M11q82J146n47m55M33J07o2O34J86r78j57M28O2J7o37
$$ -12 -1304 1069 1138 -214 197 -685 461 -86 -541 -108 -1 -63 571 757 -221 -378 50 112 129 -508
6105e08L41J43l94O94M1l28J112j231k9m06J049n63n98K58O5n06l32J475k87J31
$$ -508 -167 -24 -418 276 317 -11 1101 -130 -159 -565 484 -79 -677 -419 -354 -860 -1192 283 -4 127
6125A27J94j568J048n38K65L74j47J110j924Q53o11J180n66L69J100j192L17j258
$$ 127 321 -1247 -199 -737 -472 -98 -245 865 -1059 -206 -817 363 -203 166 1266 74 391 -867
6143h67J338o11j278K387j204J18o33P77K80p39J45m19J664j333J504q55o82L90
$$ -867 471 -140 -1418 969 -235 -117 -750 27 307 -432 -287 -706 958 -375 1129 274 -408 -18
6161a8j05MO05L40q93P78n19n11J849j601R28o55m91q4P87J32j098k24L61P09
$$ -18 -123 -119 486 826 -67 711 192 -319 1530 -71 857 202 -289 -373 414 546 -552 -776 -415 294
6181B94o32M10K65j98m21K47O14J42n91l72N3J60m3p96J617j246N44Q7p0l75P17
$$ 294 -338 72 337 139 -282 -35 579 721 130 -242 -189 -29 -72 -868 749 -497 47 134 64 -311 406
6202D06j018J050o37L0l50N20O91j408J391r60l96P52o32L16J071j132J165j192
$$ 406 -612 438 -199 -169 -519 1 692 -716 675 -285 -681 71 -561 -245 826 -306 859 -333
6220c33M55n00M5O27j118J381j955Q88P21q68J796j817q32J384o91J211R4r6n75
$$ -333 122 -378 -333 294 -824 557 -1398 -510 211 -657 1139 -678 -1510 -126 -817 394 488 392 -183
6239a83J85N25k95K06j292J653j344N72N90j335O13j033J897o27L05j029j13R7
$$ -183 2 527 232 438 -854 799 -545 27 617 -718 -105 -1138 759 132 437 -592 -705 -608
6257f08N19M52n16q8l80R98N59j040N88j647L009j525K29M84n94p27J86j31L71
$$ -608 -89 363 -153 -241 -621 377 936 -104 484 -1163 1846 321 550 1034 440 -287 -101 -232 139
6276A39n81r9j55O77o68J278j049L9R22K53o31o85O67j6K60q43M14j188R24j486
$$ 139 -442 -541 -696 -19 -687 591 -458 -419 503 756 125 -560 107 91 351 -492 -78 -1266 -342 -1828
6296a828J696K43p32J422j93p35J97J423j877m31J819j126M86q63J236j53o01
$$ -1828 -132 111 -621 801 608 -127 70 1493 -384 -815 1004 -122 364 -499 737 584 -17
6313a7K7M46j68j067J699j823j28N34K57K38o29R48j147J365j243J779j209p67
$$ -17 10 456 288 -779 920 -903 -1031 -497 -240 -2 -631 317 -830 535 -708 1071 -138 -905
6331i05J412j173J380j6j522J337j100R09m25j78N03o8J81j072R88j117J564m09
$$ -905 507 -666 714 698 -824 513 -587 322 -103 -281 222 154 335 -737 251 -866 698 289
6349B89j606J461q1o67J59j33J558K49j883J148N68j784J480q57J35O57M7o6j369
$$ 289 -1317 144 63 -604 -445 -578 980 1229 -654 494 1062 -722 758 -99 36 693 740 674 -695
6368f95O00Q20r05O93j294L29J297m10l7o43n17Q50m06m75K20J806l01k426K065
$$ -695 -95 725 -180 513 -781 -452 845 435 398 -245 -762 88 -318 -793 -573 1233 932 -1494 571
6387E71m66O11j324P84n7P75n27q31j70j40J195j45j07J89r91J298r57K48q40
$$ 571 105 716 -608 176 119 894 367 -464 -634 -774 421 276 169 358 -633 665 -292 -44 -884
6406h84O38J75Q9P93j622N1o01J790p12R13O43j450n09J301j005M0K49M27o96
$$ -884 -246 -71 18 811 -811 -760 -1361 429 -283 630 1273 -177 -686 615 -390 -350 -101 326 -370
6425c70J522j459k09J214j428J476j594J355k3j234K0L92L40N8J5q86J010p72
$$ -370 1152 -307 -516 698 -730 746 -848 507 484 -750 -730 -338 2 60 75 -811 199 -573
6443e73Q92j68o55J37M57m97N91k02M21p18O7j19L05k99J352n46L93j270R22l27
$$ -573 319 151 -504 -367 90 -407 184 -18 403 -315 -248 -367 -62 -361 991 445 838 -432 490 163
6463A63O22j110j28J16J387l19j937J523r87J217l46j228O07k1N71n15J14P2j32
$$ 163 785 -325 -453 -337 1050 731 -1206 317 -670 547 201 -1027 -420 -441 130 -385 -271 -199 -331
6482c31N85k87L97r61O96n6n79J117j92R71j968J105j510K45M33j99Q30r1J56
$$ -331 254 -33 364 -597 99 43 -536 581 389 1360 -608 497 -1013 -768 -335 -534 296 205 361
6501C61j3r47K70L95l11m39O13J34m20P62p2n1j424J054k11J093j149j143M22
$$ 361 348 -599 -329 66 -245 -684 -71 63 -357 405 333 282 -1142 -88 -299 794 -355 -1498 -1076
6520a076R51l82L15N00K22q17J195j251O92j59N08n2m29m72o70J057l08O03n42
$$ -1076 -125 -507 -192 308 530 -287 908 -343 349 190 698 646 217 -255 -925 132 -176 427 -115
6539a15O32l80J249j546N45n17p32O62O50k96j552J481j034J002j05p46N90j81
$$ -115 517 137 1386 -160 385 -132 -864 -202 448 152 -1400 81 -953 49 -56 -802 -212 -393
6557c93M16o68N51K1K67k8l19R22j028O71j671N04L27k0J73j46O21r88J009j37
$$ -393 23 -645 -94 -73 194 166 -153 769 -259 412 -1259 -755 -428 -448 -275 -421 200 -788 221 84
6577H4j35m67O8J648j386p0J36k07R10j039Q98l88P82p27o54R96J25N10j020j229
$$ 84 -51 -518 -450 1198 -188 -258 -122 -329 581 -458 440 52 834 107 -547 449 574 1084 64 -1165
6597a165P71j135J247N26Q36r22p45Q80r79j23P04R0M65L51o79K80R4j151J342
$$ -1165 -394 -1529 -282 244 1080 158 -587 293 -686 -809 -105 -15 450 801 122 402 496 -655 687
6616F87j109J323r96k66M78p09N86p65R23J81J43q60k56J039j23P08q92r37K03
$$ 687 -422 901 -95 -361 117 -592 -6 -771 152 333 476 -384 -640 399 276 984 92 -845 -642
6635f42R85J04n22L55l22M44K7J52M77m77p75j26j26P87l2p88l82O39M59o68O9
$$ -642 343 447 -75 280 -42 402 429 581 1058 581 -194 -320 -446 341 309 -479 -861 -222 237 -431 -362
6656c62J94n1q7M30k69K75k5j3p59P89j011J638p06M14p21n26Q65p51J143q11
$$ -362 -168 -219 -306 124 -145 130 105 92 -667 122 -889 749 43 457 -264 -790 75 -676 467 -344
6676c44m32J046M08k82j469J856p16L77n21n51J288k075K087j120J1O71j237R75
$$ -344 -776 270 678 396 -1073 783 67 444 -77 -628 660 -1415 672 -448 -437 234 -1003 -28
6694b8o45J162j877J605K83r08O69p69R20L95m54k60q07J52J047L72j258N98j90
$$ -28 -673 489 -1388 217 500 -408 261 -508 412 807 353 93 -714 -562 485 857 -401 197 7
6713GN09m61k63N77l19p05O00J38k73K15n60L07p31J078K25j42q29q1J375m93
$$ 7 516 55 -208 369 50 -655 -55 83 -190 25 -535 -228 -959 119 344 202 -627 -708 667 174
6733A74j14r51J326j060l30J139k58J292j866n90L91M84O59n44R71j331P99M59
$$ 174 60 -891 435 -625 -955 184 -74 1218 -648 -1238 -847 -363 296 -248 723 -608 191 650
6751F50j718J975p02m37o1L91j55%J002k039K310j909R28J4j02J58p38J612r22
$$ 650 -1068 907 205 -232 -293 98 -57 -57 945 -1094 1216 -693 235 249 147 305 -433 1179 257
6770B57l52m70O38k12K58l53j1j089Q23K55J452j836Q18j459Q37J050j199j43
$$ 257 -95 -565 73 -139 119 -234 -245 -1334 -511 -256 1196 -640 178 -1281 -444 606 -593 -736
6788g36J772r37j62j02q40J332m4j72k41l70Q49L94q10l86J56N95L30j292J52
$$ -736 1036 99 -63 -165 -1005 327 283 111 -130 -500 349 743 -67 -453 -297 298 628 -664 -512
6807e12M81k64M68k99j363R52lJ342p7j015o96J267j429Q94JO63n02n81J199L3
$$ -512 -31 -295 173 -126 -1489 -537 -540 802 725 -290 -986 281 -1148 -254 -253 410 -92 -673 526 559
6827E59j093J622p25m7k15j416Q38k47J113m60p93J85K28k54J192j197R94l58
$$ 559 -534 1088 363 316 101 -1315 -477 -724 389 -71 -864 -679 -451 -705 487 -710 284 -74
6845g4k44K74n09J052j560P22J053j167M48j165J783r17N23q18J249n32K58m62
$$ -74 -318 -44 -553 499 -1061 -339 714 -453 -5 -1170 613 -304 219 -599 650 118 376 -86
6863h6m92L62K25M35l71n14K76O0k83K60m51L64r92P03N44L65n95L16J48m40p2
$$ -86 -578 -216 9 444 73 -441 -165 -105 -388 -128 -579 -215 -1207 -504 40 405 -190 126 274 -166 -238
6884b38k05O95j5j2n79J293k62o93L83p79l83K83M44O89p59k97P55J56n95M5j14
$$ -238 -443 252 237 225 -354 939 677 -16 367 -412 -795 -512 -68 621 -138 -435 320 476 -119 -74 -188
6905a88N5q11J53J2J040l76o73R95p91R91K0q00o52J180j020P4M58N23j80R14
$$ -188 -133 -944 -791 -779 261 -115 -788 207 -584 407 427 -373 -1025 155 -865 -791 -333 190 10 924
6925I24j875P27j51J598p29N48k02q20Q2k56J042j530J311r42O78Pq76Q19J46
$$ 924 -951 -224 -375 1223 494 1042 840 20 102 -154 888 -642 669 -273 405 412 -464 355 501
6944E01o42n15J042k04j045J754j459L82O86r38L98m08L79N77K46j305n10J023
$$ 501 -141 -656 386 182 -863 891 -568 -186 500 -438 -40 -448 -69 508 754 -551 -1061 -38
6962c8K11l43n83K794j403J01p72j211J672r7K4k9N0m64L60l26P91j92p88k03
$$ -38 173 -170 -753 2041 638 739 -33 -1244 428 331 355 326 376 -88 272 -54 737 545 -243 -446
6982d46Q59k82p86R88j410K301k084J226L19o93l19j88Q50p76K16N52j313O59
$$ -446 413 131 -655 333 -1077 1224 -860 366 685 -8 -327 -515 335 -441 -225 327 -986 -327
7000c27m54J845j136L36n34R54oJ12l75O3P58j500Q43l77J93Q43k187O31q28O26
$$ -327 -781 1064 -72 264 -270 684 678 790 415 478 1236 -264 579 202 395 1238 -949 -318 -1146 -520
7020e20j21M3K405k407O20o8k26N30p29J054j265Q44p38l31P55Q4j71m94J080
$$ -520 -641 -598 1807 -600 20 -48 -274 256 -473 581 -684 160 -578 -909 -154 -70 -241 -735 345
7039C45j212J202q20J98l73N53M41k80j38J68o12N12N33k73r16N62K75k28r58
$$ 345 -867 335 -485 -287 -660 -107 334 54 -84 84 -528 -16 517 244 -672 -110 165 -63 -1021
7058a021R11N22n29l66NL72Q6p34J212L9p77O97o44r29K137r08K48k26o83P33
$$ -1021 -110 412 -117 -483 -478 -106 -20 -754 458 497 -280 417 -227 -1156 981 73 321 95 -588 145
7078A45P14j259P81r17R52R56j789P89l47l06J037k437J940j71J62J47k09J29
$$ 145 859 -400 381 -536 416 1372 -417 372 25 -281 756 -1681 259 88 250 397 188 317
7096C17j344M97K56N91O37l71K23j450M26m35j62J579j039J76q77R34k80p0R11
$$ 317 -1027 -530 -274 317 954 583 806 -644 -218 -653 -815 764 -275 -99 -976 -42 -322 -392 519
7115E19n57l56K62R85r13L26n68l48N05j171K533k039J069Jp46j84N12k2Q85m07
$$ 519 -38 -394 -132 853 -60 266 -302 -650 -145 -1316 1217 -822 247 248 -498 -682 -170 -192 693 286
7135B86l41Q09m31n28O00o59m26M11k5L47l58R00j636J134q31Q01l19k52k97N62
$$ 286 -55 754 323 -205 395 -264 -690 -279 -304 43 -315 585 -1051 83 -748 53 -266 -518 -815 -253
7155b53N77o40J136j089P02k31m22O98j84K23j01j145P58p02R46k40p83Q04P9
$$ -253 324 -316 820 -269 433 202 -220 478 294 517 416 -729 29 -673 273 33 -750 54 133
7174A33j8Rj084k79R58L48O20j196P08j477Q00R46l69o06M10Q27j994J647l6l58
$$ 133 115 124 -960 -1239 -281 67 687 -509 199 -1278 -478 468 99 -507 -97 730 -1264 383 347 -11
7194a1K6j93P72j088J524j046k65J38J190j584N5J123k382J769n3o13P29j23K33
$$ -11 15 -178 594 -494 1030 -16 -281 -143 1047 -537 -482 641 -1741 28 -25 -638 91 -32 201
7213B01k47j022J579k88m5j095J440j448N71N39m29M74k1N42j188J83J81O81j239
$$ 201 -46 -1068 511 223 178 -917 523 -925 -354 185 -244 230 209 751 -437 -254 -73 608 -631
7232f31M40L57n43N43Q20j698P09l60L34p40M56P08q22k40K61P42p90J378m15
$$ -631 -191 166 -377 166 986 -712 -3 -363 -29 -769 -313 395 -427 -667 -406 336 -454 924 509
7251E09r29j10L74M82R0o61L52n89Q81Q38j294J708j796n66O53o63R87n50K80
$$ 509 -420 -530 -156 326 416 -245 107 -482 399 1237 -57 1651 -145 -711 -58 -721 266 -284 -4
7270dp52O34J14K74m3k36r07L6J537o15J92O0m84N49j980K772o87R2j584P49P05
$$ -4 -756 -122 -8 266 223 -13 -920 -884 653 38 230 290 -194 355 -1625 1147 460 552 -1032 -283 422
7291D22q83R48j489K366r74M03j526M33J423l79p8k36O47j455K64J411j344l69
$$ 422 -461 487 -1002 1364 390 793 -733 -300 1123 744 666 430 1077 -378 -114 1297 -47 -416
7309d16n18J362k46K85R39j460N81j035J005p83m99J923j810J393j809J353k80
$$ -416 -934 428 182 467 1406 -54 527 -508 497 -286 -785 1138 -672 721 -1088 265 -15
7326a5n17J143q24K65K05K82r96L48K52j02M86n11j094J662K43j565L20o10J147
$$ -15 -532 611 -213 52 257 539 -457 -109 143 41 527 16 -1078 584 827 -738 -418 -1028 119
7345A19K74R61p07j019K28q3P9j37M77q83N66m3m38j69m11N72L26K21k60q2J56
$$ 119 393 1354 647 -372 -144 -227 -148 -285 192 -691 -125 -168 -606 -775 -1186 -614 -288 -67 -327 -409 -253
7366b53k0J271j845R25J011j352P34o06O19j203O81j19m19J013m61p04P11m34
$$ -253 -273 998 -847 78 1089 -263 471 -135 484 -719 -38 -157 -576 437 -24 -728 -17 -451
7384d51L18j035K106j133K2nm00J309j394J666j724J752j306J565r76n25L42p73
$$ -451 -133 -1168 938 -195 -173 -178 -578 731 -663 1003 -721 1031 -275 1290 314 -211 131 -642
7402f42J566j210M04m86L27n21q9J329j042J192r97N88q24R38P14j158j40J22
$$ -642 924 -286 118 -368 -41 -562 -651 678 -364 828 -169 419 -405 533 1247 89 -51 71
7420G1m06J530j520j87l68J005k33J5J58J257j027J59j415J125j046j11J595q82
$$ 71 -335 1195 -325 -512 -880 125 -108 -93 65 1322 295 454 -961 164 -882 -993 602 -280
7438b80j17j20K22j8m08L24N25p25K45J180j248M36l86L06O81m76o29O3m32P17
$$ -280 -397 -517 -295 -313 -721 -397 128 -597 -352 828 -420 16 -370 -64 617 141 -488 -425 -857 -140
7458a40l31K01L0K34l08Q19o27p73J56l21J291m65P49q02P9J321j291M2p11O19
$$ -140 -471 -270 -240 -6 -314 505 -122 -895 -739 -1060 231 -234 515 -287 -208 1113 -178 -136 -847 -228
7478b28N89q19R42j514J950n45k32M47j322L88Rl8o17J379n29l54N09K37k65M88
$$ -228 361 -458 484 -1030 920 375 143 590 -732 -344 -335 -373 -990 389 -140 -494 15 252 -13 475
7498D75o63K4O15J6j187R44r19mJ229p10J06n16R21p38K39O49k041J494m32M0
$$ 475 -188 -164 451 467 -720 224 -695 -699 530 -180 -74 -590 331 -407 -168 481 -1560 -66 -498 -458
7518d58J18m24J187k054Q45K365k002l30QJ390j40l74l96L69j81N32l8n87R15
$$ -458 -340 -764 423 -1631 -786 1579 -423 -753 -745 645 505 131 -265 104 -77 455 417 -170 745
7537G45j056L9P96o11N52j012L86L37k29l43N0Q9O4P78p69j174J633m55J214j481
$$ 745 -311 -272 524 -87 465 -547 -161 176 -53 -396 -346 -257 -193 585 -184 -1358 275 -180 1034 -447
7557d47Q03o93M70j82j526K109p82M34l52J94Q22j658R13ML15j294J181k66r62
$$ -447 356 -337 133 -49 -1575 534 -248 186 -166 28 850 -808 105 109 424 -870 311 45 -917
7576i17N59k44L01J92Q68R9L16j348o82J539n91J93r90N54P80l45k15O66j300
$$ -917 -358 -602 -301 -109 759 858 1174 -174 -856 683 92 285 -705 -151 629 284 69 735 -565
7595e65N40R42m42m20P65j161r1J137r55P19M05o78N52n75j61M87j117P86r07
$$ -565 -25 917 475 55 820 -341 -432 705 -250 469 874 196 748 173 12 499 -618 168 -739
7614g39J096j049M54P15j51l84l69N79Q20o03K56q44N67j122P08o30O51Q24p76
$$ -739 357 -692 -238 477 326 -58 -427 152 972 369 625 -219 348 -774 -66 -696 -45 779 3
7633CJ419j160K73n15L39p30l79P80l37R53k040J718L38j090n8p39J846n36R80
$$ 3 1422 262 535 20 359 -371 -750 30 -307 646 -1394 324 662 -428 -486 -1225 621 85 1065
7652A065j254Q75l61j320J179l07J079J81q08k39k88N37l23P55r85J25N19j325
$$ 1065 -189 686 325 -995 184 -123 956 1137 329 90 -198 339 16 771 -214 -89 430 -895
7670h95J440j277J146L08k82o34n27m3R46J70o3p4K37r29J53q62J155q42P16l7
$$ -895 545 -732 414 722 440 -194 -721 -764 182 352 289 215 452 -477 -324 -1186 -31 -873 -157 -194
7690a94J91r5k81L69M64n17L55J01R3j632J676p15M12J97l95l76J71N06o94Q55
$$ -194 -3 -98 -379 -10 454 -63 292 393 486 -1146 530 -185 227 424 29 -347 -176 330 -364 491
7710D91l67m99L77n1p18P50J98K6L13j516J036p18J160o18K12L45j075R58j312
$$ 491 124 -375 2 -49 -767 -17 181 207 520 -996 40 -678 482 -136 76 421 -654 304 -1008
7729a008J546o65O1p24M43O40k010J074L56m9k99P24Q16j140R23m15l30J22L88
$$ -1008 538 -127 -66 -790 -347 293 -1717 -643 -287 -336 -635 89 905 -235 688 273 -57 65 453
7748D53N8o28Q21j266N20p39R16P09m17l5m12J77L42K3k97pk29j92J098j325N07
$$ 453 511 -117 704 -562 -42 -781 135 844 427 392 -20 157 499 522 225 218 -11 -203 895 -430 77
7769G7j513Q81L53p46N11K79R46o53J01M12o16n91P69n77J57Q29M72j512R32Q
$$ 77 -1436 -555 -202 -948 -437 -158 788 135 236 648 32 -559 210 -367 -210 619 1091 -421 511 519
7789E19j272J473j131P2N01q00J048o09K13q62K63R20m96J46q84J130p27R58j98
$$ 519 -753 720 -411 -339 162 -638 410 -199 14 -848 -585 335 -161 -15 -899 231 -496 462 264
7808B64m79K84L90n46n57k50K22k95R45K65K71j082J773j598n78J366l048L369
$$ 264 -215 69 459 -87 -644 -894 -672 -967 -22 243 514 -568 1205 -393 -971 395 -2653 716
7826G16k002J921m36p22k24P46K78k31j34k02m35M26p62P67J503J60j649N72l60
$$ 716 -1286 635 199 -523 -747 -1 277 46 -88 -290 -725 -299 -1061 -294 1209 1369 -280 292 -68
7845f8J14J199j220J59J3j229J628j359J094l59k90K51o51J003r29J352q80L77
$$ -68 46 1245 25 184 197 -1032 596 -763 331 -28 -318 -67 -718 285 -644 708 -172 205
7863B05n36k06N56M69q16n00N07l63Q16q07Q70k39k2m3O98o25m47J372p26N93
$$ 205 -331 -537 19 488 -328 -828 -321 -684 132 -675 195 -44 -66 -109 589 -36 -483 889 163 756
7883G56r50J62k12k02J75K26J290j611J024p73n09P78k96O44j262J056j519J502
$$ 756 -194 -32 -244 -446 -271 -45 1245 -366 658 -115 -624 154 -142 502 -760 296 -1223 279
7901B79J63o8j1n83K77M73r26M35j33M78r55J736j613N08m45J303O3j462J116
$$ 279 442 374 363 -220 57 530 -396 39 -94 384 -571 1165 -448 60 -385 918 981 -481 635
7920F35p55p84J039q23J171n92K077k577r8Q49p24K56J90J94m94L50L52j24n71
$$ 635 -120 -904 135 -688 483 -109 1968 -609 -707 142 -582 -326 -136 58 -436 -86 266 142 -429
7939d29p42J506j761J440q61J50J470q07q26K42R27m67M12m06k65j03K05K59J75
$$ -429 -1171 335 -1426 14 -847 -697 773 -34 -860 -618 309 -158 254 -152 -417 -520 -315 -56 119
7958A19n25J088j635R78M63o97N27n75k76R56k00j60o09Q28l55J57n3m50Q50j086
$$ 119 -406 682 -953 25 488 -209 318 -257 -533 423 223 63 -546 282 -73 84 31 -419 431 -655
7978f55J087p35J50L7j220K432m29j051L29p96P33n68L14J93R26m61n26L38J46
$$ -655 432 -303 -153 -116 -1336 1096 667 -384 -55 -851 -118 -686 -372 -179 747 286 -240 98 244
7997B44j1j518K020r77J057o12J2j39j82K8r27P34M45j016P29K75M77j401L35
$$ 244 233 -1285 735 -242 815 203 215 76 -106 -78 -1005 -271 174 -842 -113 162 639 -762 -427
8016d27P52n78J222j610M53L12P85n44K9l90j13L87m25M90j095Q53N36o24m76
$$ -427 325 -253 969 -641 -188 124 909 365 394 4 -109 278 -147 343 -752 101 637 13 -463
8035d63L12M04O14J70j317O23m25m1Q4n2p30L21M24k54n9q72J470L32o48M93j38
$$ -463 -151 253 867 1037 -280 343 -82 -123 -39 -91 -821 -500 -76 -330 -389 -1261 209 541 -107 386 248
8056B48L73n46L03J26l19q53j58K94Q71j14J15k9p85N65M02j251J813j402L83
$$ 248 621 75 378 504 185 -668 -826 -532 339 225 340 311 -474 91 493 -758 1055 -347 36
8075C6j20m68J639q08k95j259Q85J145n01k55k76J687j658Q23O4o40j99m14J649
$$ 36 -84 -552 1087 279 -16 -1275 -390 755 254 -1 -277 1410 -248 575 639 -1 -200 -614 1035
8094A035j861R11R19j870Q57J09R7n26N74j4L06r80O34J189k068Q44p85O0O12
$$ 1035 -826 85 1004 -866 -9 100 197 -329 245 231 537 -443 191 1380 -688 156 -629 -569 43
8113D3M50q54M76K00k77M40K83j462L86R9J035k60l17l76m28Q13j236R36j160
$$ 43 493 -361 115 315 38 478 761 -701 -315 -216 819 559 242 -134 -562 251 -985 -49 -1209
8132a209R33J447j344j44m5J52P00m48o89l04J360p19J93O48k6n87k89O13O69
$$ -1209 -276 1171 -173 -317 -362 -210 490 42 -647 -951 409 -310 -117 531 505 -82 -371 242 911
8151I11k362J240M11L37j161N34N11j371P59L89j60J72J32R43k268O10J35O53
$$ 911 -1451 -211 200 537 -624 -90 421 -950 -191 198 38 210 342 1285 -983 -373 -238 415
8169D15j072R86P74j784Q50l13L87l18j40J385k339J357j749J838R77k254J515
$$ 415 -657 329 1103 -681 169 -144 243 -75 -215 1170 -1169 188 -1561 277 1254 -1000 515
8186E15j567J791j583J724j132J200o66r57J472j651Q27m57J116m25J0Q8p12K35
$$ 515 -1052 739 -844 880 -252 948 282 -675 797 -854 -27 -484 632 207 217 305 -407 -172
8204a72J148q87k3J35Q1r09J550l55q50R9R40n90O39l26o96M75l39k50N35j272
$$ -172 976 89 66 201 282 -627 923 568 -282 -183 757 167 806 480 -216 259 -80 -330 205 -1067
8224a067M09J469k135J380k50O03r14O29J490j045j444J007j3M35j100J319q22
$$ -1067 -658 811 -1324 56 -194 409 -505 124 1614 569 -875 132 119 554 -546 773 -49
8241d9p16J230j535J672k42L23k293J792J96J56p34N1k3J48k70k48J067j160M38
$$ -49 -765 465 -1070 602 360 683 -1610 182 378 534 -200 -149 -172 -24 -294 -542 525 -635 -197
8260a97l89o04K301k152O28P09p91L73K02K98j271N8O29O36L9p34Q4N8N35p01
$$ -197 -586 -1190 1111 -1041 -413 296 -495 -122 80 378 -893 -835 -206 430 469 -265 -181 -123 412 -289
8280b89M54P65j611L75l06J534j842O29O44m09L28r02M74M45n12L85P2J117j265
$$ -289 165 930 -681 -306 -612 922 -920 -291 353 -56 272 -630 -156 289 -223 162 234 1351 86
8299H6J015j191P89l60n09O32q64J836k294J004m81j75P10r73J210k75q74O45
$$ 86 1101 -90 699 339 -170 462 -402 1434 -860 144 -337 -512 198 -775 435 160 -714 -69
8317f9l30l87J060j79l27k49k83O39M17p05R39M40k158J521j286P27J67m73K10
$$ -69 -399 -786 274 95 -232 -481 -764 -125 292 -413 526 966 -1192 329 -957 -230 -63 -536 -326
8336c26k46P09K63m52J001j274N08J32m0J88k48l45p58J438j352J844m32o02J068
$$ -326 -572 137 400 -52 949 -325 183 315 275 463 215 -130 -888 550 -802 1042 610 8 1076
8355A076j532J433j076N7n29o8J139j19q00p50J616m27j81O20j88m57q96J945
$$ 1076 -456 977 -99 -42 -571 -639 500 381 -419 -1169 447 20 -161 459 271 -186 -1082 863
8373H63j992L36N63M31n08P34P2j032K77K95p56O69R08J08j395J9P40o13P97m38
$$ 863 -1129 -793 -230 201 -307 427 499 -533 -256 39 -717 -48 860 968 -427 -408 332 -281 516 78
8393G8J281j684P89J08m62m92j98R94l43n86R71k41l64O7l03R91o49m01o3k92
$$ 78 1359 -325 464 572 110 -382 -580 414 71 -515 456 215 -149 -82 -385 606 -43 -444 -507 -799
8413g99Q09J04J58k75K51m74O74K02j319J287N7r13N70k81j13J30O67j455O13
$$ -799 10 114 272 -3 248 -226 448 650 -669 618 675 -238 332 51 -62 68 735 -720 -107
8432a07o36R70O1m94J338q75L07P2N12p05j212J390j121j86k11J254j085M24J22
$$ -107 -743 227 288 -206 1132 257 564 636 1148 443 -769 621 -500 -686 -897 357 -728 -304 -182
8451a82j291J045k54P80L78k76J6j053J101m51O03M8j050M20p43J661q92r7K57
$$ -182 -1473 -428 -682 98 476 200 216 -837 264 -187 416 464 -586 -166 -909 752 -140 -237 20
8470B0P9M24p44M94m35N44l88k99L37p3m3R31j148o78J935k033J557L70j095l17
$$ 20 99 523 -221 273 -162 382 -6 -305 32 -41 -84 847 -301 -979 956 -1077 480 850 -245 -562
8490e62M79l06Q77p93l4N11P08r61L78q76J015p99R96M88j323M05n00P84L44j53
$$ -562 -83 -389 488 -305 -339 172 880 -81 297 -579 436 -363 633 1121 -202 203 -297 487 831 678
8510F78k97L01j099Q76Q38k407J012K57N42j423N50J033j264J362j242n35O94
$$ 678 381 682 -417 459 1297 -1110 -98 159 701 -722 -172 861 -403 959 -283 -818 -124
8527a24N39n99Q55N22k870K290j035M92n2J21k38J75N78q71Q39m39k64l86N51
$$ -124 415 -184 671 1193 -1677 613 -422 70 18 139 -99 76 654 -217 622 183 -81 -467 84
8546H4L67j395J197k50l41J1R52L84j126O77K30m24r52P75k27M6P4j80N1P79j945
$$ 84 451 -944 253 3 -338 -327 625 1009 -117 560 790 366 -586 189 -38 8 82 -98 -47 732 -1213
8567a213J250j96R20k31l2o24l1K36Q25j045p10N63N01O27j901J547m49N64l77
$$ -1213 37 -159 761 530 498 -126 -157 79 904 -141 -851 -288 213 840 -1061 486 37 601 224
8586B24j035M05L8R51o91M05l20m52O64j25L81m39P63L1k171J365j86J656j780
$$ 224 -811 -406 -368 583 -108 297 -23 -475 189 64 445 6 769 800 -1371 -6 -192 1464 -316
8605c16J309n37k05P30j148J548r89r86J320m13O22j3l75j663J282l27m8N14j280
$$ -316 993 456 251 981 -167 1381 392 -594 726 313 935 922 547 -1116 166 -161 -209 305 -975
8624i75J677j901K375q72m26k53l9J034n62M12j746K122q80q4M96l65P58j01j643
$$ -975 702 -1199 1176 304 -122 -375 -414 620 58 470 -1276 846 -34 -118 378 13 771 670 -973
8643i73J440l80J01j626P22J123K35j586L91N77j31p1L23j161K50Q83m20N87o33
$$ -973 467 87 188 -1438 -716 407 642 -944 -553 24 -107 -178 145 -1016 -766 117 -303 284 -349
8662c49L0J353n7p54r4l35j1M49o03n0L07m42P7J074j062M26j78R15j470J072
$$ -349 -319 1034 977 223 129 -206 -217 232 -371 -421 -114 -556 -479 595 -467 -41 -219 696 -774 298
8682B98R44j730j36R97l84O65J26j133O85l54J116j328L23n48k47M14m80K274
$$ 298 1242 -488 -624 373 -11 654 780 -353 332 -22 1094 -234 89 -459 -706 -292 -772 1502
8700A502k051M67R41j114n1m09P87O1J033j853L01Q38j025N75r10J332K86o72
$$ 1502 -549 -82 859 -255 -306 -715 72 133 1166 -687 -386 452 -573 2 -908 424 710 38
8718C8O86j412J221l87o76L8l21P83K54L44k57o15M61J20j16l55K11J04o98O8
$$ 38 724 -688 533 146 -530 -492 -813 -30 224 568 311 -304 157 277 161 -194 17 121 -577 -509
8738e09Q29j45p93J282j819J567p49J54j03j9L64n81N07n37J076p21J89k04L13
$$ -509 320 175 -618 664 -1155 412 -337 -183 -286 -305 59 -522 -15 -552 524 -197 -8 -212 101
8757A01o63P2M80l60j66J15P83j178J022l4p8K31j95Q48j849J118j20O02r74L58
$$ 101 -562 -490 -10 -370 -536 -421 362 -816 206 172 94 325 130 978 -871 247 127 729 -245 113
8777A13J78p22N81n45k15J00n9J590j426J273j156L06k44r06J607l85R76k308
$$ 113 291 -431 150 -395 -610 -510 -569 1021 -405 868 -288 18 -226 -1132 475 90 1066 -1242
8795a242R19N69k40K15k38N66j82M18j546J67k07o7K144j605K2k84Q78M3r69J944
$$ -1242 -323 246 6 221 -17 549 367 785 -761 -594 -801 -868 1276 -329 -307 -591 287 330 -639 1305
8815A305j456N8O4J75r1K41m45L88J131j338p02K20J05L08J488j609K41j76P64
$$ 1305 -151 -93 -29 146 55 296 -149 239 1370 32 -670 -450 -345 -37 1451 -158 83 -93 671
8834F71j038J192k49p00j24O40M07j127L19k1O20P0q35l33M32n35J65j76M75R35
$$ 671 -367 825 576 -124 -248 392 799 -328 -9 -30 590 660 -175 -508 -76 -611 -446 -622 -147 788
8854G88j882J238j000K051j142Q85n93R95j572P13J08j313J287j278P12J93J95
$$ 788 -1094 144 -856 1195 53 938 345 1340 -232 481 589 -724 563 -715 -3 190 385
8871C85o50K02L85k25l84L63K21N09j263K51Q79L0l57j057M73q88l3J484K32L32
$$ 385 -265 -63 322 97 -287 76 297 806 -457 -206 673 703 346 -711 -238 -1126 -1159 325 557 889
8891H89K9j234j211K749k046J263q61J047M61j445P07o58O80k68o58L67j77J296
$$ 889 918 -316 -1527 1222 -824 439 -422 625 1086 -359 348 -310 370 102 -556 -189 -366 930
8909I30j378R10p92M85l27j151J858r33J279q49j19M64m67N1j0O06m23m52M05
$$ 930 -448 462 -330 155 -172 -1323 535 -398 881 32 -87 377 -90 -39 -49 557 134 -318 87
8928H7l36L6J066j659K47K61Q70j65m51M17p00o96M50J534o08r03N85N1R2o56
$$ 87 -249 -213 853 -806 -559 -298 572 407 -44 373 -327 -1023 -573 961 353 -550 35 86 178 -478
8948d78R24j00p33J054k60O78j751L33R69r89K43K2J289j051j85k71N89l48j31
$$ -478 446 346 -387 667 407 1085 -666 -333 636 -353 -110 -88 1201 150 -35 -306 283 -65 -196
8967a96P59J5j206J174o58k02l24J353j827J931j060r30O78M57N50n92N92j982
$$ -196 563 578 -628 546 -112 -314 -638 715 -1112 819 -241 -1171 -493 -36 514 -78 514 -1468
8985a468J174k80r6N56l17J103j308R89j73o24l25p63J912m56L75r6J85k86j020
$$ -1468 -294 -574 -670 -114 -431 672 -636 353 180 -444 -769 -1532 380 -76 299 203 388 102 -918
9004i18P35k09O86k79j09l59Q56M4m68J203r44n56m83J351k31j361R32r4M1J17
$$ -918 -183 -392 294 15 -94 -453 403 447 -21 1182 238 -318 -801 550 319 -1042 -110 -204 -163 -46
9024d6o91%O09L20K99k42o1m13L93n43P17Q21p41o71J284l02k98n45M99o99N08
$$ -46 -737 -737 -128 192 491 249 188 -225 168 -375 342 1163 422 -249 1035 733 435 -110 389 -310 198
9045A98n38j34J235j348J61o24N53J82k53R0l07J027j565J570j048q96J284R00
$$ 198 -340 -474 761 -587 -426 -1050 -497 -315 -568 -478 -785 242 -1323 247 -801 -1697 -413 487
9063D87J36j132J668k99j162N55p29J524j331R39j184l56P02O61l61m35J633p76
$$ 487 623 -509 1159 860 -302 253 -476 1048 -283 656 -528 -884 -182 479 118 -317 1316 540
9081E40n40J61o9p37j62J700j088J42q30N58J657j585k45m67P0R16m4O27j83j64
$$ 540 0 161 92 -645 -807 893 -195 -53 -883 -325 1332 -253 -498 -965 -895 21 -23 604 421 257
9101B57M15r92k7Q33l44k47K17j28p87J680j132J66J66r08O36M38L59m27o55J09
$$ 257 672 -320 -347 486 142 -105 112 -16 -803 877 -255 -89 77 -831 -195 243 602 175 -480 -371
9121c71M39l73N84M93j894O52J117j003J943j688R08j323P02P60j113Q55j42n97
$$ -371 68 -305 279 772 -1122 -470 647 -356 1587 -101 807 -516 186 946 -167 688 546 -51
9139e1j58n55P88O06L01j447N31J040q75j3n68K70K06q5l88O84J71j341J143K13
$$ -51 -209 -764 24 630 931 -516 15 1055 180 167 -401 -131 75 -10 -398 286 457 -884 259 472
9159D72j88j15r0J086j588Q73r35Q05M98m32L05j536J368l91l66L3J041j000k18
$$ 472 284 169 79 1165 -423 450 -485 320 818 386 691 -845 523 132 -234 -201 840 -160 -378
9178c78J030n24l49P44J3r20L34O29q83K57m47J133m41n78J30K40J21k2N64j435
$$ -378 652 128 -221 523 536 -384 -50 579 -304 -47 -494 639 198 -380 -250 -10 111 89 653 -782
9198g82J113j387J699J33j240Q24L70j069q3M50O32m58k65J018q20L0K5l87K50
$$ -782 331 -1056 643 776 -464 360 730 -339 -422 28 660 202 -63 955 135 165 190 -197 53
9217E3o48N22J55o60M51j057J563j614P96j076J721M7n21J024j087l7r0K13N8
$$ 53 -595 -73 82 -578 -127 -1184 379 -1235 -439 -1515 206 253 -268 756 -331 -368 -458 -245 -187
9236a87N1O66o32j29o13o4J240r2J96O47j260K29r89N54Q50r76oP83r53K95Q13
$$ -187 -136 530 -102 -231 -844 -908 332 240 436 1083 -177 52 -937 -383 467 -509 -515 268 -685 -390 423
9257D23k64M86j180n3Q95l2o22p94J380m97Q60j92l7k05n90M44K76k94r05Q55
$$ 423 159 645 -535 -588 307 275 -347 -1141 239 -258 602 410 373 168 -422 22 298 4 -901 -46
9277d6Q87j474J305o44q28J122K24N08j089k23L90r1p95J176l25J1j161J245r06
$$ -46 841 -633 672 28 -800 322 546 1054 -35 -258 132 41 -754 422 97 108 -1053 192 -714
9296g14J119l84R98j097P63l74J070n36r12J092n99j51m85Q5O56j215L9J499j635
$$ -714 405 21 1019 -78 685 311 1381 845 -67 1025 426 275 -210 -125 531 -684 -645 854 -781
9315g81N75o64J694M22k337O17P2J200o52k77m60R89n31N0P07r99J279j475J560
$$ -781 -206 -870 824 1246 -1091 -474 -402 798 146 -131 -591 398 -133 -83 624 -375 904 -571 989
9334I89l11q02J56l05O34r53P88K96p97Q53j188J293j079L32p21P27N16m93L89
$$ 989 678 -124 32 -273 361 -592 196 492 -305 548 -640 653 -426 -94 -815 -88 428 -65 324
9353C24q88J327k15q74l42L23k88K83J200j076L41K99k196J434O75L05l02M1l11
$$ 324 -564 763 548 -326 -668 -345 -633 -350 850 -226 115 414 -1782 -348 327 632 330 371 60
9372F0m6j83N37l37J41m39K20Q30K56j111l03R89j077Q17q72Q18J98p76J386k250
$$ 60 14 -169 368 31 172 -267 -47 783 1039 -72 -375 614 -463 354 -518 300 498 -278 1108 -1142
9392a142J544J2k07q24N14N78r43J156q37L11j0n36l44P18J18j42J39N53m54J1
$$ -1142 402 414 207 -617 -103 475 -468 688 -149 162 152 -384 -728 -10 108 -34 105 658 204 215
9412B15r11J195m77j50R20j208L92o01P28L47J86n46r17N84o22J225j33n03P6
$$ 215 -696 499 22 -128 792 -416 -24 -625 103 450 636 90 -827 -243 -865 360 227 -276 -200
9431b00K30O36j714J927j525J212l74n36n7O59l72k16P40j429J036n80J000n29
$$ -200 30 666 -1048 879 -646 566 192 -344 -401 258 -114 -330 410 -1019 17 -563 437 -92
9449i2J027o78j254Q68Q43j129n6J10Q76q06N76M50k001J767q4j072n21J303q6
$$ -92 935 257 -997 -129 714 -415 -471 -361 515 -291 285 735 -1266 501 417 -655 -1176 127 41
9468D1j03q0j79o88J424m77p26J182o00Q06j030J028j076M31J94m04O9p61J002
$$ 41 -62 -142 -321 -1009 415 -62 -788 394 -206 600 -430 598 -478 -47 147 -257 -188 -949 53
9487E3j16K8M25j537K211q03M85j095J136j366N4J488j382P90j238O07M83O4l74
$$ 53 -63 -35 390 -1147 1064 261 746 -349 787 -579 -525 963 -419 371 -867 -260 223 287 -87
9506h7j163K468j845K08L17n85J675j132q2M66j073J236k15l52m85N7q60J419
$$ -87 -1250 1218 -627 -419 -102 -687 988 -144 -226 240 -833 403 188 -164 -649 -592 -1452 -33
9524c3m84r7J132j980K088p00o65n8P07P66o70M90j464L96J605r74l44m53J795
$$ -33 -517 -614 518 -1462 626 -74 -739 -797 -90 676 6 496 -968 -572 1033 59 -285 -738 1057
9543A057l6m99k79M53n97p59N71O70L42j138K31J15o14O78K89p59Q61l44m15L9
$$ 1057 1021 522 243 696 99 -660 -89 581 923 -215 16 131 -483 195 484 -275 586 242 -173 -134
9563a34j57J508o70M9j584r3J707j080P09o22J394j144Q21j14J7j024M62P2k41
$$ -134 -291 1217 547 596 -988 -1081 626 -454 255 -367 1027 -117 704 590 607 -417 45 117 -124
9582a24P93l2p48k98k48N7K55N29P11j368J09M30M21j433J962r80M33P57r98P68
$$ -124 669 637 -111 -409 -657 -600 -345 184 895 -473 -364 66 487 -946 1016 36 469 1226 228 996
9602I96j360j58P24j180Q45p20K774k933Q59o10J473l00K05Q8r95m48J354j56
$$ 996 -364 -522 202 -978 -133 -853 1921 -1012 -153 -763 710 410 615 703 -292 -740 614 458
9620D58n51k42J215j511L41L70M13j330O19J547m70j8r64k88K21L37Q3l84N50
$$ 458 -93 -335 880 -631 -290 80 493 -837 -218 1329 859 841 -123 -411 -190 147 230 -154 396
9639C96j44p22O79J8r40M63J499j709M28m83P16K03j013K27O27n85R56r9l23j17
$$ 396 252 -470 209 227 -713 -250 1249 -460 -32 -515 201 404 -609 -382 245 -340 616 517 194 77
9659G7J85o8j220R26Q86j312J267j076J401p50q20N50j14j05J09L80o63P62p87
$$ 77 262 194 -1026 -100 786 -526 741 -335 1066 316 -504 46 -68 -173 -64 316 -347 415 -372
9678c72Q21j250j67K347k798L110k172Q19J71j977J548p91J376q00M14k40m29
$$ -372 449 -801 -968 1379 -1419 1691 -481 338 509 -1468 80 -711 665 -135 279 39 -390
9695c90L69r08J146K20m39K04j72J132j478Q31J57o09j77n16J347j696J837j409
$$ -390 -21 -929 217 437 -2 202 30 1162 -316 515 672 63 -114 -630 717 -979 858 -551
9713e51M32J89k29k80L04K02N59o9K45p03K2j267J213J06j73R3q2r77O25O37r43
$$ -551 -119 70 -159 -439 -135 67 626 557 802 99 121 -1146 67 173 0 93 11 -966 -341 296 -647
9734f47K254k084O97k57M96l74j5O43Q57j373o30R99m53N19n81O76j615k01R24
$$ -647 1607 -477 220 -37 459 85 70 713 1570 197 -433 566 113 632 51 727 -888 -1089 -165
9753a65l92J809j226r7L0M70L92j74P12j255j97M76J35M3j530J175j191J972j619
$$ -165 -557 1252 26 -71 -41 429 821 647 1359 104 -93 383 518 561 -969 206 -985 987 -632
9772f32j46Q98m84J84q12J798q30j45N89j145J315k78J94L86j296L66j86J0N34
$$ -632 -778 120 -364 -180 -992 806 -24 -169 420 -725 590 312 506 892 -404 -38 -224 -214 320
9791C20j0j443J669q55q5J495k153J322j014J513o41p21O09K58r24Q12j87K1j29
$$ 320 310 -1133 536 -319 -404 1091 -1062 260 -754 759 118 -603 6 264 -660 152 -35 -14 -143
9810a43K90J48j540J186J58M43p22J127l33j425P2J331L26q71M21O95j353o0m70
$$ -143 147 295 -1245 -59 99 542 -180 947 614 -811 -739 592 918 47 468 1163 -190 -250 -720
9829g20J087l44Q4M79q68J442j415P16m84K82p41R58o17J71l6J36q86J67J256
$$ -720 367 23 107 586 -282 1160 -255 461 -23 259 -482 476 -141 30 -6 130 -756 -589 667
9848F67j53j000J203j015l73n98N87Q7O30N19j463J706o43n53R13o43k4j236J270
$$ 667 514 -486 717 -298 -671 -1269 -682 -595 35 554 -909 797 154 -399 514 -129 -153 -1389 -119
9867a19O32j85m60j312J368m49J60J084o20Q0o11O17m26K33K07J9k96m07Q49N82
$$ -119 513 328 -132 -1444 -76 -525 -365 719 99 179 -432 185 -241 -8 199 218 -78 -485 364 946
9887I46m49o14o48O59J60J41N42j065N95o06q1kl9N23R44j402M86N77r22J099
$$ 946 497 -117 -765 -106 54 195 737 -328 267 -339 -420 -422 -461 62 1006 -396 90 667 -255 844
9907H44j295Q07O7q99O72o15N21k28o04J210j324J603k72q83l8k34J098r45M47
$$ 844 -451 356 423 -476 196 -419 102 -126 -730 480 -844 759 487 -396 -434 -668 430 -515 -68
9926f8o01J530l95j225J165M27R3r08m8N82o99J184j058j95J168j718J162o47
$$ -68 -669 861 466 -759 406 833 926 18 -30 552 -147 1037 -21 -216 952 -766 396 -251
9944b51J043j150P72n10j15P44j715J289j51M38r32L0J68m38J026o91jM74O60
$$ -251 792 -358 414 -96 -211 533 -1182 107 -44 394 -538 -508 -340 -778 248 -443 -444 30 690
9963F90q13n00Q75j430J346j5m01K026k011P04o27l98J060n69M5k41N21J23r84
$$ 690 -123 -623 252 -1178 168 153 -248 1778 -233 471 -156 -554 506 -63 -18 -259 262 385 -599
9982e99r80J554j3r05O75K11K5L00J25j184O11J00J78j96j56J27N07O32r65J341
$$ -599 -1579 -25 -38 -943 -268 -57 -32 268 393 -791 -180 -80 98 -98 -254 -127 380 1012 47 1388
10002A388j181q66N79N77M8n86N09o18J730k556O62k56L30R14j081O7J22M53Q7
$$ 1388 207 -659 -80 497 545 -41 468 -150 1580 -976 -314 -570 -240 674 -407 -340 -218 235 322
10021C22L65q89r74K729k240M81J044m37j638O21J106j161J38L64j122K321k161
$$ 322 687 -202 -1176 1553 -687 -206 838 401 -1237 -616 490 -671 -533 -169 -1291 1030 -1131
10038a131J653q70J106r11j06J070j914J512l88M90j796K238p71m71L4l23Q97
$$ -1131 522 -348 758 -153 -259 811 -1103 409 21 511 -1285 953 182 -289 -255 -578 319
10055C19k73M07n41j83J058j670J248p57J04n9N60O85l55l58j21R7o17J181l1
$$ 319 46 453 -88 -271 787 -883 365 -392 -288 -347 213 898 543 185 64 161 -456 725 694
10074F94p86j59K47J34o25J91M28M34j017M51m00R70L09j544Q14p37K20r1J120
$$ 694 -92 -251 -4 130 -495 -304 124 558 -459 -8 -408 562 871 -673 141 -596 -376 -467 653
10093F53j109R9K136k154J084p12K06q22M43O04k38L47j109M5Q21m85O3k39J054
$$ 653 -456 -357 1779 -375 709 -3 203 -619 -176 428 190 537 -572 -527 294 -191 -128 -367 687
10112F87q94Q55j13j727K094k175O89N58N75m26j43mk4J185k002M83K96K51k71
$$ 687 -207 648 535 -1192 902 -1273 -584 -26 549 123 -20 -24 -48 1137 -865 -382 -86 165 -106
10131a06l76M54l54L76j051R84J10j63R47j215J755j603j80R91p11J555j898R74
$$ -106 -482 -28 -382 -6 -1057 -73 37 -126 821 -394 1361 -242 -422 569 -142 1413 -485 489
10149D89l12K5K74j052k07L71L63q74J317n62L86K91j076K06M61K74j97k49K98
$$ 489 177 202 476 -576 -783 -412 -49 -923 394 -168 218 509 -567 -361 100 374 177 -72 226
10168B26L09r52R06r74J216j132N65j185R41M61k7q4j433J227j95jK99l10M78
$$ 226 535 -417 489 -485 731 -401 164 -1021 -80 381 354 270 -1163 64 -131 -132 167 -143 335
10187C35j07M20r37j74J709j989J668j112L14J189j645J323j170K92m88K24P83
$$ 335 228 648 -289 -463 1246 -743 925 -187 127 1316 -329 994 -176 116 -372 -148 635
10204F35r21M20LJ75j98j657J496l18K85j171J533m35K92n60J191l78p74j99J371
$$ 635 -286 134 137 312 114 -1543 -47 -365 -80 -1251 282 -153 139 -421 770 392 -382 -581 790
10223G90o07j453K168K15l64n53k25l99K65L48M82j241J391r70J014o67l87P47
$$ 790 183 -1270 898 1113 749 196 -29 -428 -163 185 667 -574 817 -153 861 194 -193 554
10241E54q88J048p00N35m18n21J816j207N17j738J227k51R49q43K23l96L7n12
$$ 554 -334 714 14 549 131 -390 1426 219 736 -1002 225 -26 923 80 303 -93 -56 -568
10259e68J17k58M82N13q23Q98p64R47j267P32O7o85J025n01O13k15l77N24k58
$$ -568 -451 -709 -227 286 -537 361 -403 544 -723 9 76 -609 416 -85 528 313 -64 460 202
10278B02K79j111J174r23M33P74j684O42J64O03r62P29jl5r6r23J251o1q53n18
$$ 202 481 -630 544 -379 54 828 -856 -214 -50 553 -409 320 319 284 188 -735 516 455 -398 -916
10298i16N84N77j023J368n40j748J226n91J725r73N96j269J413r2j683J311o69
$$ -916 -332 245 -778 590 50 -1698 -472 -1063 662 -311 285 -984 429 337 -1346 -35 -704
10315g04J108l86P86j401O62P53j809Q06J25m75J05N04M13p21L52j039J712J06
$$ -704 404 18 804 -597 65 818 -991 -185 -60 -535 -430 74 487 -234 118 -921 791 897
10333H97r97M38o20J605j038k41J95j69j71K05p5l15K49N61o41M11k37j155O30
$$ 897 -100 338 -282 1323 285 44 239 70 -101 104 29 -286 -37 524 -117 294 57 -1098 -468
10352d68m20N07L28k37L48O10k15q67k00k82O20P8j553K145p84Q87q08l67K64
$$ -468 -888 -381 -53 -290 58 668 453 -414 -614 -896 -276 -198 -1751 394 -390 497 -311 -678 -414
10371d14l83K47k79J187K91K58j252r8J231n72k47k15K97M36m33N52r77P03J07
$$ -414 -797 -550 -829 358 649 907 -345 -443 788 216 -31 -246 51 487 54 606 -371 332 439
10390D39Q93j452M11n04O31o96O01N55j065j78Q56j099J587q86j35K02n80K10
$$ 439 1332 -120 291 -213 418 -278 323 878 -187 -365 491 -608 979 93 -42 160 -420 -210
10408b10M85J67j067J085j462J628m74j119J063p63J383j062L17J512n04j542
$$ -210 275 442 -625 460 -1002 626 152 -967 96 -667 716 -346 -29 1483 979 -563
10424e63k71J573m12m55N37p5M64k92j7o19p00Q66K3o35L48l2J29p10Q32m02o90
$$ -563 -834 739 327 -128 409 334 798 506 489 -130 -830 36 59 -576 -228 -260 -131 -841 -9 -411 -1101
10445a101J460n33L62n84Q56o97mJ37l93Q19j411K23Q17k30K64K85l95q72J541
$$ -1101 359 -174 188 -396 460 -237 -241 -104 -497 322 -1089 -866 -49 -279 -15 270 -125 -997 544
10464E44q09p89J969j375K049j001o1R7q5p21J13o1j015J793j241k99J613j390
$$ 544 -265 -1054 915 -460 1589 588 527 624 539 -182 -69 -130 -1145 648 -593 -892 721 -669
10482f69O82o07O33m17N1P19n17M31j62J073q18R5o64j097M10Q44l76J50q77J476
$$ -669 13 -594 39 -378 -327 392 -125 306 144 1217 399 494 -170 -1267 -857 -13 -389 -239 -1116 360
10502C60p25R13n70J98j66j22M09j30o6j86p34Q82j72RN06n21M76N47k150J255
$$ 360 -365 548 -22 176 10 -112 297 167 101 -85 -819 63 -109 -100 406 -115 361 908 -1242 13
10522A3M79o18O54q30M1J30L1j11l38N82p92K35j2N52R5L21n24r2j773K156l46
$$ 13 492 -126 528 -302 -261 -131 -100 -211 -549 33 -759 -524 -536 16 111 432 -92 -184 -1957 199 -147
10543a47J80m16l00M19q35J803q48M91j048J17R81k266K517k17j073O05k50M28
$$ -147 33 -383 -683 -264 -1099 704 -144 347 -701 -584 397 -1869 648 431 -642 -37 -287 141
10561A41j498J786q16J339j211Q27j145j99J70m88J732m55J93j27m0j152Q4J069
$$ 141 -1357 429 -387 952 -259 568 -577 -776 -606 -1094 638 183 376 249 209 -943 -859 210
10579B10j155K69O99j562J589q05J444p39j28L19J15j528M71J13j44Q56o2o09
$$ 210 -945 -676 23 -1539 50 -755 689 -50 -178 141 256 -1272 -801 -688 -832 24 -38 -647
10597f47L0l99J771j712J310O02j481J918k355J664J92m84j078M78q13P37M31
$$ -647 -617 -1016 755 -957 353 955 -526 1392 -963 701 893 409 -669 -191 -1004 -267 164
10614A64j3j12j79N58q02P55j264Q70O25m24K68o61n64P40N92L46n94q74J296
$$ 164 151 39 -140 418 -384 371 -893 -23 602 178 446 -215 -779 -39 553 899 305 -569 727
10633G27l35K76n04j350J537j47o25Q23j632J208J69o78P22P3N25j685Q42p38
$$ 727 392 668 164 -1186 351 204 -421 402 -1230 -22 147 -531 191 264 789 -896 -54 -792
10651g92Q90m82J073j029r19J545j199J681q94R9J273j577L4Q11p20k38K519j506
$$ -792 98 -384 689 -340 -1259 286 -913 768 -126 -27 1246 -331 -297 514 -206 -444 2075 569
10669E69j152P64j35p44k63K287j369J8J53K39J46n89K05l12r9N68m63o6J585
$$ 569 -583 181 46 -698 -961 1326 -43 -25 128 367 513 -76 129 -183 -282 286 -177 -243 1342
10688A342j278N37j268O6L43Q08j075K040j874M88l11R29r43l8L09j219J063R35
$$ 1342 64 601 -667 -601 -258 550 -525 1515 -359 129 -182 747 -196 -234 75 -1144 -81 854
10706H54m54m18J085q96K15j16M20j303N02O34p23K41K92n90J25K48j39J48K93
$$ 854 400 -18 1067 171 386 270 690 -613 -111 523 -200 41 333 -257 -132 116 -23 125 418
10725D18j003L16K48j00Q10j389J083j365L82P8N16k01p40P92K4o3L96q15N52
$$ 418 -585 -269 -21 -121 689 -700 383 -982 -600 -522 -6 -207 -947 -155 -131 -194 202 -613 -61
10744f1j77J84L27n64J175j063L77q62N88n45O35O58j195J047o18j14p74J212
$$ -61 -238 -54 273 -291 884 -179 198 -664 -76 -621 14 672 -523 524 -94 -208 -982 230
10762B30K08r29Q87j703J759l90M55n42N9L09l4L7o70p26J688m31l88J59J51j033
$$ 230 438 -491 396 -1307 452 62 517 -25 34 343 309 346 -324 -1050 638 207 -181 -22 129 -904
10782i04J871j90j762R83j24j235J553m06Q88l72j380P29l47J243k83o7r05N65
$$ -904 967 777 -985 -2 -126 -1361 192 -214 674 302 -1078 -349 -696 547 264 197 -708 -143
10800a43m47P50L95j152Q53j236Q88P01j039R90k231J803j316J172j268J467J202
$$ -143 -590 160 555 -597 256 -980 -92 609 -430 560 -1671 132 -1184 -12 -1280 187 1389
10817A389j131J69q16J255j481P28J184j117M34q95N7O82K07L36j862J065M57
$$ 1389 258 427 -389 866 -615 113 1297 180 614 -281 -224 458 665 1001 -861 204 661
10834F61n23M81p09L25j498K452j737J328j726J457l45l74J056m91q39j37J608
$$ 661 138 619 -90 235 -1263 1189 -548 780 -946 511 166 -208 848 357 -482 -619 989
10851I89l29j249P15l79j08L78Q4N02j788P60J98J15j87R7M29r58o8N28k13P1
$$ 989 660 -589 126 -253 -361 17 101 603 -1185 -425 -227 -112 -299 -202 227 -731 -799 -271 -484 -413
10871d13J095k52r57N37q3k91J304p25m70P64r50J147r52l74J214J24n18o89J424
$$ -413 682 430 -527 10 -73 -364 940 215 -255 509 -441 706 -246 -620 594 718 200 -489 935
10890I35j188J55M46j585J059N76o61j43O60n13J228r28m03l2m3J016q52J079
$$ 935 -253 -98 348 -1237 -178 398 -263 -406 254 -259 969 41 -362 -394 -437 579 -273 806
10908H06j428J145l24j25Q12j716J443o88L49P7q27O28l19N53k73r6p10O88O49
$$ 806 -622 523 199 74 886 -830 613 -75 274 351 -476 152 -167 386 113 17 -693 -5 644
10927F44j700J548j15J00l51q71J054l8M20q05l77K002j828K19k35O97o62rL55
$$ 644 -1056 492 377 477 126 -745 309 271 691 -114 -491 1511 -317 -98 -333 364 -298 -307 48
10946D8L96m12q8K28j099J679j34j618M46M54j93R73j638L21J55J21p8n1K48L48
$$ 48 444 32 -56 172 -927 752 618 -1000 -554 -100 -293 680 -958 -637 -482 -361 -439 -490 -242 106
10966A06K59m71j135J343k76N80q65L93k6R4L40j155m01J481o31O00p41L46p8
$$ 106 365 -106 -1241 102 -174 406 -459 -66 -92 2 342 -813 -1214 267 -364 236 -505 -159 -237
10985b37N54j086M98R94q79K10n66J591k036J171o87P8m9lQ71j788J503p07N81
$$ -237 317 -769 -271 723 -156 54 -512 1079 -957 214 -473 -395 -444 -447 424 -1364 139 -568 13
11004A3Jl52P23l86R1p84J443j043N28M88j275K96N28k44P80j106N04L34j85o90
$$ 13 14 -338 385 -1 90 -694 749 -294 234 722 -553 -257 271 27 807 -299 205 539 354 -336
11024c36K31O28j546Q74K19K5J99P39j375p94J586q41N67k45k56L46K9m18P09
$$ -336 -105 523 -1023 -149 70 95 294 1033 -342 -1136 450 -391 176 -69 -325 21 50 -368 341
11043C41n71L59M78k62k26j31M2P24o83k44N98q53J096j821K233j399J427j478
$$ 341 -230 129 607 345 119 -12 30 754 71 -173 425 -428 668 -1153 1080 -319 1108 -370
11061c70P56o03P47k134J511p47Q09J46L0L23m60N76j033N82q35J38N60Lj82p6
$$ -370 386 -217 530 -1604 -93 -840 -31 115 145 468 8 584 -449 133 -702 -564 -4 -1 -183 -259
11081b59O76r17J934p41q73R16j771J778j108J173r89m63J506q76k81j004J261
$$ -259 417 -500 1434 693 -180 736 -1035 743 -365 808 -181 -644 862 -14 -295 -1299 -38
11098c8J16k04l23j25J367q01p73k88J307N97kn9j386M5P94m89R17j437J852q88
$$ -38 78 -126 -449 -574 793 -8 -781 -1069 238 835 833 774 -612 -567 227 -262 655 -782 1070 182
11118A82n19R49J8q18m44J471j122L04L29m9m93L83l06k71K26l64K32R29l31k39
$$ 182 -337 612 630 -188 -632 839 -283 21 350 301 -192 191 -115 -386 -160 -524 -292 637 306 67
11138F7N04j109J152o5l01m99M32k81q39J389m24l10l15R38l9o78R33m64p86N49
$$ 67 571 -538 614 549 248 -251 181 -100 -939 450 26 -284 -599 339 300 -378 555 91 -695 -146
11158a46L35K80j960L157j147k58m88jN65n81J590j630L91O8j036J667k20m67
$$ -146 189 469 -1491 1666 519 261 -227 -228 337 -244 1346 -284 107 175 -861 806 586 119
11176A19j06l73R75o35k94m12R16j051J396j266j5J202r38P33r42J054q38oR71
$$ 119 13 -360 615 -20 -314 -726 190 -861 535 -731 -746 456 -482 251 -691 363 -475 -481 490
11195D90j454J039M85j48q97J327j011r26J596j226K52N92pM41j447R76n34K35
$$ 490 -964 75 560 412 -485 842 -169 -1095 501 -725 -473 119 112 553 -894 82 -452 -217
11213b17Q84l99o83M41m31o40J152Q38q56K46J62Q2K52o67r67R69J639j806J1
$$ -217 667 268 -415 26 -405 -1045 107 945 89 335 497 579 831 164 -803 166 1805 -1 10
11232A0R67j553O18m03N60L30n81R95q01o64M17K36Q24q55p73l02J069L30l98
$$ 10 977 -576 42 -361 199 529 -52 943 142 -522 -105 131 955 100 -673 -975 94 424 26
11251B6q63P99l08j094J737n39O5l35j67N93m14N39r41J90R09r2R6j498Q63L74
$$ 26 -837 -38 -346 -1440 297 -242 -177 -512 -679 -86 -500 39 -902 -712 197 105 201 -1297 -434 -60
11271f0N19o29Q26L26o57O52j634O69l10J67O49j71K97j664Q68m45N02L10K3R78
$$ -60 459 -170 656 982 325 977 -657 12 -298 -131 518 347 644 -1020 -152 -597 -95 215 238 1216
11291A216j723J766j273K70K29n8j077N05N7m45O93J172p18j954J580n22J221
$$ 1216 -507 1259 -14 256 485 427 -650 -145 -88 -533 160 1332 614 -1340 240 -282 939
11308I39j45P8p99p2k20O98o75J035j50m44J8J48p97r3P06m41M18m07M40j334
$$ 939 794 872 73 1 -219 479 -196 839 689 245 263 411 -386 -479 227 -214 204 -203 237 -1097
11328a097Q80j37N47m66j120J524j949J357K7Q61J92j554J139m04K86j459O3J588
$$ -1097 -217 -354 193 -273 -1393 131 -1818 -461 -434 427 619 -935 204 -200 86 -1373 -1310 278
11346B78o30J377l52K04j451J113k88p03J35O79N0o11M32O24j390P02p99J177
$$ 278 -352 1025 673 877 -574 539 251 -452 -317 362 412 -199 233 857 -533 169 -630 547
11364E47j742K336r64m46K42L2Q0L95m06k8m42nN21K47m26M85j195J495k90M85
$$ 547 -1195 1141 177 -269 -27 5 85 480 74 46 -396 -401 120 367 -59 426 -769 726 436 921
11384I21n61j049J249j39J61K43j250M07j9n8p32R44O03m41OK35k47j106J114
$$ 921 360 -689 560 421 582 825 -425 -18 -37 -95 -827 117 720 279 285 520 273 -833 281
11403B81l50n11L45N49O24p28M57l86m93J54j94Q91K4rK37j190M07k92k77J192
$$ 281 -69 -580 -235 314 938 210 667 281 -212 -58 -252 639 663 654 891 -299 108 -184 -461 731
11423G31j126K56J55N62m12m43R95j872J753m66m62R21j343J74q56J240l08n35
$$ 731 -395 -139 16 578 166 -277 718 -1154 599 133 -329 592 -751 -577 -1433 -193 -501 -1036
11441a036O82L32K71l01j104J055r08J440p90J095j601J230q99K12j47J7O06m69
$$ -1036 -354 -22 249 -52 -1156 -101 -1009 431 -359 736 -865 365 -534 -322 -469 -452 154 -315
11459c15N30k46o23J597j799K343j393M79n8r17J385r01L38k02j042K14J536j058
$$ -315 215 -31 -654 943 -856 1487 94 573 515 -402 983 82 420 218 -824 -610 926 -132
11477a32O05j36q55k83P96j08k48j42O48p07O03K03j556N27j46R04R8l99L01l03
$$ -132 473 337 -518 -801 -5 -113 -361 -503 145 -562 41 244 -1312 -785 -931 -27 71 -328 -27 -330
11497c30N40j037L93J663j397R43n10M82n42J60l7l58J2K25p63P28j52M72n06
$$ -330 210 -827 -434 1229 -168 775 265 747 205 365 328 -30 -18 207 -556 172 20 492 -14
11516a4p2k00L99j119J375k69p20J085j124K254j578q4J312j196O63p62L97j581
$$ -14 -86 -286 113 -1006 369 100 -620 465 -659 1595 17 -67 1245 49 712 -50 347 -1234
11534a234P59Q74j40O34j102L21o90J457j165J23P83j93M09j374l5K71r3P40p41
$$ -1234 -475 399 259 893 -209 112 -578 879 -286 -163 620 427 836 -538 -573 -302 -395 345 -396
11553c96K32j312J108l33J018M74m70l67l80M91j526J683j138J278j205MJ019
$$ -396 -164 -1476 -368 -701 317 791 321 -46 -426 65 -1461 222 -916 362 -843 -839 180
11570A80j073O51k06P7O46n08P35p78J083o54JJ7m27J066r15O9k32M70p9M08K35
$$ 180 -893 -242 -448 -371 275 -233 502 -276 807 153 154 171 -256 810 -105 -36 -268 202 123 531 766
11591G66l51J57K26j681M3M91l7L62J10K6p5K8R88k039Q53P7k60k15L46J6l02
$$ 766 415 572 798 -883 -840 -349 -386 -24 86 112 37 65 1053 -986 -133 -56 -316 -531 -185 -169 -471
11612d71N7j82R53j48j53K91k88p12O30J921k494N54j23j433K136j205J569j663
$$ -471 -414 -596 357 209 56 347 59 -653 -23 1898 -596 -42 -165 -1598 538 -667 902 -761
11630g61M65L47Q24j29o88n3j86o6O04o86K01n64M22P29M3j205Q03M61m17j20
$$ -761 -296 51 875 746 58 5 -181 -247 357 -329 -128 -692 -270 459 502 -703 100 561 144 24
11650B4j156J103J11J03j387J092K87o9K40O51lj050l98L48k9O41j92l97l96O85
$$ 24 -1132 -29 82 185 -1202 -110 177 108 348 999 996 -54 -452 -104 -133 508 316 -81 -477 208
11670B08j27q7L36o96M04J7L54o89o7N57P49p57j032J437j91K80r39J285p62M28
$$ 208 81 -6 330 -366 38 55 409 -280 -347 210 959 202 -830 607 416 696 -243 1042 280 708
11690G08J58j696J038l80L12q68L80P49j200M63N24o22O78K80m82K8J202j426
$$ 708 866 -830 208 -172 140 -728 -348 401 -799 -336 188 -434 244 524 42 70 1272 -154
11708a54n83J67M69N55j491K476k025R74k48q1k83o14J179J35n42l88J47M28L6
$$ -154 -737 -570 -101 454 -1037 1439 -586 388 140 59 -224 -838 341 476 -66 -454 -307 121 157
11727A57pp38R35q15Q75r04j90M11J185l86n54j371R52L20R72l27K83m81J7Q46
$$ 157 150 -588 347 -468 407 -497 -687 -276 909 523 -31 -1402 -450 -130 842 515 798 317 334 1180
11747A180j216O31K35j804M97M44k27p35J856k282J050J66P44r1l1j406M25P8
$$ 1180 -36 595 830 -974 -477 -33 -260 -995 861 -1421 -371 -205 539 448 417 -989 -564 -486
11765d86R00r9j69J45P6p97j123J834j060R69j57m05O19j65P9k44LL83r14k60
$$ -486 414 315 146 291 367 -430 -1553 281 -779 190 33 -372 247 82 161 -83 -80 303 -611 -871
11785h71N12J239j797R19N38j054J005j172P52Q5j8j291P96J282r35O21j281J66
$$ -871 -359 880 -917 2 540 -514 491 -681 71 156 138 -1153 -357 925 -10 611 -670 -504
11803e04P32J303j687n63J523k117J419k28m81J162l72L27j363P85L90o86M72
$$ -504 228 1531 -156 -719 804 -1313 106 -122 -603 559 187 514 -849 -64 326 -360 112
$$ [...]
16383e28
##END NTUPLES=NMR FID
##END=
