##TITLE=31P_LR_724-R2-CR14 
 64 sc cdcl3
 26.2.2025
##JCAMPDX= 6.0         $$ Bruker NMR JCAMP-DX V2.0
##DATA TYPE= NMR SPECTRUM
##DATA CLASS= NTUPLES
##ORIGIN= UXNMR, Bruker Analytische Messtechnik GmbH
##OWNER= root
$$ XWIN-NMR		Version 3.5
$$ Wed Feb 26 16:22:34 2025 Russian Standard Time (UT+4h)  new_Human@DPX200
##.OBSERVE FREQUENCY= 81.013821
##.OBSERVE NUCLEUS= ^31P
##.ACQUISITION MODE= SIMULTANEOUS
##.ACQUISITION SCHEME= undefined
##.AVERAGES= 64
##.DIGITISER RES= 17
##SPECTROMETER/DATA SYSTEM= spect
##.PULSE SEQUENCE= zgpg30
##.SOLVENT NAME= Acetone
##.SHIFT REFERENCE= (INTERNAL, Acetone, 0, 198.062)
##AUDIT TRAIL= $$ (NUMBER, WHEN, WHO, WHERE, WHAT)
$$ ##TITLE= Audit trail, XWIN-NMR		Version 3.5
$$ ##JCAMPDX= 5.01
$$ ##ORIGIN= Bruker BioSpin GmbH
$$ ##OWNER= new_Human
$$ C:/Bruker/XWIN-NMR/data/yarkov/nmr/P31/2/pdata/1/auditp.txt
$$ ##AUDIT TRAIL=  $$ (NUMBER, WHEN, WHO, WHERE, WHAT)
(   1,<2025-02-26 16:20:36.34 +0400>,<new_Human>,<DPX200>,
      <created by zg, POWCHK disabled, PULCHK disabled
       configuration hash MD5:
       00 E9 B6 7A A2 85 ED C7 34 08 36 98 17 FE 4E 26
       data hash MD5: 32K
       37 32 37 80 F1 E7 7E 76 5E 50 5C 49 42 86 9D AA>)
(   2,<2025-02-26 16:21:17.46 +0400>,<new_Human>,<DPX200>,
      <Start of raw data processing
       efp BC_mod = 2 LB = 1.5 FT_mod = 6 PKNL = 1 PHC0 = 1806.453 PHC1 = 6.895418 SI = 64K 
       data hash MD5: 64K
       F1 3B 38 21 A2 34 3E 91 7C 8B D4 5D F9 E8 0A 5E>)
(   3,<2025-02-26 16:21:49.42 +0400>,<new_Human>,<DPX200>,
      <pk PHC0 = -1.015065 PHC1 = 2.600001 
       data hash MD5: 64K
       EE E5 95 E4 6E 59 15 6D 16 22 EE BF F6 FD CD 66>)
$$ ##END=
$$ 
$$ hash MD5
$$ BA 9A 75 7C B5 29 6A 8D 13 02 EA 94 67 A1 54 76
##$RELAX= 
##$RELAX= 
##$RELAX= 
##$RELAX= 
##$RELAX= 
##$RELAX= 
##$RELAX= 
##$RELAX= 
$$ Bruker specific parameters
$$ --------------------------
##$DU= <C:/Bruker/XWIN-NMR>
##$EXPNO= 2
##$NAME= <P31>
##$PROCNO= 1
##$TYPE= <nmr>
##$USER= <yarkov>
##$AMP= (0..31)
100 100 100 100 100 100 100 100 100 100 100 100 100 100 100 100 100 100 
100 100 100 100 100 100 100 100 100 100 100 100 100 100 
##$AQSEQ= 0
##$AQ_mod= 1
##$AUNM= <au_zg>
##$AUTOPOS= <>
##$BF1= 81.014009
##$BF2= 200.13
##$BF3= 200.13
##$BF4= 200.13
##$BF5= 200.13
##$BF6= 200.13
##$BF7= 200.13
##$BF8= 200.13
##$BYTORDA= 1
##$CFDGTYP= 0
##$CFRGTYP= 5
##$CHEMSTR= <none>
##$CNST= (0..31)
1 1 145 1 1 1 1 1 1 1 1 1 1 1 1 1 1 1 1 1 1 1 1 1 1 1 1 1 1 1 1 1 
##$CPDPRG= <waltz16>
##$CPDPRG1= <>
##$CPDPRG2= <waltz16>
##$CPDPRG3= <>
##$CPDPRG4= <mlev>
##$CPDPRG5= <mlev>
##$CPDPRG6= <mlev>
##$CPDPRG7= <mlev>
##$CPDPRG8= <mlev>
##$CPDPRGB= <>
##$CPDPRGT= <>
##$D= (0..31)
0 1 0 0 0 0 0 0 0 0.06 0 0.03 2e-05 3e-06 0 0 0.0002 0 0 0 0 0 0 0 0 0 
0 0 0 0 0 0 
##$DATE= 1740572435
##$DBL= (0..7)
120 120 120 11 120 120 24 19 
##$DBP= (0..7)
150 150 150 150 150 150 150 150 
##$DBP07= 0
##$DBPNAM0= <>
##$DBPNAM1= <>
##$DBPNAM2= <>
##$DBPNAM3= <>
##$DBPNAM4= <>
##$DBPNAM5= <>
##$DBPNAM6= <>
##$DBPNAM7= <>
$$ [...]
##$SUBNAM2= <"">
##$SUBNAM3= <"">
##$SUBNAM4= <"">
##$SUBNAM5= <"">
##$SUBNAM6= <"">
##$SUBNAM7= <"">
##$SUBNAM8= <"">
##$SUBNAM9= <"">
##$SW= 400.765351723535
##$SWIBOX= (0..15)
0 1 3 0 0 0 0 0 0 0 0 0 0 0 0 0 
##$SW_h= 32467.5324675325
##$TD= 32768
##$TD0= 1
##$TE= 0
##$TE2= 300
##$TE3= 300
##$TEG= 300
##$TL= (0..7)
0 120 53 12 22 120 120 120 
##$TP= (0..7)
150 150 150 150 150 150 150 150 
##$TP07= 0
##$TPNAME0= <>
##$TPNAME1= <>
##$TPNAME2= <>
##$TPNAME3= <>
##$TPNAME4= <>
##$TPNAME5= <>
##$TPNAME6= <>
##$TPNAME7= <>
##$TPOAL= (0..7)
0.5 0.5 0.5 0.5 0.5 0.5 0.5 0.5 
##$TPOFFS= (0..7)
0 0 0 0 0 0 0 0 
##$TUNHIN= 0
##$TUNHOUT= 0
##$TUNXOUT= 0
##$USERA1= <user>
##$USERA2= <user>
##$USERA3= <user>
##$USERA4= <user>
##$USERA5= <user>
##$V9= 5
##$VALIST= <valist>
##$VCLIST= <CCCCCCCCCCCCCCC>
##$VD= 0
##$VDLIST= <DDDDDDDDDDDDDDD>
##$VPLIST= <PPPPPPPPPPPPPPP>
##$VTLIST= <TTTTTTTTTTTTTTT>
##$WBST= 1024
##$WBSW= 4
##$XGAIN= (0..3)
0 0 0 0 
##$XL= 0
##$YL= 0
##$YMAX_a= 26142
##$YMIN_a= -32315
##$ZGOPTNS= <>
##$ZL1= 120
##$ZL2= 120
##$ZL3= 120
##$ZL4= 120
##$ABSF1= 0
##$ABSF2= 0
##$ABSG= 0
##$ABSL= 0
##$ALPHA= 0
##$AQORDER= 0
##$ASSFAC= 0
##$ASSFACI= 0
##$ASSFACX= 0
##$ASSWID= 0
##$AUNMP= <proc_1d>
##$AZFE= 0.1
##$AZFW= 0.5
##$BCFW= 0
##$BC_mod= 2
##$BYTORDP= 0
##$COROFFS= 0
##$CY= -3
##$DATMOD= 1
##$DC= 0
##$DFILT= <>
##$DTYPP= 0
##$F1P= 0
##$F2P= 0
##$FCOR= 1
##$FTSIZE= 65536
##$FT_mod= 6
##$GAMMA= 0
##$GB= 0
##$INTBC= 1
##$INTSCL= 9.790993e-09
##$ISEN= 30
##$LB= 1.5
##$LEV0= 0
##$LPBIN= 0
##$MAXI= 10000
##$MC2= 0
##$MEAN= 0
##$ME_mod= 0
##$MI= 50
##$NCOEF= 0
##$NC_proc= -5
##$NLEV= 6
##$NOISF1= 182.463
##$NOISF2= 159.3651
##$NSP= 0
##$NTH_PI= 0
##$NZP= 0
##$OFFSET= 198.0616
##$PC= 4
##$PHC0= 1805.438
##$PHC1= 9.49542
##$PH_mod= 1
##$PKNL= yes
##$PPARMOD= 0
##$PSCAL= 0
##$PSIGN= 0
##$REVERSE= no
##$SF= 81.0140089999434
##$SI= 65536
##$SIGF1= 159.3651
##$SIGF2= -187.1042
##$SINO= 113.3802
##$SIOLD= 16384
##$SREGLST= <1H.CDCl3>
##$SSB= 0
##$STSI= 65536
##$STSR= 0
##$SW_p= 32467.5324675325
##$SYMM= 0
##$S_DEV= 0
##$TDeff= 32768
##$TDoff= 0
##$TI= <>
##$TILT= no
##$TM1= 0
##$TM2= 0
##$TOPLEV= 0
##$USERP1= <user>
##$USERP2= <user>
##$USERP3= <user>
##$USERP4= <user>
##$USERP5= <user>
##$WDW= 1
##$XDIM= 65536
##$YMAX_p= 508797765
##$YMIN_p= -9659590
$$ End of Bruker specific parameters
$$ ---------------------------------
##NTUPLES= NMR SPECTRUM
##VAR_NAME=  FREQUENCY,     SPECTRUM/REAL,   SPECTRUM/IMAG
##SYMBOL=    X,             R,               I
##VAR_TYPE=  INDEPENDENT,   DEPENDENT,       DEPENDENT
##VAR_FORM=  AFFN,          ASDF,            ASDF
##VAR_DIM=   65536,         65536,           65536
##UNITS=     HZ,            ARBITRARY UNITS, ARBITRARY UNITS
##FACTOR=    0.49542278885378, 1,            1
##FIRST=     16045.7642231865, 0,            0
##LAST=      -16421.768244346, 0,            0
##MIN=       -16421.768244346, -9659590,     0
##MAX=       16045.7642231865, 508797765,    0
$$ Real data points
##PAGE= N=1
##DATA TABLE= (X++(R..R)), XYDATA
$$ [...]
43158d14070O06365K83839p5736j10403p5025k76445m55379k82450l2924j08647
43148i40875k44225N3096N27725M95241K7430j05216K53817L47706j82918n97911
43138c66130k10811M86947N60112m072m15321k93942k9923N591m9765L2705J61751
43127a22858J51026M5772R241N4198O7020K8516P2616K92949N38480M98889Q1253
43116A717102l64082l70825P6012M86041M34656J0067l84016m83109l12610o3665
43106G45571M5056p7268k58539k20481L8618J96194N5481j63990j61261R134O2385
43095B70900q2943k31361k04734j6303K00332K80723J15227k00561l71525k16968
43085d57213Q4185K11857R6178p3336j59329j98841k30714j88129q303K59094
$$ plain form
43158 -414070 192295 476134 400398 289995 214970 -61475 -516854 -799304 -832228 -940875
43148 -940875 -1185100 -1132004 -604279 -109038 -81608 -186824 66993 414699 231781 -366130
43138 -366130 -576941 -89994 470118 466046 50725 -243217 -273140 -267549 -317314 -284609 -122858
43127 -122858 28168 73940 83181 137379 204399 232915 305531 598480 1136960 1635849 1717102
43116 1717102 1353020 982195 1058207 1544248 1978904 1988971 1604955 1121846 809236 745571
43106 745571 790627 713359 454820 234339 272957 469151 524632 360642 199381 208515 270900
43095 270900 187957 -43404 -248138 -264441 -64109 216614 331841 131280 -240245 -457213
43085 -457213 -373028 -161171 -64993 -138329 -297658 -496499 -727213 -915342 -923645 -664551
43075f64551M82214N30931L58428O4383j65077k44551k62046l10607l37497k42668
43065g91041l5000K03427M13739N21264M13910R8323k11711l11590k45532j97308
43055a41519k18716k18635j55690o9950M2531K16940L83597L92745J99575p3977
43045C56901k65562k82340j12912J69311M18759N09942M17558J82053j36586m20457
43035H36667n05236l31906l8641J65680J68297k0556k77180l66108j28176K32139
43025b65020K68599j23283m64398k89203J96617L82939P6746l02783l40704r1547
43015i52037J41486J95839J01643k3399j2609K24667N09353N01378J14989l28415
43005D72895m68744k87495k5651J22336J10506j8085j37206q0159J72007M03082
$$ plain form
43075 -664551 -182337 348594 707022 771405 606328 361777 99731 -210876 -548373 -791041
43065 -791041 -826041 -622614 -208875 312389 726299 824622 612911 301321 55789 -141519
43055 -141519 -360235 -578870 -734560 -804510 -761979 -545039 -161442 231303 430878 356901
43045 356901 91339 -191001 -303913 -134602 284157 794099 1211657 1393710 1257124 836667
43035 836667 331431 -475 -39116 126564 294861 274305 -2875 -368983 -497159 -265020
43025 -265020 3579 -119704 -584102 -873305 -676688 -293749 -217003 -519786 -860490 -952037
43015 -952037 -810551 -614712 -513069 -536468 -549077 -324410 184943 686321 801310 472895
43005 472895 4151 -283344 -308995 -186659 -76153 -94238 -231444 -311603 -139596 263486
42995B63486L88671J63756m3286q8881j0605J02657J92865J93218M8446j80370
42985A029957l26028k82230j02589R1952K26496K50913J02550k01553m82238n37918
42975b30688l74123j80351o2428O0541K30489K84843P4515k46845l40657p7797
42965h62501L27632N69444N09648K14829j21584k99709k83102k27859k35338j74621
42955e83161O6326K79535J83871r6738j63410N1078K06422J45397J11868K23206
42945D24394J96888j15221l52401j86603J16384J08693j56483l14782l13913l28538
42935i21582k38147K18797Q14790R39713M31817j76074l70788k09880k4817L9488
42925E03317Q925p6902j18398M207K06490K41259O2552r6196r8816r1500j90577
$$ plain form
42995 263486 652157 815913 772627 683746 673141 775798 968663 1161881 1210327 1029957
42985 1029957 703929 421699 319110 411062 637558 888471 991021 789468 307230 -230688
42975 -230688 -604811 -785162 -847590 -787049 -556560 -271717 -197202 -444047 -784704 -862501
42965 -862501 -534869 34575 544223 759052 637468 337759 54657 -173202 -408540 -583161
42955 -583161 -516835 -237300 -53429 -150167 -313577 -262499 -56077 89320 201188 424394
42945 424394 621282 506061 153660 -32943 83441 192134 35651 -279131 -593044 -921582
42935 -921582 -1159729 -940932 -126142 813571 1245388 1069314 698526 488646 463829 503317
42925 503317 512242 435340 316942 321149 527639 768898 831450 735254 636438 544938 354361
42914C54361k52598j20903J11619K42646J92347j3196l00176m84494l60240J3106
42904f17528K90992K44799K5449q9790m9511J0281K0993M1097J16330J84603J26855
42893C04570p8775k46370j39991J81265L55162K11656M7700J45714K79306J08506
42883A168743j61762p9654K17770J33501l87127o80426l82935M1895J03567j7816
42873d4244J2578M8015j32733k59271j7048K88271J49614k83580l96470m8664
42863f83532K70303K17094m719r4666o1928m3959l9044L0160J61667K58273J92427
42852B02076n3522k54550j43354J50943J66740j83313l50694M0984N02539L28038
42842D05887l31218o76589m17641m3251P1571J41634L73974N14634L26720N9360
$$ plain form
42914 354361 101763 -19140 92479 335125 527472 514276 214100 -270394 -630634 -617528
42904 -617528 -326536 -81737 -56288 -146078 -195589 -185308 -164315 -123218 -6888 177715 304570
42893 304570 225795 -20575 -160566 20699 375861 587517 635217 780931 1060237 1168743
42883 1168743 1006981 927327 1145097 1278598 891471 211045 -171890 -129995 -26428 -44244
42873 -44244 -31666 16349 -116384 -375655 -392703 -104432 45182 -238398 -634868 -683532
42863 -683532 -413229 -196135 -200854 -295520 -357448 -401407 -440451 -410291 -248624 9649 202076
42852 202076 148554 -105996 -249350 -98407 68333 -114980 -465674 -424690 77849 405887
42842 405887 74669 -601920 -1019561 -1062812 -991241 -849607 -475633 39001 365721 425081
42832D25081N3838J93778J25675j66103l55953k69350q7898m0502q6141p690K36443
42821B1178L87676K23149o3238o4170K25910L40224N8514j88324K3597M04197
42811A368713L99505P8462n1025L6629j30836n81410o85858j45019M39865L77132
42801A106158j93962o02884n35037k24550P888N0113m2491j27923r8715l2716
42791f94119p2514j28607J4978K52910K05787j48870l23524l9483L14705K71068
42781c47669l2252j38858L8860K28836K88201K88880K52211J39178J879j16144
42771F03122k86464m77092m42758r4171K62577L41374K62883K12490M6099l29169
42761I8891n08679j05808M94338N36961k4624m85454m29829j81234j05477q7497
$$ plain form
42832 425081 478919 672697 798372 632269 276316 6966 -80932 -121434 -207575 -215265 21178
42821 21178 408854 632003 568765 504595 730505 1070729 1129243 940919 964516 1368713
42811 1368713 1768218 1846680 1795655 1832284 1701448 1120038 434180 289161 729026 1106158
42801 1106158 912196 309312 -225725 -450275 -442387 -392274 -434765 -562688 -661403 -694119
42791 -694119 -766633 -895240 -880262 -627352 -421565 -570435 -893959 -933442 -618737 -347669
42781 -347669 -379921 -518779 -479919 -251083 37118 325998 578209 717387 719266 603122
42771 603122 316658 -160434 -603192 -697363 -434786 -93412 169471 381961 428060 98891
42761 98891 -409788 -515596 -21258 515703 491079 5625 -424204 -605438 -710915 -798412
42751g98412N3884J55802M4790r8829k6268J98285L52007L66195K91959J60874
42741G00287K6501n0113j29146k69032k69365J03293N92520O17237J05099l28459
42731A098822k65309l3765l3798m4355K79952O52656N39850L6693l03765l70968
42721A556013n42449q54637q31609l02672K18625K55263j724r2496N3950J91991
42711c49745K10991J84286J41691O6464J157l5168j01413j60534m2049K50347
42701A66027M11353K40967k2789m9537P6270J2116k86348n01976m18580j43799
42691e16296J30426L05205K93991N5850k20721k31475M1713K66916K06324Q543
42681C40476o6711l563N7465Q3794J27924J58418J07235J2611n0692j18961k58969
$$ plain form
42751 -798412 -744528 -588726 -543936 -642765 -669033 -470748 -118741 247454 539413 700287
42741 700287 726788 676675 547529 278497 9132 112425 704945 1322182 1427281 1098822
42731 1098822 833513 799748 765950 721595 1001547 1654203 2194053 2230746 1926981 1556013
42721 1556013 1013564 158927 -672682 -975354 -756729 -501466 -503190 -595686 -541736 -349745
42711 -349745 -138754 45532 187223 253687 254844 219676 118263 -42271 -84320 166027
42701 166027 577380 818347 795558 746021 822291 834407 548059 46083 -372497 -516296
42691 -516296 -385870 -80665 213326 269176 48455 -183020 -141307 125609 331933 340476
42681 340476 273765 270202 327667 411461 539385 697803 805038 817649 766957 647996 389027
42670C89027l96096l85893k24631m1011Q9051J67937J53539K64j67359j20297
42660e35469J61495M00995L53043R6739j21040k28927l47581m94857m65123r6450
42650a277175M36143P24954N46704J06266j82835j29407Q2774J68015P8034k101
42640E51372M9271J23511O1369j02122j98330j95095k36744l57368l30099K5500
42630f08735M93766O61160M47122J78797Q8865K9655j67422l40810k70327p5309
42620D36762j6041n4102L1202J97244K05153P4122L9529O8654j04465m05268m10789
42609F2001p5584Q8354j62502l46721l9280L95215L91465Q7437l409Q9739n8290
42598D28425l69213l01251J85830M59781J85229k02949k52637j19406j08945j34030
$$ plain form
42670 389027 -7069 -392962 -617593 -658604 -569553 -401616 -248077 -247813 -415172 -535469
42660 -535469 -373974 27021 380064 476803 355763 126836 -220745 -715602 -1180725 -1277175
42650 -1277175 -841032 -116078 430626 536892 354057 224650 307424 475439 553473 551372
42640 551372 600643 724154 785523 683401 485071 289976 53232 -304136 -634235 -608735
42630 -608735 -114969 546191 993313 1172110 1260975 1290630 1123208 782398 512071 436762
42620 436762 420721 366619 397821 595065 800218 874340 913869 982523 878058 472790 62001
42609 62001 -13583 74771 -87731 -434452 -473732 -78517 312948 400385 396976 486715 428425
42598 428425 59212 -242039 -56209 403572 588801 385852 133215 13809 -95136 -229166
42588b29166l6605m537k08995l75119j90942J22452J40060n7770j9557L13075
42578e47104M83994K22582j64951k57355n6648J23989J02288l5217j27919j10752
42568c67093j7833P8630J20610J03468Q6573J51079L10110M41894L61975K6414
42558A295827l67053n55592m66599k34873l0486K9734j08981l47076m11030j37493
42548a333622K49181L66517J73056l324N2585K01576K45931J95691J32454M0687
42538C20732r9880k30346l04573l09534j88370M7939J70781m020k34157j17878
42528i49306K48148L51543R0253l4078K35396M39383J51598l02402l53010k5056
42518a47531K32612K49067J66702L2639j55598k16193o1739J2463k13692l94135
$$ plain form
42588 -229166 -265771 -270308 -479303 -854422 -1045364 -922912 -782852 -840622 -860179 -547104
42578 -547104 -63110 159472 -5479 -262834 -319482 -195493 -93205 -128422 -256341 -367093
42568 -367093 -384926 -306296 -185686 -82218 4355 155434 465544 907438 1269413 1295827
42558 1295827 928774 373182 -93417 -328290 -358776 -329042 -438023 -785099 -1196129 -1333622
42548 -1333622 -1084441 -717924 -544868 -548192 -495607 -294031 -48100 147591 280045 320732
42538 320732 220852 -9494 -314067 -623601 -811971 -764032 -593251 -597271 -831428 -949306
42528 -949306 -701158 -349615 -259362 -293440 -58044 381339 532937 230535 -122475 -147531
42518 -147531 85081 334148 500850 533489 377891 161698 99959 112422 -101270 -495405
42508d95405j11769L80840N14215K90467J59432J62375n4291m10044l71679J07602
42498A71743L75543O2916l67459l72694p4331J10943J21236J39243J75712J26824
42488D69676J9288o3477j11017r3157L7245J69335J45429Q3802K24626M21601
42478A303351K52624k68193o06598m97655k75868k01608n4118K76401L95484O8000
42468C91820k58356j41173J04702l8429l62368k54903K82043O37763N24246K58818
42458A144163J19646N470j79092k91175k35390j23042n8901n0912j34598k99560
42448a03391l36857q1354K42171K53598m4885l01240l20116j80007O5055L73365
42438d33661M70541J13086l92229m46481j0165L24711K37117Q8174J95046K63350
$$ plain form
42508 -495405 -607174 -226334 287881 578348 737780 900155 845864 435820 64141 171743
42498 171743 547286 610202 242743 -129951 -204282 -93339 27897 167140 342852 469676
42488 469676 488964 425487 314470 221313 258558 427893 573322 657124 881750 1303351
42478 1303351 1555975 1287782 681184 183529 -92339 -293947 -348065 -71664 323820 391820
42468 391820 133464 -7709 96993 58564 -303804 -558707 -276664 361099 885345 1144163
42458 1144163 1263809 1269279 1090187 799012 563622 440580 381679 330767 196169 -103391
42448 -103391 -440248 -521602 -279431 -25833 -70718 -371958 -692074 -872081 -807026 -433661
42438 -433661 36880 149966 -242263 -688744 -698909 -374198 -137081 -48907 146139 409489
42428D09489m8959m53656m30555l0659K19991Q0644j81260k64369j47085N7779
42418g88640K34396K42427M5675j30652l4121K22188K82437Q8080k5590J17235
42408B53435K06496q7591n57109o93465l88040n4912j9797j06725M432K61040
42398a182236L50108K03455Q2382J50657K41242J47885o7196j95097j49427K0258
42388c97969K34643L60043K35554q3099k41508J5438M50937N96256L53755O1707
42378A585757m1093r9478k86694m54088l57064o6416R0913l4865k29190j92946
42368h5164R6467L57013L06528l0657l36653l34293q1803J18309Q6406m7001n2606
42357c454Q0459J31289n0736l15916l67321j28905J52653K35394J88066K17099
$$ plain form
42428 409489 360530 -93126 -523681 -554340 -334349 -253705 -434965 -699334 -846419 -788640
42418 -788640 -554244 -311817 -266142 -396794 -430915 -208727 73710 161790 136200 253435
42408 253435 459931 372340 -184769 -878234 -1266274 -1321186 -1340983 -1447708 -1443276 -1182236
42398 -1182236 -832128 -628673 -546291 -395634 -154392 -6507 -73703 -268800 -418227 -397969
42388 -397969 -163326 196717 432271 349172 107664 123102 574039 1170295 1524050 1585757
42378 1585757 1544664 1445186 1158492 704404 347340 280924 371837 336972 107782 -85164
42368 -85164 11303 368316 674844 644187 307534 -26759 -108562 9747 96153 49152 -3454
42357 -3454 77005 208294 157558 -158358 -525679 -654584 -501931 -266537 -78471 138628
42347A38628K87692J73487j20707k87826j73339j1976l5637j23985r2322o3209
42337c09194k13265l57539j97051J40887K52874J04455N8545K26571K84122P8177
42327F8582o5123R4364K64520J14755j16717K1495M18199M90962M6831m13714
42317I24154l99089p0737O5768j15927k66174j28074J03561J04398j03599k09158
42307i4877o7787J33803J95665J60507J47207J34473P3463L3541L2254r8662m10763
42296B38824n75116k81798K08133L42850Q3916n8260J30876K25403j01387m87713
42286b74272m25561k4347K19437J65121P4710P8737O8758N6249J85041L68055
42276D91928L15779k333k70536k83430j77194j17983p0888o71p799j05515j23483
$$ plain form
42347 138628 426320 599807 479100 191274 17935 5959 -29678 -153663 -245985 -309194
42337 -309194 -522459 -879998 -1077049 -936162 -683288 -578833 -520288 -293717 -9595 68582
42327 68582 3459 97823 362343 477098 360381 381876 800075 1291037 1337868 924154
42317 924154 525065 454328 520096 404169 137995 9921 113482 217880 114281 -94877
42307 -94877 -162664 -28861 166804 327311 474518 608991 682454 715995 748249 649587 238824
42296 238824 -336292 -618090 -409957 -67107 16809 -41451 89425 314828 213441 -274272
42286 -274272 -699833 -724180 -504743 -339622 -264912 -186175 -117417 -61168 123873 491928
42276 491928 807707 805374 534838 251408 74214 -43769 -114657 -115328 -123127 -228642 -352125
42265c52125j1278J1222j74641k88774j3394M84718P01778M35463N157k00982
42255E97144j69993j57194k96391m58846m48145k28136N3097K15542J98326P2404
42245f22192o1406j52954j93779j82659j20927n287J83179M27377N97329N15270
42235C83951J71717j84391k74669r7214Q8605Q8772j2052j1058J17209J82393
42225D53263L2929k26841l26336j25155K19677M04446K82617o983k06103j88268
42215C13246l5601P6463K3214j94866m43692n35350l97932j72395o1725p6646
42205a505284l3608J64867L77466M35018L79364L51891L36125J97234n3355k26665
42195D23053k15875j22668p8796q8881j05539j22108j24885p5136M969M9066Q3880
$$ plain form
42265 -352125 -363403 -352181 -526822 -815596 -828990 -344272 357506 792969 798126 597144
42255 597144 427151 269957 -26434 -485280 -933425 -1161561 -1108464 -892922 -694596 -622192
42245 -622192 -683598 -836552 -1030331 -1212990 -1333917 -1339204 -1156025 -728648 -131319 383951
42235 383951 555668 371277 96608 -606 87999 176771 164719 153661 270870 453263
42225 453263 486192 259351 -66985 -192140 27537 431983 714600 707617 501514 313246
42215 313246 277645 354108 377322 182456 -261236 -796586 -1194518 -1366913 -1428638 -1505284
42205 -1505284 -1538892 -1374025 -996559 -561541 -182177 169714 505839 703073 649718 423053
42195 423053 207178 84510 5714 -83167 -188706 -310814 -435699 -510835 -505866 -456800 -372920
42184c72920J96474L27087K92669R0764m2028J1538P0876q863q5662l0062o329
42173D43544j54103k35560J3271L66094L90638J34534K9880J45654Q0372l05369
42163I08955n87119m31966r4752L8690K2245J19866L04754L53487K31318M8583
42153I14061j94970m99356o47601m37721m3570J64455J05158J8821O1289J32726
42143d26708R8059m6963k19916k85712j07822K43578M25946K06322j63454k23738
42133e00408P8612L40798K77877N5732k2903Q2885J83866J20400j07735l53887
42123A55237m20755k54536m1984K2258L0680K21926N51241O61357L69096n0333
42113A244187k14420r8761J8823l4737j62627k05809j55630j16296j40028j70882
$$ plain form
42184 -372920 -176446 150641 443310 534074 492046 503584 574460 565597 479935 449873 443544
42173 443544 289441 53881 67152 433246 823884 958418 988298 1133952 1214324 908955
42163 908955 321836 -110130 -204882 -166192 -143947 -24081 280673 634160 865478 914061
42153 914061 719091 219735 -427866 -865587 -909157 -744702 -639544 -620723 -559434 -426708
42143 -426708 -328649 -375612 -595528 -881240 -989062 -745484 -319538 -113216 -276670 -500408
42133 -500408 -421796 -80998 196879 252611 229708 312593 496459 616859 509124 155237
42123 155237 -265518 -520054 -562038 -539780 -509100 -287174 264067 925424 1294520 1244187
42113 1244187 1029767 931006 949829 915092 752465 546656 391026 274730 134702 -36180
42103c6180j46234q9363m6292J8903J47828K28531J02064j22407r5670K73995
42093B35175N78159M12794m5579k72849r9455J48535J61046l4898k61564l77887
42083D43477k64456O1080K93286J42634j84270k00403J06010K04385j20538l58990
42073A22215o1593M22995M74533J29099q1710k2752p4175l78615n55295l20415
42063c45713O6260K05349P7303p4738j24911q8696M2022K43849L53159K27455
42053E81339l5485j98782j68037m5721N1646R8015R1627M443j65391l44689m18148
42042e49183l12125p1784J39739J74313O4679O733J26626L04133K93040J4722
42032A90893l16970l92085j27891K18501L00027O1822j84941j37716J09794J90333
$$ plain form
42103 -36180 -182414 -271777 -318069 -299166 -151338 77193 179257 56850 -38820 235175
42093 235175 813334 1226128 1180549 907700 808245 956780 1117826 1082928 821364 443477
42083 443477 179021 240101 533387 676021 491751 291348 397358 601743 481205 122215
42073 122215 60622 483617 958150 1087249 1005539 982787 908612 529997 -25298 -345713
42063 -345713 -279453 -74104 3199 -71539 -196450 -285146 -243124 725 353884 581339
42053 581339 545854 347072 179035 133314 184960 282975 374602 379045 213654 -131035 -549183
42042 -549183 -861308 -933092 -793353 -619040 -554361 -547628 -421002 -116869 176171 190893
42032 190893 -126077 -518162 -646053 -427552 -127525 -65703 -250644 -388360 -278566 -88233
42022h8233l2440k59252j49180K20415M50542L19933J6966j39616o1337R7682
42012C75480J82254J78342J41524Q3541k2448j50477j96393r7092L6631K081k14372
42001C19071l29413q9031L22372M06479k7417n52828o21893k46142P3379O2512
41991f82911O804K40889N79228N46653P0062l85568m28190k13263j41429k73913
41981f81638l03270m8465K82875L90972K42570J6482j54302k30302j70411J3924
41971f41565J61245J17862j6634O47J92938L33311L18444L13951M12866M18594
41961A611659J77087j01359j29149R386M749j78420k75482j70296n9780j38022
41951G50373l70379o08265o99185m92411N46M56731N44395L76865L41111M70188
$$ plain form
42022 -88233 -120673 -379925 -529105 -308690 141852 461785 478751 339135 277798 375480
42012 375480 557734 736076 877600 961141 938693 788216 591823 494731 531362 533443 319071
42001 319071 -10342 -99373 222999 629478 602061 49233 -572660 -818802 -745423 -682911
41991 -682911 -676107 -435218 144010 690663 760725 375157 -53033 -266296 -407725 -681638
41981 -681638 -984908 -1033373 -750498 -359526 -116956 -100474 -254776 -485078 -655489 -641565
41971 -641565 -480320 -362458 -379092 -378445 -185507 147804 466248 780199 1193065 1611659
41961 1611659 1788746 1687387 1558238 1567624 1572373 1393953 1118471 948175 888395 750373
41951 750373 379994 -228271 -927456 -1419867 -1419321 -962590 -418195 -41330 299781 769969
41941G69969L87259m8325m72948n59669m15997k44472l3153J62815Q0739k60972
41931f34754l62973L2018M08971J98297l04829l55756J17493M68359L28648K278
41921a02248j71903k41585k88829j87587P7421K58739K10996Q8074M0849J9429
41911b96644k5159l7160k0388j9020O8265L19339M75094K25613k13048l20965
41901A55927r1466k6316k20251j47760L78373P47031M81369n843j41640j15717
41891A013707l98723p79277o66593j13005K46286J91905J23984K36234J90827
41882D5345j94596n26183l96778M3475L65244M08957L04968J77423O4438q776
41872B83517m5627o5140N578K71169O15033O92308L33853j63512l31571q1951
$$ plain form
41941 769969 1157228 1108903 635955 76286 -339711 -584183 -617336 -454521 -373782 -634754
41931 -634754 -997727 -965709 -556738 -358441 -663270 -1019026 -901533 -433174 -104526 -102248
41921 -102248 -274151 -515736 -804565 -992152 -914731 -655992 -444996 -356922 -316073 -296644
41911 -296644 -321803 -358963 -379351 -398371 -330106 -10767 464327 689940 476892 155927
41901 155927 64461 38145 -182106 -329866 48507 795538 1276907 1271064 1129424 1013707
41891 1013707 614984 -164293 -830886 -943891 -697605 -505700 -381716 -145482 45345
41882 45345 -149251 -675434 -1072212 -1028737 -663493 -254536 50432 227855 292293 283517
41872 283517 237890 172750 178328 449497 1064530 1756838 2090691 1927179 1595608 1513657
41862A513657J95335J25906j80540k94860p0186J41778J1559k48352k03881P0308
41852A060724L5037m58995q34582n68377Q3128M95409N03308L96269L20943J75916
41842A208780P65o843J20725J10517j18341l36649l70576k90184j82083j7921
41832A18190J71751K38617J29250k2765q6296p5870p5426j33273k27536k55503
41822b18861j30153M4231N9927l0690R0450M54805N93068K18513k17884j54857
41812G08549J75445J07161l54339n26950j73984J28000m4500l21597k22570J00449
41802d24336K43005K17288K59277L04166J48728p4762m9205K05369L41015J66622
41792A337167j66521m18003m61723k90037j8840J57466J67182J44281J94149K10172
$$ plain form
41862 1513657 1708992 1834898 1654358 1359498 1289312 1431090 1442649 1194297 990416 1060724
41852 1060724 1095761 636766 -197816 -766193 -683065 -187656 315652 711921 1032864 1208780
41842 1208780 1209545 1202702 1323427 1433944 1315603 978954 608378 318194 136111 118190
41832 118190 289941 528558 657808 635043 548747 472877 397451 264178 36642 -218861
41822 -218861 -349014 -304783 -244856 -275546 -185096 269709 862777 1081290 863406 708549
41812 708549 883994 991155 636816 109866 -64118 63882 19382 -302215 -524785 -424336
41802 -424336 -181331 35957 295234 599400 748128 673366 624161 829530 1170545 1337167
41792 1337167 1170646 752643 290920 883 -17957 139509 306691 450972 645121 855293
41782H55293P8578p2259l0143J68703K54874O4375k52809l73730j33160K56551
41772H16273L67197L9149l77593m40491j73175M7669O5432M8358O7813K127j02329
41761C60430l2378J31262L4958l12816m39950j67440P7355K1372M7359M70737
41751A90889Q47375O19757M5625k14364j47953k71859o08260n88528m9698M06346
41741B29330K95852p5836j48404R6671K18093l7135m45872n79895k37573L31833
41731c52936O35742M68732J43963L3911N1554j11484l77460l41233P0134M13464
41721F34387L05603j35828n19665n77180k74563J93177M62971L15430m2554k50758
41711A11020l02557m40622n96034l98675J67471N86750M87797J11990j07957r0123
$$ plain form
41782 855293 933871 861612 831469 1000172 1255046 1319421 1066612 692882 559722 816273
41772 816273 1183470 1222619 845026 404535 231360 279029 344461 392819 460632 462759 360430
41761 360430 328052 459314 494272 181456 -258494 -425934 -348579 -327207 -279848 190889
41751 190889 1038264 1658021 1703646 1489282 1341329 1069470 461210 -127318 -177016 229330
41741 229330 525182 449346 300942 397613 615706 578571 132699 -447196 -684769 -352936
41731 -352936 282806 751538 895501 929412 980966 869482 492022 150789 220923 634387
41721 634387 939990 804162 284497 -292683 -567246 -374069 88902 404332 361778 111020
41711 111020 -191537 -632159 -1228193 -1626868 -1459397 -872647 -384850 -272860 -380817 -470940
41701d70940J325P8759J02719Q719j16328n8028J32960J00456k35044m25935j52074
41690a033411K33159K30009l4653o0749K02224L36055J82898M8735J26706K04214
41680D35187R0306o5338p4580j9388n0178j13867q8166j2625P29l7537m2359N34
41668B2718N7411J19684J52864P5891j00352k11392j34692L0934R8453M0194j5900
41657A35813J2172Q2099J20588Q7702k4436j51015j47077M6467K45255J88952
41647E96520j10334l55700l61738k77411k91097l05419j30125J31062J85016J6901
41637i02325n6750J28885L42329L34951K01522J57621J77636J10130j1227n3757
41627D29015o2745j51108j97730K321L05170L02417q5175m37600m09909j83231
$$ plain form
41701 -470940 -469615 -390856 -288137 -279418 -395746 -453774 -320814 -220358 -455402 -881337 -1033411
41690 -1033411 -800252 -570243 -604896 -665645 -463421 -127366 55532 104267 230973 435187
41680 435187 525493 460155 385575 366187 316009 202142 113976 101351 102080 64543 22184 22718
41668 22718 80129 199813 352677 428568 328216 116824 -17868 13066 111519 151713 135813
41657 135813 147985 230084 350672 438374 413938 262923 115846 162313 407568 596520
41647 596520 486186 130486 -231252 -508663 -799760 -1105179 -1235304 -1104242 -919226 -902325
41637 -902325 -959075 -830190 -487861 -152910 48612 206233 383869 493999 482772 429015
41627 429015 366270 215162 17432 19753 324923 627340 542165 104565 -305344 -488575
41617d88575j30626k63602k80555n2859J91152J67807j24788l91815l14025J33585
41607a554301O14665P49219M99942J45767r4596k29040k84934j92201K8959J96444
41597a20076K24073K46949L44185L60139J92372L3475P6554J75148R0330q5708
41587A537441r2637K4041j9628k46449l77167l13066k61282k87249j57224J70628
41577b2592K89127q0791n27667l94583L05834Q32903O33770n092l70416j68588
41567D91905K35286L26633Q61m07294n39605l67854j28545R575R0268J69064J36147
41556A6441j03554l66441l33766K1454L59793M02535K36624P6375o4492k46071
41546a102l20278r0686L05686N11052M64072M57192N79616M87755k2514n53919
$$ plain form
41617 -488575 -619201 -882803 -1163358 -1216217 -1025065 -857258 -982046 -1373861 -1687886 -1554301
41607 -1554301 -939636 -190417 309525 455292 360696 131656 -153278 -345479 -316520 -120076
41597 -120076 103997 350946 695131 1055270 1247642 1281117 1357671 1532819 1623149 1537441
41587 1537441 1444804 1468845 1449217 1202768 825601 512535 251253 -35996 -193220 -22592
41577 -22592 266535 185744 -341923 -736506 -430672 402231 1036001 1030909 660493 491905
41567 491905 727191 1053824 1054685 647391 107786 -260068 -388613 -379038 -288770 -119706 16441
41556 16441 -87113 -453554 -787320 -765866 -406073 -3538 233086 309461 244969 -1102
41546 -1102 -321380 -412066 -106380 404672 868744 1325936 1905552 2393307 2370793 1816874
41536A816874o03290l02255k07956m40183n18984j35121L71034N06586K53944
41527G40649n4403k20890k56713j68666J3711J02124o5740l38173l87097j23419
41517g58617K25187M27935M35691K73070q943k27182j49949J91722M42415L12115
41507A163444p5912l51046l30411j58102n0162l7063N733J46605K78571K20402
41497H12059o4953l67920l94587o9414L43041M71713K16120j42549k46307n5108
41487E02095J34732P9806j08187j45071K0993J56657R3696n7806j23941j15928
41477D37046j12090l1935K40818N53219N56147J58127k91056m09508k44798j51612
41467G04358k74771l66823j67204K17269M50324L91206K13568J17584R6760M6781
$$ plain form
41536 1816874 1213584 911329 703373 263190 -255794 -390915 -19881 486705 740649
41527 740649 686246 465356 208643 39977 53688 155812 90072 -248101 -635198 -758617
41517 -758617 -533430 -105495 330196 603266 594323 367141 217192 408914 851329 1163444
41507 1163444 1087532 736486 406075 247973 197811 160748 166481 313086 591657 812059
41497 812059 747106 379186 -15401 -84815 258226 729939 946059 803510 557203 502095
41487 502095 636827 716633 608446 463375 484368 641025 734721 676915 552974 437046
41477 437046 324956 293021 533839 1087058 1643205 1801332 1510276 1100768 855970 704358
41467 704358 429587 62764 -104440 112829 563153 954359 1167927 1285511 1382271 1429052
41457A429052m3005j19239j86715k73702l35966l15539k47594j97252j50427r2359
41447e32746j11885k52488l35373j62270J46273K86345K35292K53433L73372K89124
41437A89077o4513k39650O9294M38843K70569k68625m26527L5179M89913L49651
41427H43211j75317n04020m80087l61075k73368j09384J25346K50075K09070J36736
41417c38813R6809L1341L274J78680M56067M33163k8382m66308l69149J00265
41407I6947L17193P3646j89378j17113L3047j21663m14042l54133J16900N23544
41397c5052N08079K22484j1428j18385j93470k48285k29778j64936j29779j37436
41387e37986j37723o3242J42374M29448N79647M14171Q4598n9166N3288J13296
$$ plain form
41457 1429052 1386047 1266808 1080093 806391 470425 154886 -92708 -289960 -440387 -532746
41447 -532746 -644631 -897119 -1232492 -1394762 -1248489 -962144 -726852 -473419 -100047 189077
41437 189077 124564 -115086 -45792 393051 663620 394995 -31532 3647 493560 843211
41427 843211 667894 163874 -316213 -677288 -950656 -1060040 -934694 -684619 -475549 -338813
41417 -338813 -242004 -210663 -207389 -28709 427358 860521 832139 365831 -3318 96947
41407 96947 414140 487786 298408 181295 214342 92679 -321363 -675496 -558596 -35052
41397 -35052 473027 695511 684083 565698 372228 123943 -105835 -270771 -400550 -537986
41387 -537986 -675709 -738951 -596577 -167129 412518 826689 911287 852121 905409 1018705
41377A018705q0929l01347k40710L3696K09011J53082j5461j64684k44654k37644
41367A29065j92680k15219k80919k09091K1193J33694l8582k20188o8719K92147
41357f49299M66232L74917K58601J79707k4665k93711l16110o3912P3862j17251
41347a11629l17039j52025K45738M40800K72153k3935j56024m1775J90025L12764
41337F59053J86580p5368k14838j55237p1124o8252n382K18553L95760K55167
41327A124912j25317l77879k96273n2830N5491m9916j94354j95552o9496M4038
41317a37176J14489K42417M01269L51680j493l36807k97179l7841j4767k47862
41307C6730k53761J60649N03274K87610k46288m81135k50524P7913J94651J21272
$$ plain form
41377 1018705 937776 636429 395719 429415 638426 791508 776047 611363 366709 129065
41367 129065 -63615 -278834 -559753 -768844 -747651 -613957 -652539 -872727 -941446 -649299
41357 -649299 -183067 191850 450451 630158 605493 311782 -4328 -68240 5622 -111629
41347 -111629 -428668 -580693 -334955 105845 377998 354063 198039 156264 346289 659053
41337 659053 845633 770265 555427 400190 329066 260814 255432 473985 869745 1124912
41327 1124912 999595 621716 325443 272613 328104 278188 83834 -111718 -181214 -137176
41317 -137176 -22687 219730 620999 972679 971186 634379 337200 299359 284592 36730
41307 36730 -217031 -56382 446892 734502 488214 7079 -243445 -165532 29119 150391
41297A50391n0264l06065n45299n56498k59389J85373N33621O10155L73804N673
41287A41502j49734M2684K59923J09247k77463l63798L4494M55345M06669j1501
41277F47368l29900l41648k28781j72103j39148p0071j6641k610O7911K30704
41267c54919L21569J83435n4905r6737J22998L42646L36783J87724P3141l2282
41257A029453k25314l72053k37356R2304K20127k6960l27227k88757M1368K84117
41247A89702K27632K4446o9980k79P1303j0036j72495j73200N9552K36169N5415
41236D38229l09659l72734k5749K69822J39638j83128k49007k5576J84223K41719
41226A07778K16716P4711k65889n97860n42180o5939M27708O03140N15045L55485
$$ plain form
41297 150391 100127 -205938 -751237 -1307735 -1567124 -1381751 -848130 -237975 135829 141502
41287 141502 -8232 34452 294375 403622 126159 -237639 -203145 252200 658869 647368
41277 647368 317468 -24180 -252961 -425064 -564212 -634283 -650924 -653534 -585623 -354919
41267 -354919 -33350 150085 95180 -1557 121441 464087 800870 988594 1061735 1029453
41257 1029453 804139 432086 194730 287034 507161 480201 152974 -135783 -94415 189702
41247 189702 417334 441780 371800 371521 442824 432788 260293 87093 146645 382814 438229
41236 438229 128570 -244164 -269913 -91 139547 -43581 -292588 -318164 -133941 107778
41226 107778 324494 399205 133316 -464544 -1006724 -1072663 -644955 -41815 473230 828715
41216H28715J59972r2730l04326l51942k43072o6420J13165K37064K34294R7435
41206F12155q9186k31811k78256k05176n8821J1048j03081k73500k25780J32780
41196g09628N62447P07362M26369o7242l59809k10323J70943L32079J36371q0196
41186I08373l4261R2222L0964n4702J35400L97264K23537l59982p19423n16353
41176A03039j69890j68206l78200l89584j83639m4478l3613L9648K35452M03339
41166e86132M22593K79337m300l02686l78841j78198J2039m5164j43252M7640
41156h76964L97393M54478J42672r6836M5706L24317L47787J31331j3827K1127
41146H77184K3525j80595m46867m77185j94354J43161K39229J09417J3429N3038
$$ plain form
41216 828715 988687 895957 591631 239689 -3383 -69803 43362 280426 514720 612155
41206 612155 522969 291158 12902 -192274 -251095 -240047 -343128 -616628 -842408 -709628
41196 -709628 -147181 560181 986550 919308 559499 349176 520119 852198 988569 908373
41186 908373 874112 966334 997298 942596 1077996 1475260 1698797 1338815 619392 103039
41176 103039 -66851 -235057 -613257 -1002841 -1186480 -1230958 -1264571 -1224923 -989471 -586132
41166 -586132 -163539 115798 111498 -191188 -570029 -748227 -736188 -781352 -924604 -876964
41156 -876964 -479571 -25093 117579 20743 66449 390766 738553 869884 856057 877184
41146 877184 900709 720114 273247 -203938 -398292 -255131 -15902 93515 106944 159982
41136A59982M2156j20148j74769J43408O05664O72551J87795m05482o28912m97780
41126a5535l46942l34696l22701j53725J31401L41826L06734K0721l16908m43311
41116a133136k68977M9540K90335L61061K99658J85207J18449K00252M07252N15069
41106A024710K74143k77515p37723o77924j08070M45385M32683j20959o15704
41097c60974n45753n3136L16179K94265J00131O408k427l3675j9683J22765K31752
41086E5852P8067k47152l88862k02869O0999J36501Q7279J18644K14022J97299
41076A09780Q7988J18609L38159M44105J84562k29719l50870p8099K25322K27393
41066A077230O833j64514k05159k03886j66282k4809J48695J74143K7674j12474
$$ plain form
41136 159982 202138 81990 -92779 50629 656293 1328844 1516639 1111157 482245 -15535
41126 -15535 -362477 -697173 -1019874 -1173599 -1042198 -700372 -393638 -372917 -689825 -1133136
41116 -1133136 -1402113 -1352573 -1062238 -701177 -401519 -216312 -97863 102389 509641 1024710
41106 1024710 1298853 1021338 283615 -394309 -502379 -56994 375689 254730 -360974
41097 -360974 -906727 -959863 -643684 -349419 -249288 -242880 -245307 -278982 -298665 -175900 55852
41086 55852 133919 -113233 -502095 -704964 -643965 -507464 -420185 -301541 -87519 109780
41076 109780 197768 316377 654536 1098641 1283203 1053484 702614 624515 849837 1077230
41066 1077230 1084063 919549 714390 510504 344222 319413 468108 642251 669925 557451
41056E57451j20103n3145N571O0441R4347L6178o1898m440K32868L36389K6210
41045A109869m98534p31349m65100r792K30384J99021J17348J26718J45796M0914
41035B65275j64348k80346j54088J21642K63148J16168j51524k75765k24992j37604
41025f22434j3472K60056N60206N31214R3381l24190l07523j1506J08824k3207
41015B51349o1491J61540L74707L12024R1441l6850p1260j48223k16667j00572
41005E55998J59003K70439N5978k98856m40078k31125J05942K27560L5441k19866
40995B20436k40010l6331J25793J14252P3406J27785J62528N3379p6290o2603
40985D62345k9296k09916m90605m68511m5880L37636K54333j39337l16677n8178
$$ plain form
41056 557451 437348 384203 389774 450215 544562 580740 518842 514402 747270 1083659 1109869
41045 1109869 611335 -120014 -585114 -594906 -364522 -165501 -48153 78565 224361 265275
41035 265275 100927 -179419 -333507 -211865 51283 167451 15927 -259838 -484830 -622434
41025 -622434 -635906 -375850 184356 715570 808951 484761 177238 165732 274556 251349
41015 251349 189858 351398 726105 1038129 1129570 1092720 1021460 873237 656570 555998
41005 555998 715001 985440 1041418 742562 302484 71359 177301 404861 440302 220436
40995 220436 -19574 -55905 69888 184140 257546 385331 547859 601238 524948 462345
40985 462345 433049 223133 -267472 -735983 -781863 -444227 -189894 -329231 -645908 -704086
40975g04086L30078M63944L25842J77612J78387K38611K18980J28825N9507O432
40965A424132j18809l06505m11134l52701k44132k22623k44935j74614n565J45021
40955e11865K24520K73634K93150K41774J53807R2949O762j71854k92175j29058
40945A81644J87206K09877j85366n17889l48340N4191R4775k47168l87058k7217
40935i85345M04713M08375J09876r014J76991L61879L22006J44221m4146k45612
40925F43944m18696m02686j53119J32002K58880K71090L04751L36882K36027j4565
40915A194510k94804n00634n89708n27094l30371j36060o8782n3023R4165L74336
40905h37465N67136N18865L29486J84581J19556M3321p4839j36812l5406J83120
$$ plain form
40975 -704086 -374008 89936 415778 593390 771777 1010388 1229368 1358193 1417700 1424132
40965 1424132 1305323 998818 587684 234983 -9149 -231772 -476707 -651321 -656886 -511865
40955 -511865 -287345 -13711 279439 521213 675020 767969 774731 602877 310702 181644
40945 181644 368850 578727 393361 -124528 -472868 -418677 -323902 -571070 -958128 -985345
40935 -985345 -580632 -172257 -62381 -71395 105596 467475 789481 933702 889556 643944
40925 643944 225248 -177438 -330557 -198555 60325 331415 636166 973048 1209075 1194510
40915 1194510 899706 399072 -190636 -717730 -1048101 -1184161 -1252943 -1305966 -1211801 -837465
40905 -837465 -270329 248536 578022 762603 882159 925480 850641 713829 678423 861543
40895H61543L02709J56148j22460k07502l4365N8372j57998l74469j96403J44494
40885D30069N8070m35255o15115j26211M67293N40260K70784J61218J75434j9092
40875I07455k95659k67713n0264r5602l49265l07838N8532J95395p7715k38543
40865e21217L0472K93367J15448k27014k61952n3075Q2869J64054L13786L09477
40855B46215m4645l60165j10298M98728P05313K25383m18213o38736l97675l565
40845b97658K87219L49811J95889J5611j2842K0633p3076k04404j17593J31686
40835B95276J81115q8175l52860l14631o1069J71060L08344L59823K78091Q8408
40825H65382l5894m77N7656j4461j61252k39357k27856j91176j49576j00916o7300
$$ plain form
40895 861543 1164252 1320400 1197940 990438 956073 1014445 856447 481978 285575 430069
40885 430069 488139 52884 -562231 -688442 -221149 319111 589895 751113 926547 907455
40875 907455 611796 344083 293819 198217 -151048 -458886 -400354 -204959 -282674 -521217
40865 -521217 -490745 -197378 -81930 -308944 -570896 -623971 -541102 -377048 -63262 246215
40855 246215 201570 -158595 -268893 229835 935148 1160531 742318 103582 -294093 -297658
40845 -297658 -10439 339372 535261 550872 538030 558663 485587 281183 163590 295276
40835 295276 476391 388216 35356 -279275 -340344 -169284 139060 498883 776974 865382
40825 865382 829488 829011 886667 872206 710954 471597 243741 52565 -97011 -197927 -265227
40814b65227k8589P8158K12150K18038O5578l7833Q5661L10744L60155J66280
40804A165115p4647j87083k03799k35808k74432k18664o3807M4329n257j20018
40794a74071j26342l3055k4647j61983k57365j39663J11492L17453M22731M05122
40784C39672J53310l02021n73036k84786L46538O46979K92974k87706m59343j00078
40774b27497L86032O02805M94029K18800q3213l32562m29016k77012M9474K62113
40764F63953J39100j54202k18134N3180L11523K25269j27474m80387p07562p09271
40754a004005l03473M00094Q07970N08554p2205k15431N0792R0011k37951l66464
40744c42108m0496K24263L0177k42136j38055Q6752k1538k62034j18221L12760
$$ plain form
40814 -265227 -293816 -215658 -3508 214530 280108 242275 327936 638680 998835 1165115
40804 1165115 1090468 903385 699586 463778 189346 -29318 -93125 -48796 -54053 -174071
40794 -174071 -300413 -333468 -358115 -520098 -777463 -917126 -805634 -488181 -65450 339672
40784 339672 492982 190961 -382075 -666861 -320323 326656 619630 331924 -127419 -227497
40774 -227497 158535 761340 1255369 1474169 1390956 1058394 629378 352366 401840 663953
40764 663953 803053 648851 430717 483897 795420 1020689 893215 412828 -294734 -1004005
40754 -1004005 -1307478 -907384 -99414 409140 336935 121504 172296 262307 24356 -342108
40744 -342108 -382604 -158341 -128164 -370300 -508355 -421603 -443141 -705175 -823396 -510636
40734e10636M27892Q2343j90175J976L90330N17317L28958Q3008o6222j62252
40724I02539k47898k48319o2066K64701M85531L67466j1893l11192l29791k04831
40714F04247j27125q1132j9169n9557k67998m16377k38933J64679M24201L37528
40704C20364L4698k10863j84703J22764M20327L40103p5636l37262j63501J04380
40694C70671L3309k54587l58328k50799j72031r0890J58850L53457J40443k16976
40684b86881p3793N08748O51994n8131q54417q32212j76194K42080J24828m6295
40674h00273R1232L02430K35586p7781l45721l55602r1913K81563M98671M09831
40664A48023J47131n0624j24827j50789r9692J00436L01627K28268j09122l53267
$$ plain form
40734 -510636 -82744 -401 -190576 -188600 201730 719047 1048005 1131013 1064791 902539
40724 902539 654641 406322 344256 608957 1094488 1461954 1450061 1138869 809078 604247
40714 604247 477122 395990 376821 317264 49266 -367111 -606044 -441365 -17164 320364
40704 320364 355062 144199 -40504 82260 502587 842690 767054 429792 266291 370671
40694 370671 403980 149393 -208935 -459734 -631765 -722655 -563805 -210348 -69905 -286881
40684 -286881 -360674 148074 800068 741937 -112480 -944692 -1120886 -878806 -753978 -800273
40674 -800273 -709041 -406611 -171025 -248806 -594527 -950129 -1042042 -760479 -261808 148023
40664 148023 295154 244530 119703 -31086 -130778 -30342 271285 499553 390431 37164
40654C7164k61266l515J29413J08693P7058N5674k1581q7371j2297J37223J60580
40643C19775M9532l649K4510r7539m22236n86053k82909K22778M03842J94089
40633a77860K4118J35468K61256J14131j69053k90848k26073j37405o3505M7611
40623d82160J40629J34595R6974J28387J78315J55423R0617J8116j29031l07063
40613B4802k69243N4206L28668K96986K22187M11275N60441J81176m69962o18351
40603G22185j63291J25443j75639m90973k35664K18900J88740k08635l05623L5258
40593b89299L17919K73052J38261P4351n4150k03758o1865L38312M47485r415
40583I70893m97050l58959K36237N19469J77586k89458l20977K456K11646J26045
$$ plain form
40654 37164 -224102 -227617 -98204 10489 87547 143221 121640 34269 21972 159195 319775
40643 319775 369307 365658 390168 292629 -129607 -715660 -998569 -775791 -371949 -177860
40633 -177860 -153742 -18274 242982 357113 188060 -102788 -328861 -466266 -529771 -482160
40623 -482160 -341531 -206936 -109962 18425 196740 352163 442780 460896 331865 24802
40613 24802 -244441 -190235 138433 435419 657606 1068881 1629322 1810498 1340536 722185
40603 722185 558894 684337 508698 17725 -217939 961 189701 -18934 -324557 -289299
40593 -289299 28620 301672 439933 514284 460134 256376 194511 532823 980308 970893
40583 970893 473843 114884 351121 870590 1048176 758718 437741 440197 651843 777888
40573G77888j9402k2533J5747o6414k06129k32451j41269o3553j9530Q1003J89084
40562B92441J02837k04974m55266m12664j99270p1690l1390R9749L10020L92532
40552a77675K97175J97288J47564l6234m13024o83173n46080j29592J85753K74322
40542h83676L26997M33188M00912R6893k68970l81846k12566R568J24842J48568
40532b06090R8742m9186k01773j67922M8417J66266Q424j85686o0315L19937N05036
40521B75850K58285j32207k53363q1533O7249k4564k65025m19050l30798j4397
40511i19553L29598L99729N1511m82723p45099m99531K2088L68921L29463J00802
40501a044794K5427K07930M20108L86513J18112j13673j30630m8578n0618r4660
$$ plain form
40573 777888 758486 735953 751700 685286 479157 246706 105437 41884 22354 103357 292441
40562 292441 395278 190304 -264962 -677626 -876896 -948586 -979976 -880227 -570207 -177675
40552 -177675 119500 316788 464352 428118 15094 -668079 -1214159 -1343751 -1157998 -883676
40542 -883676 -556679 -123491 277421 374314 105344 -276502 -489068 -479500 -354658 -206090
40532 -206090 -107348 -156534 -358307 -526229 -477812 -311546 -303122 -488808 -549123 -229186 275850
40521 275850 534135 401928 148565 67032 134281 109717 -155308 -574358 -905156 -919553
40511 -919553 -589955 -190226 -138715 -621438 -1366537 -1866068 -1843980 -1475059 -1145596 -1044794
40501 -1044794 -1019367 -811437 -391329 -4816 113296 -377 -131007 -179585 -230203 -324863
40491c24863j8792J41729J82867Q8816R9095L05924M24071J69071l01762n69731
40481A96425m71984j93803O4968K27061K00928m1771k36017n7605L17760L12698
40471C18660j93680n53752k54340K76872K92170j36983k62132J49076M69370K08747
40461C14008k68704l43086O595L18808L07557N5455k28936l45909j72403J56714
40451a99901K99326J31468q2612j20329j20286k35597k81255o4477K03054K18486
40441b52123J02285J78049M01247M53580K99798J92644J75481M4984j79432k08443
40431A208070N389J19609q7221l91174m71586l18640j37763n0846k7612J8860
40421a32914J41667K79067K90851J69550Q8098Q7301o9564m68394p18533m55346
$$ plain form
40491 -324863 -343655 -201926 -19059 69757 168852 474776 898847 1067918 766156 196425
40481 196425 -275559 -469362 -404394 -177333 23595 -18176 -254193 -311798 5962 318660
40471 318660 124980 -428772 -683112 -406240 -114070 -251053 -513185 -364109 105261 314008
40461 314008 45304 -297782 -291187 27621 335178 390633 161697 -184212 -356615 -199901
40451 -199901 99425 230893 148281 27952 -92334 -327931 -609186 -673663 -470609 -252123
40441 -252123 -149838 28211 429458 883038 1182836 1375480 1550961 1595945 1416513 1208070
40431 1208070 1213459 1333068 1245847 854673 383087 64447 -73316 -124162 -151774 -132914
40421 -132914 8753 287820 578671 748221 836319 923620 854056 385662 -332871 -788217
40411g88217L1596J66576n0396j14643J07704K09255J8083r2358J26189L76399
40401i812L27912P6591j53222l11782k99178P7209O41526Q24198M23009n6597
40391A539854j49431m7616r0682j33828P1106K81603J33945j88801k43518q0095
40381A092537j35466m80806o98498m93248j6878L96671N01234K22922k27482m38746
40371b77760k61300p621O5456J76251N47191Q46464O29151R6203j78277j20340
40361A515418j30362k73866j88757J43666K18148j82197n59417l99235J14834
40352B58232L95974J80997k84405n79215m57749m4895K32929R9162j87515j58945
40342e45430J81092L70154K10033L8250J36891L01596K47557P9700M3468Q3416
$$ plain form
40411 -788217 -756621 -590045 -640441 -755084 -647380 -438125 -420042 -512400 -386211 -9812
40401 -9812 318100 394691 241469 -70313 -369491 -292282 349244 1173442 1596451 1539854
40391 1539854 1390423 1342807 1252125 1118297 1189403 1471006 1604951 1416150 1172632 1092537
40381 1092537 957071 476265 -222233 -715481 -732359 -335688 165546 388468 160986 -277760
40371 -277760 -539060 -546681 -481225 -304974 242217 1088681 1717832 1814035 1635758 1515418
40361 1515418 1385056 1111190 922433 1066099 1284247 1102050 542633 143398 258232
40352 258232 654206 835203 550798 -28417 -486166 -531061 -298132 -198970 -386485 -545430
40342 -545430 -364338 5816 215849 254099 390990 692586 940143 1019843 1063311 1146727
40332A146727m073j54958j17466J20139K64405R0064k98488n90758n54041k17527
40322c15976J51178K88789J99359J12172J55662J93955O0044j66301k42564q2595
40312C53723J22232J24855q4374k52770j54270J28047K81351J25073k06822m64636
40302b7591n26541l90310r5011K27064L72163K91347J73468J71238K05321J99662
40292F00810K99269N86972P57219M33012k45306p03700o47141l79626l13607m27042
40282c9140l90352q0908K40619K77181R2382M2214K87875N16522L24712j89168
40272A081937m81962k49697K18214M62304L66074J22540m8700k892K63700N09607
40262B241125M55481J86113L5170R314k24496o46914p41783l21199Q1101L5994
$$ plain form
40332 1146727 1142654 987696 870230 990369 1254774 1344838 1046350 455592 -98449 -315976
40322 -315976 -164798 123991 323350 435522 591184 785139 845183 678882 436318 353723
40312 353723 475955 600810 516436 263666 109396 237443 518794 643867 437045 -27591
40302 -27591 -554132 -944442 -1039453 -812389 -440226 -148879 24589 195827 401148 600810
40292 600810 900079 1487051 2244270 2677282 2431976 1728276 1081135 701509 387902 -39140
40282 -39140 -429492 -510400 -269781 7400 99782 141996 429871 946393 1271105 1081937
40272 1081937 599975 350278 568492 1030796 1396870 1519410 1470710 1467818 1731518 2241125
40262 2241125 2696606 2882719 2917889 2927203 2702707 2055793 1314010 992811 1073912 1109906
40252A109906j28880M357J89760N0497j43665L5924L22230J82044k06157k27479
40242A188537J22620K83448R5185o5297l9629l5259p6337j6359k1403l29284o27911
40231D78311m23586P4128K31311N1582Q7931L52773K75773j88962l87082p8089
40221D74090J87728M8715j63554j63648j46372k00195n4985K94208M28275K34862
40211I39124J17029K54689L41617K38837J89329K29957J09300q9629N236K99770
40201B635259L07056K9183n2516J32075K38532L26835P03817J060996Q67239M71096
40191F719572N89507R20025O92445L45912R45852K117976K523619K303518K862244
40182B0020670M246020N210685N933671P783205J0255020J1587994J2838992J7263738
$$ plain form
40252 1109906 981026 985383 1175143 1225640 1081975 1117899 1440129 1622173 1416016 1188537
40242 1188537 1311157 1594605 1689790 1624493 1584864 1549605 1473268 1456909 1435506 1106222 478311
40231 478311 54725 128853 360164 411746 499677 852450 1128223 939261 552179 474090
40221 474090 661818 710533 546979 383331 236959 36764 -18221 275987 704262 939124
40211 939124 1056153 1310842 1652459 1891296 2080625 2310582 2419882 2330253 2335489 2635259
40201 2635259 2942315 2971498 2918982 3051057 3289589 3616424 4320241 5381237 6248476 6719572
40191 6719572 7309079 8229104 8921549 9267461 10213313 12331289 14854908 17158426 20020670
40182 20020670 24266690 29477375 35411046 43194251 53449271 65037265 77876257 95139995
40174I5139995K4934438L3053719M2715583N7689165P1842939O6089248K8361629
40167D19826716k6155842o5320540p1704029n6149226l9269657k9338780k2661156
40160A09227486j6513400j2663781j1493518j0508082q611473p007418n982850
40153C6446964m536418k974216k638566l198217k987095j870830j272444j526013
40145A5443165j555538j074954r06999j128499r15149k78488j29550n53257o79533
40136H221198l04018r9862k30049k07440p8413l30820p10632n16188M2262J46445
40126E932483j22844J1507M65038M00123j80378l98372m8642K13353K18019M44756
40116F935043Q78410J078343J298411K115206L138245L708625M581658O764584
$$ plain form
40174 95139995 120074433 153128152 195843735 253532900 325375839 391465087 419826716
40167 419826716 393670874 328350334 256646305 200497079 161227422 131888642 109227486
40160 109227486 92714086 80050305 68556787 58048705 49437232 42429814 36446964
40153 36446964 31910546 28936330 26297764 23099547 20112452 18241622 16969178 15443165
40145 15443165 13887627 12812673 11905674 10777175 9862026 9583538 9453988 8900731 8221198
40136 8221198 7917180 7817318 7587269 7379829 7301416 6970596 6259964 5743776 5786038 5932483
40126 5932483 5809639 5821146 6286184 6686307 6505929 6107557 6058915 6272268 6490287 6935043
40116 6935043 7813453 8891796 10190207 12305413 15443658 19152283 23733941 30498525
40108C0498525Q602658O605415J93861o520871r139950p581097m929265l244364
40100A4484912k313999j545321j040745q80838p77415o28412n95379o34886n54606
40091E513311l94759k71786r8003J23542R3569k62171m87535k60676Q2664J44241
40081D182397R0910J88490K17967o8205l69414l20731j39711j89835l04705j80573
40071C106590n3829k88136o01958m49881L2242J96420j07965l80532k98016o7356
40061A087579P6483J53034J40324r0276m13718m50378p9804L61772N16712L82941
40051A684669J78535O6445R1638J99820K45426J09115j57027l77172m15021k32178
40041A394250J16008M52211N61860M13794J91057L2645j01382k40275k91085k31542
$$ plain form
40108 30498525 39101183 45706598 45900459 39379588 30239638 22658541 17729276 14484912
40100 14484912 12170913 10625592 9584847 8704009 7926594 7298182 6702803 6067917 5513311
40091 5513311 5118552 4846766 4748763 4872305 4965874 4703703 4216168 3955492 4038156 4182397
40081 4182397 4273307 4461797 4679764 4611559 4242145 3921414 3781703 3591868 3287163 3106590
40071 3106590 3052761 2764625 2162667 1712786 1745028 1941448 1833483 1452951 1154935 1087579
40061 1087579 1164062 1317096 1457420 1367144 953426 503048 423244 785016 1301728 1684669
40051 1684669 1863204 1929649 2021287 2221107 2466533 2575648 2418621 2041449 1626428 1394250
40041 1394250 1510258 1962469 2524329 2938123 3129180 3161825 3060443 2820168 2529083 2297541
40031B297541j96471k32170j83357J9216J80447J27076l2981j06530o2493O9744
40021A880022L00906M98867L77996q9200m94780m88771k29175q1747r9752r7571
40011A476795l8901k6135m6043k4753j8259q7132j14650m738Q7141q597j50775
40000A043953q5326J50593K97676K43766P4871j23546k74693k61545j17398r8135
39990H50216k96415l84790p4499L64579M39750J42010j16229j64420k02993l06130
39980B51079k85617j07155O584r211M6967K19516K67704J15916L7493J79265K66277
39969I88818M5400k82352l64537j83287N5989K95274N46847O20531L18366j53962
39959A887087l34072r7202J89150J65396j23365m08491n22373m15740q9526K89264
$$ plain form
40031 2297541 2101070 1868900 1685543 1704759 1885206 2012282 1979301 1872771 1810278 1880022
40021 1880022 2180928 2679795 3057791 2968591 2473811 1985040 1755865 1674118 1574366 1476795
40011 1476795 1437894 1411759 1365716 1340963 1322704 1235572 1120922 1116184 1203325 1194728 1043953
40000 1043953 958627 1109220 1406896 1650662 1725533 1601987 1327294 1065749 948351 850216
39990 850216 553801 169011 94512 459091 898841 1040851 924622 760202 557209 251079
39980 251079 -34538 -141693 -135109 -144320 -97353 122163 389867 505783 543276 722541 988818
39969 988818 1034218 751866 387329 204042 260031 555305 1102152 1722683 2041049 1887087
39959 1887087 1553015 1455813 1644963 1810359 1686994 1278503 756130 340390 250864 540128
39949E40128L80778L6609m11288m75882j09337K60188K89671O2330j86485l89815
39939c103n27333m48951j00146K41084K67998J04051J32632L89072M77086J77129
39929G09519j92063k11602P5185K72603J68141p0006j83657j27464n4234r2237
39919B94185j85300j70273k2358O0775o8601k27635r6046L13946O06186M88314
39909I93193J16690j42852j35033J0264Q9717J2404j31381j39918N5020K17783
39899I45887N5025l62443o37027n32689j97527J25423L26881L21148N5885k35658
39889a35095j56047K68628M70708R4602m48818n27058j16017L04815M63249M57822
39879F76789L60588J38669o5079k5803J50779J13187j68726l11905j20714R0393
$$ plain form
39949 540128 920906 957515 546227 70345 -38992 221196 510867 573197 386712 -3103
39939 -3103 -530436 -979387 -1079533 -838449 -570451 -466400 -333768 55304 532390 709519
39929 709519 517456 305854 381039 653642 821783 751777 568120 440656 386422 294185
39919 294185 108885 -61388 -83746 -22971 -91572 -319207 -415253 -101307 504879 993193
39909 993193 1109883 967031 831998 842262 931979 944383 813002 673084 728104 945887
39899 945887 1000912 638469 1442 -531247 -728774 -603351 -276470 44678 100563 -135095
39889 -135095 -291142 -22514 448194 542796 93978 -433080 -549097 -244282 218967 676789
39879 676789 1037377 1176046 1110967 1085164 1235943 1349130 1180404 868499 747785 838178
39869H38178j5803k85331l15843k8880K74949L51382K56116J46032L9099j26780
39859A133119k99595l24905j67694K92K4817j6203L0987J09005N0560o4582L3401
39848E09202L18339L83537L1686l71782m11448k04869j21536j56414k1915K74690
39838B29490M27429L77982L89390N05529L95785q3465n58392o15322l21763j7730
39828G28933J74692L42258M41284K93695r1170m39053n19767l90697k63081k13580
39818F3514j26218P5913K34638J16730k19871l90945j55545K12037K50816l8521
39808B2548j60146J91196O74720P15293K05640m12880o86468n54134k39556L6931
39798b06856J55021P8169r1212j15907J29722M17642L65437n3152l96366l02995
$$ plain form
39869 838178 822375 537044 221201 192321 467270 818652 1074768 1220800 1259899 1133119
39859 1133119 833524 508619 340925 341217 366034 349831 380818 489823 540383 475801 509202
39848 509202 827541 1211078 1242764 870982 459534 254665 133129 -23285 -45200 229490
39838 229490 656919 1034901 1424291 1929820 2325605 2242140 1683748 1068426 746663 728933
39828 728933 903625 1245883 1687167 1980862 1889692 1450639 930872 540175 277094 63514
39818 63514 -62704 13209 247847 364577 144706 -246239 -401784 -189747 61069 22548
39808 22548 -137598 53598 728318 1443611 1649251 1236371 549903 -4231 -243787 -206856
39798 -206856 -51835 26334 -64878 -180785 -51063 366579 732016 678864 282498 -20497
39788b0497L3346J75784P8451O9754K60195L76038K64503J65322K81848M23457
39778B108201L39139J27519J8630j5993j12620j79267p0236N9650l4888k24719
39768B015416j63695J18848K05194o8884l48479k82716j850J21550k7238k37077
39758A331069k81368j47555o865j9907j44779j70753r748J44233Q8480p3445j11809
39747E97553o8425j77922m22436m96658k72584J3453J47147K20752L73768N02145
39737D16793M30018J86067r0328l60957n96325o10204k52820K73990N50822M30211
39727C77267J84234Q9588P8466k7334j16257O1302L68090K98394k88142p92969
39717B32639o06570J5295K86906J2880j97317Q2230M84199M99312K17384K1027
$$ plain form
39788 -20497 12849 188633 267084 336838 597033 973071 1237574 1402896 1684744 2108201
39778 2108201 2447340 2574859 2593489 2577496 2464876 2285609 2215373 2275023 2240135 2015416
39768 2015416 1851721 1970569 2175763 2106879 1758400 1475684 1473834 1595384 1568146 1331069
39758 1331069 1049701 902146 895281 875374 730595 559842 550094 694327 782807 709362 597553
39747 597553 529128 351206 -71230 -567888 -840472 -827019 -679872 -459120 -85352 416793
39737 416793 846811 1032878 942550 581593 -14732 -624936 -877756 -603766 -52944 377267
39727 377267 561501 651089 729555 702221 585964 647266 1015356 1313750 1025608 232639
39717 232639 -373931 -358636 -71730 -58850 -256167 -173937 310262 809574 1026958 1047985
39707A047985m2598j25316j43752K8168J81184O7984j28901r7653M5403P91j22303
39696G10992k5823J42073M495l05841l10870n1948o0744m03617n06217j15715
39686i23215K84231K99500J90426K57777K95012Q7583r5073R742J46827J8849
39676E71659j45474j9162J92419J02477j63205j87652K6429J17769O795n0583
39666D51472J1941k4512k25219l65420k69244N315L01365M40600K64939j29580
39656D61657l34832j14554K02916J68693j07087j52706R9452K53402J50261R4849
39646G22051K57920L48434J25699j64941j85798m8311j12788m09952n93777m24617
39636d86080m1687K53859L01205J48545k6965l4828J64880L60627K60043j57131
$$ plain form
39707 1047985 1005387 880071 736319 764487 945671 1013655 884754 787101 832504 833295 710992
39696 710992 685169 827242 831737 525896 215026 163078 102334 -301283 -807500 -923215
39686 -923215 -638984 -339484 -149058 108719 403731 491314 396241 405983 552810 571659
39676 571659 426185 407023 599442 701919 538714 351062 377491 495260 502055 451472
39666 451472 463413 438901 213682 -151738 -420982 -415667 -114302 326298 591237 461657
39656 461657 126825 12271 215187 383880 276793 124087 223539 476941 627202 722051
39646 722051 979971 1328405 1454104 1289163 1103365 1055054 942266 532314 -61463 -486080
39636 -486080 -527767 -273908 27297 175842 148877 114049 278929 639556 899599 742468
39626G42468n35290n04301j10721K37248K57385P9281j1855M3123R1109N3358
39616C41805J5798O1214J59259K25065J96308Q4261J1307R8541K36037J39141
39606A568736k15634m29200k07642J57464J81200j11489k90879k11769j18684
39597C22103j10821k1096J39819J42491K1284O4884K18116Q2306l06326l42969
39587B09791J85935O40851M72317N4139K1190K58080J94560k29706n56904n63532
39577F86721m23371k63749r9958p8224k66221l38617Q17M20347L57214q1282k34502
39566c20825J00704M09894L13699P8686O3822J71594J42778J4313j8151O2032
39556A018546J35102J41834P2094p7418k16668j95701j7211J26561Q5398j04297
$$ plain form
39626 742468 207178 -297123 -407844 -170596 86789 166070 154215 197338 288447 341805
39616 341805 357603 418817 578076 803141 999449 1083710 1095017 1193558 1429595 1568736
39606 1568736 1353102 923902 716260 873724 1054924 943435 652556 440787 322103
39597 322103 211282 190186 330005 472496 493780 558664 776780 859086 552760 209791
39587 209791 395726 1036577 1508894 1563033 1584223 1842303 2036863 1807157 1250253 686721
39577 686721 263350 -399 -100357 -178581 -444802 -783419 -782602 -362255 -5041 -86323 -320825
39566 -320825 -220121 189773 503472 582158 645980 817574 960352 974665 956514 1018546
39556 1018546 1153648 1295482 1367576 1290158 1073490 877789 860578 987139 1072537 968240
39546I68240l02158l52272j49680J93855L38953J20044j37721k4782K95280K45919
39536A195678k96365p27853n09616J05282M25369K01515j52336j64308J34106
39527B11472L39326K22763k7209j26924p8972n7113l4288J67418M58431M74090
39517A548994J03322l14367m82819m88586m51060k47255J10005K39987l5478k55014
39507b72271N0112N89421P22913L87744L5547j48131l23003m22736j86130K41011
39497F74477L65509Q3801j81308j45631L6405J76272K54361J87176j05143l76340
39487I69579l03911n0108l2026j82919q8140J70101P1992l56385m55724m9760
39477c07301K02069o9200k90796O1116N57157N32089J03187k01081l30065n18899
$$ plain form
39546 968240 666082 313810 164130 357985 696938 816982 679261 654479 949759 1195678
39536 1195678 899313 171460 -338156 -232874 192495 394010 241674 77366 211472
39527 211472 550798 773561 746352 619428 540456 483343 449055 616473 1074904 1548994
39517 1548994 1652316 1337949 855130 366544 -84516 -331771 -221766 18221 -17257 -272271
39507 -272271 -222159 367262 1090175 1477919 1513466 1365335 1042332 619596 433466 674477
39497 674477 1039986 1123787 942479 796848 833253 1009525 1263886 1451062 1345919 969579
39487 969579 665668 615560 583534 400615 312475 482576 554568 198183 -257541 -307301
39477 -307301 -105232 -174432 -465228 -404112 153045 685134 788321 587240 257175 -261724
39467b61724o02847k72744K21575L25804J7816k22327j91205j29898j48568m7552
39457a311670K20749L90983L13942J74611J46559J33467J3243r3439L538K36034
39447B28017L21594J55684K829J38896L77465K48249k73128n94265l33243Q2523
39437C54621J00418o0779J27871M42292J96356m85102o83302j28692L71675K70677
39427E06035M6235J44125J53239k62720n22459j07771L70544J00535n31580n63364
39417f67181m4718J55552j12299j29897L10282N18390J19136l24921k52034J15637
39407c12053L06930K93474K65128J94930k3486l29999o01210p25773n24251M7173
39397a409137N97200O30200K12009j30250j80561j99303k81907j47059K61070
$$ plain form
39467 -261724 -864571 -1137315 -915740 -589936 -572120 -794447 -985652 -1115550 -1264118 -1311670
39457 -1311670 -1090921 -699938 -385996 -211385 -64826 68641 81884 -11555 -8017 228017
39447 228017 549611 705295 708124 847020 1224485 1472734 1199606 605341 272098 354621
39437 354621 455039 394260 522131 964423 1160779 675677 -7625 -136317 235358 506035
39427 506035 552270 696395 849634 586914 64455 -43316 327228 427763 -103817 -667181
39417 -667181 -711899 -556347 -668646 -798543 -488261 30129 149265 -175656 -427690 -312053
39407 -312053 -5123 288351 553479 748409 724923 394924 -206286 -932059 -1456310 -1409137
39397 -1409137 -811937 -181737 30272 -99978 -280539 -479842 -761749 -908808 -647738
39388f47738N15148L23863l5142j76016j20487r2737j32210j62894j72226j15359
39378h15798R9542L67862M02461J41439j29146j88357j26290n6197R1966L25105
39368A12587M46746L57059K21782J65389O7510j52121l16191k67100j29598r0780
39358D15283j20326j00486m8770l1197k1490n970o2103j79811j69965Q2128M01544
39347A58837N15276L66706J24941l8962r3797j15674j57816j45258K8280K51637
39337H94170K23323j13941l79473k65562l2575j16109m14172m51750j65545L6231
39327g85403J6731J11513M36190N86923L24677M1061J48767M12751L31419j01368
39317A523261m61225n38759m89465m11520j69573K86865O81153O36899J18615
$$ plain form
39388 -647738 -132590 191273 156131 -19885 -140372 -233109 -365319 -528213 -700439 -815798
39378 -815798 -716256 -348394 54067 195506 66360 -121997 -248287 -304484 -212518 112587
39368 112587 559333 916392 1138174 1303563 1371073 1218952 902761 635661 506063 415283
39358 415283 294957 194471 145701 114504 93014 87044 24941 -154870 -324835 -242707 158837
39347 158837 674113 1040819 1165760 1126798 1033001 917327 759511 614253 642533 894170
39337 894170 1117493 1003552 624079 358517 325942 209833 -204339 -656089 -821634 -785403
39327 -785403 -768672 -657159 -220969 365954 690631 731692 880459 1293210 1624629 1523261
39317 1523261 1062036 523277 33812 -377708 -547281 -260416 420737 1057636 1176251
39308A176251m18437m27972R2357N07124K85458l11949o02763m06286j51509j16460
39298c74186j09888J277K1914r5058m2611K63684L99353R0287k95786l30467j67965
39287f39446j39270j18194J39178L67813J70121k00019j35082L24562M91743R2597
39277C54003l39871l17440n3296K3336p1833o6452O1073J35620J28784J21023
39267b5053P5215o2036j57287o7843P5227N0316n5400M0757K94493K92555j14958
39256C45986m69697k88963K17673L96950N0544l19577k38793J43461L73648K96017
39246E07249O8486j77679l75370l83206j42113J19978J38487r818o2826p509k9170
39235c53491j04505k0812K10835L26704K20999N4640n7618j34574j15527N9859
$$ plain form
39308 1176251 757814 329842 422199 929323 1214781 902832 300069 -106217 -257726 -374186
39298 -374186 -484074 -482797 -460883 -555941 -598552 -334868 64485 154772 -141014 -471481 -639446
39287 -639446 -778716 -896910 -757732 -389919 -219798 -419817 -554899 -230337 261406 354003
39277 354003 14132 -303308 -356604 -333268 -405101 -471553 -410480 -274860 -146076 -25053
39267 -25053 50162 -11874 -169161 -237004 -161777 -111461 -166861 -126104 168389 460944 345986
39256 345986 -123711 -412674 -195001 201949 252493 -67084 -305877 -162416 211232 507249
39246 507249 575735 398056 22686 -360520 -502633 -382655 -244168 -253986 -316812 -324321 -353491
39235 -353491 -457996 -478808 -267973 58731 279730 334370 276752 142178 26651 86510
39225H6510J66876o6063m01253k76685L30705P41801M92984n6561l04978j63739
39215E49597O7230J82648J03267k17137n81780n78564j45991K19508J55949k3926
39205b69199J20046M24033M27797J40867l7259K840J2005p9743n8824J19219J98902
39194A000684K7502k26840l35348k58424r4934M4571J01151J09517J30446R9470
39184E97795r3390l21793k90753j018J77472O6359n5515K6509R8190j1199m8031
39173A44626J42111J66414k67704o51390l22511M42423P36697L05215k19725l34999
39163A41157j89483l1648J48919K62944O1191l26084l63421J03290N41211M95718
39153H43794J96857R1174J83792J94654M4212j51139l18507l81661k00425J88185
$$ plain form
39225 86510 253386 187323 -213930 -490615 -159910 581891 1074875 1018314 713336 549597
39215 549597 616827 799475 902742 685605 103825 -474739 -620730 -401222 -245273 -269199
39205 -269199 -149153 274880 702677 843544 806285 809125 821130 741387 682563 801782 1000684
39194 1000684 1028186 801346 465998 207574 112640 157211 258362 367879 498325 597795
39184 597795 504405 182612 -108141 -109159 68313 134672 79157 105666 203856 192657 144626
39173 144626 286737 453151 185447 -465943 -788454 -346031 390666 695881 476156 141157
39163 141157 -48326 -79974 68945 331889 393080 66996 -296425 -193135 348076 843794
39153 843794 1040651 1131825 1315617 1510271 1554483 1403344 1084837 703176 502751 690936
39143F90936M64732L86497Q4556j61634k56888k56464k13384k06749l15806m37853
39133b22057l52088p6949R2119K8087k9237J19090L22260L83292L75855L99755
39123A040127K97746n3177l75472k93607R0632K78855K9762l60163m79528k71602
39113i6427J3648J72761K17109K39620K34726J16201j09079k77977k38736j8971
39103B52875K34194L97745L84411J50771j62453k49445j2972K16408R9796k03034
39093A108296k86524j55135j85670m37612m97606j56275K18939K37195K9656o1488
39083a86224k9646r1987k39581k41310K663L57325O11475N79210K14028k01338
39073G74615k07121K41039N58878K40113m10215o46343k75507J68542K46042J32772
$$ plain form
39143 690936 1155668 1542165 1626721 1465087 1208199 951735 738351 531602 215796 -222057
39133 -222057 -574145 -651094 -558975 -530888 -560125 -441035 -118775 264517 640372 1040127
39123 1040127 1337873 1284696 909224 615617 706249 985104 1014866 654703 175175 -96427
39113 -96427 -82779 89982 307091 546711 781437 897638 788559 510582 271846 252875
39103 252875 487069 884814 1269225 1419996 1257543 1008098 995126 1211534 1311330 1108296
39093 1108296 821772 666637 480967 43355 -454251 -610526 -391587 -154392 -124736 -186224
39083 -186224 -215870 -307857 -547438 -788748 -786085 -428760 182715 761925 975953 774615
39073 774615 567494 808533 1367411 1607524 1197309 550966 275459 444001 690043 822815
39063H22815J67484K93271K46913L4560j27328k09783l64883n48989m87022j06558
39053b79520K63927L03851J13819J1662O3568Q3868K5931N8673K15883K64047
39043A125709M4903k78871m59009m44460k97823m6528K14115K82948J23699j7070
39033B47613K8284P8398n7781j98545p7820J63478J61163r6893k64238j59702
39023a76043O5057K57258M03299M37640K68248K8231k7881P3129L1995k57992
39013A102941n37673n26006j98613K74462O25499N84536J75589j58392o2287K05605
39003A485661J64963r1780m3794L44636M83333O1702m92367o80879n39882l24973
38993C66620q9684J28683J52160K379n301K05918K66210j3334k45413o8952K59219
$$ plain form
39063 822815 990299 1283570 1530483 1565043 1437715 1227932 863049 314060 -172962 -279520
39053 -279520 -15593 288258 402077 413739 477307 561175 587106 645779 861662 1125709
39043 1125709 1170612 891741 432732 -11728 -309551 -356079 -141964 140984 264683 247613
39033 247613 275897 354295 296514 97969 20149 183627 344790 247897 -16341 -176043
39023 -176043 -110986 146272 549571 987211 1255459 1283690 1255809 1328938 1360933 1102941
39013 1102941 565268 39262 -159351 115111 740610 1325146 1500735 1342343 1280056 1485661
39003 1485661 1650624 1558844 1515050 1859686 2343019 2404721 1912354 1231475 691593 366620
38993 366620 276936 405619 557779 560158 554857 760775 1026985 1013651 768238 699286 958505
38982I58505K91315N7389j23460j99616l18304m42606m42735l65773k75466o6455
38972i27206K40251L26705P7729q7217J64118M53316K42058k58662l66358K6593
38962a08673L43297K51277O8390J14560K09797O2668k36238l80664k72761o8356
38952a6703O4124R0266Q7601J33881J82106Q7561j84136m64187n63687m37674
38942a020848j31153K47012M56101L11044K1957l175J82656O0732m64326p09424
38932a049424j81728N84833P41379K87427j29353k60285l51077l85602o5370M54338
38922c54862N91245K35383o3340J5797J31093l5601k68741k96822k40458k39628
38912e25934j11230K38023M65347K78730m2880l6414K60998M10121K06971j30157
$$ plain form
38982 958505 1249820 1307209 1183749 984133 665829 223223 -219512 -585285 -860751 -927206
38972 -927206 -686955 -360250 -282521 -369738 -205620 247696 489754 231092 -135266 -108673
38962 -108673 234624 485901 554291 668851 878648 941316 705078 324414 51653 -16703
38952 -16703 47421 137687 225288 359169 541275 628836 444700 -19487 -583174 -1020848
38942 -1020848 -1152001 -904989 -448888 -137844 -115887 -119062 63594 124326 -340000 -1049424
38932 -1049424 -1231152 -646319 95060 382487 253134 -7151 -358228 -743830 -809200 -354862
38922 -354862 236383 471766 408426 424223 555316 519715 250974 -45848 -286306 -525934
38912 -525934 -637164 -399141 66206 344936 302056 265642 526640 936761 1143732 1013575
38902A013575l27887l17287j67397R620J00549Q6757O4550Q6036P6060j726k1876
38891F00974J34203L76043M76352K87072j47216n78748o54081k26558L46787M36858
38881A051686j57925q84209r90809l45293M52865P30065L80923j28676k84755
38872a76128q375L48539M38109K77723J38355J57737K01541J08923o3866j27986
38862A294572k9779O3261k2678k18332k80366j38252k3576j16498k23337p9357
38852B25658J38077Q600l99505m80357L4430O10807O45022K65194n750m7436j03102
38841H91638j85325q4478J20234R0756k07479m16383l14612o6785J07860J86507
38831A21933K09711J80500J38237J11599K3563j47095k16738p0086O2504p3734
$$ plain form
38902 1013575 685688 368401 201004 210624 311173 397930 462480 548516 624576 622850 600974
38891 600974 735177 1111220 1587572 1874644 1727428 1148680 494599 268041 614828 1051686
38881 1051686 893761 9552 -981257 -1326550 -873685 -143620 237303 108627 -176128
38872 -176128 -184503 164036 602145 879868 1018223 1175960 1377501 1486424 1422558 1294572
38862 1294572 1264793 1328054 1305376 1087044 806678 668426 644850 528352 305015 225658
38852 225658 363735 372335 -27170 -507527 -473097 137710 782732 1047926 1042176 994740 891638
38841 891638 706313 621835 742069 832825 625346 208963 -105649 -172434 -64574 121933
38831 121933 331644 512144 650381 761980 785543 638448 421710 351624 414128 340394
38821C40394l06773k91815q8325m5901j95853k25376m1637R7382N2034r819N8007
38810f57682K10223L70963M42125K38755k06761m21653n4819M77829M86686M2456
38800I28122j62147L8144M9470m11604p91082n73406m0781K44464K05757J06071
38790d06992N0494m457o8171j96887m34294n25846j25393N55115Q14629M10255
38780F8453q3309j27885R6405J76493R5410l456j78003l98029l58675p649J92690
38769e27555k7882k34372K4642M46966M57837J05552j12036m5655N8320J08178
38759B53995K07914K72891J04777k10549l74962k81505m9366K06590L74139L08341
38749H12265O1853q1626m0383q2697k84326k62890J67559N15777K86918k36322
$$ plain form
38821 340394 33621 -258194 -346519 -392420 -588273 -813649 -855286 -757904 -705870 -715689 -657682
38810 -657682 -447459 -76496 365629 604384 397623 -24030 -78849 398980 885666 928122
38800 928122 765975 804119 853589 441985 -349097 -922503 -963284 -718820 -513063 -406992
38790 -406992 -356498 -360955 -429126 -626013 -1060307 -1586153 -1711546 -1156431 -341802 68453
38780 68453 -14856 -142741 -46336 130157 225567 222111 44108 -353921 -712596 -720245 -527555
38769 -527555 -555437 -789809 -765167 -318201 139636 245188 133152 87497 145817 253995
38759 253995 461909 734800 839577 629028 254066 -27439 -76805 129785 503924 812265
38749 812265 874118 792492 752109 669412 385086 122196 289755 805532 1092450 856128
38739H56128m37629k74422j53194j58567l3417K26184L42480K38361O3333j41895
38729E27362l58845l49218K2783M14790M38374K49305J96517J56738j57714m76569
38719F63523k97903J95019L14895n1958l05139j29723J01454P9904K8276J69192
38709G67540L05694K08920k4999k20414l31682k72167N3587M27832M44636P2526
38699A431473k91443l85736k92250p7693K71917N21293L43248r4381k45037K45
38689A181636J77382N0064q2647o2953j75757m73545m82665j6408L35322N9451
38679E09880m55924n33137k13090k7679r2130p7831J08371K45963L05232M57652
38669B27307O15879M92001J36272o8707j7056k6766k59976m28391k86081n6444
$$ plain form
38739 856128 418499 144077 -9117 -167684 -201101 25083 367563 605924 669257 527362
38729 527362 168517 -180701 -157918 256872 695246 944551 1141068 1297806 1140092 663523
38719 663523 365620 560639 875534 823576 518437 388714 490168 570072 598348 767540
38709 767540 1073234 1282154 1257155 1036741 705059 432892 486479 914311 1358947 1431473
38699 1431473 1140030 754294 462044 384351 656268 1177561 1520809 1426428 1181391 1181636
38689 1181636 1359018 1409082 1326435 1263482 1087725 614180 131515 115107 450429 509880
38679 509880 53956 -479181 -692271 -719950 -812080 -889911 -781540 -535577 -230345 227307
38669 227307 843186 1335187 1471459 1402752 1385696 1358930 1098954 670563 384482 328038
38659C28038p5489k47434j88877J73288M58237L36395m3776k69761j86245k3072
38649B61304j5188q5701k0744J64052K22946M1201j72936j40773J27193L22440
38639G03794J91698j54693l44577j71437J53903K68766J07418p9347j12916n5640
38629E06969L1631K04461L87153L11723q0778m30178m02456j37123P991m2262
38619C57131j13117j24830j06022k7809Q6244O2908j15127j25501K24267N72247
38609F90391M62171K7211k42736k33914j99129j67839N6121L72701M45030K79045
38599A489052J85776J65739o7221m04631l47533J43798M40636J55377k95613l55159
38589A110221p3523J42100J27250j4551j60907j78859J9372K41253J72385q6974
$$ plain form
38659 328038 252549 5115 -183762 -10474 447763 784158 740382 470621 284376 261304
38649 261304 246116 160415 139671 303723 526669 567870 394934 254161 381354 703794
38639 703794 895492 740799 396222 224785 378688 647454 754872 675525 562609 506969
38629 506969 538600 743061 1130214 1441937 1361159 930981 528525 391402 399393 357131
38619 357131 244014 119184 13162 -14647 71597 134505 19378 -106123 118144 690391
38609 690391 1152562 1179773 937037 703123 503994 336155 392276 764977 1210007 1489052
38599 1489052 1674828 1840567 1773346 1368715 1021182 1164980 1605616 1760993 1465380 1110221
38589 1110221 1036698 1178798 1306048 1291497 1130590 951731 971103 1212356 1384741 1297767
38579A297767p6220K52450L30629j48764o56488n65011n0762K40778J34113N839
38569G64331R6318K29165J82903k7341k53866l64370k99796j33667j1152N0929
38559B33454J57461K71301J98066n9074k07385q3713J06137J35088O0124K539
38549H13998o7544j15836N3297M01187M82545K3827n70913o74415k43123J80374
38539B83397J77480j36006l55195k05346K42488O16643N79424K11887p9510j07595
38529A227667j06196k65944l87263k35296M4272J70888J63611J95731J95500l4438
38519I68532l88587n13129k92712J3864J66391K18431L06760L62214K01170j49342
38509H93592l84827k73030J3938R5331q8026j85540J4069K36667J61949p2745
$$ plain form
38579 1297767 1221547 1473997 1804626 1655862 999374 434363 383601 624379 758492 764331
38569 764331 860649 1089814 1272717 1245376 991510 627140 327344 193677 182525 233454
38559 233454 390915 662216 860282 801208 593823 510110 616247 751335 811459 813998
38549 813998 746454 630618 683915 1085102 1567647 1591474 1020561 346146 103023 283397
38539 283397 460877 324871 -30324 -235670 6818 623461 1202885 1414772 1335262 1227667
38529 1227667 1121471 855527 468264 232968 277240 448128 611739 807470 1002970 968532
38519 968532 579945 66816 -225896 -212032 -45641 172790 479550 841764 1042934 893592
38509 893592 508765 235735 249673 345004 256978 71438 85507 322174 484123 411378
38499D11378j52596j20951j99983k78205r3420K05186K44180J05738K14200N46387
38489H81914N96029K11970j56530j92880q6918k1925Q8974J64836r4860n66727
38479H23883o45076j36767L88295M56986K90242K06175Q2268j67218k23002L2659
38469A108445J44712j39795l14234N4516M83125K80202l26387n28481j29732L19347
38459I51718M18065K97906J73291N6189o7730j47137j28048R8629O37562J283025
38449C573470J541916J180777M63473l04270j043760j540191j378299n93572J16412
38440B015956K18257o5294k94127l95007l73712p9678L13337K50809k81975m75155
38430H33411Q1881O07947K90711m22612n51556o7897K49950O6981k65426m42530
$$ plain form
38499 411378 258782 137831 -62152 -340357 -433777 -228591 15589 121327 335527 881914
38489 881914 1477943 1689913 1533383 1340503 1253585 1231660 1320634 1485470 1390610 823883
38479 823883 178807 42040 430335 887321 1177563 1383738 1466006 1298788 1075786 1108445
38469 1108445 1253157 1113362 799128 853644 1336769 1616971 1290584 762103 632371 951718
38459 951718 1369783 1667689 1840980 1897169 1829439 1682302 1554254 1652883 2290445 3573470
38449 3573470 5115386 6296163 6759636 6455366 5411606 3871415 2493116 1899544 2015956
38440 2015956 2234213 2168919 1874792 1479785 1106073 1026395 1339732 1590541 1308566 833411
38430 833411 915292 1523239 1813950 1391338 839782 771885 1021835 1088816 823390 380860
38420C80860m24534j70415J96805K60158p2170k26977J56703N26951K93619j47113
38410G73887p7599L60753N31797L89659K85402J19693l45212o98633m05620J71819
38400A105946K53125j09477k11836R2762L07803K35124J05938n4463l41791m49992
38390I33139o3455M37343M52221R0339j32152j79113k91383l02056M574K71679
38380A221136J55528N2571L71932O52550L57804q0029n2498P2114k56249n46441
38370A948418j46864L54102N7907n48590l76554L35729M83649J7853k10491r8108
38360A817051j73016k63154R9721M13023k1613o01845l95530O6597j84380n22944
38350B33910J72710J167660R73013J09610K17678J010141Q57372q0717k17662
$$ plain form
38420 380860 -43674 -214089 -17284 242874 170704 -56273 100430 627381 921000 773887
38410 773887 696288 1057041 1588838 1978497 2263899 2383592 2038380 1339747 934127 1105946
38400 1105946 1359071 1249594 1037758 1130520 1438323 1673447 1779385 1724922 1383131 933139
38390 933139 869684 1307027 1759248 1849587 1717435 1538322 1246939 944883 949457 1221136
38380 1221136 1376664 1429235 1801167 2453717 2811521 2731492 2678994 2751108 2494859 1948418
38370 1948418 1801554 2155656 2213563 1664973 1288419 1624148 2107797 2125650 1915159 1817051
38360 1817051 1644035 1380881 1480602 1893625 1872012 1270167 874637 941234 756854 233910
38350 233910 406620 1574280 2547293 2656903 2874581 3884722 4742094 4661377 4443715
38341D443715L44207J10523o75437l89509O82555P33945l9751J94096J169963
38332F574307R34666j09929L04592J772226J649771J99730M06598K301174K811190
38323A6844325J846857K642825N190143N905184N054253P060768J1673961J3428406
38315F9646722J2563780J6597893K7189632L7281012M7146451O7654943R4531678
38308C72612111R4711881M1473773m2124277r8843450r9020237o6878226m1160252
38301A60771323l1383441k4480400j5357083j0923703j2430932j2530001q631048
38294D5034715n766084n985415n465944k845024j556240k719672l115832j494360
38286A6086144n58430j443820j827900p56546l25097j309837j645157m91418K49796
$$ plain form
38341 4443715 4787922 4898445 4223008 3833499 4516054 5249999 5210248 5404344 6574307
38332 6574307 7508973 7399044 7703636 9475862 11125633 11325363 11731961 14033135 16844325
38323 16844325 18691182 21334007 26524150 32429334 37483587 44544355 56218316 69646722
38315 69646722 82210502 98808395 125998027 163279039 210425490 278080433 372612111
38308 372612111 467323992 508797765 466673488 367830038 268809801 201931575 160771323
38301 160771323 129387882 104907482 89550399 78626696 66195764 53665763 45034715
38294 45034715 39268631 33283216 27817272 24972248 23416008 20696336 17580504 16086144
38286 16086144 15527714 14083894 12255994 11499448 11174351 9864514 8219357 7727939 7977735
38277G977735l43180o95610l9849K22910m75228p39553j11096l4927r20623j165959
38267C674620j74453M30869k70960r49591n37502R8439J21747J25356M69796L38706
38257C327027m55671p17822Q588M56770j65329q06874m88596J17637J30720p5685
38247A330765O3412J88538k5545r8291J75215J53306l31814m06955K72161P20475
38237B041267K54311l79732l96609k19732l92731m66883j755M08475J43661l46054
38227F44218m03825k43874k75073k15656K21519N63244L66835M7159J15078L05672
38217A125297K20798J18353L05904M41640J80116j43556j66738j67202m08335
38208A506277n15741k08200M3466j70131l84586m3228M97157N32594R3291k73534
$$ plain form
38277 7977735 7634555 6938945 6899096 7122006 6646778 5907225 5796129 5761202 4840579 3674620
38267 3674620 3500167 3931036 3660076 2710485 2172983 2271422 2393169 2518525 2988321 3327027
38257 3327027 2871356 2153534 2162122 2618892 2453563 1646689 1158093 1275730 1406450 1330765
38247 1330765 1394177 1582715 1557170 1458879 1634094 1787400 1455586 1048631 1320792 2041267
38237 2041267 2295578 1915846 1519237 1299505 906774 439891 438136 846611 990272 644218
38227 644218 240393 -3481 -278554 -494210 -272691 290553 657388 704547 819625 1125297
38217 1125297 1346095 1464448 1770352 2211992 2392108 2248552 2081814 1914612 1506277
38208 1506277 990536 782336 825802 655671 271085 227857 725014 1257608 1350899 1077365
38198A077365l61179k82828l4055L00445L36999k8663k78123m7991K38604P2753
38188I93327l17816m31061k80187j31509N8127L46448M34398J92961P2248L65793
38178A302729N77245K08988l03818k21312L25088N85702L55159J13954J73077
38169C116812L70945N24998N88942M41060K3917l97970n43539n25321n70442n66803
38159B462599l19801k7370l3370k84666m51836m22148l11057j82781q7556j39141
38149B02873k57147j35129K40444M26288K16797M4987K57307M74145K29698j92052
38139A508211k13409R3493K07283M0927o6566n1650j33592k43752j12928J35931
38129A163948J11679j61034k84908j98907k24284l63345j95723L49451O91947
$$ plain form
38198 1077365 716186 433358 399303 699748 1036747 1008084 729961 681970 920574 993327
38188 993327 675511 244450 -35737 -167246 -109119 237329 671727 864688 936936 1302729
38178 1302729 1879974 2088962 1785144 1563832 1888920 2474622 2829781 2943735 3116812
38169 3116812 3487757 4012755 4601697 5042757 5066674 4668704 4125165 3599844 3029402 2462599
38159 2462599 2142798 2115428 2082058 1797392 1345556 923408 612351 429570 342014 202873
38149 202873 -54274 -189403 51041 477329 694126 739113 996420 1470565 1700263 1508211
38139 1508211 1294802 1388295 1595578 1636505 1569939 1518289 1384697 1140945 1028017 1163948
38129 1163948 1275627 1114593 829685 630778 406494 43149 -152574 196877 888824
38120H88824L76675k52262m90008j48205L09169M13121K17077J01221J77930J27404
38110A720946k48645n63323l26053K36339L97839J6406k52042l8011J56242j15088
38100I84610m20941k09101J88713J07609k94121l03960J41137M03173K30776M7517
38090H75412Q8179N0720j99097k97875n3651J60473L1951j64084m9199K22672
38080F65501K26836n6701k09821M1531M68776N96415K21871l44440n79310l04992
38070G25666J38108L16957J43276j93115m81523n10881j22616M71282O88268K57069
38060A432491l22557m04333o4952J30634M9253P3490L10818L72504R3898j05555
38050A565691J17056M41856L31544j96598n98256m95230p1342K14590J43034r3249
$$ plain form
38120 888824 1265499 1013237 523229 375024 684193 1097314 1314391 1415612 1593542 1720946
38110 1720946 1472301 908978 582925 819264 1217103 1233509 981467 943456 1099698 984610
38100 984610 563669 354568 543281 650890 356769 52809 193946 597119 827895 875412
38090 875412 963591 1014311 815214 517339 463688 624161 656112 492028 442829 665501
38080 665501 892337 835636 625815 667346 1136122 1732537 1954408 1609968 1030658 725666
38070 725666 863774 1180731 1324007 1130892 649369 138488 15872 487154 1175422 1432491
38060 1432491 1109934 705601 640649 771283 820536 894026 1204844 1577348 1671246 1565691
38050 1565691 1682747 2124603 2456147 2259549 1661293 1166063 1094721 1309311 1452345 1359096
38040A359096j87742j13952j03551k31402k50658O641K83711K20538j13956l04437
38030E64288j40036J82909L67680K84639k7472l89303n34304l50560n1857O8876
38020b5140P610P13J75908M17324N11421L10164j24978m45769l04740J43020L15388
38009I80921k0391l91342l20285J271J38145J24565K25492L10084R8691j83293
37999I63858r0087K19196J62667k60527l89797L4604M27945K55075k17804m15443
37989F89687k44180k3171M7267M197q3003j65690j83312j31432o9148k2349J811
37978a79323l9232r6105J8354L11615M52241K60702J00740L08598N06305J45240
37968A789135m57506m57157J59203M64536L3759m21866k50536J63580J84797m0420
$$ plain form
38040 1359096 1171354 1057402 953851 722449 471791 478432 762143 982681 868725 564288
38030 564288 424252 607161 974841 1259480 1232008 842705 308401 -42159 -94016 -25140
38020 -25140 -17530 -16817 159091 576415 1087836 1398000 1273022 827253 522513 665533 980921
38009 980921 960530 569188 248903 250174 388319 512884 738376 1048460 1147151 963858
37999 963858 873771 1092967 1255634 995107 605310 639914 1067859 1322934 1105130 689687
37989 689687 445507 422336 469603 473800 390797 225107 41795 -89637 -158785 -181134 -179323
37978 -179323 -218555 -314660 -296306 15309 467550 728252 828992 1137590 1643895 1789135
37968 1789135 1331629 874472 1033675 1498211 1531970 1110104 859568 1023148 1207945 1167525
37958A167525k2756J61332J38043j942M9804J15912j74092n76429m72291J26146
37948E11252N07294K82538j28636k03222J3830J91228K58112L47914M32255L28990
37938B541555J3503k97693l98906l05802j53936L3641L34333O60387P07899L51368
37928C486349p0582j44309M5988Q0825j16949j97654j1578J56666J24728J18021
37918C471505L18666N49361O69546Q45566J113668J134468P92405O06770J046406
37909A0548361J808856K334303K688701L280467L982257M334483M535330N396138
37901C8908896P184508R248930J0994535J2451156J3415906J2702605R050611
37894A13957147K696915m432745j0098130j3096325j3519109j2229611j0231940
$$ plain form
37958 1167525 1144769 1306101 1444144 1442202 1492006 1607918 1433826 857397 385106 511252
37948 511252 1018546 1301084 1172448 969226 983056 1174284 1432396 1780310 2212565 2541555
37938 2541555 2555058 2257365 1858459 1552657 1398721 1432362 1766695 2427082 3134981 3486349
37928 3486349 3415767 3271458 3317446 3398271 3281322 3083668 3072090 3228756 3353484 3471505
37918 3471505 3790171 4339532 5009078 5854644 6968312 8102780 8895185 9501955 10548361
37909 10548361 12357217 14691520 17380221 20660688 24642945 28977428 33512758 38908896
37901 38908896 46093404 55342334 66336869 78788025 92203931 104906536 113957147
37894 113957147 116654062 112221317 102123187 89026862 75507753 63278142 53046202
37887E3046202q234632o529733n184891m246460l679664l249209k693152k041820
37879A7186641j598766j537770j639582j530531j120090o86828n26064o08628
37871G938382o48844m62325j72826n0141j94969m24194m69175k74727o7870q1591
37861E091720k36267k18850P9204L66553L40754J33785J30649M10434O68612P33029
37851G499623Q38433J228717J769771K239928K810248L805280M908677M985414
37843C0086091L079527l95364l719209n294572m948425l738502k681639j994684
37835A0393223j483623j118400r35596p71431n18194m11529o41876q82989o92462
37826B937123k36158n8005j90497j16997L14676N87112L38864q8254k39645j79842
$$ plain form
37887 53046202 44811570 38281837 33096946 28850486 25170822 21921613 19228461 17186641
37879 17186641 15587875 14050105 12410523 10879992 9759902 9073074 8547010 7938382
37871 7938382 7289538 6827213 6654387 6604246 6409277 5985083 5515908 5241181 5173311 5091720
37861 5091720 4855453 4636603 4715807 5082360 5423114 5556899 5687548 6097982 6766594 7499623
37851 7499623 8338056 9566773 11336544 13576472 16386720 20192000 25100677 30086091
37843 30086091 33165618 32770254 29051045 23756473 18808048 15069546 12387907 10393223
37835 10393223 8909600 7791200 6855604 6084173 5565979 5154450 4512574 3629585 2937123
37826 2937123 2700965 2642960 2452463 2335466 2650142 3237254 3576118 3487864 3248219 3068377
37816C068377j71393j69845n5244j413j78344l69656k99337r7756m9299r9463
37806A576627j0823J75980K24248J00763m6267j66236k62446k42602j07352q7698
37796A154194k93629m54671l28271j01638k9826K3314K45253L82085J23313k66524
37786D53600k98466o1434l6383k27610j70469K09506M49453L53584K67012L64328
37776A303121L09779q6641m35228l47027j4857J35036K9741j20250j82419j18073
37766D73182J03170L63313L98983J32640k16804m56622n64314m44886L5485O19364
37756D43511P32740K59800j95020j43510J22704J04222j02703j11914k0082k23406
37746H66342o18633o52567j94754K32004K39377Q9695J87604M51085N00281K31071
$$ plain form
37816 3068377 2896984 2727139 2671895 2670482 2492138 2122482 1823145 1725389 1676090 1576627
37806 1576627 1565804 1741784 1966032 2066795 2020528 1854292 1591846 1349244 1241892 1154194
37796 1154194 860565 405894 77623 -24015 -53841 -30527 214726 596811 720124 453600
37786 453600 155134 93700 57317 -170293 -340762 -131256 318197 671781 938793 1303121
37776 1303121 1612900 1526259 1091031 744004 729147 864183 893924 773674 591255 473182
37766 473182 576352 939665 1338648 1471288 1254484 797862 233548 -211338 -175853 443511
37756 443511 1176251 1436051 1241031 1097521 1220225 1324447 1221744 1109830 1089748 866342
37746 866342 247709 -404858 -599612 -367608 -128231 -38536 149068 600153 1100434 1331505
37736A331505j01163k48755j77135L0701K50726K96956K6835m31094o72414m01049
37726i4887J82508N28088L47005n7031k01972l3662J22590J28169J89444L86408
37716A496660M25479R7776l07125l66998j22737L8539r263k0310J20607J58570
37706A511198j19678m98935n75102k59378J35888K74595J32592n1942q8336l8025
37696D22877q3613k28528k53254m4660J68167R1822j89143k92745p9197J53458
37686c34816J22239m6557q2990k1782p4595j67769M163M18049N94896K30153l37069
37675C03922n54974l53224r5983P496O7076J35155P7913r2094j20672Q7096K79711
37664b58578K69720K41591L96205N47852M05738P9391o3636L8467Q1197j03788
$$ plain form
37736 1331505 1230342 981587 804452 835153 1085879 1382835 1409670 978576 306162 -94887
37726 -94887 87621 615709 962714 905683 703711 670049 792639 920808 1110252 1496660
37716 1496660 1922139 2019915 1712790 1345792 1223055 1261594 1252331 1232021 1352628 1511198
37706 1511198 1391520 892585 317483 58105 193993 468588 601180 549238 460902 422877
37696 422877 339264 110736 -142518 -187178 -19011 72811 -116332 -409077 -488274 -334816
37686 -334816 -212577 -259134 -342124 -363906 -438501 -606270 -602107 -184058 410838 640991 303922
37675 303922 -251052 -604276 -700259 -692763 -625687 -490532 -412619 -504713 -625385 -538289 -258578
37664 -258578 11142 252733 648938 1196790 1602528 1681919 1618283 1656750 1737947 1634159
37654A634159l16944l37708k38634k31297l67164m97633m41689j53501K07530
37645g42881L93576L30365J91295J15313r401k96881n41835m30919k2346K76790
37635g36924K26528j700j15431k3K89469N92748O67426L83644n2858k73124j62850
37624H16905Q3279K86350M04238L70524J46222n6732L5143K94872L09229L4815
37614B724845j04281O4990J36814j85657n36608m58070j57179j56916m25683m52310
37604D49945j17049J12591m1948k27934m6275L14800L69206L2046l09223l37681
37594A98478j30305O7977J50519J40135M5472j25513k77890k91720j61177K3856
37584c60168K08522L67377M02957K35590Q177k9531Q5289K2174l00263m70670
$$ plain form
37654 1634159 1317215 979507 740873 509576 142412 -355221 -796910 -950411 -742881
37645 -742881 -349305 -18940 172355 287668 278267 -18614 -560449 -991368 -1013714 -736924
37635 -736924 -510396 -512096 -627527 -627550 -338081 254667 922093 1305737 1252879 979755 816905
37624 816905 900184 1186534 1590772 1961296 2107518 2050786 2085929 2380801 2690030 2724845
37614 2724845 2620564 2685554 2822368 2636711 2100103 1642033 1484854 1327938 902255 449945
37604 449945 332896 445487 403539 175605 129330 444130 813336 845382 536159 198478
37594 198478 68173 136150 286669 426804 472276 346763 68873 -222847 -384024 -360168
37584 -360168 -151646 215731 618688 854278 862455 832924 918213 940387 640124 169454
37574A69454j65932K95442L71209O7459j65465j71846j86009k29277k4830L65608
37564C25813M27322j1456l98467k43448J53869J98025j20628l14364j42915J90087
37554F3838M45872N32508L65579n4042m45078m66275j42968J81680K90321K41682
37544A013117J33925n717j07405q5781M396K9279l2031j33896l24745o21910p81693
37533i12461m90301J67285O74712O28974J73539j90524j25056K62583N72728M95935
37523A257414P4545l84186o15161n66667l30064m9285J16366J27305J69468M06432
37513B06167O22647M25234j24104m53330k47432R4814N8502k65468m30762l40484
37503d54216k54785k52521j51044P2722J95748J30042O4470J51322K92169L08240
$$ plain form
37574 169454 3522 298964 670173 737632 572167 400321 214312 -14965 -39795 325813
37564 325813 753135 741679 343212 99764 253633 451658 331030 16666 -126249 63838
37554 63838 509710 1042218 1407797 1353755 908677 442402 299434 481114 771435 1013117
37544 1013117 1147042 1141325 1033920 948139 952535 981814 949783 815887 491142 -130768 -912461
37533 -912461 -1402762 -1235477 -560765 68209 241748 51224 -73832 188751 761479 1257414
37523 1257414 1331959 947773 332612 -234055 -564119 -613404 -497038 -369733 -200265 206167
37513 206167 828814 1254048 1129944 676614 429182 523996 582498 317030 -113732 -454216
37503 -454216 -709001 -961522 -1112566 -1039844 -844096 -714054 -649584 -498262 -206093 102147
37493A02147J67510N421o002J41599J97453o8243m44389m42637j4710K81258R0118
37482I525j86899m7294L11142L84926K26593K53673M12085K59287j85721m04080
37472A033237k36796q7829j46235r2414J98229L12452q385l90731m25673k72049
37462a16194k55208k67263k4679L58578N03085L14369M5069q8881q2145k1184
37452C65547L118n1475r4329l592J28951P9903j08281j14305J42566K98606P2706
37441G19415l00193m13699k14672O8309K82721L73314K64653Q340j24151L6919
37431G00956K90256L44738K01539K2917j85059m66985o51809n23706j93975p524
37421d68652q5112j89432o3877K56149M86261L71832l6247l61843k82286O1658
$$ plain form
37493 102147 269657 275078 269076 410675 608128 539885 95496 -347141 -361851 -80593 9525
37482 9525 -177374 -224668 86474 471400 697993 951666 1363751 1623038 1437317 1033237
37472 1033237 796441 708612 562377 469963 668192 980644 972259 581528 155855 -116194
37462 -116194 -371402 -638665 -663344 -304766 198319 512688 557757 468876 386731 365547
37452 365547 368665 317190 222861 219269 348220 428123 319842 205537 348103 646709 719415
37441 719415 419222 5523 -209149 -140840 141881 515195 779848 788188 664037 700956
37431 700956 991212 1335950 1537489 1560406 1375347 908362 256553 -267153 -461128 -468652
37421 -468652 -553764 -743196 -807073 -550924 -64663 307169 270922 -90921 -373207 -311549
37411c11549K39434J33775N5670J62151J70215r0944k49058O3222N25919N19004
37401A217839M0396l03774k00773O086m6416k25237k38712j13209m6549l8354
37391E1297L4888J23795P0867q5439j25257J4424J26299M0919j11257r0910Q0908
37380A30534J29421q0777l26016k89591N9824M51098N84943L52176r1227l67327
37370E53058j71636L08570M68860K4448n27737n18909n487L73474L15912J12157
37360I32710P631r5466j89121j8512L62217M50575M9772l38537k67186j6096m3253
37349H34734j96507m9783K94154L71263J50246M3889J89347K77943J19929j09965
37339A925250k48996l50377m38682m12390k55658o8623J12125K55985J83015j90204
$$ plain form
37411 -311549 -72115 61660 117330 279481 449696 358752 109694 172916 698835 1217839
37401 1217839 1258235 954461 753688 759774 713358 488121 249409 136200 89651 51297
37391 51297 86185 209980 280847 195408 70151 84575 210874 251793 140536 49626 130534
37380 130534 259955 179178 -146838 -436429 -376605 74493 659436 1011612 920385 553058
37370 553058 381422 689992 1158852 1183300 655563 136654 131167 504641 820553 932710
37360 932710 940341 844875 655754 637242 999459 1450034 1499806 1161269 894083 877987 834734
37349 834734 638227 588444 882598 1253861 1404107 1447996 1637343 1915286 2035215 1925250
37339 1925250 1676254 1325877 887195 474805 219147 150524 262649 518634 701649 511445
37329E11445n27479m07256M0247K61309P5634j01184N9676L21181K82636o7721
37319D48488m14613m95076k56055J57208M40512L51439o492k91392l49340l08086
37309g23407k29352J2991L95998O03607M22890N9670j42988j26717p0665p4522
37299A27505r1413q6459q0069o4702m372Q9219J45798R5955o7329k52703l16209
37288e04779k03810k0000J10896J94178K86096L42440K75499J07311n8062j56725
37278C73044j49630J3031K68069L93223K61616L9213m9887l1527n4923j05178
37268I57051r0469p7198j55912k00063o6520Q5846J8591j59327j64917m1544o1317
37257D4221j95476j54493N3496J02394n9137r3848J33944L42059L57122L69905
$$ plain form
37329 511445 -16034 -423290 -383043 -121734 -46100 -147284 -87608 233573 516209 448488
37319 448488 33875 -461201 -717256 -560048 -119536 231903 225411 -65981 -415321 -723407
37309 -723407 -952759 -939768 -543770 59837 482727 542397 399409 272692 202027 127505
37299 127505 36092 -50367 -130436 -195138 -199510 -110291 35507 131462 64133 -188570 -504779
37288 -504779 -708589 -728589 -617693 -423515 -137419 205021 480520 587831 529769 373044
37278 373044 223414 236445 504514 897737 1159353 1198566 1148679 1117152 1062229 957051
37268 957051 866582 789384 633472 433409 366889 452735 471326 311999 147082 105538 44221
37257 44221 -151255 -305748 -252252 -149858 -208995 -302843 -168899 173160 530282 900187
37247I00187M55448L18956j82049o67021p13976l97804o0895J50852K43907J72127
37237B19732j7036q3547P6663K38697K22334J76725K32880J94890q4716l23167
37227H53455k09746M6294J6573k56326l33060p8033J58482R4106j22298j99801
37217c0354q2029Q0000J45057P3025q2861j97929j44144J12382M50824O09451
$$ plain form
37247 900187 1355635 1674591 1492542 825521 111545 -286259 -347154 -196302 47605 219732
37237 219732 202696 119149 195812 434509 656843 833568 1066448 1261338 1176622 853455
37227 853455 643709 690003 706576 450250 117190 39157 197639 291745 169447 -30354
37217 -30354 -112383 -32383 112674 185699 102838 -95091 -239235 -126853 323971 933422
$$ [...]
##END NTUPLES=NMR SPECTRUM
##END=
