##TITLE=31P_DE-80H_X3
 64 sc D2O
 26.2.2025
##JCAMPDX= 6.0         $$ Bruker NMR JCAMP-DX V2.0
##DATA TYPE= NMR SPECTRUM
##DATA CLASS= NTUPLES
##ORIGIN= UXNMR, Bruker Analytische Messtechnik GmbH
##OWNER= root
$$ XWIN-NMR		Version 3.5
$$ Thu Feb 27 14:25:13 2025 Russian Standard Time (UT+4h)  new_Human@DPX200
##.OBSERVE FREQUENCY= 81.013821
##.OBSERVE NUCLEUS= ^31P
##.ACQUISITION MODE= SIMULTANEOUS
##.ACQUISITION SCHEME= undefined
##.AVERAGES= 64
##.DIGITISER RES= 17
##SPECTROMETER/DATA SYSTEM= spect
##.PULSE SEQUENCE= zgpg30
##.SOLVENT NAME= Acetone
##.SHIFT REFERENCE= (INTERNAL, Acetone, 0, 198.062)
##AUDIT TRAIL= $$ (NUMBER, WHEN, WHO, WHERE, WHAT)
$$ ##TITLE= Audit trail, XWIN-NMR		Version 3.5
$$ ##JCAMPDX= 5.01
$$ ##ORIGIN= Bruker BioSpin GmbH
$$ ##OWNER= new_Human
$$ C:/Bruker/XWIN-NMR/data/yarkov/nmr/P31/2/pdata/1/auditp.txt
$$ ##AUDIT TRAIL=  $$ (NUMBER, WHEN, WHO, WHERE, WHAT)
(   1,<2025-02-27 14:23:12.39 +0400>,<new_Human>,<DPX200>,
      <created by zg, POWCHK disabled, PULCHK disabled
       configuration hash MD5:
       00 E9 B6 7A A2 85 ED C7 34 08 36 98 17 FE 4E 26
       data hash MD5: 32K
       3A 26 FB 30 C9 91 BD 8C 69 36 D1 78 B1 79 E0 F7>)
(   2,<2025-02-27 14:23:50.20 +0400>,<new_Human>,<DPX200>,
      <Start of raw data processing
       efp BC_mod = 2 LB = 1.5 FT_mod = 6 PKNL = 1 PHC0 = 1782.524 PHC1 = 18.69542 SI = 64K 
       data hash MD5: 64K
       5F 07 C5 08 E9 A2 FA 0E 5F 98 AA E8 CC 44 4D A1>)
(   3,<2025-02-27 14:24:19.54 +0400>,<new_Human>,<DPX200>,
      <pk PHC0 = -7.491771 PHC1 = 0 
       data hash MD5: 64K
       43 6A 15 52 B1 7B 29 D9 4D 88 41 52 23 16 90 2A>)
$$ ##END=
$$ 
$$ hash MD5
$$ 2E C4 82 02 76 48 30 6C 81 88 63 AF 00 72 2D 37
##$RELAX= 
##$RELAX= 
##$RELAX= 
##$RELAX= 
##$RELAX= 
##$RELAX= 
##$RELAX= 
##$RELAX= 
$$ Bruker specific parameters
$$ --------------------------
##$DU= <C:/Bruker/XWIN-NMR>
##$EXPNO= 2
##$NAME= <P31>
##$PROCNO= 1
##$TYPE= <nmr>
##$USER= <yarkov>
##$AMP= (0..31)
100 100 100 100 100 100 100 100 100 100 100 100 100 100 100 100 100 100 
100 100 100 100 100 100 100 100 100 100 100 100 100 100 
##$AQSEQ= 0
##$AQ_mod= 1
##$AUNM= <au_zg>
##$AUTOPOS= <>
##$BF1= 81.014009
##$BF2= 200.13
##$BF3= 200.13
##$BF4= 200.13
##$BF5= 200.13
##$BF6= 200.13
##$BF7= 200.13
##$BF8= 200.13
##$BYTORDA= 1
##$CFDGTYP= 0
##$CFRGTYP= 5
##$CHEMSTR= <none>
##$CNST= (0..31)
1 1 145 1 1 1 1 1 1 1 1 1 1 1 1 1 1 1 1 1 1 1 1 1 1 1 1 1 1 1 1 1 
##$CPDPRG= <waltz16>
##$CPDPRG1= <>
##$CPDPRG2= <waltz16>
##$CPDPRG3= <>
##$CPDPRG4= <mlev>
##$CPDPRG5= <mlev>
##$CPDPRG6= <mlev>
##$CPDPRG7= <mlev>
##$CPDPRG8= <mlev>
##$CPDPRGB= <>
##$CPDPRGT= <>
##$D= (0..31)
0 1 0 0 0 0 0 0 0 0.06 0 0.03 2e-05 3e-06 0 0 0.0002 0 0 0 0 0 0 0 0 0 
0 0 0 0 0 0 
##$DATE= 1740651791
##$DBL= (0..7)
120 120 120 11 120 120 24 19 
##$DBP= (0..7)
150 150 150 150 150 150 150 150 
##$DBP07= 0
##$DBPNAM0= <>
##$DBPNAM1= <>
##$DBPNAM2= <>
##$DBPNAM3= <>
##$DBPNAM4= <>
##$DBPNAM5= <>
##$DBPNAM6= <>
##$DBPNAM7= <>
##$DBPOAL= (0..7)
$$ [...]
##$SUBNAM3= <"">
##$SUBNAM4= <"">
##$SUBNAM5= <"">
##$SUBNAM6= <"">
##$SUBNAM7= <"">
##$SUBNAM8= <"">
##$SUBNAM9= <"">
##$SW= 400.765351723535
##$SWIBOX= (0..15)
0 1 3 0 0 0 0 0 0 0 0 0 0 0 0 0 
##$SW_h= 32467.5324675325
##$TD= 32768
##$TD0= 1
##$TE= 0
##$TE2= 300
##$TE3= 300
##$TEG= 300
##$TL= (0..7)
0 120 53 12 22 120 120 120 
##$TP= (0..7)
150 150 150 150 150 150 150 150 
##$TP07= 0
##$TPNAME0= <>
##$TPNAME1= <>
##$TPNAME2= <>
##$TPNAME3= <>
##$TPNAME4= <>
##$TPNAME5= <>
##$TPNAME6= <>
##$TPNAME7= <>
##$TPOAL= (0..7)
0.5 0.5 0.5 0.5 0.5 0.5 0.5 0.5 
##$TPOFFS= (0..7)
0 0 0 0 0 0 0 0 
##$TUNHIN= 0
##$TUNHOUT= 0
##$TUNXOUT= 0
##$USERA1= <user>
##$USERA2= <user>
##$USERA3= <user>
##$USERA4= <user>
##$USERA5= <user>
##$V9= 5
##$VALIST= <valist>
##$VCLIST= <CCCCCCCCCCCCCCC>
##$VD= 0
##$VDLIST= <DDDDDDDDDDDDDDD>
##$VPLIST= <PPPPPPPPPPPPPPP>
##$VTLIST= <TTTTTTTTTTTTTTT>
##$WBST= 1024
##$WBSW= 4
##$XGAIN= (0..3)
0 0 0 0 
##$XL= 0
##$YL= 0
##$YMAX_a= 86842
##$YMIN_a= -100652
##$ZGOPTNS= <>
##$ZL1= 120
##$ZL2= 120
##$ZL3= 120
##$ZL4= 120
##$ABSF1= 0
##$ABSF2= 0
##$ABSG= 0
##$ABSL= 0
##$ALPHA= 0
##$AQORDER= 0
##$ASSFAC= 0
##$ASSFACI= 0
##$ASSFACX= 0
##$ASSWID= 0
##$AUNMP= <proc_1d>
##$AZFE= 0.1
##$AZFW= 0.5
##$BCFW= 0
##$BC_mod= 2
##$BYTORDP= 0
##$COROFFS= 0
##$CY= -3
##$DATMOD= 1
##$DC= 0
##$DFILT= <>
##$DTYPP= 0
##$F1P= 0
##$F2P= 0
##$FCOR= 1
##$FTSIZE= 65536
##$FT_mod= 6
##$GAMMA= 0
##$GB= 0
##$INTBC= 1
##$INTSCL= 9.790993e-09
##$ISEN= 30
##$LB= 1.5
##$LEV0= 0
##$LPBIN= 0
##$MAXI= 10000
##$MC2= 0
##$MEAN= 0
##$ME_mod= 0
##$MI= 50
##$NCOEF= 0
##$NC_proc= -5
##$NLEV= 6
##$NOISF1= 182.463
##$NOISF2= 159.3651
##$NSP= 0
##$NTH_PI= 0
##$NZP= 0
##$OFFSET= 198.0616
##$PC= 4
##$PHC0= 1775.032
##$PHC1= 18.69542
##$PH_mod= 1
##$PKNL= yes
##$PPARMOD= 0
##$PSCAL= 0
##$PSIGN= 0
##$REVERSE= no
##$SF= 81.0140089999434
##$SI= 65536
##$SIGF1= 159.3651
##$SIGF2= -187.1042
##$SINO= 113.3802
##$SIOLD= 16384
##$SREGLST= <1H.CDCl3>
##$SSB= 0
##$STSI= 65536
##$STSR= 0
##$SW_p= 32467.5324675325
##$SYMM= 0
##$S_DEV= 0
##$TDeff= 32768
##$TDoff= 0
##$TI= <>
##$TILT= no
##$TM1= 0
##$TM2= 0
##$TOPLEV= 0
##$USERP1= <user>
##$USERP2= <user>
##$USERP3= <user>
##$USERP4= <user>
##$USERP5= <user>
##$WDW= 1
##$XDIM= 65536
##$YMAX_p= 272377005
##$YMIN_p= -30350431
$$ End of Bruker specific parameters
$$ ---------------------------------
##NTUPLES= NMR SPECTRUM
##VAR_NAME=  FREQUENCY,     SPECTRUM/REAL,   SPECTRUM/IMAG
##SYMBOL=    X,             R,               I
##VAR_TYPE=  INDEPENDENT,   DEPENDENT,       DEPENDENT
##VAR_FORM=  AFFN,          ASDF,            ASDF
##VAR_DIM=   65536,         65536,           65536
##UNITS=     HZ,            ARBITRARY UNITS, ARBITRARY UNITS
##FACTOR=    0.49542278885378, 1,            1
##FIRST=     16045.7642231865, 0,            0
##LAST=      -16421.768244346, 0,            0
##MIN=       -16421.768244346, -30350431,    0
##MAX=       16045.7642231865, 272377005,    0
$$ Real data points
##PAGE= N=1
##DATA TABLE= (X++(R..R)), XYDATA
$$ [...]
46949a867334L22605Q18241O78555L7244m42053l14106J67863M21351K68454Q3629
$$ -1867334 -1544729 -726488 -47933 -10689 -452742 -766848 -598985 -177634 90820 174449
46939A74449J95092M05576L08289r7341m02868l52270j06765P6505J40885J24183
$$ 174449 369541 775117 1083406 986065 583197 230927 124162 200667 341552 465735
46929D65735K8156q0561p7446j9059j36033m40278n95758l80613l8435P2431l1158
$$ 465735 493891 413330 335884 316825 180792 -259486 -855244 -1235857 -1274292 -1201861 -1233019
46918a233019q6192j5883P1583J74170L52745M70736L08152n9819k74996j30950
$$ -1233019 -1319211 -1335094 -1263511 -1089341 -736596 -265860 42292 -17527 -292523 -423473
46908d23473K05015M24929L62663M6324l48461n67579m48012p9511K53232K97678
$$ -423473 -218458 206471 569134 615458 266997 -300582 -748594 -828105 -574873 -277195
46898b77195J8237l49556m29959n4350M85559P06534M75315O7984k73397m86452
$$ -277195 -258958 -608514 -1038473 -1092823 -607264 99270 574585 642569 369172 -117280
46888a17280m09514R3263N86121L07902o62774j161230m49502O35418Q41795L04415
$$ -117280 -526794 -433531 152590 460492 -202282 -1363512 -1813014 -1177596 -335801 -31386
46878c1386J66069O79987Q74402J99050o12317p11420k72488L9949M2164n8318
$$ -31386 134683 814670 1689072 1888122 1275805 564385 291897 331846 374010 315692
46868C15692j88609l39856l55984j87384k4786O6768K24509L08088o6358p13070
$$ 315692 127083 -212773 -568757 -756141 -780927 -714159 -489650 -181562 -247920 -960990
46858i60990p80181L7713Q23886O26777j89414n15101l6692N59536O72674L15979
$$ -960990 -1741171 -1703458 -879572 -252795 -442209 -957310 -994002 -434466 238208 554187
46848E54187k89601r05676j107102o20775J26815M04793J50210l7158J19988K54664
$$ 554187 264586 -641090 -1748192 -2368967 -2242152 -1837359 -1687149 -1724307 -1604319 -1349655
46838a349655J23900J7373J45442K30350O6310l0114K26061M76879J73074n73186
$$ -1349655 -1225755 -1208382 -1062940 -832590 -766280 -796394 -570333 -93454 79620 -493566
46828d93566j061223q64822k45542K92242N25579N09155L21673K5474k19734k25550
$$ -493566 -1554789 -2419611 -2665153 -2372911 -1847332 -1338177 -1016504 -991030 -1210764 -1436314
46818a436314k5064Q9420p3445k88446j71551K63080N71644M73794J88228L7256
$$ -1436314 -1461378 -1371958 -1445403 -1733849 -1905400 -1642320 -1070676 -596882 -408654 -371398
46808c71398K2042P571K1719P0069n9295m30664o50927l66714J22515K35159m5165
$$ -371398 -349356 -341785 -320066 -249997 -309292 -739956 -1390883 -1757597 -1635082 -1399923 -1445088
46797a445088k11349l6573K20219L93494O01112P70428N64642j1258m32501l34308
$$ -1445088 -1656437 -1693010 -1472791 -1079297 -478185 292243 856885 845627 413126 78818
46787G8818L4568K54383K44539J23010o1395k23621k04176m6233j1371j75365
$$ 78818 113386 367769 612308 735318 673923 450302 246126 199893 188522 13157
46777A3157l27951l48389k83957l8392M63136P55964K34357p26205r16792O71
$$ 13157 -314794 -663183 -947140 -985532 -522396 233568 467925 -258280 -1175072 -1174401
46767a174401Q31577N45695k41781l83510J0607P4344j35512J14207N96664K90703
$$ -1174401 -342824 202871 -38910 -422420 -411813 -337469 -472981 -358774 237890 528593
46757E28593p21790j054973j65534O88693L60408n16479p06654k43772n37q5208
$$ 528593 -193197 -1248170 -1413704 -725011 -364603 -881082 -1587736 -1831508 -1832045 -1917253
46747a917253J03321N64629O22251J23284k76127j43306K04918L66052L73800
$$ -1917253 -1813932 -1249303 -627052 -503768 -779895 -923201 -718283 -352231 21569
46738B1569L70146L08383J70097M5040j10213l90724o06003m88811k32726k69456
$$ 21569 391715 700098 870195 915235 805022 414298 -191705 -680516 -913242 -1182698
46728a182698m82293k91103L35600O52218K28425l78397m75151j86483k8510j8620
$$ -1182698 -1664991 -1956094 -1620494 -968276 -739851 -1118248 -1593399 -1779882 -1808392 -1827012
46718a827012J49086L72874K75381p8488k20607j2997J86780J21820n4543j22130
$$ -1827012 -1677926 -1305052 -1029671 -1108159 -1328766 -1341763 -1154983 -1033163 -1087706 -1209836
46708a209836o9080L3287J23292J03546k1496j7257K64321N34737M10074J6217
$$ -1209836 -1278916 -1245629 -1122337 -1018791 -1040287 -1057544 -793223 -258486 151588 167805
46698A67805j79466q0506q133m2304J17327N12745P02560M08850o4501k95853
$$ 167805 -11661 -92167 -100300 -142604 -25277 487468 1190028 1598878 1534377 1238524
46688A238524k24066K9299L63957N07833J24848n76761q47916l99462Q7989p2954
$$ 1238524 1014458 1043757 1407714 1915547 2040395 1463634 615718 216256 304245 231291
46678B31291n66406o11951j41800K27373J66254q9513l05433m57585m33570j20997
$$ 231291 -335115 -947066 -1088866 -861493 -695239 -784752 -1090185 -1547770 -1981340 -2102337
46668b102337K14756J93835m0017P044L53939M63565O9972m46170o31759m43669
$$ -2102337 -1887581 -1693746 -1733763 -1726719 -1372780 -909215 -839243 -1285413 -1917172 -2360841
46658b360841o5023L05787M23947K26529J05678M18252P50372L71362n22176q65543
$$ -2360841 -2425864 -2120077 -1696130 -1469601 -1363923 -945671 -195299 176063 -346113 -1211656
46648a211656k79658L33363K13100j27441R6610N81388N21470L4698n7562L63215
$$ -1211656 -1491314 -1157951 -944851 -1072292 -975682 -394294 127176 161874 104312 467527
46638D67527N67745K42563o5636K2856Q6825l15483q62541r36806m75138Q3186
$$ 467527 1035272 1277835 1212199 1235055 1321880 1006397 143856 -792950 -1268088 -1184902
46628a184902M46455O71996Q33575Q27900N57750J35706j83786k66144k51307
$$ -1184902 -738447 -66451 767124 1595024 2152774 2288480 2104694 1838550 1587243
46619A587243l71002n99072o18588k24977L57580O64585M06476l20736j046100
$$ 1587243 1216241 617169 -1419 -226396 131184 795769 1202245 881509 -164591
46610a64591j138629l55990O93132J014132L67832m40268o48432m15803k34674
$$ -164591 -1303220 -1659210 -966078 48054 415886 -24382 -672814 -1088617 -1323291
46601a323291n9650L13427M82499n4368q55057r33053j88433M53075M45780K87527
$$ -1323291 -1382941 -1069514 -587015 -641383 -1496440 -2429493 -2617926 -2164851 -1719071 -1431544
46591a431544N03614P93062O53958K28060n783M0077R5243k81j93755l43217k54617
$$ -1431544 -927930 -134868 519090 747150 741367 781444 876687 876406 682651 339434 84817
46580H4817J14775M10957K52782j10593p7244K90217K62516k99877n35449P2157
$$ 84817 199592 610549 863331 752738 675494 965711 1228227 928350 392901 465058
46570D65058P33415M71453m11744q24051m24262J58317L78477K61702m467k58910
$$ 465058 1198473 1669926 1258182 434131 9869 168186 546663 808365 803898 544988
46560E44988k56780K4734J37542j98390m78926j36473M18163L51974j86355k52461
$$ 544988 288208 312942 450484 252094 -226832 -363305 54858 406832 220477 -31984
46550c1984K95105M98001j12511o91068m02001L02948M59027J7123k93339j58410
$$ -31984 263121 761122 648611 -42457 -444458 -141510 317517 334640 41301 -117109
46540a17109K7713o7799k86760l53295k41086q2318L6260J20606K10561K63118
$$ -117109 -89396 -157195 -443955 -797250 -1038336 -1120654 -1084394 -963788 -753227 -490109
46530d90109J27305j95091l28121R2484P82479R90031M59995k22794m72349m15999
$$ -490109 -362804 -557895 -886016 -793532 -11053 978978 1438973 1216179 743830 327831
46520C27831m40256m80160k48710J41490L17965K37493J56706J31349j91k02664
$$ 327831 -112425 -592585 -841295 -699805 -381840 -144347 12359 143708 143517 -59147
46510e9147k51389j40076q2414r0681O4177L98132N56614K50399l64994q45339
$$ -59147 -310536 -450612 -533026 -623707 -559530 -161398 395216 645615 280621 -564718
46500e64718q52781l79113K64943O70784O75413M73666L06153J58481p8511l15755
$$ -564718 -1417499 -1796612 -1531669 -860885 -185472 288194 594347 752828 674317 358562
46490C58562l81820l14434k71714k51015j66780r6040j33227j09098J73989N01443
$$ 358562 -23258 -337692 -609406 -860421 -1027201 -1123241 -1256468 -1365566 -1191577 -690134
46480f90134M63195R2709j56388r6111J5071M4960J86777M07048K94675j95818
$$ -690134 -226939 -134230 -290618 -386729 -371658 -326698 -139921 267127 561802 365984
46470C65984m29437k7420L94657J09878m86700l98385L66086O86526J5856p69184
$$ 365984 -63453 -90873 303784 413662 -73038 -471423 -105337 581189 597045 -172139
46460a72139p01162j30190m0872m74432n65997n305M72328K45722l02815m49193
$$ -172139 -873301 -1003491 -1044363 -1518795 -2084792 -2090097 -1617769 -1372047 -1674862 -2124055
46450b124055j23368K29614L91433M52674L94853J25920j54929j14425J84731
$$ -2124055 -2247423 -2017809 -1626376 -1173702 -778849 -652929 -807858 -922283 -737552
46441g37552L33121J95493P2383J50637K09616O3112q2688N159J48937K2495l20403
$$ -737552 -404431 -208938 -136555 14082 223698 286810 204122 209281 358218 380713 60310
46430F0310n00696l10966J07356N04761O76545M47842j64777p42824p40772j32502
$$ 60310 -440386 -751352 -643996 -139235 537310 985152 820375 77551 -663221 -795723
46420g95723M41822L81300j69064n52365m53426k07642k00688l00359j60558J36685
$$ -795723 -353901 27399 -141665 -694030 -1147456 -1355098 -1555786 -1856145 -2016703 -1880018
46410a880018J77016p9608j73516J07700L23073O3163l49382l33996M4130K29785
$$ -1880018 -1703002 -1782610 -1956126 -1848426 -1525353 -1462190 -1811572 -2145568 -2101438 -1871653
46400a871653R7197O4843K80326L55613Q6546j74198j43580p5488k56430m82338
$$ -1871653 -1774456 -1709613 -1429287 -1073674 -987128 -1161326 -1304906 -1380394 -1636824 -2119162
46390b119162m10864p1936L09087O50154Q63464P35858K82953j31451l04672l97054
$$ -2119162 -2530026 -2601962 -2292875 -1642721 -779257 -43399 239554 108103 -196569 -593623
46380e93623l82826P7219Q13846R40864J30906n98142k45875O24693P58788J45318
$$ -593623 -976449 -899230 -85384 855480 986386 388244 142369 767062 1525850 1671168
46370A671168j68492P7793J01039l16198m01601Q3568K50777l85769r68170o58369
$$ 1671168 1502676 1580469 1681508 1365310 963709 1047277 1298054 912285 -55885 -714254
46360g14254M1371J97320j25121k43063l7141J39469K30263L15784J41359l67609
$$ -714254 -672883 -475563 -600684 -843747 -880888 -741419 -511156 -195372 -54013 -421622
46350d21622n63376N3513P98367O17080l09875q02174m23390N3793J8613j56966
$$ -421622 -984998 -931485 -133118 483962 174087 -628087 -1051477 -997684 -979071 -1136037
46340a136037M974K47907J21567k23442l02832k6478K47933K07264j17625m10863
$$ -1136037 -1131063 -883156 -761589 -985031 -1287863 -1314341 -1066408 -859144 -976769 -1387632
46330a387632l27326J52294O13275O54682L77132J44132k1749l71749p98649p99776
$$ -1387632 -1714958 -1562664 -949389 -294707 82425 226557 204808 -166941 -965590 -1765366
46320a765366k20869M12631N57820L25404K15834L89728M83671J32505m91886
$$ -1765366 -1986235 -1573604 -1015784 -690380 -474546 -84818 398853 531358 39472
46311C9472p93679m78310k1688q1123m71117l07961N95515J192787O45965l44470
$$ 39472 -754207 -1232517 -1254205 -1335328 -1806445 -2114406 -1518891 -326104 319861 -24609
46301b4609n39236o065J65939k39968k87345L62956P61873K46327m63146m84522
$$ -24609 -563845 -569910 -403971 -643939 -931284 -568328 193545 439872 -23274 -507796
46291e07796j21880r3869k04482J66992P73392P97940K10679j83798j6498K16210
$$ -507796 -629676 -723545 -928027 -761035 12357 810297 1020976 837178 820680 1036890
46281A036890Q5334j73806j99972m3209P0658P9054Q540r0771l1288L49380Q11417
$$ 1036890 1122224 948418 748446 705237 775895 854949 863489 772718 741430 1090810 1902227
46270A902227Q22999J85114o79586j156569j007814n12163j84272k91057n22020
$$ 1902227 2725226 2910340 2230754 1074185 66371 -445792 -630064 -921121 -1443141
46261a443141l13701L36024O93981K68805l74380l14109M30646R45308O85955
$$ -1443141 -1756842 -1420818 -726837 -458032 -832412 -1146521 -715875 229433 915388
46252I15388K7371m94146p78149q08491m01963L08912P00458M30772k6008o9356
$$ 915388 942759 448613 -329536 -1138027 -1539990 -1231078 -530620 -99848 -125856 -195212
46242a95212J79138K19264L8019J9318J59571L2754m28076p11367m82045q2537
$$ -195212 -16074 203190 241209 260527 420098 452852 24776 -686591 -1168636 -1251173
46232a251173J442j75013j96885P0798L61061M11413J98006j69307m97220m80959
$$ -1251173 -1249731 -1424744 -1621629 -1550831 -1189770 -778357 -580351 -749658 -1246878 -1727837
46222a727837N0056P71754J033796N68127j52150m38542j35486L18865M43298
$$ -1727837 -1677781 -906027 127769 695896 543746 105204 -30282 288583 731881
46213G31881J38379l24568n43045l09303J20009K10050j88119n42561l13878K62635
$$ 731881 870260 545692 2647 -306656 -186647 23403 -164716 -707277 -1021155 -758520
46203g58520M98983K42720J1595J31852L17222K58528Q7132j328r8980k68831
$$ -758520 -259537 -16817 -5222 126630 443852 702380 789512 788184 689204 420373
46193D20373l27244k52529l48200o43483o23565j9811N98875N94172K21635J78568
$$ 420373 93129 -159400 -507600 -1151083 -1774648 -1794459 -1195584 -601412 -379777 -201209
46183b01209M98204O11244L32130N7852K4172J7969j36075l48635n31339o01976
$$ -201209 296995 908239 1240369 1298221 1322393 1340362 1204287 855652 324313 -277663
46173b77663l11601L81849Q80410N44493l17967p56486m85101j50611k18312l79787
$$ -277663 -589264 -207415 672995 1217488 899521 143035 -342066 -492677 -710989 -1090776
46163a090776k86186j14147p0421J2468K29113L20798J69162L7200M5258k8313
$$ -1090776 -1376962 -1491109 -1561530 -1549062 -1319949 -999151 -829989 -792789 -747531 -775844
46153g75844j79905o3739K75777K82942j27664k49941K61256P16286N01145P7709
$$ -775844 -955749 -1019488 -743711 -460769 -588433 -838374 -577118 139168 640313 718022
46143G18022Q9533K03330j84804o78525m42831L13155N63647N2838m22451l42274
$$ 718022 807555 1010885 826081 147556 -295275 17880 581527 634365 211914 -130360
46133a30360p4990k949O1453L03712M76638L52971P1151j87405m12885n47891
$$ -130360 -205350 -208299 -146846 156866 633504 986475 1057626 870221 457336 -90555
46123i0555m86938l18111j45071K01646P37802Q51514M7702r84721j029348j03763
$$ -90555 -577493 -895604 -1040675 -839029 -101227 750287 797989 -186732 -1216080 -1319843
46113a319843M92750J05997m25082k97618J4696j81217m73200j08018N82330O45043
$$ -1319843 -827093 -721096 -1146178 -1443796 -1429100 -1610317 -2083517 -2191535 -1609205 -964162
46103i64162N5608k81527O439K91910P8762k36362p6624M20277O41114L44472
$$ -964162 -908554 -1190081 -1183642 -891732 -812970 -1049332 -1125956 -705679 -64565 279907
46093B79907p8487j24153K33817N29600L65122j09905m27161m27950l60551l60358
$$ 279907 201420 77267 311084 840684 1205806 1095901 668740 240790 -119761 -480119
46083d80119k60902m6048j2409k21828k57489J10511M45680K75063j79542l97114
$$ -480119 -741021 -787069 -799478 -1021306 -1278795 -1168284 -722604 -447541 -627083 -1024197
46073a024197l42279k93558j84960K21561O75968O44685J64236j28964R9911M74498
$$ -1024197 -1366476 -1660034 -1844994 -1623433 -947465 -302780 -138544 -267508 -167597 306901
46063C06901N01877J37514l38974o41258o08775l35912j54760k01426j47943K57308
$$ 306901 808778 946292 607318 -33940 -642715 -978627 -1133387 -1334813 -1482756 -1225448
46053a225448O26269M70173Q7711J77567O50138O77633K5596n46455m87091k09361
$$ -1225448 -599179 -129006 -41295 136272 786410 1464043 1489639 943184 456093 246732
46043B46732k27930l25269j31412J38729J51364Q7174J70374J01066l41907o33092
$$ 246732 18802 -306467 -437879 -299150 -147786 -60612 109762 210828 -131079 -764171
46033g64171k42987L60291L43566j57559l09026r878J5283m04695n14940N4364
$$ -764171 -1007158 -646867 -303301 -460860 -769886 -779764 -764481 -1169176 -1684116 -1629752
46023a629752O03284M96336J41029J95553M75499L83951n1754l24442l06528k46908
$$ -1629752 -1026468 -530132 -389103 -193550 281949 665900 614146 289704 -16824 -263732
46013b63732j36855J97728M98508L12940j59227j84292L86536P91377M41009k62052
$$ -263732 -400587 -202859 295649 608589 449362 265070 651606 1442983 1883992 1621940
46003A621940n94799n13494m50772m49387j41842M70386Q05217M36096l35701
$$ 1621940 1027141 513647 62875 -386512 -528354 -57968 747249 1183345 847644
45994H47644q43372p48097k12888L90392P39035O80765L38975N3848M2365J47869
$$ 847644 4272 -743825 -956713 -566321 172714 853479 1192454 1246302 1288667 1436536
45984A436536P9302j59864k98720k43265k13502l28027l29481K7804N07868O45830
$$ 1436536 1515838 1355974 1057254 813989 600487 272460 -57021 -29217 478651 1124481
45974A124481L93468J43395Q8810k6772l54010n43069k61602J72531J41407l90521
$$ 1124481 1517949 1661344 1750154 1723382 1369372 826303 564701 737232 878639 488118
45964D88118q02823o51055j50522K68772M78023N22812L53881j533k49584j55414
$$ 488118 -314705 -965760 -1116282 -847510 -369487 153325 507206 505673 256089 100675
45954A00675P3517L5498l06792n82710m93281j16041K38717L00519K8891l03391
$$ 100675 174192 209690 -97102 -679812 -1173093 -1289134 -1050417 -749898 -721007 -1024398
45944a024398l15263J7892K54205P6361j92295k0381N11394P75701M77516J335
$$ -1024398 -1339661 -1321769 -1067564 -991203 -1183498 -1203879 -692485 83216 560732 562067
45934E62067k14875j98948j47328k4325K46738M87343M61995J87714j63477m63832
$$ 562067 347192 148244 916 -23409 223329 710672 1172667 1360381 1196904 733072
45924G33072n59726k87015J98928L91755M3797m31731m99804k16211k1014k9468
$$ 733072 173346 -113669 85259 477014 520811 89080 -410724 -626935 -647949 -677417
45914f77417q60R3506p178l11650m15738n2649N08709P82850N80342J03059k89789
$$ -677417 -678277 -584771 -591949 -903599 -1319337 -1371986 -863277 -80427 499915 602974 313185
45903C13185l44429j04319J22278J11945m152J8494J39744J30269l8589k10056
$$ 313185 -31244 -135563 -13285 98660 94508 113002 252746 383015 344426 134370
45893A34370l54895n00665m30022P6370O83262P22206J23190l81953k39800K01685
$$ 134370 -220525 -721190 -1151212 -1074842 -391580 330626 453816 71863 -167937 33748
45883C3748K81867o6523m13457n27244n16535m54746k92334p3919Q8394K00816
$$ 33748 315615 249092 -164365 -691609 -1208144 -1662890 -1955224 -2029143 -1940749 -1739933
45873a739933K94726K69157R7327L9380L10543O42353N50477J6162m52348m66327
$$ -1739933 -1445207 -1176050 -1078723 -1039343 -728800 -86447 464030 480192 27844 -438483
45863d38483j49566J60235K91596K23758k0384k90354l13483J3631M23399N31056
$$ -438483 -588049 -427814 -136218 87540 67156 -223198 -536681 -523050 -99651 431405
45853D31405K79832J6949P5634L45094L85296K0531l45172k18049K71786M68036
$$ 431405 711237 728186 803820 1148914 1534210 1554741 1209569 991520 1263306 1731342
45843A731342K9238o70264j081649j049970o69099n862O96945R37553N39639L2826
$$ 1731342 1760580 1090316 8667 -1041303 -1710402 -1716264 -1019319 -81766 457873 490699
45833D90699l8828Q3971j48788n57943m36160K36255N96818J60188m46754m24479
$$ 490699 451871 535842 387054 -170889 -607049 -370794 226024 386212 -60542 -485021
45823d85021Q5913L49629J20799j79887j94933l3611N4808N0929J09187K91440
$$ -485021 -399108 -49479 71320 -108567 -303500 -337111 -282303 -231374 -122187 169253
45813A69253M26258K51628k15827n16092k00442N33078R80727Q06266M12771K58430
$$ 169253 595511 847139 631312 115220 -85222 447856 1428583 2234849 2647620 2906050
45803B906050J98329j40688o30926p59889l80881O5470J17357k11421n68870o92048
$$ 2906050 3104379 2963691 2332765 1572876 1191995 1257465 1374822 1163401 594531 -97517
45793i7517n97514m37643k60447K1827L85670N54930L31497m709L7971M64295
$$ -97517 -695031 -1132674 -1393121 -1371294 -985624 -430694 -99197 -103906 -65935 398360
45783C98360P28033M73319l9739m01725n29623m61366j35603K93040L61758m9618
$$ 398360 1126393 1599712 1559973 1158248 628625 167259 31656 324696 686454 636836
45773F36836l68570j12212L54872M04810J35858R3380K58783J08052m04256p15173
$$ 636836 268266 156054 510926 915736 1051594 1144974 1403757 1511809 1107553 392380
45763C92380n66510l02970j23525K23379P43365Q96020L90164k67475m40288j54269
$$ 392380 -174130 -477100 -600625 -377246 366119 1262139 1652303 1384828 944540 790271
45753G90271J51706K71039K39475M9360k45983m05371l19178k16951k79718l33872
$$ 790271 941977 1213016 1452491 1501851 1255868 850497 531319 314368 34650 -299222
45743b99222k16366j11598j73951j41453K45070O97097P23127L55774Q2818J42899
$$ -299222 -515588 -627186 -801137 -942590 -697520 -423 722704 1078478 1161296 1304195
45733A304195L05366L18822K08753R5634j3996j99068n01222p86700p20725j26362
$$ 1304195 1609561 1928383 2137136 2232770 2218774 2019706 1518484 731784 11059 -115303
45723a15303N64567O17066l8323n84188l97637J17216K54235R0198J69820M61719
$$ -115303 449264 1066330 1028007 443819 46182 163398 417633 507831 677651 1139370
45713A139370M56172J58407J29001M88586O77877L76661n4577k74355m25089o11714
$$ 1139370 1595542 1753949 1882950 2371536 3049413 3426074 3371497 3097142 2672053 2060339
45703B060339n58422j64310J53191Q8514n3316Q4334K80093J26491k91988n62720
$$ 2060339 1501917 1337607 1490798 1579312 1525996 1610330 1890423 2016914 1724926 1162206
45693A162206n11260k14178K57796P11390P54825K95145j67259k01598j13695
$$ 1162206 650946 436768 694564 1405954 2160779 2455924 2288665 2087067 1973372
45684A973372m09213q49603p16835O7304P63341Q17243M31016o945m63149r41042
$$ 1973372 1564159 714556 -2279 65025 828366 1645609 2076625 2069680 1606531 665489
45674F65489j114944p15963m0986L01677Q3260l35517m38386o0893M90495P56350
$$ 665489 -449455 -1165418 -1206404 -904727 -821467 -1156984 -1595370 -1656263 -1165768 -409418
45664d09418O08023L95211M95678P80417P57345K46828l65101o28316n10627k42390
$$ -409418 198605 593816 1089494 1869911 2627256 2874084 2508983 1880667 1370040 1127650
45654A127650M6733L03505L71568J41036k04180l70312l67908m64269o71748n90002
$$ 1127650 1174383 1477888 1849456 1990492 1786312 1416000 1048092 583823 -87925 -677927
45644f77927J9864P11116P62570J16768m55457l10960K45119M20519J4251m16188
$$ -677927 -658063 53053 815623 932391 476934 165974 411093 831612 845863 429675
45634D29675m13837j34473J17223L41795N42232M27615j33033o76273o54253j80168
$$ 429675 15838 -118635 -1412 340383 882615 1310230 1177197 500924 -153329 -333497
45624c33497J98965K88923L01131K81142Q8077j06108N6026M14269L53972k41304
$$ -333497 -134532 154391 455522 736664 824741 718633 774659 1188928 1542900 1301596
45614A301596p11239n78389k17356j79225l47769k57140J15459L91028L95159
$$ 1301596 590357 11968 -205388 -384613 -732382 -989522 -874063 -483035 -87876
45605h7876K61333Q2327j38172k95701k77026j37985M3567K87643M56354K13242
$$ -87876 173457 255784 117612 -178089 -455115 -593100 -549533 -261890 194464 407706
45595D07706m05938p45533l51587K74970L54137m81k5559L99092N57486J11918
$$ 407706 1768 -743765 -1095352 -820382 -466245 -466726 -492285 -93193 464293 576211
45585E76211l26389j82020K31926L16761R2253m0739l8883j53660l77343m67571
$$ 576211 249822 67802 299728 616489 708742 668003 629120 475460 98117 -369454
45575c69454l80706k45730l3456L33400O43190N87628K47054J01k9274o1450j92311
$$ -369454 -750160 -995890 -1029346 -695946 -52756 534872 781926 782027 752753 691303 498992
45564D98992k12128L1353M05333P09544Q41813O94180K09203l52046n31012k48161
$$ 498992 286864 318217 723550 1433094 2274907 2969087 3178290 2826244 2295232 2047071
45554B047071K3195j20135m69735n60715l53894k09023k75277k86658j5348L73713
$$ 2047071 2070266 1950131 1480396 919681 565787 356764 81487 -205171 -220519 153194
45544A53194N56255M42622J97259r310j27884j74476j72702j54989j57519j92399
$$ 153194 709449 1152071 1349330 1340020 1212136 1037660 864958 709969 552450 360051
45534C60051k25385j80940q022K22607L44332K93875K17608K57064L01980J57576
$$ 360051 134666 -46274 -54296 168311 512643 806518 1024126 1281190 1583170 1740746
45524A740746q0059j06847O1328k1980n84305j144551j029406k54268M78165O37545
$$ 1740746 1660687 1553840 1615168 1593188 1008883 -135668 -1165074 -1419342 -941177 -303632
45514c03632L84275J88769K52731M26055M60097K25275j52763l31051j25261J53694
$$ -303632 80643 269412 522143 948198 1408295 1633570 1480807 1149756 1024495 1178189
45504A178189K8702m49509p02825m26204J5203J85009J56143J94070K49841J66897
$$ 1178189 1206891 757382 54557 -371647 -356444 -171435 -15292 178778 428619 595516
45494E95516P5637J36813J50342j09484l93743l21319k9111P1942K9283K13965
$$ 595516 671153 807966 958308 848824 455081 133762 104651 176593 205876 419841
45484D19841N49216N64123K28786K7135J05883Q9021q7801L9427N20216O46870
$$ 419841 969057 1533180 1761966 1789101 1894984 1984005 1896204 1935631 2455847 3102717
45474C102717P2623m76145k89370J69688L7346n11426n82032p1610J77156k23741
$$ 3102717 3175340 2699195 2409825 2579513 2616859 2105433 1523401 1451791 1628947 1405206
45464A405206o04854l16497L52100P27679O60262M43948K35544l856k06279k06014
$$ 1405206 800352 483855 835955 1563634 2223896 2667844 2903388 2899532 2693253 2487239
45454B487239J2505K66994L26565P1390l51075n37978k39463K27054K64667k32801
$$ 2487239 2499744 2766738 3093303 3164693 2813618 2275640 2036177 2263231 2527898 2295097
45444B295097p11544o83914l16429j01726k04255l72753l34739n5841K94617M75553
$$ 2295097 1583553 899639 583210 481484 277229 -95524 -430263 -486104 -191487 284066
45434B84066L58813J03075N1352L46176P25285P94087M55285K0688p8265K79812
$$ 284066 642879 745954 797306 1143482 1868767 2662854 3118139 3138827 3060562 3340374
45424C340374P21224P27282K62162j34984p6711J02931j24337n86778o00242l8266
$$ 3340374 4061598 4788880 5051042 4916058 4839347 4942278 4817941 4231163 3630921 3592655
45414C592655L86998J13024n06663p30632l53376K17917N39497M93800K69251
$$ 3592655 3979653 4092677 3586014 2855382 2502006 2719923 3259420 3753220 4022471
45405D022471J92794M18152O73164N45877P0187l08401l93926m05865l88882o2507
$$ 4022471 4215265 4633417 5306581 5852458 5922645 5614244 5220318 4814453 4425571 4363064
45395D363064M71441N26605j77397q84787p73271j05422K51222P4628j77902k95355
$$ 4363064 4834505 5361110 5183713 4298926 3525655 3420233 3671455 3746083 3568181 3272826
45385C272826m56333n86796l91606j8950O9263o6528J01507N70073O51986P1674
$$ 3272826 2816493 2229697 1838091 1819141 1888404 1821876 1923383 2493456 3145442 3217116
45375C217116n24580n23742j79668o8572k57629m78573o55341p48586m63152L27379
$$ 3217116 2692536 2168794 1989126 1920554 1662925 1184352 529011 -219575 -682727 -355348
45365c55348J111478J231580P17223J75824m2366j23417k75972l92158l30379
$$ -355348 756130 1987710 2704933 2880757 2838391 2714974 2439002 2046844 1716465
45356A716465k00145j73758j98136r8759P6123J9261l91478p25511l85977N37915
$$ 1716465 1516320 1342562 1144426 1045667 1121790 1141051 749573 24062 -361915 176000
45346A76000J161123Q49344N3643l63802l39459m54942p42482n70198J29396M93037
$$ 176000 1337123 2186467 2240110 1876308 1536849 1081907 339425 -230773 -101377 391660
45336C91660O4715l72040j4031O37144N96729K9116l8381N64708Q55712K72597
$$ 391660 456375 84335 70304 707448 1304177 1333293 1294912 1859620 2715332 2987929
45326B987929m62480m68758P5083L81606J87219j49591l58874m93591n62941m14757
$$ 2987929 2525449 2056691 2131774 2513380 2700599 2551008 2192134 1698543 1135602 720845
45316G20845n0859K46152K26790k3933j92098q9492J67637L46366L95278M41673
$$ 720845 669986 916138 1142928 1118995 926897 837405 1005042 1351408 1746686 2188359
45306B188359N06105M28372J88018P6020L07355O13032N24213J5435m29922m20728
$$ 2188359 2694464 3122836 3310854 3386874 3694229 4307261 4831474 4846909 4416987 3996259
45296C996259q1162J76861J09613j86941m25786m15014k59584k12786k69424j04359
$$ 3996259 3915097 4091958 4201571 4014630 3588844 3173830 2914246 2701460 2432036 2327677
45286B327677M17373R15054R71682P18419N50035M46564R8281l66357l91788J24866
$$ 2327677 2745050 3660104 4631786 5350205 5900240 6346804 6445085 6078728 5686940 5811806
45276E811806N13765J92116n39153q81902m78505L02750Q33195P56354K02045
$$ 5811806 6325571 6517687 5978534 5096632 4618127 4920877 5754072 6510426 6712471
45267F712471l63317o01364o59062q82170j197065j124919m98742K18597N29456
$$ 6712471 6349154 5747790 5088728 4206558 3009493 1884574 1385832 1604429 2133885
45258B133885M70222L42963K10484j5238k35252k82015k32119k77850l81965l44737
$$ 2133885 2604107 2947070 3157554 3142316 2907064 2625049 2392930 2115080 1733115 1388378
45248A388378j45044M3267J32167J92531K68787L03029K37510P3714j34718k63999
$$ 1388378 1243334 1286601 1418768 1611299 1880086 2183115 2420625 2494339 2359621 2095622
45238B095622j74036J24662M25304N08921L12119p0557m13778m44249j33920J24072
$$ 2095622 1921586 2046248 2471552 2980473 3292592 3222035 2808257 2364008 2230088 2354160
45228B354160n3998m50437m91909j20815J04279o1445j27879K62830O40815M41808
$$ 2354160 2300162 1849725 1357816 1237001 1341280 1279835 1151956 1414786 2055601 2497409
45218B497409l8458j22675J31359P8667l68798n48631j00535M81973N95995K90812
$$ 2497409 2458951 2336276 2467635 2546302 2177504 1628873 1528338 2010311 2606306 2897118
45208B897118M680m9211M7983J60625J58255l9851k90238k88074N1017M44068
$$ 2897118 2901798 2852587 2900570 3061195 3219450 3179599 2889361 2601287 2652304 3096372
45198C096372N72347L86169K9213l19564m61350k74321Q8761K82716J47186j42480
$$ 3096372 3668719 4054888 4084101 3764537 3303187 3028866 3117627 3400343 3547529 3405049
45188C405049l40479l73395k83629j19087N8375J92725K89274L51525L25201K32804
$$ 3405049 3064570 2691175 2407546 2288459 2346834 2539559 2828833 3180358 3505559 3738363
45178C738363K23105K87804J28012l77679p66069m97136K38509P18384O51629
$$ 3738363 3961468 4249272 4377284 3999605 3233536 2736400 2974909 3693293 4344922
45169D344922M02386K43986K4599k71251k84700O3967K52724p3813m70471l21961
$$ 4344922 4747308 4991294 5015893 4744642 4459942 4523909 4776633 4702820 4232349 3910388
45159C910388K33466N26998K82619j71847m78053n76150n19804l59445k21684
$$ 3910388 4143854 4670852 4953471 4781624 4303571 3727421 3207617 2848172 2626488
45150B626488k18619k73418k30655p7475J13259L26971M97836M29149Q4893j90904
$$ 2626488 2407869 2134451 1903796 1826321 1939580 2266551 2764387 3193536 3278429 3087525
45140C087525n2807L40531N03918K66241m9791r4231J01857K30993P1742k84371
$$ 3087525 3034718 3375249 3879167 4145408 4095617 4001386 4103243 4334236 4405978 4121607
45130D121607n01727l35766O6541L11661K35162O1554N6006K55530N98217R99060
$$ 4121607 3619880 3284114 3350655 3662316 3897478 3959032 4015038 4270568 4868785 5867845
45120E867845J190595Q87253L21962J91363P31280J251613J039591L90634K10050
$$ 5867845 7058440 7945693 8267655 8459018 9190298 10441911 11481502 11872136 12082186
45111A2082186Q14057J667973K178202K234003K066169K060677K624857L748061
$$ 12082186 12896243 14564216 16742418 18976421 21042590 23103267 25728124 29476185
45103B9476185M763529N005030M565892L882651K774416O82200k114947m368474
$$ 29476185 34239714 39244744 43810636 47693287 50467703 51149903 49034956 44666482
45095D4666482n245451n180247m991497m760009m073757k942158j900359j372070
$$ 44666482 39421031 34240784 29249287 24489278 20415521 17473363 15573004 14200934
45087A4200934j314993j402390j323397j014805p23073o89655p61493n88165j98748
$$ 14200934 12885941 11483551 10160154 9145349 8422276 7732621 6971128 6382963 6184215
45078F184215J8485m6126q7507Q349l2816k83144m14159l45677m48524p43785
$$ 6184215 6202700 6156574 6069067 6077416 6044600 5761456 5347297 5001620 4553096 3809311
45068C809311o28458M5365L60356l75159j335473j218988j98311L59122J7378
$$ 3809311 3180853 3226218 3586574 3211415 1875942 656954 458643 817765 835143
45059H35143j52566O03869J502577J449622O13765j0290l5393J12854Q5679l9863
$$ 835143 682577 1286446 2789023 4238645 4852410 4842120 4806727 4919581 5005260 4965397
45049D965397j64686k95956l00724k5068L53249N07545M57662M66324M90554K24433
$$ 4965397 4800711 4504755 4204031 4178963 4532212 5039757 5497419 5963743 6454297 6678730
45039F678730k69342m84542k02042J59010J69967l5351j36956k01486m41401o69793
$$ 6678730 6409388 5924846 5722804 5881814 6051781 6016430 5879474 5677988 5236587 4566794
45029D566794n11297m1122K83330K88687J94827P4778k22638n21015l38485K57553
$$ 4566794 4055497 4014375 4297705 4586392 4781219 4855997 4633359 4112344 3773859 4031412
45019D031412M58910j47882q20429o67235M9827M02499K47215K38445N09389M10658
$$ 4031412 4490322 4342440 3522011 2854776 2904603 3307102 3554317 3792762 4302151 4712809
45009D712809k18892n36193L8299Q41184R08561L09707j46473j09998Q8595J27723
$$ 4712809 4493917 3957724 3996023 4837207 5745768 6055475 5909002 5799004 5887599 6015322
44999F015322k4406l24750o16042n68630j42426J49092o1617l51763j56896K83593
$$ 6015322 5990916 5666166 5050124 4481494 4339068 4488160 4426543 4074780 3917884 4201477
44989D201477L73439K47875M93604R32043P37227j27126o27689j37637P32136
$$ 4201477 4574916 4822791 5316395 6248438 6985665 6858539 6230850 6093213 6825349
44980F825349J185143J241752J180239Q41682J91447j54699K20008P22346O32341
$$ 6825349 8010492 9252244 10432483 11274165 11465612 11310913 11530921 12253267 12885608
44971A2885608L29507P14208J728823K440129K473797K419081K771862L355865
$$ 12885608 13215115 13929323 15658146 18098275 20572072 22991153 25763015 29118880
44963B9118880L946364M660953N467741N985135O041850N816480N165321L489439
$$ 29118880 33065244 37726197 43193938 49179073 55220923 61037403 66202724 69692163
44955F9692163O83252k351417m606682n933400o681481o876515o344457n313485
$$ 69692163 70375415 68023998 63417316 57483916 50802435 43925920 37581463 32267978
44947C2267978m258722l314414k380471j655690j473680j645355j546627r75487
$$ 32267978 28009256 24694842 22314371 20658681 19185001 17539646 15993019 15017532
44939A5017532m61211n55748j168116j754782j874948j422584o06705R7200J94941
$$ 15017532 14556321 14000573 12832457 11077675 9202727 7780143 7173438 7270638 7465579
44930G465579l85017j148234j440997r86677o6355O95423P68908J59126n58866
$$ 7465579 7080562 5932328 4491331 3504654 3438299 4133722 4902630 5061756 4502890
44921D502890q06174n88036l38803k66551j72868P5952K85185K73912J53789Q9755
$$ 4502890 3696716 3108680 2769877 2503326 2330458 2406410 2691595 2965507 3119296 3209051
44911C209051O5245O2877J89507M07754M22286Q5391l29602n06407m80894m04613
$$ 3209051 3274296 3337173 3526680 3934434 4356720 4442111 4112509 3606102 3125208 2720595
44901B720595k26211M6010P8459l29616p60326o63359j55356K09471L15314M88963
$$ 2720595 2494384 2540394 2618853 2289237 1528911 865552 710196 919667 1234981 1723944
44891A723944O95014M83362j20497m13220k7286M78712M54108M9614j86210j45936
$$ 1723944 2418958 2902320 2781823 2368603 2341317 2820029 3274137 3323751 3137541 2991605
44881B991605p7705k5807Q8430Q9470j96738m83838l39220J56894N23366N29219
$$ 2991605 2913900 2888093 2976523 3065993 2869255 2385417 2046197 2203091 2726457 3255676
44871C255676L01742m6366m02079m28672N5796N61621M16440k36201n77590l07125
$$ 3255676 3557418 3511052 3108973 2680301 2736097 3297718 3714158 3477957 2900367 2593242
44861B593242J4525j5160l7716K81359N64043L66465k7649q8382R2032Q9007J6317
$$ 2593242 2607767 2592607 2554891 2836250 3400293 3766758 3739109 3650727 3742759 3831766 3848083
44850C848083L63272J059341J422880J121691N72693K43689J29498J48731N08345
$$ 3848083 4211355 5270696 6693576 7815267 8387960 8631649 8761147 8909878 9418223
44841I418223J271314J943509J956917J379662P57809L83464J00982k38547n51993
$$ 9418223 10689537 12633046 14589963 15969625 16727434 17110898 17211880 16973333 16421340
44832A6421340q10139j173376j670910k018530j969350j655645j361572j106542
$$ 16421340 15611201 14437825 12766915 10748385 8779035 7123390 5761818 4655276
44824D655276p11300j92600J86441K58734J04143j58774m78624p10059o18956
$$ 4655276 3943976 3751376 3937817 4196551 4300694 4141920 3663296 2953237 2334281
44815B334281k00638K09358L08735J64571N2955J34044L99234P13694P61670K41259
$$ 2334281 2133643 2343001 2651736 2816307 2869262 3003306 3402540 4116234 4877904 5119163
44805E119163o30499j097642p11062M3388L74944K12859P4877R9561q8142n29562
$$ 5119163 4488664 3391022 2679960 2723348 3098292 3311151 3386028 3485589 3397447 2867885
44795B867885p07046m16229j84806m12247o69430l90150J89414M10324K15561
$$ 2867885 2160839 1744610 1559804 1147557 478127 87977 277391 687715 903276
44786I03276J17321K60070K05310k55282o68520n68021j35922J22694J22232K45036
$$ 903276 1020597 1280667 1485977 1230695 562175 -5846 -141768 -19074 103158 348194
44776C48194O93830J116510J033361M85793O977q4596q1172l57105o96677n78594
$$ 348194 1042024 2158534 3191895 3677688 3684665 3600069 3518897 3161792 2465115 1886521
44766A886521k8852L57406L16477K36436L36805J75092n32127j143923q60442
$$ 1886521 1857669 2215075 2531552 2767988 3104793 3279885 2747758 1603835 743393
44757G43393O7091O46114N11241K26590K42970L27882J97194J9256q595l5097
$$ 743393 810484 1456598 1967839 2194429 2437399 2765281 2962475 2981731 2973136 2938039
44747B938039j86683k78261j90537j14244j24550N6740N28587Q49995O22886R8410
$$ 2938039 2751356 2473095 2282558 2168314 2043764 2100504 2629091 3479086 4101972 4200382
44737D200382k15053k37512j79095m7078J74421J35326m29946j006382p74678
$$ 4200382 3985329 3747817 3568722 3521644 3696065 3831391 3401445 2395063 1620385
44728A620385J94249R42606R76424Q60235J107390J227484N66467m12318n84668
$$ 1620385 1814634 2757240 3733664 4593899 5701289 6928773 7495240 7082922 6498254
44719F498254K21592R31646P07850j864k59941R8629N15567O44158O60592Q06132
$$ 6498254 6719846 7651492 8359342 8357478 8097537 8196166 8711733 9355891 10016483 10822615
44709A0822615J131512J639502K235181K560251K306739J698179J235766R62662
$$ 10822615 11954127 13593629 15828810 18389061 20695800 22393979 23629745 24592407
44701B4592407M52319m32028j300005j863763k222971k345858j949417j244290
$$ 24592407 25044726 24612698 23312693 21448930 19225959 16880101 14930684 13686394
44693A3686394j068645j687748k107895j381836j02420L47943k68272q91667q45370
$$ 13686394 12617749 10930001 8822106 7440270 7337850 7685793 7417521 6525854 5680484
44684E680484n81759o02342o68889m78904k61428k16667q4867K29478K77082j42193
$$ 5680484 5098725 4496383 3827494 3348590 3087162 2870495 2785628 3015106 3292188 3149995
44674C149995m40388j41147K49334L3296m58613l15497N00410J027392O56162
$$ 3149995 2709607 2568460 2817794 2851090 2392477 2076980 2577390 3604782 4260944
44665D260944j37178n66197m42848q7819K01574L14214K31577Q15l03226o39302
$$ 4260944 4123766 3557569 3114721 3026902 3228476 3542690 3774267 3775082 3471856 2832554
44655B832554r24001r76706p20893l40262l4758K29900M87536N06980J50542j68355
$$ 2832554 1908553 931847 210954 -129308 -164066 65834 553370 1060350 1210892 1042537
44645A042537J06216Q13522J127947O00287k68217o84243m59115j8364K26738
$$ 1042537 1148753 1962275 3090222 3690509 3422292 2738049 2278934 2260570 2487308
44636B487308K37658J86700J74867J53502N0066q9088j39488p4858J3867R3199
$$ 2487308 2724966 2911666 3086533 3240035 3290101 3201013 3061525 2986667 3000534 3093733
44626C093733J99835K37628L6055k71467k72569R5075L18427N7190k71291j42258
$$ 3093733 3293568 3531196 3567251 3295784 3023215 3118290 3436717 3493907 3222616 3080358
44616C080358J89350Q8407m02615o28884l60548k5398J14335K67197M79040M52172
$$ 3080358 3269708 3358115 2955500 2326616 1966068 1940670 2055005 2322202 2801242 3253414
44606C253414K13918K12278M33445J97803o90783j319642q45178K69249R19080
$$ 3253414 3467332 3679610 4113055 4310858 3620075 2300433 1455255 1724504 2643584
44597B643584Q29871N82087M71689K18637k39905m74250k46831J31189L32050
$$ 2643584 3473455 4055542 4527231 4745868 4505963 4031713 3784882 3916071 4248121
44588D248121M27789N71332O55908N19233K06221j49606m77557o81599o46300
$$ 4248121 4675910 5247242 5903150 6422383 6628604 6478998 6001441 5319842 4673542
44579D673542m65623m27127n90828n76785K465R75115J663466J525240O73106
$$ 4673542 4207919 3780792 3189964 2613179 2615644 3590759 5254225 6779465 7452571
44570G452571k38375n98558l25410J69704M23019K91961k6670k22034j23880J48120
$$ 7452571 7214196 6615638 6290228 6459932 6882951 7174912 7148242 6926208 6802328 6950448
44560F950448K97177K14649J41025K65798L15245o5286n81286n18302J43977M84413
$$ 6950448 7247625 7462274 7603299 7869097 8184342 8119056 7537770 7019468 7163445 7647858
44550G647858q1649q47810p73421J3077M53670J22758k91140j33786L63542O48910
$$ 7647858 7566209 6718399 5944978 5958055 6411725 6534483 6243343 6109557 6473099 7122009
44540G122009O25667M83370K45643p5107k14282J0046L01149K11410k46960o37062
$$ 7122009 7747676 8231046 8476689 8401582 8187300 8197346 8498495 8709905 8462945 7825883
44530G825883o69804m70108l06527k76265k64987r1551K84034O32186O33956K73536
$$ 7825883 7156079 6685971 6379444 6103179 5838192 5746641 6030675 6662861 7296817 7570353
44520G570353q1519j01133J52264M17527O03533P53619P85351N54272J51147j29445
$$ 7570353 7488834 7387701 7539965 7957492 8561025 9314644 10099995 10654267 10805414 10675969
44510A0675969j63052j15859j16668l8178K22005M22570K28188k56001n17667
$$ 10675969 10512917 10397058 10280390 10242212 10464217 10886787 11114975 10858974 10341307
44501A0341307l22535o8420j90299m56871k95643K77926O09416L97010J57929
$$ 10341307 10018772 9950352 9760053 9303182 9007539 9285465 9894881 10291891 10449820
44492A0449820L75496P05862N70770J55388J34507N87168Q96847P24191M01044
$$ 10449820 10825316 11531178 12101948 12257336 12391843 12979011 13875858 14600049 15001093
44483A5001093K51003J57002m878j01614j62523m81227r84281j073740n21736
$$ 15001093 15252096 15409098 15404220 15302606 15140083 14658856 13674575 12600835 12079099
44474A2079099J147j85158p72093r24451m27113K02677N07066M18673q830o03229
$$ 12079099 12080246 11895088 11122995 10198544 9771431 9974108 10481174 10899847 10891017 10287788
44464A0287788r05729n71479Q7603M49774M02483K97283J87359k24267q16176
$$ 10287788 9382059 8810580 8898183 9347957 9750440 10047723 10235082 10010815 9194639
44455I194639r24731k66193N54194P90947M18739o3287l33838m10219l60069k09749
$$ 9194639 8269908 8003715 8557909 9348856 9767595 9704308 9370470 8960251 8600182 8390433
44445H390433m8218J1353n0973j53083j46898R8427M83768O38231L51379n6019
$$ 8390433 8342215 8353568 8302595 8149512 8002614 8101041 8584809 9223040 9574419 9518400
44435I518400j39120J9013L2547l3343K03804N54682L27578m70447q57526k85475
$$ 9518400 9379280 9398293 9430840 9397497 9601301 10155983 10483561 10013114 9155588 8870113
44425H870113M68175M90557J05843J78946O01982N50079k3248k76539J11593M75499
$$ 8870113 9338288 9828845 9934688 10113634 10715616 11265695 11242447 10965908 11077501 11553000
44415A1553000L42900J57892M19245Q49245R21706O63126M41029L72050L68811
$$ 11553000 11895900 12053792 12473037 13322282 14243988 14907114 15348143 15720193 16089004
44406A6089004M21812M54517K33662k09501l98338m2377M42728M60774M8945k46169
$$ 16089004 16510816 16965333 17198995 16989494 16591156 16548779 16991507 17452281 17501226 17255057
44396A7255057j37422J44347K43186o505n55859j137354j379159j172510q17581
$$ 17255057 17117635 17261982 17505168 17498663 16942804 15805450 14426291 13253781 12436200
44387A2436200o18693n36115m46418m51244o00885n98774k05742K78010L81634
$$ 12436200 11817507 11281392 10834974 10383730 9782845 9184071 8978329 9256339 9637973
44378I637973J31110j13935k95054n70095p38313m23841J45831K29545l67090
$$ 9637973 9769083 9655148 9360094 8789999 8051686 7627845 7773676 8003221 7636131
44369G636131r13723p23796k3310M53103L38208j85312p11811q20628k90582N65741
$$ 7636131 6722408 5998612 5975302 6428405 6766613 6581301 5869490 5048862 4758280 5324021
44359E324021J039695P82444J89845j82508k70738l03348l13520k39993k30296
$$ 5324021 6363716 7146160 7336005 7153497 6882759 6579411 6265891 6025898 5795602
44350E795602m06375n21273k70337K01880N00649N41858N08281L96848Q8072k12777
$$ 5795602 5389227 4867954 4597617 4799497 5300146 5842004 6350285 6747133 6835205 6622428
44340F622428j28480K52801L78180J222m55751m84324j05874K69818L33906P4891
$$ 6622428 6493948 6746749 7124929 7126151 6670400 6186076 6080202 6350020 6683926 6758817
44330F758817k82837m15844j83816J64368L00138L21176N78482R59186Q59718
$$ 6758817 6475980 6060136 5876320 6040688 6340826 6662002 7240484 8199670 9059388
44321I059388J22253n10994l30368L36607O24222L87163K71506N53793O51001
$$ 9059388 9181641 8670647 8340279 8676886 9301108 9688271 9959777 10513570 11164571
44312A1164571P5505p17414r34548n35354j51501r1924n0071J52910J59410k83110
$$ 11164571 11240076 10522662 9588114 9052760 8901259 8809335 8759264 8912174 9071584 8788474
44302H788474p57980p33648l74541k36469l14447o1686N81142Q75511L38244m69509
$$ 8788474 8030494 7296846 6922305 6685836 6371389 6309703 6890845 7766356 8104600 7635091
44292G635091p14874m37274l04137m84621m82253o7019L17502K70835Q839o9686
$$ 7635091 6920217 6482943 6178806 5694185 5211932 5144913 5462415 5733250 5742089 5672403
44282E672403K7170O0303L0793J32946L92923O21886O51505M68015K10666J05120
$$ 5672403 5699573 5759876 5790669 5923615 6316538 6938424 7589929 8057944 8268610 8373730
44272H373730K29785L07943m723n39645o51290k8486Q18896J125086O92016m9379
$$ 8373730 8603515 8911458 8906735 8367090 7715800 7687314 8506210 9631296 10323312 10273933
44262A0273933n27000l61849M34760J263497J275825L62256m70744k47833O51386
$$ 10273933 9746933 9385084 9819844 11083341 12359166 12721422 12250678 12002845 12654231
44253A2654231R55191K25488n95641n31510K02218O95066N70805K27828J33917
$$ 12654231 13609422 13834910 13239269 12707759 12909977 13605043 14175848 14403676 14537593
44244A4537593L70113P79317J165383J326898J170453Q39828N83098N14803O26524
$$ 14537593 14907706 15687023 16852406 18179304 19349757 20189585 20772683 21287486 21914010
44235B1914010R14096J282500J420405J060400L74525j57223l24677l58100m15901
$$ 21914010 22828106 24110606 25531011 26591411 26965936 26808713 26484036 26125936 25710035
44226B5710035k28323M55182J277512J550477J114610N38294L37181L40830Q0272
$$ 25710035 25481712 25936894 27214406 28764883 29879493 30417787 30754968 31095798 31176070
44217C1176070m66280q71957q81043o62247m49200k64734q0539L5913P1974J58412
$$ 31176070 30709790 29837833 28956790 28294543 27845343 27580609 27500070 27535983 27607957 27766369
44207B7766369L64183N46754N22212K85857J0932p4719J67241O05106Q49684O69957
$$ 27766369 28130552 28677306 29199518 29485375 29496307 29421588 29588829 30193935 31043619 31713576
44197C1713576L36922K68431M14344L94563J89627J57856L34606L63161K74063
$$ 31713576 32050498 32318929 32733273 33127836 33317463 33475319 33809925 34173086 34447149
44188C4447149N71380J208396J324330O00696M4799N37003J333287J199028N08952
$$ 34447149 35018529 36226925 37551255 38151951 38196750 38733753 40067040 41266068 41775020
44179D1775020P35320J963090K527882J519993J73148l2738N54636O46572R7460
$$ 41775020 42510340 44473430 47001312 48521305 48694453 48661715 49216351 49862923 49960383
44170D9960383j41897K90914P50334P87553P51337J004589J320318J365013J263058
$$ 49960383 49818486 50109400 50859734 51647287 52398624 53403213 54723531 56088544 57351602
44161E7351602J363298J740178K158288K375332K356412K270446K299417K414317
$$ 57351602 58714900 60455078 62613366 64988698 67345110 69615556 71914973 74329290
44153G4329290K417328K227798J947689J613120J176475Q33523R80440J615325
$$ 74329290 76746618 78974416 80922105 82535225 83711700 84545223 85525663 87140988
44145H7140988K167286K249410K240977K742783L758667M830904N716440O493699
$$ 87140988 89308274 91557684 93798661 96541444 100300111 105131015 110847455 117341154
44137A17341154P243003Q071266R232278J0769182J2244686J3249048J3899977
$$ 117341154 124584157 132655423 141887701 152656883 164901569 178150617 192050594
44130A92050594J4374959J4321568J3368029J1870462J0356901Q495912N580745
$$ 192050594 206425553 220747121 234115150 245985612 256342513 264838425 270419170
44123B70419170J957835j070669k906698m201942n471019o223791o044823n614131
$$ 270419170 272377005 271306336 268399638 264197696 258726677 252502886 246458063 240843932
44115B40843932n864347o774879p813784r054731j0915287j3016136j4226269
$$ 240843932 234979585 228204706 220390922 211336191 200420904 187404768 173178499
44108A73178499j3966982j2851132j1844413j1206912j0457355r145108p467518
$$ 173178499 159211517 146360385 134515972 123309060 112851705 103706597 96239079
44101I6239079o111411n482668n226594m763361m179891m090845m576055m911698
$$ 96239079 90127668 84645000 79418406 74655045 70475154 66384309 61808254 56896556
44093E6896556m632990m187677m047333l816362k950171j870679j474106j768962
$$ 56896556 52263566 48075889 44028556 40212194 37262023 35391344 33917238 32148276
44085C2148276j914346j563959j270935j412543j561249j286217r09333r79375
$$ 32148276 30233930 28669971 27399036 25986493 24425244 23139027 22229694 21250319
44077B1250319j426868j704126j511252j021139n61397l53704m25326n58387m51153
$$ 21250319 19823451 18119325 16608073 15586934 15025537 14671833 14246507 13688120 13236967
44068A3236967r3924J54986J9684l04406l72017j0416M99727P06079L85720k63952
$$ 13236967 13143043 13298029 13317713 13013307 12641290 12630874 13130601 13836680 14222400 13958448
44058A3958448p94991r18748p29181m82197k86093j37003p3997n3110J57036O04678
$$ 13958448 13163457 12244709 11515528 11033331 10747238 10610235 10536238 10483128 10640164 11244842
44048A1244842Q14124K75170p35044j301691r55486j76803L29869M31270M10068
$$ 11244842 12058966 12334136 11599092 10297401 9341915 9165112 9494981 9926251 10336319
44039A0336319M22614M43182M75551N07850M35929K47268Q0493n7991l53535p73709
$$ 10336319 10758933 11202115 11677666 12185516 12621445 12868713 12949206 12891215 12537680 11763971
44029A1763971r54256p65378o05063p40404p40691j19873P30504R29543L47207
$$ 11763971 10809715 10044337 9439274 8698870 7958179 7838306 8568810 9498353 9845560
44020I845560k35508k86729j56737k83604l95386l418P10118J077709Q64576M86158
$$ 9845560 9610052 9323323 9166586 8882982 8487596 8484178 9194296 10272005 11136581 11622739
44010A1622739L25930K97787J96976J05702K31478N81611J014856J443350J767785
$$ 11622739 11948669 12246456 12443432 12549134 12780612 13362223 14377079 15820429 17588214
44001A7588214J769213J346727P84458M74413L86698J56981k43474l45842P1437
$$ 17588214 19357427 20704154 21488612 21963025 22349723 22506704 22263230 21917388 21988825
43992B1988825M66544J88865n91306j107913j036715p53369n51212k31426L02243
$$ 21988825 22455369 22644234 22052928 20945015 19908300 19154931 18603719 18372293 18674536
43983A8674536O26624M16825P3008K10100P65131J147249J156703J200858J554440
$$ 18674536 19301160 19717985 19790993 20001093 20766224 21913473 23070176 24271034 25825474
43974B5825474J905880J825606J319215O84590Q1452n05219j035313j398190j581746
$$ 25825474 27731354 29556960 30876175 31560765 31642217 31136998 30101685 28703495 27121749
43965B7121749j685821j776124j836386j856086j863295j842893j693111j333214
$$ 27121749 25435928 23659804 21823418 19967332 18104037 16261144 14568033 13234819
43957A3234819q52693m88348m05553n45311p41899r09528r88671q11296k84707
$$ 13234819 12382126 11893778 11488225 10942914 10201015 9291487 8302816 7491520 7206813
43948G206813K91148M21801P0342k03924O001L57490K54458k73635o23042m61816
$$ 7206813 7497961 7919762 7990104 7786180 7792181 8149671 8404129 8130494 7507452 7045636
43938G045636p5083J70501K79466L92037M47415L24919J12671J0634P1276J84952
$$ 7045636 6970553 7141054 7420520 7812557 8259972 8584891 8697562 8708196 8779472 8964424
43928H964424K38204J87191O4944M14J45765N06423Q93946J081957R76115O73307
$$ 8964424 9202628 9389819 9454763 9455177 9600942 10107365 11001311 12083268 13059383 13732690
43918A3732690M31846M98261Q20988J024540Q56489N64592N82170R27035J235312
$$ 13732690 14164536 14662797 15483785 16508325 17364814 17929406 18511576 19438611 20673923
43909B0673923J348281J479264J762985K049664K257265K518263K806295K827582
$$ 20673923 22022204 23501468 25264453 27314117 29571382 32089645 34895940 37723522
43901C7723522K515713K230497K174218K015908J464964Q14363M25317K7914q32276
$$ 37723522 40239235 42469732 44643950 46659858 48124822 48939185 49364502 49392416 48560140
43892D8560140j863344k261797j872193j432110j515377j836970j859267j563385
$$ 48560140 46696796 44434999 42562806 41130696 39615319 37778349 35919082 34355697
43884C4355697j277444j146446j133110j217431j234579q13991R8743Q82452Q83789
$$ 34355697 33078253 31931807 30798697 29581266 28346687 27532696 27631439 28513891 29397680
43875B9397680L37479J72649Q38042J712380J860715J126284K57172L6063M37569
$$ 29397680 29735159 29907808 30745850 32458230 34318945 35445229 35702401 35738464 36176033
43866C6176033O90389J69529q52591j528623j528369j473436k021677k836851
$$ 36176033 36866422 37035951 36183360 34654737 33126368 31652932 29631255 26794404
43858B6794404k984595k240629j391117j119071j199580j107533q59423p31854
$$ 26794404 23809809 21569180 20178063 19058992 17859412 16751879 15892456 15160602
43850A5160602n70534p0796M51070L11662m80158j104663j048208o99841n43954
$$ 15160602 14590068 14519272 14970342 15282004 14801846 13697183 12648975 11949134 11405180
43841A1405180l97814M7026M47904K62790l05765n37561k80811j28812m54576
$$ 11405180 11007366 11054392 11502296 11765086 11459321 10921760 10640949 10512137 10057561
43832A0057561r07973j059574r73878q58213o40682k72593m9797j94660m00791
$$ 10057561 9149588 8090014 7116136 6257923 5617241 5344648 5294851 5100191 4699400
43823D699400k42277J56931L08820R2992j50852k19430k77042m21810m36752j56078
$$ 4699400 4457123 4614054 4922874 5015866 4865014 4645584 4368542 3946732 3509980 3353902
43813C353902K19264L86232L27140K39501K12580J63355M0483n6360K3361L09353
$$ 3353902 3573166 3959398 4286538 4526039 4738619 4901974 4942457 4886097 4909458 5218811
43803E218811O34693P38996N00576O9190k77691l93600l36395k47478k44854l63023
$$ 5218811 5853504 6592500 7093076 7162266 6884575 6490975 6154580 5907102 5662248 5299225
43793E299225m70343l15412J67845O41837O68941K55670j18787q5897J94763L04380
$$ 5299225 4828882 4513470 4681315 5323152 5992093 6247763 6128976 6043079 6237842 6542222
43783F542222Q1636k63811m26485k51815J97253O71252Q79285P28464M04091J43484
$$ 6542222 6623858 6360047 5933562 5681747 5879000 6550252 7429537 8158001 8562092 8705576
43773H705576r191j27644j55134R5138O47265J196689J360302J083598O98733
$$ 8705576 8696385 8568741 8413607 8508745 9156010 10352699 11713001 12796599 13495332
43764A3495332N25761N08727L89570J94709K80909P68956J204865J113183P48839
$$ 13495332 14021093 14529820 14919390 15114099 15395008 16163964 17368829 18482012 19230851
43755A9230851Q57969J632638K341840K248716J562433J117729J294852J657708
$$ 19230851 20088820 21721458 24063298 26312014 27874447 28992176 30287028 31944736
43747C1944736J627050J134733N07145j7009m61782r39890j464797j908354k083930
$$ 31944736 33571786 34706519 35213664 35196655 34734873 33794983 32330186 30421832 28337902
43738B8337902j910873j526705j191928j072369j154520j332599j470432j402186
$$ 28337902 26427029 24900324 23708396 22636027 21481507 20148908 18678476 17276290
43730A7276290j045754n84835l91677o32633j019322j088012p14648k41569p5216
$$ 17276290 16230536 15645701 15254024 14621391 13602069 12514057 11799409 11557840 11482624
43721A1482624k53151m67954m61135k92558j90795k18924k10770n8704P3008l9460
$$ 11482624 11229473 10761519 10300384 10007826 9817031 9598107 9387337 9328633 9401641 9362181
43711I362181l15580m13648j79937J28185J85186J0523j38615j69814j96636k09052
$$ 9362181 9046601 8632953 8453016 8581201 8766387 8776910 8638295 8468481 8271845 8062793
43701H062793n113M43533Q13947Q07980N22611K37293N103k61365m22123k13141
$$ 8062793 8057680 8501213 9315160 10123140 10645751 10883044 10888147 10626782 10204659 9991518
43691I991518K56136M86566K28646j63684k31454q254J51247J37973J43619K52502
$$ 9991518 10247654 10734220 10962866 10799182 10567728 10559474 10710721 10848694 10992313 11244815
43681A1244815L45363M16576O29622R39360R69439M97976j18809k78468J51465
$$ 11244815 11590178 12006754 12636376 13575736 14545175 15043151 14924342 14645874 14797339
43672A4797339O66607P18064L14425o7252p0394K15978N40141Q87464J383567
$$ 14797339 15463946 16182010 16496435 16429183 16358789 16574767 17114908 18002372 19385939
43663A9385939J882462J978128J558687J087331J077933J447355J686378J594853
$$ 19385939 21268401 23246529 24805216 25892547 26970480 28417835 30104213 31699066
43655C1699066J494616J653334J827545J589722R29249K86905J9458L868j61785
$$ 31699066 33193682 34847016 36674561 38264283 39193532 39480437 39499895 39503763 39341978
43646C9341978o39786j150618j340992j246958j202319j315397j330921j110960
$$ 39341978 38702192 37551574 36210582 34963624 33761305 32445908 31114987 30004027
43638C0004027r01317q61802o85905j23799M00715K98594j95777k58897K40291
$$ 30004027 29102710 28240908 27555003 27431204 27831919 28130513 27934736 27675839 27916130
43629B7916130M59247j18745q10339o75614J92635R27762J060574P96401L98834
$$ 27916130 28375377 28256632 27446293 26770679 26963314 27891076 28951650 29748051 30146885
43620C0146885K800p2520M49140J179835J313969P07297J84911M93295J372964
$$ 30146885 30149685 30077165 30526305 31706140 33020109 33727406 33912317 34405612 35778576
43611C5778576K008896K072458J921393J954339K180094K427323K668716L008020
$$ 35778576 37787472 39859930 41781323 43735662 45915756 48343079 51011795 54019815
43603E4019815L476816L960703M318957M536064M736697N062744N569263O228427
$$ 54019815 57496631 61457334 65776291 70312355 75049052 80111796 85681059 91909486
43595I1909486O952416P591806Q022372Q291622Q562025Q830044Q829900Q318659
$$ 91909486 98861902 106453708 114476080 122767702 131329727 140159771 148989671 157308330
43587A57308330P328626O034143M525269K837732J021564r74997l270029n686802
$$ 157308330 164636956 170671099 175196368 178034100 179055664 178080667 174810638 169123836
43579A69123836p667334q831575r409101r800401r955919r616196q958959q462928
$$ 169123836 161456502 152624927 143215826 133415425 123459506 113843310 104884351 96421423
43571I6421423q199445p797727p116975o430406n899800n386539m847318m383898
$$ 96421423 88221978 80424251 73307276 66876870 60977070 55590531 50743213 46359315
43563D6359315l839866k968846k123357k039760k644069k840703j998915r51343
$$ 46359315 42519449 39550603 37427246 35387486 32743417 29902714 27903799 26952456
43555B6952456q14050j369985j480834p71837P208K10814L0289j08267j46533
$$ 26952456 26138406 24768421 23287587 22515750 22522958 22733772 22764061 22655794 22509261
43546B2509261j53378l7440K20115M25177M66647M50461M29152L20214J78178
$$ 22509261 22355883 22318443 22538558 22963735 23430382 23880843 24309995 24630209 24808387
43537B4808387K02482L75391M24156K30984m8555l25264o49318q93432q32747
$$ 24808387 25010869 25386260 25810416 26041400 25992845 25667581 25018263 24124831 23292084
43528B3292084o63343r16136j613372k027559j630947q24452l14173k03044j93266
$$ 23292084 22628741 21712605 20099233 18071674 16440727 15616275 15302102 15099058 14905792
43519A4905792k69860n42547p09983m24198m9052k68306r16266j021824k55686
$$ 14905792 14635932 14093385 13383402 12959204 12910152 12641846 11725580 10703756 10448070
43510A0448070M49250J95415n91311q18272k68847K41444J10371l44867n13854
$$ 10448070 10897320 11092735 10501424 9683152 9414305 9655749 9766120 9421253 8907399
43501H907399k65192J23175L98637M33467J66542k78005n67785m85217j85779
$$ 8907399 8642207 8765382 9164019 9597486 9764028 9486023 8918238 8433021 8247242
43492H247242K6401P8317J17762K25703L58519N49598R29836J451975J758288
$$ 8247242 8273643 8351960 8469722 8695425 9053944 9603542 10533378 11985353 13743641
43483A3743641J502515P86156J30478m6139J77113M47186O40620R09871J245002
$$ 13743641 15246156 16032312 16162790 16116651 16293764 16740950 17381570 18291441 19536443
43474A9536443J347635J153946J162814J830817K815272L335055L260924L264247
$$ 19536443 20884078 22038024 23200838 25031655 27846927 31181982 34442906 37707153
43466C7707153L733270M162548L998734L537841L377158L349270K758167J575702
$$ 37707153 41440423 45602971 49601705 53139546 56516704 59865974 62624141 64199843
43458F4199843O49812N66901R09958R14075L89490l33712j037405j826755k856161
$$ 64199843 64849655 65416556 66326514 67240589 67630079 67296367 66258962 64432207 61576046
43449F1576046m069084n115417n471607m886960l822340l169169l340268l829875
$$ 61576046 57506962 52391545 46919938 42032978 38210638 35041469 31701201 27871326
43441B7871326l810417k976229j729759q02976p58181j496488k133845j790387
$$ 27871326 24060909 21084680 19354921 18551945 17793764 16297276 14163431 12373044
43433A2373044p02315o9180n06176j210491j153495n38819l15561o24695o87904
$$ 12373044 11670729 11601549 11095373 9884882 8731387 8192568 7877007 7252312 6564408
43424F564408j74820K86896J84589j44310k53458l51644p65246j163188r81254
$$ 6564408 6389588 6676484 6861073 6716763 6463305 6111661 5346415 4183227 3201973
43415C201973l36757J07378P1428j03955j11758k6869Q4942L92043Q72379J044889
$$ 3201973 2865216 2972594 3044022 2940067 2828309 2801440 2886382 3278425 4150804 5195693
43405E195693N07689m20913r63899p75948k77781m1113j18002j63450k0094J17909
$$ 5195693 5703382 5282469 4318570 3542622 3264841 3223728 3105726 2942276 2922182 3040091
43395C040091Q5971N3K5184R6244K0146k49317n49535o44405l74686J81598O25476
$$ 3040091 3126062 3126115 3151299 3247543 3267689 3018372 2468837 1824432 1449746 1631344 2256820
43384B256820N08214j55065p95920q90883n07335o7438K55303O03785R80161J064633
$$ 2256820 2765034 2609969 1814049 923166 415831 348393 603696 1207481 2187642 3252275
43374C252275N97970k25756q47362q07252j87679L67955K41436m41767q80981
$$ 3252275 3850245 3624489 2777127 1969875 1782196 2150151 2391587 1949820 1068839
43365A068839n49586J76027N79674M98521K67833N0289k25669l94027j50842L34727
$$ 1068839 519253 695280 1274954 1773475 2041308 2091597 1865928 1471901 1321059 1655786
43355A655786N05406K44786N1910J87915K32984j68954o50722o70623l24854j00817
$$ 1655786 2161192 2405978 2457888 2645803 2878787 2709833 2059111 1388488 1063634 962817
43345I62817j00340m8255Q7584M3810j69980j42611L48123R42685J082605O20702
$$ 962817 862477 814222 901806 945616 775636 633025 981148 1923833 3006438 3627140
43335C627140p0663n04141n16237l42178k79514l13788j91097J30745L18587R8233
$$ 3627140 3556477 3052336 2536099 2193921 1914407 1600619 1409522 1540267 1858854 1957087
43325A957087l17245m54985j69090K01252K57713j7364k78351k12115J00327K42873
$$ 1957087 1639842 1184857 1015767 1217019 1474732 1457368 1179017 966902 1067229 1310102
43315A310102n1890n34811p13973m60009r9675J11861K97859N99298Q10837O44670
$$ 1310102 1258212 723401 9428 -450581 -550256 -438395 -140536 458762 1269599 1914269
43305A914269J76960k41221m21444m49402m20365k95610m7163K05539K72073Q1704
$$ 1914269 2091229 1850008 1428564 979162 558797 263187 216024 421563 693636 775340
43295G75340k15632l81123l54120k83643k10217P1780N93491Q92923N57886n2043
$$ 775340 559708 178585 -175535 -459178 -669395 -597615 -4124 888799 1446685 1394642
43285A394642j87472K08133M38503J77259o7078J12282L39936J76225j28239j77619
$$ 1394642 1207170 1415303 1853806 2031065 1963987 2076269 2416205 2592430 2464191 2286572
43275B286572j67842l99474n29383q5799O06871Q19981N09924K24839J01730j98761
$$ 2286572 2118730 1719256 1189873 1104074 1710945 2530926 3040850 3265689 3367419 3168658
43265C168658o26818o81433k87558N8939J42277K53487M17614K08456l81873o60374
$$ 3168658 2541840 1860407 1572849 1631788 1774065 2027552 2445166 2653622 2271749 1611375
43255A611375k25873M06740N95230L86999J17797k00143n56704n58627j0840N21063
$$ 1611375 1385502 1792242 2387472 2774471 2892268 2692125 2135421 1576794 1565954 2087017
43245B087017M04060q5878j59805K82255N46618K40319j86791j76049J72963L66188
$$ 2087017 2491077 2405199 2245394 2527649 3074267 3314586 3127795 2951746 3124709 3490897
43235C490897K35265P1817J48599L62613M15901K40100J00050K15085L98551K72485
$$ 3490897 3726162 3797979 3946578 4309191 4725092 4965192 5065242 5280327 5678878 5951363
43225E951363j78582n08627l45565J70276N85847O08166K82934j32726l60886
$$ 5951363 5772781 5264154 4918589 5088865 5674712 6282878 6565812 6433086 6072200
43216F072200k92026p6332N5652O3085N7190N4636n972m4395P8330K64877K80353
$$ 6072200 5780174 5703842 5759494 5822579 5879769 5934405 5928433 5884038 5962368 6227245 6507598
43205F507598J48690J03509J36714J0708k34084k68513r3729j38882n08096o67910
$$ 6507598 6656288 6759797 6896511 6907219 6673135 6404622 6310893 6172011 5663915 4996005
43195D996005k48637L11582L68252n3486m47303n91059o41607o70398n67126l13492
$$ 4996005 4747368 5058950 5427202 5373716 4926413 4335354 3693747 3023349 2456223 2142731
43185B142731j8231K26224L13152J55396o3758J1601L47436M67224K29928J27216
$$ 2142731 2124500 2350724 2663876 2819272 2755514 2767115 3114551 3581775 3811703 3938919
43175C938919L92362M29570k13953q66650o04251K70417O14615J47657k62084
$$ 3938919 4331281 4760851 4546898 3680248 3075997 3346414 3961029 4108686 3846602
43166C846602l9925L80428N04544M97889N72227M60829M982l72450k96523m7323
$$ 3846602 3806677 4187105 4691649 5189538 5761765 6222594 6227576 5855126 5558603 5511280
43156E511280o3097k60449k94764j24019J00865L50472N20349K87919l83280r16951
$$ 5511280 5448183 5187734 4892970 4768951 4869816 5220288 5740637 6028556 5645276 4728325
43146D728325p84316k41557O4572M004l8398P3377J7588m04751r21488j125460
$$ 4728325 3944009 3702452 3767024 3771028 3732630 3806007 3823595 3418844 2497356 1371896
43136A371896q75361l16252K58830N51093M80565K84270K24237K45565J14569
$$ 1371896 496535 180283 439113 990206 1470771 1755041 1979278 2224843 2339412
43127B339412j70012l36569j93076J81220N81410Q32285Q16805N25560Q6049l57197
$$ 2339412 2169400 1832831 1639755 1820975 2402385 3234670 4051475 4577035 4663084 4305887
43117D305887p25842q83123o12442N0578O14827N80799M7868m14412m75155l23216
$$ 4305887 3580045 2696922 2084480 2135058 2749885 3330684 3378552 2964140 2488985 2165769
43107B165769k55436l33926n05221o91456o43198r6642O93594R68237L86264l67645
$$ 2165769 1910333 1576407 1071186 379730 -263468 -360110 333484 1301721 1687985 1320340
43097A320340l89078K14194M88401K4538m79327k98554K75668M70729J94572K2144
$$ 1320340 931262 1145456 1633857 1658395 1179068 880514 1156182 1626911 1821483 1843627
43087A843627K02598L58140K14922J4959L905L6141l1459j6786J67115J80927
$$ 1843627 2046225 2404365 2619287 2634246 2638151 2674292 2642833 2626047 2793162 2974089
43077B974089k16834o39558n57897r1149J90757J02564l8587m0001k7926q893
$$ 2974089 2757255 2117697 1559800 1468651 1659408 1761972 1723385 1683384 1655458 1646565
43067A646565K15437N78654O84664L98466R0459Q3813K14993J65814p1181k78273
$$ 1646565 1862002 2440656 3125320 3523786 3614245 3698058 3913051 4078865 4007684 3729411
43057C729411l09244j12832L03448P67046J021544J043017J037650J039657Q34820
$$ 3729411 3420167 3307335 3610783 4377829 5399373 6442390 7480040 8519697 9354517
43048I354517M16377J46913K40687M12702K94922r8254n65384j043599j430779
$$ 9354517 9770894 9917807 10158494 10571196 10866118 10767864 10202480 9158881 7728102
43039G728102j414475q81694k59861l9285j40561j57351m6846j10411l78896n09055
$$ 7728102 6313627 5431933 5172072 5132787 4992226 4834875 4788029 4677618 4298722 3789667
43029C789667l34391j07094q6045k04519k64158k06893q0331P1144J75069J31107
$$ 3789667 3455276 3348182 3262137 3057618 2793460 2586567 2506236 2577380 2752449 2883556
43019B883556o6130k71236k91000l6384L61511N76694L88865J5272p7363K01620
$$ 2883556 2817426 2546190 2255190 2218806 2580317 3157011 3545876 3561148 3483785 3685405
43009C685405M08883K14210j27792k51522k77437m75272o04637k04308N44227
$$ 3685405 4094288 4308498 4180706 3929184 3651747 3176475 2571838 2367530 2911757
43000B911757Q79065M82482j10637l11192j80752p0445K679K34499N67223P31910
$$ 2911757 3790822 4273304 4162667 3851475 3670723 3600278 3602957 3837456 4404679 5136589
42990E136589O31506L89369J07145j75160l41225k57121K4978K76536L18289J46636
$$ 5136589 5768095 6157464 6264609 6089449 5748224 5491103 5516081 5792617 6110906 6257542
42980F257542j33123l88813m77353k90280J24241M78858L90640k27482q98815
$$ 6257542 6124419 5735606 5258253 4967973 5092214 5571072 5961712 5734230 4835415
42971D835415r35210k35417M60396M06953j81311m04310Q8865O36135N55246J27519
$$ 4835415 3900205 3664788 4125184 4532137 4350826 3946516 4035381 4671516 5226762 5354281
42961E354281J00904M85798N31005k5694l86603J48525R42693P33977n00924j303537
$$ 5354281 5455185 5940983 6471988 6446294 6059691 6208216 7150909 7884886 7383962 6080425
42951F080425p15013L22589L23057n55287p89927J74107J110545Q76429k6210
$$ 6080425 5365412 5688001 6011058 5455771 4665844 4839951 5950496 6826925 6800715
42942F800715m57986l19027k68921l85078j94749K32397K81024j52258n10999
$$ 6800715 6342729 6023702 5754781 5369703 5174954 5407351 5688375 5536117 5025118
42933E025118n35475n26282n67168l24941J98344N12329M66528M59067N64257
$$ 5025118 4489643 3963361 3396193 3071252 3269596 3781925 4248453 4707520 5271777
42924E271777K78622m80412r42874n91895J7890J64190L8244K23150O34119P54748
$$ 5271777 5550399 5069987 4127113 3535218 3553108 3717298 3755542 3978692 4612811 5367559
42914E367559N40532L32181J79573r060O6752O75357J290266J120859L65243O4601
$$ 5367559 5908091 6240272 6419845 6410785 6477537 7152894 8443160 9564019 9929262 9993863
42904I993863N84336J064166O78377k63675r12296j038577j070154j255934j320363
$$ 9993863 10578199 11642365 12320742 12057067 11144771 10106194 9036040 7780106 6459743
42895F459743r55944l50068o9065m16850r73880r72127k45101M52783L59031l01748
$$ 6459743 5503799 5153731 5084666 4667816 3693936 2721809 2476708 2929491 3288522 2986774
42885B986774o58420l65243R9909K70473K36113K26556J91943M7381q7572j51377
$$ 2986774 2328354 1963111 2063020 2333493 2569606 2796162 2988105 3035486 2947914 2796537
42875B796537k76551m22600k57312K86896O89320M62766j46971m77472l00061
$$ 2796537 2519986 2097386 1840074 2126970 2816290 3279056 3132085 2654613 2354552
42866B354552K3599J24183j0183k13901l45651k79982J9393L50377M13228J73704
$$ 2354552 2378151 2502334 2492151 2278250 1932599 1652617 1672010 2022387 2435615 2609319
42856B609319p6177p4042J37858L37847L82716K71077O7796j35757k48330k57404
$$ 2609319 2533142 2459100 2596958 2934805 3317521 3588598 3656394 3520637 3272307 3014903
42846C014903k62187l57915m84200m54808j85018J45430K34816j0932l47141m32338
$$ 3014903 2752716 2394801 1910601 1455793 1270775 1416205 1651021 1640089 1292948 860610
42836H60610j74707J79743K65703q1428o21930q23220l45546M97209R35872N56711
$$ 860610 685903 865646 1131349 1049921 427991 -395229 -740775 -243566 692306 1249017
42826A249017k27522o76921n25448o5448L71201O55948O79479L58057r2515k39878
$$ 1249017 1021495 344574 -180874 -246322 124879 780827 1460306 1818363 1725848 1485970
42816A485970M8979M07746M09276K1107m36159n90933k71156L03050N90673L03484
$$ 1485970 1534949 1942695 2351971 2373078 1936919 1345986 1074830 1377880 1968553 2272037
42806B272037j20088l6455M03586L60684m14165j072187q52538j60031J58341
$$ 2272037 2151949 2115494 2519080 2879764 2465599 1393412 540874 380843 539184
42797E39184R9917K52670N76838M18787k57912o13729j94662L47523K53343k51693
$$ 539184 639101 891771 1468609 1887396 1629484 1015755 821093 1168616 1421959 1170266
42787A170266m15655o4157L40645M59057L24248M307m34316o77648l86535K67003
$$ 1170266 754611 690454 1031099 1490156 1814404 1818711 1384395 706747 320212 587215
42777E87215O81769N37484J11964j70980j93986n7008J48940L10402K63970j5167
$$ 587215 1268984 1806468 1918432 1747452 1553466 1496458 1645398 1955800 2219770 2204603
42767B204603l26164m52210l39649k9297M02718P63933Q06141M79663j7377m81430
$$ 2204603 1878439 1426229 1086580 1057283 1460001 2223934 3030075 3509738 3492361 3010931
42757C010931p87574p31981j63779N81022P99109K93917k29496p3861M46132M65067
$$ 3010931 2223357 1491376 1327597 1908619 2707728 3001645 2772149 2698288 3144420 3609487
42747C609487j51817o51968n28706j36437K3873K3035J53711L44917L64184K72834
$$ 3609487 3457670 2805702 2276996 2140559 2164432 2187467 2341178 2686095 3050279 3323113
42737C323113K51136K11893p906k66029l14127k12934j76389j67419m3242N5649
$$ 3323113 3574249 3786142 3778236 3512207 3198080 2985146 2808757 2641338 2598096 2653745
42727B653745r4818l28113k82942j831J57151J63285L19913O04948O07079K58073
$$ 2653745 2558927 2230814 1947872 1946041 2103192 2266477 2586390 3191338 3798417 4056490
42717D056490K0978J10400J39389j01581j38297L70635Q52032N86164j00894k65806
$$ 4056490 4077468 4187868 4327257 4225676 4087379 4458014 5310046 5896210 5795316 5529510
42707E529510J66807K74379l59390r15133n90150J37171K30557l21332n02865
$$ 5529510 5696317 5970696 5611306 4696173 4106023 4243194 4473751 4152419 3649554
42698C649554J78749R47409Q71496J27033l73381k77942q9567k03763k84013J21701
$$ 3649554 3828303 4775712 5647208 5774241 5400860 5122918 5033351 4829588 4545575 4667276
42688D667276P74968J008139O21425Q8164j28517q4675o9196j13004j0187L01708
$$ 4667276 5442244 6450383 7071808 7159972 7031455 6946780 6877584 6764580 6754393 7056101
42678G056101N85004N41885J53154k50219l19414j23296j00570m46097p51358
$$ 7056101 7641105 8182990 8336144 8085925 7766511 7643215 7542645 7096548 6345190
42669F345190n42819m122K67031J39508M1681J22043l4498n63228q25401l00505
$$ 6345190 5802371 5798249 6065280 6204788 6246469 6368512 6334014 5770786 4945385 4644880
42659D644880M87400O12860N8694l35448j44929J56559R2773j23329r8691P2338
$$ 4644880 5132280 5745140 5803834 5468386 5323457 5480016 5572789 5449460 5350769 5423107
42649E423107O6926p7741o2021J52038K71008Q6518k66120m57083k61992K28641
$$ 5423107 5490033 5412292 5350271 5502309 5773317 5859835 5593715 5136632 4874640 5103281
42639E103281O42461O72690M15649J97593P7287j74919n27935n36153k3086M39814
$$ 5103281 5745742 6418432 6834081 7031674 7108961 6934042 6406107 5869954 5846868 6286682
42629F286682K02706n03820q08345l81837J46433J14933k88952l91212L3272N73483
$$ 6286682 6489388 5985568 5177223 4795386 4941819 5056752 4767800 4376588 4409860 4983343
42619D983343P86917O21950K65182r7127k98443k47301q7151r7066l07792m09193
$$ 4983343 5770260 6392210 6657392 6560265 6261822 6014521 5927370 5830304 5522512 5113319
42609E113319j92331J15210J81987P3956J10907L05228L19140K5048k71291l31321
$$ 5113319 4920988 5036198 5218185 5292141 5403048 5708276 6027416 6052464 5781173 5449852
42599E449852l57226n80338p56134m78726J26294M75321L40087J72779M20820
$$ 5449852 5092626 4512288 3756154 3277428 3403722 3879043 4219130 4391909 4812729
42590D812729Q44864Q56511L75364n3234m5097R3092j16730n25033n28770m3095
$$ 4812729 5657593 6514104 6889468 6836234 6791137 6884229 6767499 6242466 5713696 5670601
42580E670601K29791j86646p04431m30919M51184Q18657K02472n35298m87056
$$ 5670601 5900392 5713746 5009315 4578396 5029580 5848237 6050709 5515411 5028355
42571E028355M5178J99583q9179k04661j9117l9366m03260n80502k49860K45356
$$ 5028355 5073533 5273116 5183937 4979276 4960159 4920793 4517533 3937031 3687171 3932527
42561C932527N48327P24138P72467M01763k96248n92883r4677N55701N54083N6522
$$ 3932527 4480854 5204992 5977459 6379222 6082974 5490091 5395414 5951115 6505198 6561720
42551F561720k45467k73889m74292p97676o64667J1600N57746M84610N3142l07070
$$ 6561720 6316253 6042364 5568072 4770396 4105729 4117329 4675075 5159685 5212827 4905757
42541D905757n31010o07872l28275K80335P29472O65378L10157j4500l58338p35420
$$ 4905757 4374747 3766875 3438600 3718935 4448407 5113785 5423942 5409442 5051104 4315684
42531D315684p28282r2074N95480N78144K5486k15212J09779L94034K39606m419
$$ 4315684 3587402 3495328 4090808 4668952 4694438 4479226 4589005 4983039 5222645 5218226
42521E218226m2837k09210p37703j084690o63158J40532M23137L6787l29044k70067
$$ 5218226 5175389 4966179 4228476 3143786 2480628 2621160 3044297 3081084 2752040 2481973
42511B481973j05261q0833R1617N44209P51566K80458l84000m01107K23712O11550
$$ 2481973 2376712 2295879 2387496 2931705 3683271 3963729 3579729 3178622 3402334 4013884
42501D013884J94746n78410q65122l97307L49948P37771N54289J35446k6888J63348
$$ 4013884 4208630 3630220 2765098 2367791 2717739 3455510 4009799 4145245 4118357 4281705
42491D281705L15572J09776k27358k52150L3789K19011J37747O7880J90356K60493
$$ 4281705 4597277 4707053 4479695 4227545 4261334 4480345 4618092 4685972 4876328 5136821
42481E136821K0008l87953o54989p01017n94675l27495M2756K19037j9897m13548
$$ 5136821 5156829 4768876 4113887 3412870 2818195 2490700 2533456 2752493 2732596 2319048
42471B319048m49519p311M81241N62323K52205p9682j75597j10622p8870q3618
$$ 2319048 1869529 1862218 2343459 2905782 3157987 3078305 2902708 2792086 2713216 2629598
42461B629598K8993K22362J67346l14363q62054r56537o23800l58772l32291j74136
$$ 2629598 2658591 2880953 3048299 2733936 1871882 915345 291545 -67227 -399518 -573654
42451e73654K77597N49066K48050k17799j69034L57992O99591N02168L9507l42197
$$ -573654 -296057 253009 501059 283260 114226 472218 1171809 1673977 1713484 1371287
42441A371287n60701n53362k18454K59343M56017K64592O5659J73968M14923M26668
$$ 1371287 810586 257224 38770 298113 754130 1018722 1084381 1258349 1673272 2099940
42431B099940J38952k02906l03287l2188M16827N77655K03423l04742l47827l1193
$$ 2099940 2238892 2035986 1732699 1700511 2117338 2694993 2898416 2593674 2245847 2214654
42421B214654r3254p45278j161230n72479N56433J040607M71374l80929o42626
$$ 2214654 2121400 1376122 214892 -357587 198846 1239453 1710827 1329898 687272
42412F87272k86102J39296L01700L07899L15689K46398k9036l53399l39448J29835
$$ 687272 401170 540466 842166 1150065 1465754 1712152 1683116 1329717 990269 1120104
42402A120104O05870N36770j3561m30913l81158j85202j96988k39445j2173K95879
$$ 1120104 1725974 2262744 2249183 1818270 1437112 1251910 1054922 815477 803304 1099183
42392A099183K83056%j80099k17428l63179n02253j81557N44369Q94626L44837
$$ 1099183 1382239 1382239 1202140 984712 621533 119280 -62277 482092 1376718 1721555
42382A721555n88239r44770m38420L76583Q29084O66256O1119n09260m99894J71079
$$ 1721555 1133316 188546 -249874 126709 955793 1622049 1683168 1173908 674014 845093
42372H45093Q39250P29179q0374o97378n22675O5931L35641J37466j30093k43341
$$ 845093 1684343 2413522 2333148 1635770 1113095 1179026 1514667 1652133 1522040 1278699
42362A278699l62433n52796n59455k23027K08953M22999M62739N36498N63489
$$ 1278699 916266 363470 -195985 -419012 -210059 212940 675679 1212177 1775666
42353A775666K65407k96434o19298l44853K75185O88676O78309M79729L45845
$$ 1775666 2041073 1744639 1125341 780488 1055673 1744349 2422658 2902387 3248232
42344C248232K50251Q2810o8977j4915K20092L44273J20404l45947p03903o93000
$$ 3248232 3498483 3581293 3512316 3497401 3717493 4061766 4182170 3836223 3132320 2439320
42334B439320l21497K23947P15590R32399P27793J57132n16021j003689j143452
$$ 2439320 2117823 2341770 3057360 3989759 4717552 4874684 4358663 3354974 2211522
42325B211522q77232k53032M50434P82582N33143K0792k42624j45453k2942j30512
$$ 2211522 1334290 1081258 1531692 2314274 2847417 2868209 2625585 2480132 2457190 2326678
42315B326678l26406l42718j43077J07269K54855K22404P071k60186l69775k67066
$$ 2326678 2000272 1657554 1514477 1621746 1876601 2099005 2106076 1845890 1476115 1209049
42305A209049j43352k01352m12708n73278m95678r5175N58469J158317J269362
$$ 1209049 1065697 864345 451637 -121641 -617319 -712494 -154025 1004292 2273654
42296B273654P05205k21637r26545j031565o09849l5879L49829M64707M10418
$$ 2273654 2978859 2757222 1830677 799112 189263 153384 503213 967920 1378338
42287A378338K28291j10761m15916k78965L34140P68789M65499j09601m169P42864
$$ 1378338 1606629 1495868 1079952 800987 1135127 1903916 2369415 2259814 2255645 2998509
42277B998509J003245K36657o01755m62073K23566K72795m06001p73673l35370
$$ 2998509 4001754 4238411 3636656 3174583 3398149 3670944 3264943 2491270 2155900
42268B155900K04573J53102k07237k55814M3094L18033M21772M45529M05230K58388
$$ 2155900 2360473 2513575 2306338 2050524 2093618 2411651 2833423 3278952 3684182 3942570
42258C942570L3681k44163n31069n98386k52190K08178K24872j72612k98798J45510
$$ 3942570 3976251 3732088 3201019 2602633 2350443 2558621 2783493 2610881 2312083 2457593
42248B457593N34869K40306m28528p36204n55295k84515o6588K32426M53707K55656
$$ 2457593 2992462 3232768 2804240 2068036 1512741 1228226 1161638 1394064 1847771 2103427
42238B103427k32561m76163k87106K1165K45749M96869P24560O45214L20507K32927
$$ 2103427 1870866 1394703 1107597 1128762 1374511 1871380 2595940 3241154 3561661 3794588
42228C794588N01986N62539K7186n81879m87857K31819P48339N89605J23398j04672
$$ 3794588 4296574 4859113 4886299 4304420 3816563 4048382 4796721 5386326 5509724 5405052
42218E405052m7749J9308J8670J15275L64090N54949M29352n6756o87971j122446
$$ 5405052 5357303 5376611 5395281 5510556 5874646 6429595 6858947 6802191 6114220 4991774
42208D991774j075669n01614L01216Q11997O73745M3988n11231n64220k27351
$$ 4991774 3916105 3414491 3715707 4527704 5201449 5245437 4734206 4169986 3942635
42199C942635O2667P8678l4251r1852j37537k79064m37545m42516l01170j86626
$$ 3942635 4005302 4083980 4049729 3957877 3820340 3541276 3103731 2661215 2360045 2173419
42189B173419j62732r2843J17677L22279K86207j9473l66211m83560k78734R2941
$$ 2173419 2010687 1917844 2035521 2357800 2644007 2624534 2258323 1774763 1496029 1588970
42179A588970L08063J28719k83765m08226N2998O80008P44400J65620l20397j44311
$$ 1588970 1897033 2025752 1741987 1333761 1386759 2066767 2811167 2976787 2656390 2512079
42169B512079L36296M27116J16522k7692K07630M79437N93334P31864Q44647N26086
$$ 2512079 2848375 3275491 3392013 3364321 3571951 4051388 4644722 5376586 6221233 6747319
42159F747319j49237l47278L81442J192196R34051k27645r77831n91273K69909
$$ 6747319 6598082 6250804 6632246 7824442 8758493 8530848 7553017 6961744 7231653
42150G231653O44154M39118J54796l600k14051n20594p26793p45721p03477o87296
$$ 7231653 7875807 8314925 8469721 8466121 8252070 7731476 7004683 6258962 5555485 4868189
42140D868189o43289n49181m85612m75552l93115j12997L11087O63120P23610
$$ 4868189 4224900 3675719 3190107 2714555 2321440 2208443 2519530 3182650 3906260
42131C906260M05028j85032p43290r07804n62703l7240J74780o845j49574L6884
$$ 3906260 4311288 4126256 3382966 2475162 1912459 1875219 2049999 2043154 1893580 1930464
42121A930464K09142p0718n14443m25084J65060L81004k08080q70985p69564j49741
$$ 1930464 2139606 2068888 1554445 1129361 1294421 1675425 1467345 596360 -173204 -322945
42111c22945J76676R4318J43751M76358O73263N35093K94825N1636k75167m22883
$$ -322945 -146269 -51951 91800 568158 1241421 1776514 2071339 2122975 1847808 1424925
42101A424925j7246N79629N07617k82002q22525n81985k21809l76021n47376j0016
$$ 1424925 1407679 1987308 2494925 2212923 1390398 808413 586604 210583 -336793 -346809
42091c46809Q66520J125196O27274M4670k64078m66691n21918j73962L00828K29513
$$ -346809 519711 1644907 2272181 2316851 2052773 1586082 1064164 890202 1191030 1420543
42081A420543l94020p54296l93927J34545J54979j74530k37849J27877N66095
$$ 1420543 1026523 272227 -121700 12845 167824 -6706 -244555 -116678 449417
42072D49417P77249P27227M31024q0748o00281q21803o28466j87372K14509L55216
$$ 449417 1226666 1953893 2384917 2304169 1703888 882085 253619 66247 280756 635972
42062F35972J85161j30538l12325k03283Q5802K96882K88223J73852J86208L71682
$$ 635972 821133 690595 378270 174987 260789 557671 845894 1019746 1205954 1577636
42052A577636M79610K71375j22266l77343m72895o45291p83981l87726N69577
$$ 1577636 2057246 2328621 2206355 1829012 1356117 710826 -73155 -460881 108696
42043A08696J240880R21103Q9475k36307N9010J91880j49077l45575J7379M09851
$$ 108696 1349576 2270679 2360154 2123847 2182857 2374737 2225660 1880085 1897464 2307315
42033B307315K25101k60552l86645j12875R5531Q7790J03894J76440O5013j92372
$$ 2307315 2532416 2271864 1885219 1772344 1867875 1955665 2059559 2235999 2301012 2108640
42023B108640j88667K33065O52709N95467J57260j35067j6619J85366K1256l89913
$$ 2108640 1919973 2153038 2805747 3401214 3558474 3423407 3406788 3592154 3613410 3223497
42013C223497m04395K67333R75218Q15341j50556q32995m35298N70595J075940
$$ 3223497 2819102 3086435 4061653 4876994 4726438 3893443 3458145 4028740 5104680
42004E104680O37336j96189o55267m93737n4011J18096k29492p40296p31197Q798
$$ 5104680 5742016 5545827 4890560 4396823 4342812 4460908 4231416 3491120 2759923 2768721
41994B768721Q37712R30895K25832n69012q27981n84927k82970k23737l21364
$$ 2768721 3606433 4537328 4763160 4194148 3366167 2781240 2498270 2274533 1953169
41985A953169k40749K39801R07562J228180R01451J95722m03815o97034p12414
$$ 1953169 1712420 1952221 2859783 4087963 4989414 5185136 4781321 4084287 3371873
41976C371873l96665K30737P21078M98996l48805r78394p22703J21143O83963
$$ 3371873 2975208 3205945 3927023 4426019 4077214 3098820 2376117 2497260 3181223
41967C181223N46711R4296j16509m5005l8533j76633j08113L15489N92472J96871
$$ 3181223 3727934 3822230 3705721 3660716 3622183 3445550 3337437 3652926 4245398 4442269
41957D442269m96097n14130L65411J192913J109806M62604J30227K35049K42273
$$ 4442269 3946172 3432042 3797453 4990366 6100172 6562776 6693003 6928052 7170325
41948G170325Q624j20244j37705m16279q52191q36704l07038N619k57801m61193
$$ 7170325 7178949 7058705 6921000 6504721 5652530 4815826 4508788 4514407 4256606 3795413
41938C795413k9549N88111O71210L47139J92381J83808q2350m27935k92282J96275
$$ 3795413 3765864 4353975 5025185 5372324 5564705 5748513 5666163 5238228 4945946 5142221
41928E142221K73313k48989o86280o09364m30694n03201m30290J49723P25096
$$ 5142221 5415534 5166545 4480265 3870901 3440207 2937006 2506716 2656439 3381535
41919C381535N80254r4064m96209l90289k54021l33979k99995K9291K65950M8115
$$ 3381535 3961789 3867725 3371516 2981227 2727206 2393227 2093232 2122523 2388473 2436588
41909B436588m10810o73694o19195l43791J27434O74847R00328N21768j84546
$$ 2436588 2025778 1352084 732889 389098 516532 1191379 2091707 2613475 2428929
41900B428929o83160p98335p01312m44425L2932M93369N22188J61322n6863J03857
$$ 2428929 1745769 947434 246122 -198303 -165371 327998 850186 1011508 954645 1058502
41890A058502K23394o7621m60463m60637j53625L2586P9928K93542N70857M24633
$$ 1058502 1281896 1214275 753812 293175 139550 172136 252064 545606 1116463 1541096
41880A541096j67638n67222l90210p8636j75781m84813m52071p2320J69991J09640
$$ 1541096 1373458 806236 416026 337390 161609 -323204 -775275 -847595 -677604 -567964
41870e67964M7195Q9580m4110l75450l82864K51205R88578J012869K95106l70992
$$ -567964 -520769 -431189 -475299 -850749 -1233613 -982408 6170 1019039 1314145 943153
41860I43153l79918L4545K42782j0519m46842o48962m33596M3658M01284L33905
$$ 943153 563235 597780 840562 830043 383201 -265761 -699357 -655699 -254415 79490
41850G9490o6480l45235j47562L84488P41472N37636j41902p93116q76503k93523
$$ 79490 13010 -332225 -479787 -95299 646173 1183809 1041907 248791 -627712 -921235
41840i21235M64193P86732O01202L43574K46517L8124m33848p11719l33829L59359
$$ -921235 -457042 329690 930892 1274466 1520983 1559107 1125259 413540 79711 439070
41830D39070O19971L60665J86534L72459N05897K99017N8666L8731k8661l27743
$$ 439070 1059041 1419706 1606240 1978699 2484596 2783613 2842279 2881010 2852349 2524606
41820B524606m77464j97390O0628k03136o27698m97694J16849M92556L75791K05087
$$ 2524606 2047142 1849752 1910380 1707244 1079546 581852 698701 1191257 1567048 1772135
41810A772135K45856K53453P1448j24699k94764n80485p52226l11798O12526J148405
$$ 1772135 2017991 2271444 2342892 2218193 1923429 1342944 590718 278920 891446 2039851
41800B039851P92828N4558l60642m26789m60239m66844l21236j52115p1916Q4171
$$ 2039851 2832679 2887237 2526595 2099806 1639567 1172723 851487 699372 627456 711627
41790G11627L29159K93719j04139k69763J84557O49347L53860l92607o45588k64788
$$ 711627 1040786 1334505 1230366 960603 1145160 1794507 2148367 1755760 1110172 845384
41780H45384J1900j46477k51268K0695L21691L81589M62758O88369O28049N1883
$$ 845384 857284 710807 459539 480234 801925 1183514 1646272 2334641 2962690 3014573
41770C014573m74707l25079K51165M82923J16364m00879o01558m13547p131L56028
$$ 3014573 2539866 2214787 2465952 2948875 3065239 2664360 2062802 1649255 1642124 1998152
41760A998152L73057l0091m69835m45689N2841N09180M86826R2508k09270j12985
$$ 1998152 2371209 2341118 1871283 1425594 1478435 1987615 2474441 2566949 2357679 2244694
41750B244694K43745M56099K99365j6466j18497L7961J45637M4992k1243J83903
$$ 2244694 2488439 2944538 3243903 3227437 3108940 3146901 3292538 3337530 3316287 3500190
41740C500190M63428M20755j0280n08754p46441o09706j55535L83425O13735L05846
$$ 3500190 3963618 4384373 4374093 3865339 3118898 2509192 2353657 2737082 3350817 3656663
41730C656663k65007n54741l76095n2746J05487J97162M36257P13170P30149M69634
$$ 3656663 3391656 2836915 2460820 2408074 2513561 2710723 3146980 3860150 4590299 5059933
41720E059933K34381K00963J82946n2742m19113o30878n92790m69440l85050k54436
$$ 5059933 5294314 5495277 5678223 5625481 5206368 4575490 3982700 3513260 3128210 2873774
41710B873774J1985K90285L68299K16104K67j39469k02032k14180j34245P1888
$$ 2873774 2885759 3176044 3544343 3760447 3760714 3621245 3419213 3205033 3070788 3142676
41700C142676L24411M71633M37024K88127J37796m374k17438m71597n38434k29838
$$ 3142676 3467087 3938720 4375744 4663871 4801667 4797293 4579855 4108258 3569824 3339986
41690C339986L11588P21210Q04364O42338L25815j38921n89118p03130m38154
$$ 3339986 3651574 4372784 5177148 5819486 6145301 6006380 5417262 4714132 4275978
41681D275978j79196j98249k57370p8642J00854p5238l64084k17015K81775M43862
$$ 4275978 4096782 3898533 3641163 3562521 3663375 3588137 3224053 3007038 3288813 3732675
41671C732675M1881l27804k05832N4031L737p6731K84308P62452N59273l50430
$$ 3732675 3774556 3446752 3240920 3294951 3298688 3221957 3506265 4268717 4827990 4477560
41661D477560j018745p72238j00283P0156l63421o13207j28857O40652Q23084
$$ 4477560 3458815 2686577 2586294 2656450 2293029 1679822 1550965 2191617 3014701
41652C014701K43148l71169l39889J35352L44101N7021k71401k56186o4603K0692
$$ 3014701 3257849 2886680 2546791 2682143 3026244 3083265 2811864 2555678 2491075 2511767
41642B511767Q9091L14881M89929K85068j47330k64142J47374O79619Q36066O01894
$$ 2511767 2600858 2915739 3405668 3690736 3543406 3279264 3426638 4106257 4942323 5544217
41632E544217L43022K93241L10206J24901k69736n68524n26252k82278j62526
$$ 5544217 5887239 6180480 6490686 6615587 6345851 5777327 5251075 4968797 4806271
41623D806271k23205k49359k13053l68686p22433p76015j50598P69073J218130
$$ 4806271 4583066 4333707 4120654 3751968 3029535 2253520 2102922 2871995 4090125
41614D090125R65166M60774J43541J2053q1830j18291m5518N4235J03255J33876
$$ 4090125 5055291 5516065 5659606 5671659 5589829 5471538 5426020 5480255 5583510 5717386
41604E717386J27819m9451l95463o19028m48959k7034J99991R191l12856l18324
$$ 5717386 5845205 5795754 5400291 4781263 4332304 4305270 4505261 4514452 4201596 3883272
41594C883272J6263K24073l4538m59326m88564j30921k4953n34957j178204j253920
$$ 3883272 3899535 4123608 4089070 3629744 3141180 3010259 2985306 2450349 1272145 18225
41584A8225p40518j78930J18479K84204M27285M30614K53274M5404j05868k30057
$$ 18225 -722293 -901223 -782744 -498540 -71255 359359 612633 658037 552169 322112
41574C22112k54792p0067J75349K08880Q9874J23149K75028J66998k08682l10988
$$ 322112 67320 -2747 172602 381482 471356 594505 869533 1036531 827849 516861
41564E16861J13291N17256L20258k10809l86329j34225q706k53806m70309l15479
$$ 516861 630152 1147408 1467666 1256857 870528 736303 727597 473791 3482 -311997
41554c11997j7373L9038j36079k72274k63368j67559M4468M25155P81227P62330
$$ -311997 -329370 -290332 -426411 -698685 -962053 -1129612 -1085144 -659989 121238 883568
41544H83568K97991k46165m66134l51322j89613j36269p3948R2498K15479J18713
$$ 883568 1181559 935394 469260 117938 -71675 -207944 -281892 -189394 26085 144798
41534A44798r0245j14971J28764L67049K88547p7563l89666l85794j79705j05491
$$ 144798 54553 -60418 68346 435395 723942 646379 256713 -129081 -308786 -414277
41524d14277k75527m12271k22543J76886M19881M06337L44003K72121k4149m48751
$$ -414277 -689804 -1102075 -1324618 -1147732 -727851 -321514 22489 294610 270461 -178290
41514a78290m22542L14372J091684J048972K84220l18159l04487o7559k6564o0572
$$ -178290 -600832 -286460 805224 1854196 2138416 1820257 1515770 1448211 1421647 1361075
41504A361075L0606Q7381n6658k32138k79382l47134n05802m39476O1995N98691
$$ 1361075 1391681 1479062 1422404 1190266 910884 563750 57948 -381528 -319533 279158
41494B79158N99472Q3621m20985n74822m46638j55138K71357O67274P37058M07656
$$ 279158 878630 962251 541266 -33556 -480194 -635332 -363975 303299 1040357 1448013
41484A448013l2520k17063j3586M12052P12579O06251J55299k58148l44656j95206
$$ 1448013 1415493 1198430 1184844 1596896 2309475 2915726 3071025 2812877 2468221 2273015
41474B273015n9089j8940o1413k64817o32058q64831o34659p1130K97088J47609
$$ 2273015 2213926 2194986 2133573 1868756 1236698 371867 -262792 -333922 -36834 110775
41464A10775k81811n15399l83317j44609q8698j06865J78032P77763J084230N86286
$$ 110775 -171036 -686435 -1069752 -1214361 -1303059 -1409924 -1231892 -454129 630101 1216387
41454A216387l08975o77814l04855R9279O7050N3444N05824R09531M96954m70830
$$ 1216387 907412 229598 -75257 24022 91072 144516 650340 1559871 2056825 1585995
41444A585995r38164m58746L35458O74458M55670M4415k13798j76191J7917K2119
$$ 1585995 647831 189085 524543 1199001 1654671 1699086 1485288 1309097 1327014 1349133
41434A349133k45428l37774R1546N97204M77990j28271m00856p2807K68137K32256
$$ 1349133 1103705 765931 857477 1454681 1932671 1804400 1403544 1330737 1598874 1831130
41424A831130J64147L41251M20807J33357j51388q9988j6971l25883o82005n29471
$$ 1831130 1995277 2336528 2757335 2890692 2739304 2649316 2632345 2306462 1624457 1094986
41414A094986l5164J79076L1013p156J84053J49654l28872p71499o20247K3559
$$ 1094986 1059822 1238898 1269911 1262755 1446808 1596462 1267590 496091 -124156 -100597
41404a00597N50876N60628K14938o7846j22519j45508l00780m06695k39227p129
$$ -100597 450279 1010907 1225845 1157999 1035480 889972 589192 182497 -56730 -63859
41394f3859j11903m33659l79511J80351N88291L72546P797J54168N77492N48475
$$ -63859 -175762 -609421 -988932 -808581 -220290 152256 160053 314221 891713 1440188
41384A440188O1127j64055J31415L59529Q5403k99516k75756j5800k4150l13933
$$ 1440188 1501315 1337260 1468675 1828204 1913607 1614091 1338335 1322535 1298385 984452
41374I84452m50496k49554K5894J36125J50792J94260K00090P5523o4020j5536
$$ 984452 533956 284402 310296 446421 597213 791473 991563 1067086 1003066 987530
41364I87530K04780L37647J97710j01167l05978l13356k01465p4540k6678j63271
$$ 987530 1192310 1529957 1727667 1626500 1320522 1007166 805701 731161 704483 541212
41354E41212m31540m91935o0878O05868R09838O68506L19234K39400K79601K04533
$$ 541212 109672 -382263 -443141 162727 1072565 1741071 2060305 2299705 2579306 2783839
41344B783839J49562K54897K43991j24700m86731l38360J16554K11130j76474
$$ 2783839 2933401 3188298 3432289 3307589 2820858 2482498 2599052 2810182 2633708
$$ [...]
##END NTUPLES=NMR SPECTRUM
##END=
