##TITLE=1H_CA-9322
200Mhz, dmso
24.02.25
##JCAMPDX= 6.0         $$ Bruker NMR JCAMP-DX V2.0
##DATA TYPE= NMR SPECTRUM
##DATA CLASS= NTUPLES
##ORIGIN= UXNMR, Bruker Analytische Messtechnik GmbH
##OWNER= root
$$ XWIN-NMR		Version 3.5
$$ Wed Feb 26 17:43:06 2025 Russian Standard Time (UT+4h)  new_Human@DPX200
##.OBSERVE FREQUENCY= 81.021009
##.OBSERVE NUCLEUS= ^31P
##.ACQUISITION MODE= SIMULTANEOUS
##.ACQUISITION SCHEME= undefined
##.AVERAGES= 64
##.DIGITISER RES= 17
##SPECTROMETER/DATA SYSTEM= spect
##.PULSE SEQUENCE= zg30
##.SOLVENT NAME= D2O
##.SHIFT REFERENCE= (INTERNAL, D2O, 0, 244.655)
##AUDIT TRAIL= $$ (NUMBER, WHEN, WHO, WHERE, WHAT)
$$ ##TITLE= Audit trail, XWIN-NMR		Version 3.5
$$ ##JCAMPDX= 5.01
$$ ##ORIGIN= Bruker BioSpin GmbH
$$ ##OWNER= new_Human
$$ C:/Bruker/XWIN-NMR/data/yarkov/nmr/P31_mono/1/pdata/1/auditp.txt
$$ ##AUDIT TRAIL=  $$ (NUMBER, WHEN, WHO, WHERE, WHAT)
(   1,<2025-02-26 17:39:51.60 +0400>,<new_Human>,<DPX200>,
      <created by zg, POWCHK disabled, PULCHK disabled
       configuration hash MD5:
       00 E9 B6 7A A2 85 ED C7 34 08 36 98 17 FE 4E 26
       data hash MD5: 64K
       C5 E9 7B F8 4F A8 6C BD 91 69 B1 2B 59 2F 10 EF>)
(   2,<2025-02-26 17:40:38.46 +0400>,<new_Human>,<DPX200>,
      <Start of raw data processing
       efp BC_mod = 2 LB = 2 FT_mod = 6 PKNL = 1 PHC0 = 66.08089 PHC1 = -76.00012 SI = 32K 
       data hash MD5: 32K
       A6 84 31 B9 E8 9B EA 5F 0A A5 7C B8 51 1A F5 0A>)
(   3,<2025-02-26 17:42:11.95 +0400>,<new_Human>,<DPX200>,
      <pk PHC0 = 16.21841 PHC1 = -24 
       data hash MD5: 32K
       A1 37 31 7A E9 23 7A B3 2B 21 51 0B 3D E8 76 7F>)
$$ ##END=
$$ 
$$ hash MD5
$$ BE 21 8D 3F DE 7C E1 FB C7 FC 80 11 98 FF 1E CC
##$RELAX= 
##$RELAX= 
##$RELAX= 
##$RELAX= 
##$RELAX= 
##$RELAX= 
##$RELAX= 
$$ Bruker specific parameters
$$ --------------------------
##$DU= <C:/Bruker/XWIN-NMR>
##$EXPNO= 1
##$NAME= <P31_mono>
##$PROCNO= 1
##$TYPE= <nmr>
##$USER= <yarkov>
##$AMP= (0..31)
100 100 100 100 100 100 100 100 100 100 100 100 100 100 100 100 100 100 
100 100 100 100 100 100 100 100 100 100 100 100 100 100 
##$AQSEQ= 0
##$AQ_mod= 1
##$AUNM= <au_zg>
##$AUTOPOS= <>
##$BF1= 81.014009
##$BF2= 200.13
##$BF3= 200.13
##$BF4= 200.13
##$BF5= 200.13
##$BF6= 200.13
##$BF7= 200.13
##$BF8= 200.13
##$BYTORDA= 1
##$CFDGTYP= 0
##$CFRGTYP= 5
##$CHEMSTR= <none>
##$CNST= (0..31)
1 1 145 1 1 1 1 1 1 1 1 1 1 1 1 1 1 1 1 1 1 1 1 1 1 1 1 1 1 1 1 1 
##$CPDPRG= <waltz16>
##$CPDPRG1= <>
##$CPDPRG2= <waltz16>
##$CPDPRG3= <>
##$CPDPRG4= <mlev>
##$CPDPRG5= <mlev>
##$CPDPRG6= <mlev>
##$CPDPRG7= <mlev>
##$CPDPRG8= <mlev>
##$CPDPRGB= <>
##$CPDPRGT= <>
##$D= (0..31)
0 1 0 0 0 0 0 0 0 0 0 0.03 2e-05 3e-06 0 0 0 0 0 0 0 0 0 0 0 0 0 0 0 0 
0 0 
##$DATE= 1740577191
##$DBL= (0..7)
120 120 120 11 120 120 24 19 
##$DBP= (0..7)
150 150 150 150 150 150 150 150 
##$DBP07= 0
##$DBPNAM0= <>
##$DBPNAM1= <>
##$DBPNAM2= <>
##$DBPNAM3= <>
##$DBPNAM4= <>
##$DBPNAM5= <>
##$DBPNAM6= <>
##$DBPNAM7= <>
##$DBPOAL= (0..7)
0.5 0.5 0.5 0.5 0.5 0.5 0.5 0.5 
$$ [...]
##$SUBNAM1= <"">
##$SUBNAM2= <"">
##$SUBNAM3= <"">
##$SUBNAM4= <"">
##$SUBNAM5= <"">
##$SUBNAM6= <"">
##$SUBNAM7= <"">
##$SUBNAM8= <"">
##$SUBNAM9= <"">
##$SW= 316.473788187772
##$SWIBOX= (0..15)
0 1 0 0 0 0 0 0 0 0 0 0 0 0 0 0 
##$SW_h= 25641.0256410256
##$TD= 65536
##$TD0= 1
##$TE= 0
##$TE2= 300
##$TE3= 300
##$TEG= 300
##$TL= (0..7)
0 120 53 12 22 120 120 120 
##$TP= (0..7)
150 150 150 150 150 150 150 150 
##$TP07= 0
##$TPNAME0= <>
##$TPNAME1= <>
##$TPNAME2= <>
##$TPNAME3= <>
##$TPNAME4= <>
##$TPNAME5= <>
##$TPNAME6= <>
##$TPNAME7= <>
##$TPOAL= (0..7)
0.5 0.5 0.5 0.5 0.5 0.5 0.5 0.5 
##$TPOFFS= (0..7)
0 0 0 0 0 0 0 0 
##$TUNHIN= 0
##$TUNHOUT= 0
##$TUNXOUT= 0
##$USERA1= <user>
##$USERA2= <user>
##$USERA3= <user>
##$USERA4= <user>
##$USERA5= <user>
##$V9= 5
##$VALIST= <valist>
##$VCLIST= <CCCCCCCCCCCCCCC>
##$VD= 0
##$VDLIST= <DDDDDDDDDDDDDDD>
##$VPLIST= <PPPPPPPPPPPPPPP>
##$VTLIST= <TTTTTTTTTTTTTTT>
##$WBST= 1024
##$WBSW= 4
##$XGAIN= (0..3)
0 0 0 0 
##$XL= 0
##$YL= 0
##$YMAX_a= 5639
##$YMIN_a= -3873
##$ZGOPTNS= <>
##$ZL1= 120
##$ZL2= 120
##$ZL3= 120
##$ZL4= 120
##$ABSF1= 0
##$ABSF2= 0
##$ABSG= 0
##$ABSL= 0
##$ALPHA= 0
##$AQORDER= 0
##$ASSFAC= 0
##$ASSFACI= 0
##$ASSFACX= 0
##$ASSWID= 0
##$AUNMP= <proc_1d>
##$AZFE= 0.1
##$AZFW= 0.5
##$BCFW= 0
##$BC_mod= 2
##$BYTORDP= 0
##$COROFFS= 0
##$CY= -3
##$DATMOD= 1
##$DC= 0
##$DFILT= <>
##$DTYPP= 0
##$F1P= 0
##$F2P= 0
##$FCOR= 1
##$FTSIZE= 32768
##$FT_mod= 6
##$GAMMA= 0
##$GB= 0
##$INTBC= 1
##$INTSCL= 6.657923e-10
##$ISEN= 30
##$LB= 2
##$LEV0= 0
##$LPBIN= 0
##$MAXI= 10000
##$MC2= 0
##$MEAN= 0
##$ME_mod= 0
##$MI= 1.036342
##$NCOEF= 0
##$NC_proc= -11
##$NLEV= 6
##$NOISF1= 3.799351
##$NOISF2= 2.8
##$NSP= 0
##$NTH_PI= 0
##$NZP= 0
##$OFFSET= 244.6554
##$PC= 1.4
##$PHC0= 82.2993
##$PHC1= -100.0001
##$PH_mod= 1
##$PKNL= yes
##$PPARMOD= 0
##$PSCAL= 0
##$PSIGN= 0
##$REVERSE= no
##$SF= 81.014009
##$SI= 32768
##$SIGF1= 3
##$SIGF2= 2
##$SINO= 400
##$SIOLD= 16384
##$SREGLST= <1H.CDCl3>
##$SSB= 0
##$STSI= 32768
##$STSR= 0
##$SW_p= 25641.0256410256
##$SYMM= 0
##$S_DEV= 0
##$TDeff= 65536
##$TDoff= 0
##$TI= <>
##$TILT= no
##$TM1= 0
##$TM2= 0
##$TOPLEV= 0
##$USERP1= <user>
##$USERP2= <user>
##$USERP3= <user>
##$USERP4= <user>
##$USERP5= <user>
##$WDW= 1
##$XDIM= 32768
##$YMAX_p= 466663752
##$YMIN_p= -122667185
$$ End of Bruker specific parameters
$$ ---------------------------------
##NTUPLES= NMR SPECTRUM
##VAR_NAME=  FREQUENCY,     SPECTRUM/REAL,   SPECTRUM/IMAG
##SYMBOL=    X,             R,               I
##VAR_TYPE=  INDEPENDENT,   DEPENDENT,       DEPENDENT
##VAR_FORM=  AFFN,          ASDF,            ASDF
##VAR_DIM=   32768,         32768,           32768
##UNITS=     HZ,            ARBITRARY UNITS, ARBITRARY UNITS
##FACTOR=    0.782525883999927, 1,           1
##FIRST=     19820.5144135685, 0,            0
##LAST=      -5820.51122745712, 0,           0
##MIN=       -5820.51122745712, -122667185,  0
##MAX=       19820.5144135685, 466663752,    0
$$ Real data points
##PAGE= N=1
##DATA TABLE= (X++(R..R)), XYDATA
$$ [...]
$$ plain form
11704 28130373 22025027 -141055 -8689335 10733174 14137207 3090695 4732132 2895930
11696 2895930 -3009037 -17292058 -15225379 15126112 33262242 24887757 15244217 5283571
11688 5283571 -2362633 -504509 -16003300 -27193515 -42224484 -46724816 -37567498 -20328480
11680 -20328480 -8216477 -10687661 -22070420 -36126787 -31599652 -26804280 -7685031
11673 -7685031 -11013455 -3089469 -4713269 -32998557 -51910910 -53488361 -23571537 8544411
11665 8544411 20302678 31912295 16106958 -8867434 -4832259 -5113259 -1429859 -9648775
11657 -9648775 -31237417 -19663636 3245061 -10708194 -26849072 -42306319 -53050255
11650 -53050255 -48419507 -29037389 9340714 28059618 30678473 26111864 23086926 10431821
$$ packed form
11704B8130373o105346k2166082q548280J9422509L404033j1046512J641437j836202
11696B895930n904967j4283021K066679L0351491J8136130q374485r643540r960646
11688E283571p646204J858124j5498791j1190215j5030969m500332R157318J7239018
11680b0328480J2112003k471184j1382759j4056367M527135M795372J9119249
11673g685031l328424P923986j623800k8285288j8912353j577451K9916824L2115948
11665H544411J1758267J1609617j5805337k4974392M035175k81000L683400q218916
11657i648775k1588642J1573781K2908697j3953255j6140878j5457247j0743936
11650e3050255M630748J9382118L8378103J8718904K618855m566609l024938j2655105
$$ plain form
11642 10431821 14040785 13339241 -23232333 -43059303 -43691741 -45941951 -34718892 -26713266
11634 -26713266 -41052691 -38669240 -17950687 -5930346 -7733577 796384 23733533
11627 23733533 31465381 19720576 -26500253 -66024726 -74457901 -63443892 -72445345
11620 -72445345 -81576223 -78681443 -58329155 -61904144 -76402923 -44373251 -20679831
11613 -20679831 -27289765 -1747805 17384815 -4673587 -778012 21093508 43333866
11606 43333866 37668112 30633743 18310474 21329772 19627204 12438527 9922819 17421841
11598 17421841 20366420 23794153 20444906 13476656 9820206 19686690 23103286 32953346
11590 32953346 31578955 13334603 -4478217 -19549161 -32294547 -49777256 -53878069
$$ packed form
11642A0431821L608964p01544l6571574j9826970o32438k250210J1223059Q005626
11634b6713266j4339425K383451K0718553J2020341j803231Q529961K2937149
11627B3733533P731848j1744805m6220829l9524473q433175J1014009r001453
11620g2445345r130878K894780K0352288l574989j4498779L2029672K3693420
11613b0679831o609934K5541960J9132620k2058402L895575K1871520K2240358
11606D3333866n665754p034369j2323269L019298j702568p188677k515708P499022
11598A7421841K944579L427733l349247o968250l656450R866484L416596R850060
11590C2953346j374391j8244352j7812820j5070944j2745386j7482709m100813
$$ plain form
11583 -53878069 -54977729 -44962570 -40492141 -71267120 -118648299 -122667185 -106567174
11576 -106567174 -94276171 -57384581 -24979133 -21250792 -26011248 -24685530 -27367704
11569 -27367704 -33584379 -17527325 -11232357 -20049239 -34223885 -44760262 -28800811
11562 -28800811 -27907976 -45548862 -49242336 -59325071 -69660106 -54532642 -32826151
11555 -32826151 -45338485 -59675190 -26968018 -10808586 -17057586 14006404 26412747
11548 26412747 11565921 -9065003 -7999776 8493313 27874618 8622068 -18384357
11541 -18384357 -16946841 -26398614 -22766700 -29396884 -47663628 -10870463 29852946 48180632
11533 48180632 56181429 56571966 58334718 52838509 37397196 27379495 14295238 -3645676
$$ packed form
11583e3878069j099660J0015159M470429l0774979m7381179m018886J6100011
11576a06567174J2291003L6891590L2405448L728341m760456J325718k682174
11569b7367704o216675J6057054O294968q816882j4174646j0536377J5959451
11562b8800811Q92835j7640886l693474j0082735j0335035J5127464K1706491
11555c2826151j2512334j4336705L2707172J6159432o249000L1063990J2406343
11548B6412747j4846826k0630924J065227J6493089J9381305j9252550k7006425
11541a8384357J437516r451773L631914o630184j8266744L6793165M0723409J8327686
11533D8180632Q000797L90537J762752n496209j5441313j0017701j3084257j7940914
$$ plain form
11525 -3645676 18082222 25349524 14974944 -84787 -9323139 -20848314 -20938722 -18181356
11517 -18181356 -2465875 4241708 7537553 18086888 12655287 18289583 12700486 9941101
11509 9941101 18587969 21551702 20191827 23414083 5641962 8899915 24875391 11162532
11501 11162532 -3626293 3860423 -14007048 -9561646 14711389 17741069 10763545 5414259
11493 5414259 22737962 45913206 45673894 37381973 33749638 29761563 19683752 6450553
11485 6450553 7927348 28917994 30033402 21086091 -8796560 -18584670 -8798524 -22889079
11477 -22889079 -44259556 -51225598 -18316517 9902128 18548804 22965120 26728046 29249578
11469 29249578 26968018 52012708 64722190 40700192 14574849 -3707479 -1555445
$$ packed form
11525c645676K1727898P267302j0374580j5059731r238352j1525175r0408K757366
11517a8181356J5715481O707583L295845J0549335n431601N634296n589097k759385
11509I941101Q646868K963733j359875L222256j7772121L257953J5975476j3712859
11501A1162532j4788825P486716j7867471M445402K4273035L029680o977524n349286
11493E414259J7323703K3175244k39312q291921l632335l988075j0077811j3233199
11485F450553J476795K0990646J115408q947311k9882651r788110R786146j4090555
11477b2889079k1370477o966042L2909081K8218645Q646676M416316L762926K521532
11469B9249578k281560K5044690J2709482k4021998k6125343j8282328K152034
$$ plain form
11462 -1555445 17774037 37603793 23367852 8810624 20610516 37597270 40055907
11455 40055907 28570794 19945870 25350650 44015195 47603184 37699789 33075333 29315675
11447 29315675 26374627 6910941 11594619 35210199 33805640 26028607 18608754 37773004
11439 37773004 29669530 246473 2989118 40030999 47516017 22100851 -4349963
11432 -4349963 -14725847 -25751639 -13389275 -2114331 -301489 699170 10503010 33948123
11424 33948123 38830683 16127081 17705500 33586780 43685956 52460314 43599711 34354746
11416 34354746 22560257 4241605 -10643767 -8956858 -4469091 443588 -2340972 -21249177
11408 -21249177 -11472437 -7960014 -29953792 -47581733 -17971978 -7018611 -30288829
$$ packed form
11462a555445J9329482J9829756j4235941j4557228J1799892J6986754K458637
11455D0055907j1485113q624924N404780J8664545L587989r903395m624456l759658
11447B9315675k941048j9463686M683678K3615580j404559p777033p419853J9164250
11439C7773004q103474k9423057K742645L7041881P485018k5415166k6450814
11432d349963j0375884j1025792J2362364J1274944J812842J000659R803840K3445113
11424C3948123M882560k2703602J578419J5881280J0099176Q774358q860603r244965
11416C4354746j1794489j8318652j4885372J686909M487767M912679k784560j8908205
11408b1249177R776740L512423k1993778j7627941K9609755J0953367k3270218
$$ plain form
11401 -30288829 -63508135 -67413495 -61592347 -40116268 4420796 27486472 6975041
11394 6975041 -31876737 -28039655 -19077621 -13681485 -12169041 1422198 11812966 10342889
11386 10342889 14169900 -3979261 -9087941 -28916823 -39981019 -32289746 -26313336 -27030727
11378 -27030727 -4434797 14922329 -11328724 -46817995 -45825427 -17383724 -21162995
11371 -21162995 -40280314 -47511180 -46807269 -38025286 -15206077 -7582806 -21956870 -46313568
11363 -46313568 -47411416 -9665978 -11403590 -1987531 10027287 29600134 24648562 -6679797
11355 -6679797 -8828715 -15826355 -21210715 -17047017 -13465645 -10503168 9116464 -2932720
11347 -2932720 -16446648 -4873676 8625089 20723392 30245342 32778877 32290129 32286229
$$ packed form
11401c0288829l3219306l905360N821148K1476079M4537064K3065676k0511431
11394F975041l8851778L837082Q962034N396136J512444J3591239J0390768j470077
11386A0342889L827011j8149161n108680j9828882j1064196P691273N976410p17391
11378b7030727K2595930J9357126k6251053l5489271R92568K8441703l779271
11371b1162995j9117319p230866P03911Q781983K2819209P623271j4374064k4356698
11363d6313568j097848L7745438j737612R416059J2014818J9572847m951572l1328359
11355f679797k148918o997640n384360M163698L581372K962477J9619632j2049184
11347b932720j3513928J1572972J3498765J2098303R521950K533535m88748l900
$$ plain form
11339 32286229 14100467 13255032 6732755 -2623390 -15695262 -17411220 -21032576 -6534201
11331 -6534201 6783832 -18263107 -4988904 29516212 56992364 32464112 5236926
11324 5236926 6630458 11844715 13620382 21633182 18351760 11631121 6977790 6092976
11316 6092976 27765882 39413987 22404223 10777211 17924158 20371186 -3824201
11309 -3824201 -28751497 -32113780 -22203781 -1896401 8743234 -10412575 -33282374
11302 -33282374 -47119300 -44489464 -23075808 3647510 19815840 24117851 17266316
11295 17266316 7325810 -516271 14780983 30406395 16823891 6171478 -25811244
11288 -25811244 -42320338 -33221052 -40413285 -39343419 -19775737 9431110 43911875
$$ packed form
11339C2286229j8185762q45435o522277r356145j3071872j715958l621356J4498375
11331f534201J3318033k5046939J3274203L4505116K7476152k4528252k7227186
11324E236926J393532N214257J775667Q012800l281422o720639m653331q84814
11316F092976K1672906J1648105j7009764j1627012P146947K447028k4195387
11309c824201k4927296l362283R909999K0307380J0639635j9155809k2869799
11302c3282374j3836926K629836K1413656K6723318J6168330M302011o851535
11295A7266316r940506p842081J5297254J5625412j3582504j0652413l1982722
11288b5811244j6509094R099286p192233J069866J9567682K9206847L4480765
$$ plain form
11281 43911875 72071557 64274365 37986647 20979104 22590190 43217349 41973760
11274 41973760 21003700 484706 -5850287 -14690506 -26996843 -36015616 -39621429 -45941500
11266 -45941500 -44397107 -49453695 -45413648 -23185160 -5161887 23197135 49619938
11259 49619938 34949252 4798784 -13890987 -21289741 -2193409 16810806 29227510
11252 29227510 15511448 -26474819 -52936340 -61970029 -41443849 -17290593 12151978
11245 12151978 29146272 26337124 18446146 22229087 33261502 22011809 13278306 17501401
11237 17501401 32288416 45562358 66336852 68639603 89808860 108229242 92076792
11230 92076792 80749295 82127331 75370797 83424152 106577947 135965717 133985640 118228652
$$ packed form
11281D3911875K8159682p797192k6287718j7007543J611086K0627159j243589
11274D1973760k0970060k0518994o334993q840219j2306337r018773l605813o320071
11266d5941500J544393n056588M040047K2228488J8023273K8359022K6422803
11259D9619938j4670686l0150468j8689771p398754J9096332J9004215J2416704
11252B9227510j3716062m1986267k6461521r033689K0526180K4153256K9442571
11245A2151978J6994294k809148p890978L782941J1032415j1249693q733503M223095
11237A7501401J4787015J3273942K0774494K302751K1169257J8420382j6152450
11230I2076792j1327497J378036o756534Q053355K3153795K9387770j980077j5756988
$$ plain form
11222 118228652 119348840 111074600 89521492 84810388 86978582 135187522 194274100
11215 194274100 194566780 154094284 139079782 139142815 126168722 103267963 92058555 86589482
11207 86589482 86764481 101975272 101343861 103591057 116826513 112072934 94006270 85014196
11199 85014196 84438726 98517620 104527148 93889185 87724596 77048086 59406089 39214702
11191 39214702 31363126 52567689 74402223 52818399 26298117 8860367 14167886
11184 14167886 18335451 11534858 21008684 34252672 46056300 62807272 66829315 72808287
11176 72808287 53201565 18368054 2759523 7526087 -6319166 -13152102 4147456
11169 4147456 19746825 28704802 35166000 21186595 1939093 2096759 21577718 35493455
$$ packed form
11222A18228652J120188q274240k1553108m711104K168194M8208940N9086578
11215A94274100K92680m0472496j5014502O3033j2974093k2900759j1209408n469073
11207H6589482J74999J5210791o31411K247196J3235456m753579j8066664q992074
11199H5014196n75470J4078894O009528j0637963o164589j0676510j7641997k0191387
11191C9214702p851576K1204563K1834534k1583824k6520282j7437750N307519
11184A4167886M167565o800593R473826J3243988J1803628J6750972M022043N978972
11176G2808287j9606722l4833511j5608531M766564j3845253o832936J7299558
11169D147456J5599369Q957977O461198j3979405j9247502J57666J9480959J3915737
$$ plain form
11161 35493455 35701765 33782334 45458077 34266212 6952929 -6747455 -3695910 -7306843
11153 -7306843 -17286686 -22702716 -41574696 -45946919 -18009139 5970824 18077762 39814598
11145 39814598 53952757 50425774 50794420 40301293 38098887 48968305 33767922 24409286
11137 24409286 12595429 23774478 37661529 42265232 42584675 42002452 27764870 19001167
11129 19001167 -3872970 -17589770 -26036823 -37136335 -38115905 -29790523 -30419058 -20597164
11121 -20597164 -6734268 8068956 28447612 29455959 8109233 -10276072 -7611601
11114 -7611601 15119711 12962947 5326337 1804360 -13240314 -14903265 15738995 42167292
11106 42167292 55327474 62391532 60578804 69586708 68126797 45501611 26199059 11314197
$$ packed form
11161C5493455K08310j919431J1675743j1191865k7313283j3700384L051545l610933
11153g306843r979843n416030j8871980m372223K7937780K3979963J2106938K1736836
11145C9814598J4138159l526983L68646j0493127k202406J0869418j5200383r358636
11137B4409286j1813857J1179049J3887051M603703L19443n82223j4237582q763703
11129A9001167k2874137j3716800q447053j1099512r79570Q325382o28535R821894
11121b0597164J3862896J4803224K0378656J008347k1346726j8385305K664471
11114g611601K2731312k156764p636610l521977j5044674j662951L0642260K6428297
11106D2167292J3160182P064058j812728R007904j459911k2625186j9302552j4884862
$$ plain form
11098 11314197 -27063987 -33733939 -2848096 46341377 72787318 76326340 74978418
11091 74978418 75011980 63155533 46836632 17880731 -866682 -4874992 -17055278 -36268920
11083 -36268920 -27413688 -4846846 17490840 16915989 25112907 31312670 16428710 11170654
11075 11170654 17196904 36630502 69720362 92437442 98923428 93619859 63574359
11068 63574359 11487812 -5580288 20552040 61536824 72685665 65878477 46678725
11061 46678725 40782474 58182581 46459090 24291987 8418190 3728352 5522385
11054 5522385 -11225472 -13799509 -11418486 -9156404 -26050373 -52214360 -62745077 -51010289
11046 -51010289 -26097188 18254316 44619988 42951819 16520891 -13555811 -23333470
$$ packed form
11098A1314197l8378184o669952L0885843M9189473K6445941L539022j347922
11091G4978418L3562j1856447j6318901k8955901j8747413m008310j2180286j9213642
11083c6268920Q855232K2566842K2337686n74851Q196918O199763j4883960n258056
11075A1170654O026250J9433598L3089860K2717080O485986n303569l0045500
11068F3574359n2086547j7068100K6132328M0984784J1148841o807188j9199752
11061D6678725n896251J7400107j1723491k2167103j5873797m689838J794033
11054E522385j6747857k574037K381023K262082j6893969k6163987j0530717J1734788
11046e1010289K4913101M4351504K6365672j668169k6430928l0076702r777659
$$ plain form
11039 -23333470 -26147786 -11723606 4958323 -5623048 -4316572 -4042112 -6581730 -11971798
11031 -11971798 -3902017 9821914 10054566 14852515 20116540 8156925 -9683094 -30299008
11023 -30299008 -28345029 -18778845 -15484418 -17613525 -25760298 -11207716 19682461 24958643
11015 24958643 13573291 -3068923 -14742337 -14601206 -6327445 -6919715 3592698 6460762
11007 6460762 4339426 22026822 30699608 8126950 -6191036 -6205041 -221169 19389510
10999 19389510 24639163 -128554 -10001830 -14079565 -6469458 7673793 9437368 17346776
10991 17346776 30382917 22746640 13003594 18890548 28784208 41983028 46298699 30766294
10983 30766294 8368533 -28462456 -14769938 5982371 -5555455 -1442812 219989
$$ packed form
11039b3333470k814316J4424180J6681929j0581371J306476K74460k539618n390068
11031a1971798Q069781J3723931K32652M797949N264025j1959615j7840019k0615914
11023c0299008J953979R566184L294427k129107q146773J4552582L0890177N276182
11015B4958643j1385352j6642214j1673414J41131Q273761n92270J0512413K868064
11007F460762k121336J7687396Q672786k2572658j4317986j4005N983872J9610679
10999A9389510N249653k4767717r873276m077735P610107J4143251J763575P909408
10991A7346776J3036141p636277r743046N886954R893660J3198820M315671j5532405
10983C0766294k2397761l6830989J3692518K0752309j1537826M112643J662801
$$ plain form
10976 219989 -2618292 2485697 8340434 4000960 -959457 2112755 -3444611 -23357226
10968 -23357226 -31892910 -30229124 -22113341 -12278928 -16062617 -27158271 -11733242 -6344477
10960 -6344477 -10031299 -4794206 -12512096 -18275019 -176248 17296253 43668253 63489343
10952 63489343 47844303 13392744 -6265081 -5925626 875065 -4229959 2011298 5326976
10944 5326976 6099050 14012688 19085930 6952411 -5607598 757127 17127466 19849127
10936 19849127 18591011 33485229 46202121 30391288 -13678339 -41964305 -41908062 -25115495
10928 -25115495 -21862155 -7138632 18151090 21704276 -4813615 -15008113 -15489536 -13938374
10920 -13938374 4470316 27737623 37980442 21652674 18456213 17614132 15963387 32087498
$$ packed form
10976B19989k838281N103989N854737m339474m960417L072212n557366j9912615
10968b3357226q535684J663786Q115783R834413l783689j1095654J5425029N388765
10960f344477l686822N237093p717890n762923J8098771J7472501K6372000J9821090
10952F3489343j5645040l4451559j9657825L39455O800691n105024O241257L315678
10944E326976P72074P913638N073242j2133519j2560009O364725J6370339K721661
10936A9849127j258116J4894218J2716892j5810833m4069627k8285966N6243J6792567
10928b5115495L253340J4723523K5289722L553186k6517891j0194498m81423J551162
10920a3938374J8408690K3267307J0242819j6327768l196461q42081j650745J6124111
$$ plain form
10912 32087498 28617452 9305956 10327367 20937296 22692570 37222170 47105323 36356508
10904 36356508 20251653 10297347 12503413 8694595 13209214 14303179 -7530184 -23407379
10896 -23407379 -18677834 -28312331 -31473283 3961600 32589861 31348350 24042035 13846217
10888 13846217 -19734299 -50417175 -59863555 -50223185 -39850203 -39225733 -45446781 -39019732
10880 -39019732 -12325149 14698825 15019443 -6004305 -22023267 -30697236 -30417343 -42321856
10872 -42321856 -44424506 -36095332 -42377614 -28915499 -37736858 -56319044 -46012203 -33406663
10864 -33406663 -18776280 -12434870 -35522662 -75043319 -66232683 -43651851 -13123858
10857 -13123858 16028333 26136838 18011614 -384804 6872845 38150433 44561662
$$ packed form
10912C2087498l470046j9311496J021411J0609929J755274J4529600R883153j0748815
10904C6356508j6104855r954306K206066l808818M514619J093965k1833363j5877195
10896b3407379M729545r634497l160952L5434883K8628261j241511p306315j0195818
10888A3846217l3580516l0682876r446380R640370J0372982O24470o221048O427049
10880c9019732K6694583K7023974L20618k1023748j6018962q673969K79893j1904513
10872d2321856k102650Q329174o282282J3462115q821359j8582186J0306841J2605540
10864c3406663J4630383O341410k3087792l9520657Q810636K2580832L0527993
10857a3123858K9152191J0108505q125224j8396418P257649L1277588O411229
$$ plain form
10850 44561662 21293366 -6239340 7423551 17276710 18963872 14639425 26558338
10843 26558338 15449638 1955836 3085222 24599804 37689793 47768504 52443661
10836 52443661 37422393 30311452 13832264 -9206343 -23199957 -21042173 2178090
10829 2178090 16254950 13977192 -834547 -15362612 -18254785 -9935798 -14923021 -30426138
10821 -30426138 -41538287 -44683210 -45961458 -39895352 -51908091 -59629754 -81134019 -76033706
10813 -76033706 -49471309 -28173185 -14096502 6767599 7650894 5892643 -1671569 -6826754
10805 -6826754 -8839517 -4415444 -6126188 -8800107 502984 6649198 7746831 8024034
10797 8024034 -26719940 -56616693 -39982389 -10958423 -2168777 -21528114 -8380300
$$ packed form
10850D4561662k3268296k7532706J3662891R853159J687162m324447J1918913
10843B6558338j1108700j3493802J129386K1514582J3089989J0078711M675157
10836E2443661j5021268p110941j6479188k3038607j3993614K157784K3220263
10829B178090J4076860k277758j4811739j4528065k892173Q318987m987223j5503117
10821c0426138j1112149l144923j278248O066106j2012739p721663k1504265N100313
10813g6033706K6562397K1298124J4076683K0864101Q83295j758251p564212n155185
10805f826754k012763M424073j710744k673919R303091O146214J097633K77203
10797H024034l4743974k9896753J6634304K9023966Q789646j9359337J3147814
$$ plain form
10790 -8380300 9272044 1601086 -21786452 -33598347 -9449532 -2839338 -16172377
10783 -16172377 4952898 3516798 -29492732 -47655808 -57975469 -37900731 -1251771
10776 -1251771 34928623 30966198 1369238 -24171745 -24700729 -5133045 6050277 -2181832
10768 -2181832 -7134871 8129064 23786370 18253763 17588159 14104781 2751955 -7297217
10760 -7297217 -8771821 -2174242 17032015 25413386 13550234 10731766 34819514 40164807
10752 40164807 8694493 -34389441 -30517512 -20624967 -14844218 -15652612 -18001943 -15511361
10744 -15511361 -6789262 -146466 4303940 -515257 -8075553 -9837594 -20661865 -17914290
10736 -17914290 -12071562 -2021362 9133998 -27736093 -55523391 -54632734 -46386541 -45958722
$$ packed form
10790h380300J7652344p670958k3387538j1811895K4148815O610194j3333039
10783a6172377K1125275j436100l3009530j8163076j0319661K0074738L6648960
10776a251771L6180394l962425k9596960k5540983n28984J9567684J1183322q232109
10768b181832m953039J5263935J5657306n532607o65604l483378j1352826j0049172
10760g297217j474604O597579J9206257Q381371j1863152k818468K4087748N345293
10752D0164807l1470314m3083934L871929R892545N780749q08394k349331K490582
10744a5511361Q722099O642796M450406m819197p560296j762041j0824271K747575
10736a7914290N842728J0050200J1155360l6870091k7787298Q90657Q246193M27819
$$ plain form
10728 -45958722 -41539538 -23336866 -25865468 -33877455 -43541322 -30941539 4642337 1895994
10720 1895994 -21534873 -32488842 -26188002 -38328768 -43602187 -59867232 -36005003
10713 -36005003 -21743637 -19502577 -12061641 -9968126 -10196730 -11305222 -46732438 -39572356
10705 -39572356 -7303956 18437156 11283209 -21497410 -38931560 -11414694 11393997
10698 11393997 9927763 5742389 -18966004 -38231143 -53042315 -48781288 -35668455
10691 -35668455 -21168154 -8234090 6955816 17815775 23050685 7937541 -6151304
10684 -6151304 -10142491 -25081502 -30138631 -32072068 -17873413 -10782286 -16477422 13538064
10676 13538064 48594175 55473034 39753151 21123009 7789866 10851128 25384214
$$ packed form
10728d5958722M419184J8202672k528602q011987r663867J2599783L5583876k746343
10720A895994k3430867j0953969O300840j2140766n273419j6265045K3862229
10713c6005003J4261366K241060P440936K093515k28604j108492l5427216P160082
10705c9572356L2268400K5741112p153947l2780619j7434150K7516866K2808691
10698A1393997j466234m185374k4708393j9265139j4811172M261027J3112833
10691c5668455J4500301J2934064J5189906J0859959N234910j5113144j4088845
10684f151304l991187j4939011n057129j933437J4198655P091127n695136L0015486
10676A3538064L5056111O878859j5719883j8630142j3333143L061262J4533086
$$ plain form
10669 25384214 15231314 10796811 20808645 20950991 20052963 34670330 34393477 28313162
10661 28313162 31066562 12402179 -8284141 -29911345 -40720287 -38996171 -25618761
10654 -25618761 1821465 -3726368 -8355325 -5406031 -8002375 -7489567 -9039110 -27207704
10646 -27207704 -28696319 -37992538 -37928666 -22831028 -13811467 -14195303 -13265791 -15487336
10638 -15487336 -32399301 -29497609 -16523196 -24055913 -14197621 -10091889 -40764740 -66610782
10630 -66610782 -68823674 -57612068 -35529290 -39576396 -44467104 -11590847 11730811
10623 11730811 5124897 -7596235 -3865805 2102372 -17664741 -32359737 -24257694 3217026
10615 3217026 33176634 65157139 75584334 73263316 57860659 48514090 41479271 7643955
$$ packed form
10669B5384214j0152900m434503J0011834J42346q98028J4617367k76853o080315
10661B8313162K753400j8664383k0686320k1627204j0808942J724116J3377410
10654b5618761K7440226n547833m628957K949294k596344N12808j549543j8168594
10646b7207704j488615r296219O3872J5097638R019561l83836R29512k221545
10638a5487336j6911965K901692J2974413p532717R858292M105732l0672851k5846042
10630f6610782k212892J1211606K2082778m047106m890708L2876257K3321658
10623A1730811o605914j2721132L730430N968177j9767113j4694996Q102043K7474720
10615C217026K9959608L1980505J0427195k321018j5402657r346569p034819l3835316
$$ plain form
10607 7643955 -12482677 -21213069 -19399282 -8920339 -14476994 -11131566 -19585582 -14173427
10599 -14173427 -630273 2844568 8509050 -2108581 -8470092 -4875537 1113412 -1507181
10591 -1507181 -29592729 -25163887 -7495268 8923558 16389758 22520521 27307475 3945776
10583 3945776 -20213559 -18384169 -21449797 -6944943 1439044 -18914979 -15842968 5046863
10575 5046863 14266508 22916097 27475782 45284322 64243052 62958229 73808448 82433462
10567 82433462 74784336 78326942 100273372 109638679 100136719 80548412 63964781 65376391
10559 65376391 65990169 66001685 67750500 80798833 78042882 83651212 73993316 65939101
10551 65939101 75360796 74932781 70200880 57655085 44339831 62191876 108015007 118499494
$$ packed form
10607G643955k0126632q730392J813787J0478943n556655L345428q454016N412155
10599a4173427J3543154L474841N664482j0617631o361511L594555N988949k620593
10591a507181k8085548M428842J7668619J6418826P466200O130763M786954k3361699
10583C945776k4159335J829390l065628J4504854Q383987k0354023L072011K0889831
10575E046863R219645Q649589M559685J7808540J8958730j284823J0850219Q625014
10567H2433462p649126L542606K1946430R365307r501960j9588307j6583631J411610
10559F5376391O13778J1516J748815J3048333k755951N608330r657896q054215
10551F5939101R421695m28015m731901j2545795j3315254J7852045M5823131J0484487
$$ plain form
10543 118499494 117494809 100450470 84211910 74826896 86913946 98837428 110200003
10536 110200003 134809634 140079047 128759012 122942348 129651726 112540283 75101890
10529 75101890 90857764 127008463 147551717 148411933 132026662 118461449 104137010
10522 104137010 77802292 64279080 91865353 108315826 123799512 114801611 93425641
10515 93425641 93518709 105967325 101558807 103721095 107903266 85374778 60960472 72583593
10507 72583593 82041504 58026887 34118269 25112680 186760 3212939 12447605 12997960
10499 12997960 28112086 40280434 30102078 36225166 58676441 58275092 47058678
10492 47058678 30668670 -2542154 -14465929 -15076442 -10711495 2468701 4242114 16035846
$$ packed form
10543A18499494j004685j7044339j6238560r385014J2087050J1923482J1362575
10536A10200003K4609631N269413j1320035n816664O709378j7111443l7438393
10529G5101890J5755874L6150699K0543254Q60216j6385271j3565213j4324439
10522A04137010k6334718j3523212K7586273J6450473J5483686q997901k1375970
10515I3425641R3068J2448616m408518K162288M182171k2528488k4414306J1623121
10507G2583593R457911k4014617k3908618r005589k4925920L026179R234666N50355
10499A2997960J5114126J2168348j0178356O123088K2451275m01349j1216414
10492D7058678j6390008l3210824j1923775o10513M364947J3180196J773413J1793732
$$ plain form
10484 16035846 29692611 29217640 22575488 25872909 26759554 19646595 3790722 5320657
10476 5320657 -3222053 -16870886 -27825678 -37059154 -21295698 11164737 35656654
10469 35656654 59360268 79220649 68913664 45602099 20076882 6550967 -3114339
10462 -3114339 11477671 20159239 23176255 29056333 24268977 40658626 60148380 58027456
10454 58027456 46256899 33877964 15089341 -1549538 -459264 18998192 13917989
10447 13917989 25547692 48830586 41764899 3109991 -5687557 -1532013 1569599 -4920057
10439 -4920057 -13544189 -18045980 5626592 10449359 -11033056 -15708490 -25006702 -17569070
10431 -17569070 23343297 47420072 22956443 -2148199 -1767204 9602471 33756188
$$ packed form
10484A6035846J3656765m74971o642152L297421Q86645p112959j5855873J529935
10476E320657q542710j3648833j0954792r233476J5763456L2460435K4491917
10469C5656654K3703614J9860381j0306985k3311565k5525217j3525915r665306
10462c114339J4592010Q681568L017016N880078m787356J6389649J9489754k120924
10454E8027456j1770557j2378935j8788623j6638879J090274J9457456n080203
10447A3917989J1629703K3282894p065687l8654908q797548M155544L101612o489656
10439d920057q624132m501791K3672572M822767k1482415m675434r298212P437632
10431a7569070M0912367K4076775k4463629k5104642L80995J1369675K4153717
$$ plain form
10424 33756188 53813630 68025791 63664242 27260032 -18297460 -28092899 -19941743
10417 -19941743 -15515556 6949272 39159126 28549143 5967013 2981414 -2631195
10410 -2631195 -31541278 -21240275 -313461 13686452 22953111 19941804 5204855
10403 5204855 -3433471 2508612 -7942193 -27544473 -12638803 -14648927 -21162814 -3720896
10395 -3720896 8155164 -6146598 -22544113 -37810932 -39080771 -19210206 16180720
10388 16180720 45604473 41098573 46852898 65672454 73594544 73322204 64933449 66264259
10380 66264259 61163401 54913708 61406428 65336420 53327224 42862275 51540301 54502467
10372 54502467 47183071 36336603 50091452 43737573 6051371 765039 6813947 16969
$$ packed form
10424C3756188K0057442J4212161m361549l6404210m5557492r795439Q151156
10417a9941743M426187K2464828L2209854j0609983k2582130k985599n612609
10410b631195k8910083J0301003K0926814J3999913R266659l011307j4736949
10403E204855q638326N942083j0450805j9602280J4905670k010124o513887J7441918
10395c720896J1876060j4301762j6397515j5266819j269839J9870565L5390926
10388A6180720K9423753m505900N754325J8819556P922090k72340q388755J330810
10380F6264259n100858o249693O492720L929992j2009196j0464949Q678026K962166
10372E4502467p319396j0846468J3754849o353879l7686202n286332O048908o796978
$$ plain form
10364 16969 2507820 7676975 7667095 19748282 38222017 41883978 45883395 18952756
10356 18952756 -6296473 6262738 10200424 9967050 6940167 33694231 42379092 36581585
10348 36581585 47789126 61248259 60762188 62034633 67416685 62083351 29181075 -7672205
10340 -7672205 -27729708 -25601273 -18431678 -13522451 -40426106 -60176005 -35357427 -931799
10332 -931799 22085874 31394916 35763780 28945536 21468250 345150 -4303463 5660216
10324 5660216 17937376 26111856 19429857 11391501 19269553 27765821 38614098 38277404
10316 38277404 35590097 40203289 49027627 24350242 -323039 -16562527 -33168092
10309 -33168092 -14083784 -689220 15392274 22009544 22832178 8685888 -18635376
$$ packed form
10364A6969K490851N169155r880J2081187J8473735L661961L999417k6930639
10356A8952756k5249229J2559211L937686k33374l026883K6754064Q684861n797507
10348C6581585J1207541J3459133m86071J272445N382052n333334l2902276l6853280
10340g672205k0057503K128435P169595M909227k6903655j9749899K4818578L4425628
10332i31799K3017673R309042M368864o818244p477286k1123100m648613R963679
10324E660216J2277160Q174480o681999q038356P878052Q496268J0848277l36694
10316C8277404k687307M613192Q824338k4677385k4673281j6239488j6605565
10309c3168092J9084308J3394564J6081494O617270Q22634j4146290k7321264
$$ plain form
10302 -18635376 -10727280 -11527752 -19760219 -14459206 -8337524 -17093640 -14307601 -12045210
10294 -12045210 3435881 2597505 -16278542 -27025700 -35589940 -36326629 -24328666 -2043395
10286 -2043395 14303187 19528867 27647539 32753470 32684438 33978311 37586885 26853011
10278 26853011 19553404 3728137 1369306 19778745 42463287 47230952 15912902
10271 15912902 -12115186 -18432731 -24012964 -18265190 -28901981 -30071867 -32010276 -40038556
10263 -40038556 -32469119 -34919400 -31394733 -28734973 -17598780 -8536213 7284264 15418572
10255 15418572 26803602 11611921 -18154840 -39759256 -49470484 -46585645 -42059887
10248 -42059887 -20289376 5598052 15486055 32617109 33063306 21401062 -3765679
$$ packed form
10302a8635376P908096q00472q232467N301013O121682q756116K786039K262391
10294a2045210J5481091q38376j8876047j0747158q564240p36689J1997963K2285271
10286b043395J6346582N225680Q118672N105931o9032J293873L608574j0733874
10278B6853011p299607j5825267k358831J8409439K2684542M767665l1318050
10271A5912902k8028088o317545n580233N747774j0636791j169886j938409q028280
10263d0038556P569437k450281L524667K659760J1136193R062567J5820477Q134308
10255A5418572J1385030j5191681k9766761k1604416r711228K884839M525758
10248d2059887K1770511K5887428R888003J7131054M46197j1662244k5166741
$$ plain form
10241 -3765679 -9314266 -16934502 -18383315 -22190734 -25225797 -29589683 -21062880 -2887762
10233 -2887762 15149055 14992773 15229111 27200964 24210733 11841015 29595460 30596301
10225 30596301 -11665432 -52962236 -68601211 -71935540 -85859765 -79790893 -50762250
10218 -50762250 -30118335 -13925130 -3043142 -6389599 3061817 21923598 41508621
10211 41508621 43882819 26429238 26091984 47682450 57098759 47704212 32448207 43132120
10203 43132120 61117765 65689283 52182784 54774249 69440393 72759990 46069728
10196 46069728 12024849 9026337 16354521 21720563 6963356 -3019884 11510590 45266712
10188 45266712 69455721 91707729 102081191 105352536 90496457 71529165 62362170
$$ packed form
10241c765679n548587p620236j448813l807419l035063m363886Q526803J8175118
10233b887762J8036817j56282K36338J1971853k990231j2369718J7754445J000841
10225C0596301m2261733m1296804j5638975l334329j3924225O068872K9028643
10218e0762250K0643915J6193205J0881988l346457R451416J8861781J9585023
10211D1508621K374198j7453581l37254K1590466R416309r394547j5256005J0683913
10203D3132120J7985645M571518j3506499K591465J4666144L319597k6690262
10196D6069728l4044879k998512P328184N366042j4757207r983240J4530474L3756122
10188D5266712K4189009K2252008J0373462L271345j4856079j8967292r166995
$$ plain form
10181 62362170 48299166 37106939 24143489 23039187 17696891 4820292 -3097999
10174 -3097999 -29332634 -41989900 -27565479 23816800 63421355 66155707 67942191
10167 67942191 57307516 49760903 44660539 40490814 39017089 28832591 -671879 -9745491
10159 -9745491 6721547 18046098 5781659 -14184004 -31223000 -40872472 -25029255
10152 -25029255 17067135 37204289 15936291 -5071125 -16913365 5920801 46268187
10145 46268187 69038497 67126963 52300807 57676604 45632874 31782325 16663601
10138 16663601 -10697081 -22802575 -555243 20715529 24052632 -9490034 -34055465
10131 -34055465 -28176701 -13344165 9091602 15577925 16094530 17176729 12469156 8046335
$$ packed form
10181F2362170j4063004j1192227j2963450j104302n342296j2876599p918291
10174c097999k6234635j2657266J4424421N1382279L9604555K734352J786484
10167F7942191j0634675p546613n100364m169725j473725j0184498k9504470r073612
10159i745491J6467038J1324551j2264439j9965663j7038996r649472J5843217
10152b5029255M2096390K0137154k1267998k1007416j1842240K2834166M0347386
10145D6268187K2770310j911534j4826156N375797j2043730j3850549j5118724
10138A6663601k7360682j2105494K2247332K1270772L337103l3542666k4565431
10131c4055465N878764J4832536K2435767O486323N16605J082199m707573m422821
$$ plain form
10123 8046335 -3892191 -18965385 -19759277 -14869499 -4021682 10268893 -6436771 -217071
10115 -217071 -6110203 -39368547 -42944582 -22709815 -22776029 -32711973 -12914707 7831137
10107 7831137 8328313 -20588749 -37834930 -33463251 -25590096 -33199167 -27050066 -9397377
10099 -9397377 3363012 18503811 5749156 -33128514 -56646101 -43552486 -19549484
10092 -19549484 6302518 -3210609 -34018501 -49449172 -36755380 -16133969 6028898
10085 6028898 18129661 17857431 22529878 15592862 -6140363 -39375130 -63684776 -59072514
10077 -59072514 -38586316 -25279380 -28946997 -15344354 -437842 5945785 19321092
10070 19321092 9412966 230607 -1423578 -8250533 -22722574 -25348553 -12918936 10627621
$$ packed form
10123H046335j1938526j5073194p93892M889778J0847817J4290575j6705664O219700
10115b17071n893132l3258344l576035K0234767o6214r935944J9797266K0745844
10107G831137M97176k8917062j7246181M371679P873155p609071O149101J7652689
10099i397377J2760389J5140799j2754655l8877670k3517587J3093615K4003002
10092a9549484K5852002r513127l0807892j5430671J2693792K0621411K2162867
10085F028898J2100763k72230M672447o937016k1733225l3234767k4309646M612262
10077e9072514K0486198J3306936l667617J3602643J4906512O383627J3375307
10070A9321092r908126r182359j654185o826955j4472041k625979J2429617K3546557
$$ plain form
10062 10627621 32742665 43042163 42658928 12233653 -17402599 -16672140 -3814643 -4003526
10054 -4003526 -27175311 -21971666 -12444620 -6563115 4140102 30289831 23866916 1950836
10046 1950836 4310308 33333956 49024388 46737972 47552530 51093743 42259052 27715162
10038 27715162 20466243 9015222 8310514 10209129 3916390 -16437982 -14820664 -4386835
10030 -4386835 2868840 -2786117 -6646497 -4163862 10364255 25184082 37375833 49095776
10022 49095776 39372340 24843015 19743111 21616812 42786976 53003098 21591726
10015 21591726 13474671 47640616 70477865 62597879 51444081 24384733 -9098267
10008 -9098267 -3040031 19858797 30975237 22984379 10353065 -278703 4359065 4357129
$$ packed form
10062A0627621K2115044J0299498l83235l0425275k9636252P30459J2857497j88883
10054d003526k3171785N203645R527046N881505J0703217K6149729o422915k1916080
10046A950836K359472K9023648J5690432k286416Q14558L541213q834691j4543890
10038B7715162p248919j1451021p04708J898615o292739k0354372J617318J0433829
10030d386835P255675n654957l860380K482635J4528117J4819827J2191751J1719943
10022D9095776r723436j4529325n099904J873701K1170164J0216122l1411372
10015B1591726q117055L4165945K2837249p879986j1153798k7059348l3483000
10008i098267O058236K2898828J1116440p990858j2631314j0631768M637768j936
$$ plain form
10000 4357129 23234016 36528434 68194151 92994888 77841553 56006579 41809513
9993 41809513 4104211 -30544722 -48059400 -39307228 -16267230 1977824 1519995 -12682330
9985 -12682330 -23204299 -25264931 -26555041 -49722060 -54579759 -28750690 -18855008 -18646825
9977 -18646825 -17577997 -25511077 -37816453 -41331261 -32363095 -3818233 23553773 46635425
9969 46635425 75509710 67672095 32489898 20219591 25000157 32931464 37800225 30023445
9961 30023445 19260224 314820 -13893949 -5335852 -1994506 -6747614 12918530 16961065
9953 16961065 13447169 -8298447 -20101187 -28620190 -28116730 -11483590 -12049625 -11732067
9945 -11732067 6249795 103619 6143025 23667042 37233101 59650777 60056543 33339585
$$ packed form
10000D357129J8876887J3294418L1665717K4800737j5153335k1834974j4197066
9993D1809513l7705302l4648933j7514678Q752172K3039998J8245054m57829j4202325
9985a2682330j0521969k060632j290110k3167019m857699K5829069R895682K08183
9977a8646825J068828p933080j2305376l514808Q968166K8544862K7372006K3081652
9969D6635425K8874285p837615l5182197j2270307M780566P931307M868761p776780
9961C0023445j0763221j8945404j4208769Q558097L341346m753108J9666144M042535
9953A6961065l513896k1745616j1802740q519003N03460J6633140n66035L17558
9945a1732067J7981862o146176O039406J7524017J3566059K2417676M05766k6716958
$$ plain form
9937 33339585 6788453 -25492759 -35957712 -20396463 8277181 22605343 857092
9930 857092 -27674481 -46889535 -58470532 -41063581 -23017277 -18818202 -9149357 -2942335
9922 -2942335 989387 8371479 18608060 22354140 12027001 -10891703 -28337981 -35841449
9914 -35841449 -38402057 -44185956 -58616902 -52323558 -25185233 -4333051 2447201 2957862
9906 2957862 -21723304 -32236891 -36404813 -28538512 -25370399 -21615431 -22054607 -26056220
9898 -26056220 -12682144 13109267 32690194 35358620 18616481 23022671 20344374 21393814
9890 21393814 28773913 28267221 23373077 35162276 48850315 45929669 27441099 767535
9882 767535 -3737006 8473681 14216683 8552429 -10272217 -29284457 -15691311 5212839
$$ packed form
9937C3339585k6551132l2281212j0464953J5561249K8673644J4328162k1748251
9930H57092k8531573j9215054j1580997J7406951J8046304M199075R668845O207022
9922b942335L931722P382092J0236581L746080j0327139k2918704j7446278p503468
9914c5841449k560608n783899j4430946O293344K7138325K0852182O780252N10661
9906B957862k4681166j0513587m167922P866301L168113L754968m39176m001613
9898b6056220J3374076K5791411J9580927K668426j6742139M406190k678297J049440
9890B1393814P380099n06692m894144J1789199J3688039k920646j8488570k6673564
9882G67535m504541J2210687N743002n664254j8824646j9012240J3593146K0904150
$$ plain form
9874 5212839 10141595 -3325950 -14256218 -11446074 -5419127 3412312 10067115 22717052
9866 22717052 32438435 14805993 -14562217 -23363130 -15492713 -1566398 -796331 8960856
9858 8960856 24122691 31676093 19017509 -16534682 -34757797 -34694943 -40693866 -30546995
9850 -30546995 -14185512 -20969423 -38204939 -26496765 -15245131 3916022 20611930
9843 20611930 4407002 -13401940 -10799815 -10136486 -23527569 -34119426 -15984251 7765816
9835 7765816 1835994 -9216964 -2661743 -10127578 -41160176 -53003102 -56525627 -57592971
9827 -57592971 -64505831 -58413562 -34022557 -6151483 -11417524 -32429657 -56048049 -55421413
9819 -55421413 -60615111 -58281283 -65643531 -55279406 -59174143 -70859878 -65947083 -55664899
$$ packed form
9874E212839M928756j3467545j0930268K810144O026947Q831439O654803J2649937
9866B2717052R721383j7632442k9368210q800913P870417J3926315P70067R757187
9858H960856J5161835P553402j2658584l5552191j8223115O2854n998923J0146871
9850c0546995J6361483o783911j7235516J1708174J1251634J9161153J6695908
9843B0611930j6204928j7808942K602125O63329j3391083j0591857J8135175K3750067
9835G765816n929822j1052958O555221p465835l1032598j1842926l522525j067344
9827e7592971o912860O092269K4391005K7871074n266041k1012133k3618392O26636
9819e5421413n193698K333828p362248J0364125l894737j1685735M912795J0282184
$$ plain form
9811 -55664899 -22992500 -17624669 -15623118 -6105127 -13268032 -31705009 -14862934 3763129
9803 3763129 7717507 15320029 14247539 16377009 18085332 9283085 25810065 47959571
9795 47959571 51019690 33599135 20695073 24009644 24766948 8961945 -1904637 154123
9787 154123 2116222 11289396 -6111272 -19645483 -10754372 -2516771 2596739 5221851
9779 5221851 11989047 27699881 13461358 -1578230 116460 167927 -5620152 -13524258
9771 -13524258 -13998268 -29415418 -40607749 -44513526 -54738615 -58324998 -36566145 -29988236
9763 -29988236 -33936416 -8232169 25674612 39844600 17219830 -14957974 -2604198
9756 -2604198 -1184630 174603 3613386 6619060 11897886 -9091737 -18091752 -23391328
$$ packed form
9811e5664899L2672399N367831K001551R517991p162905j8436977J6842075J8626063
9803C763129L954378P602522j072490K129470J708323q802247J6526980K2149506
9795D7959571L060119j7420555j2904062L314571P57304j5805003j0866582K058760
9787A54123J962099R173174j7400668j3534211Q891111Q237601N113510K625112
9779E221851O767196J5710834j4238523j5039588J694690N1467n788079p904106
9771a3524258m74010j5417150j1192331l905777j0225089l586383K1758853O577909
9763b9988236l948180K5704247L3906781J4169988k2624770l2177804J2353776
9756b604198J419568J359233L438783L005674N278826k0989623r000015n299576
$$ plain form
9748 -23391328 -16682942 13051092 18027326 -1050792 -25888576 -28992716 -24761822 -25709714
9740 -25709714 -19185342 -13657266 -5075986 -10352158 -18041931 -22553096 -27497746 -35356821
9732 -35356821 -45235969 -55593762 -44087536 -39918165 -34445166 -18964074 13701653 43400562
9724 43400562 17504503 -15623868 -9404170 9189388 -1836249 -3796590 -2171936 4027180
9716 4027180 9947783 10638400 17986486 -4001500 -19071629 -17902766 -34878115 -19635359
9708 -19635359 -10070556 -8195894 -5782901 -4685993 -13183799 -20287213 -29679564 -26340487
9700 -26340487 -14428151 -9134740 -16560175 -24794685 -18941540 -6583704 -142257 22600111
9692 22600111 33889234 18365840 -6393737 -30500130 -33464862 -36232604 -19691169
$$ packed form
9748b3391328O708386K9734034M976234j9078118k4837784l104140M230894r47892
9740b5709714O524372N528076Q581280n276172p689773m511165m944650p859075
9732c5356821r879148j0357793J1506226M169371N472999J5481092L2665727K9698909
9724D3400562k5896059l3128371O219698J8593558j1025637j960341J624654O199116
9716D027180N920603O90617P348086k1987986j5070129J168863j6975349J5242756
9708a9635359R564803J874662K412993J096908q497806p103414r392351L339077
9700b6340487J1912336N293411p425435q234510N853145J2357836O441447K2742368
9692B2600111J1289123j5523394k4759577k4106393k964732k767742J6541435
$$ plain form
9685 -19691169 -12769295 -8726803 -5999920 16487058 14578417 14398329 15650962 18280470
9677 18280470 40530590 49007126 51283575 53381939 48499082 20064146 6793610 21296428
9669 21296428 31226032 14084378 6801838 -9908896 -30132854 -34626818 -22396245 -11149000
9661 -11149000 -30710071 -39254995 -31586300 -18502489 -18067227 -17462756 -19708626 -15735303
9653 -15735303 -22660299 -22210597 -17253041 -19008411 -17315343 -3598657 6720677 14412266
9645 14412266 10093192 -1678002 -603354 -3677131 -13895230 -18532049 -9675639 2867932
9637 2867932 -10491926 -32099061 -41842275 -23801799 6691110 10668918 -9100555 -35398032
9629 -35398032 -29223512 -18140599 -14501488 -23684519 -17155754 2900379 -8367551 -25299345
$$ packed form
9685a9691169O921874M042492K726883K2486978j908641j80088J252633K629508
9677A8280470K2250120Q476536K276449K098364m882857k8434936j3270536J4502818
9669B1296428R929604j7141654p282540j6710734k0223958m493964J2230573J1247245
9661a1149000j9561071q544924P668695J3083811M35262O04471k245870L973323
9653a5735303o924996M49702M957556j755370J693068J3716686J0319334P691589
9645A4412266m319074j1771194J074648l073777j0218099m636819Q856410J2543571
9637B867932j3359858k1607135r743214J8040476L0492909L977808j9769473k6297477
9629c5398032O174520J1082913L639111r183031O528765K0056133j1267930j6931794
$$ plain form
9621 -25299345 -14572956 -215940 16688686 44950270 32149122 7077463 5626989
9614 5626989 10398784 3712972 -7686437 410986 8716065 12175127 15891897 10109198
9606 10109198 11675557 1941944 -13011583 -13496843 -12332487 -4396170 20183132 34780452
9598 34780452 12180225 6765491 -1485112 -15707082 4768362 24806315 16258878 -6349736
9590 -6349736 -5538004 13639560 33320824 25784285 36331525 33572886 7555900 -3701794
9582 -3701794 9773232 15903691 17506894 124893 4451538 28784819 20626707 -16216231
9574 -16216231 -40498941 -36542160 -10905646 5560058 20152823 25413521 36196694
9567 36196694 19737120 22490122 38236711 32426586 36309400 24443468 9305359 -5135723
$$ packed form
9621b5299345J0726389J4357016J6904626K8261584j2801148k5071659j450474
9614E626989M771795o685812j1399409Q097423Q305079L459062L716770n782699
9606A0109198J566359r733613j4953527m85260J164356P936317K4579302J4597320
9598C4780452k2600227n414734q250603j4221970K0475444K0037953q547437k2608614
9590f349736Q11732J9177564J9681264p536539J0547240k758639k6016986j1257694
9582c701794J3475026O130459J603203j7382001M326645K4333281q158112l6842938
9574a6216231k4282710L956781K5636514J6465704J4592765N260698J0783173
9567C6196694j6459574K753002J5746589n810125L882814j1865932j5138109j4441082
$$ plain form
9559 -5135723 -20568180 -24071462 -11646351 -15699089 -23748799 -14192404 9846620 7752028
9551 7752028 10465714 6424659 21685185 16298259 -9619054 -1601298 -2479373 7153664
9543 7153664 5868789 -26747982 -41309729 -31563520 -14664734 -17583180 -29346375 10625009
9535 10625009 64765538 63520763 19908263 2563518 5839026 502388 -325627 13440380
9527 13440380 8141834 -2762696 4411829 1964824 -13443855 -7780247 2758740 -20631404
9519 -20631404 -30271574 -16079106 20982077 55043582 58723771 51396067 49970346 48581527
9511 48581527 62767555 68260129 51721934 5663789 -13715720 7835261 12016851
9504 12016851 11182794 14024678 6755176 12374966 34825574 23946009 21384796 46289107
$$ packed form
9559e135723j5432457l503282J2425111m052738q049710R556395K4039024k094592
9551G752028K713686m041055J5260526n386926k5917313Q017756q78075R633037
9543G153664j284875l2616771j4561747R746209J6898786k918446j1763195L9971384
9535A0625009N4140529j244775m3612500j7344745L275508n336638q28015J3766007
9527A3440380n298546j0904530P174525k447005j5408679N663608J0538987k3390144
9519b0631404r640170J4192468L7061183L4061505L680189p327704j425721j388819
9511D8581527J4186028N492574j6538195m6058145j9379509K1550981M181590
9504A2016851q34057K841884p269502N619790K2450608j0879565k561213K4904311
$$ plain form
9496 46289107 31596404 -11226798 -32411826 -16358523 11685184 28038872 34851586
9489 34851586 27616222 29648675 41661793 33173060 33974716 30282825 14092893 25110660
9481 25110660 44414018 59364360 57127129 42934291 11471096 6115660 1556758 1178510
9473 1178510 25409229 35647691 34997663 34034848 44942476 31682133 36440769 79609967
9465 79609967 100326314 114409465 130015161 154770208 146422939 126030970 144105483
9458 144105483 166082465 148365767 124983441 115003110 142740575 176574222 181605450
9451 181605450 176571349 180518325 168988679 163800837 163363561 167614896 182430163 208651784
9443 208651784 232641404 268838693 307474859 326897636 345145294 378324815 411797218
$$ packed form
9496D6289107j4692703m2823202k1185028J6053303K8043707J6353688O812714
9489C4851586p235364K032453J2013118q488733Q01656l691891j6189932J1017767
9481B5110660J9303358J4950342k237231j4192838l1463195n355436m558902l78248
9473A178510K4230719J0238462o50028r62815J0907628j3260343M758636M3169198
9465G9609967K0716347J4083151J5605696K4755047q347269k0391969J8074513
9458A44105483K1976982j7716698k3382326r980331K7737465L3833647N031228
9451A81605450n034101L946976j1529646n187842m37276M251335J4815267K6221621
9443B08651784K3989620L6197289L8636166J9422777J8247658L3179521L3472403
$$ plain form
9436 411797218 399528478 368251993 351845438 333054520 296279102 260236623 233299004
9429 233299004 227903531 233791209 240123923 250614970 253309576 237705087 224081483 235338488
9421 235338488 266788449 309979199 343621263 366863266 388126030 409426490 430564949
9414 430564949 405835405 346845295 297290670 287510145 286976756 273521407 264535117 233884583
9406 233884583 203816907 174989030 177679547 184932039 191612158 204307125 204769171 211222682
9398 211222682 233643741 245721138 229032265 198322072 180841989 175187288 172930260
9391 172930260 139862686 92179220 68368831 101258567 100463663 72163620 70910759
9384 70910759 99511953 107714417 90603057 70697294 68247829 82871755 89735973 87368416
$$ packed form
9436D11797218j2268740l1276485j6406555j8790918l6775418l6042479k6937619
9429B33299004n395473N887678O332714J0491047K694606j5604489j3623604J1257005
9421B35338488L1449961M3190750L3642064K3242003K1262764K1300460K1138459
9414D30564949k4729544n8990110m9554625r780525n33389j3455349q986290l0650534
9406B33884583l0067676k8827877K690517P252492O680119J2694967M62046O453511
9398B11222682K2421059J2077397j6688873l0710193j7480083n654701k257028
9391A72930260l3067574m7683466k3810389L2889736p94904k8300043j252861
9384G0910759K8601194Q202464j7111360j9905763k449465J4623926O864218k367557
$$ plain form
9376 87368416 79949208 60655011 64697517 58074484 36248978 23654114 48000258 51058990
9368 51058990 28544515 17430625 41527194 63581336 81765489 101736753 94953820
9361 94953820 68366460 36493950 7122130 9428830 28230061 41145114 55781473
9354 55781473 63297872 53313067 38928520 8953063 3787379 23771798 51260784 51275338
9346 51275338 20483615 3212360 5437267 11575630 27685395 51871116 62108299
9339 62108299 61657153 28104390 2115607 -6235530 -20836598 -27464290 -17786998 -28867
9331 -28867 28886725 53587000 65696866 46065884 20196871 21780102 15047213 -16162318
9323 -16162318 -1517971 5977499 2420688 18678586 47160154 58912699 62101069 62347842
$$ packed form
9376H7368416p419208j9294197M042506o623033k1825506j2594864K4346144L058732
9368E1058990k2514475j1113890K4096569K2054142J8184153J9971264o782933
9361I4953820k6587360l1872510k9371820K306700J8801231J2915053J4636359
9354E5781473P516399r984805j4384547k9975457n165684J9984419K7488986J4554
9346E1275338l0791723j7271255K224907O138363J6109765K4185721J0237183
9339F2108299m51146l3552763k5988783q351137j4601068o627692R677292J7758131
9331b8867K8915592K4700275J2109866j9630982k5869013J583231o732889l1209531
9323a6162318J4644347P495470l556811J6257898K8481568J1752545L188370K46773
$$ plain form
9315 62347842 60847411 56692392 50533163 48117359 37497290 21544336 16775647 17972393
9307 17972393 21522963 13918756 9480481 37887320 68763924 53672070 33934013 32021167
9299 32021167 23975841 2071201 -1847767 9713599 2681883 -32280839 -33542284 13088615
9291 13088615 26528096 -3513094 -24593294 -27491459 -13392306 -10071578 -21450891
9284 -21450891 -20615802 -12518982 -3138406 724531 5723031 -749049 1261460 -2073857
9276 -2073857 -722963 -6080462 -12795684 854182 3157442 -1742705 -9686948 -2082398
9268 -2082398 20203327 25741498 13574482 12986414 -1495303 -14518221 -18859790 -21233076
9260 -21233076 -35816097 -54613351 -58678592 -50063843 -33332596 -2972242 3008609 -16212500
$$ packed form
9315F2347842j500431m155019o159229k415804j0620069j5952954m768689J196746
9307A7972393L550570p604207m438275K8406839L0876604j5091854j9738057j912846
9299C2021167q045326k1904640l918968J1561366p031716l4962722j261445M6630899
9291A3088615J3439481l0041190k1080200k898165J4099153L320728j1379313
9284b1450891Q35089Q096820R380576L862937M998500o472080K010509l335317
9276b073857J350894n357499o715222J3649866K303260m900147p944243P604550
9268b082398K2285725N538171j2167016n88068j4481717j3022918m341569k373286
9260b1233076j4583021j8797254m065241Q614749J6731247L0360354N980851j9221109
$$ plain form
9252 -16212500 -38329192 -53812040 -42915833 -15031384 8815625 34109646 51861319
9245 51861319 55015649 50862780 41725620 11764517 -16237486 -32589331 -13051775 -145653
9237 -145653 22515770 37191394 22356497 941594 -5847978 -17786524 -16763686 3753986
9229 3753986 2843413 -31356415 -50974014 -43515122 -40214456 -31601244 -29280889 -30094542
9221 -30094542 -36123438 -35596719 -22790021 -18071956 -30455107 -14059847 7700621 5943284
9213 5943284 7444186 8639762 -20793933 -45226194 -34890410 -225260 19697780 9401674
9205 9401674 2512803 17295223 23229955 15927683 4709048 -15506810 -14960034 -6915482
9197 -6915482 -15312518 -18912689 -16447248 -6761760 3423702 -3978042 6528679 31830033
$$ packed form
9252a6212500k2116692j5482848J0896207K7884449K3847009K5294021J7751673
9245E1861319L154330m152869r137160k9961103k8002003j6351845J9537556J2906122
9237a45653K2661423J4675624j4834897k1414903o789572j1938546J022838K0517672
9229C753986r10573l4199828j9617599P458892L300666Q613212K320355q13653
9221c0094542o028896N26719J2806698M718065j2383151J6395260K1760468j757337
9213E943284J500902J195576k9433695k4432261J0335784L4665150J9923040j0296106
9205I401674o888871J4782420N934732p302272j1218635k0215858N46776Q044552
9197f915482q397036l600171K465441R685488J0185462p401744J0506721K5301354
$$ plain form
9189 31830033 58143782 56156868 25725151 15586518 33636018 26459723 -7532597
9182 -7532597 -33081614 -42270644 -30918930 -29708399 -12296275 -3395788 -10533477 -22422616
9174 -22422616 -32052107 -34654062 -40868407 -48861089 -43711337 -34869874 -28631728 -19182772
9166 -19182772 -9648790 -25292571 -7173207 27835130 36020029 19479435 -892391
9159 -892391 -10145395 -18061151 -10784170 9017001 26539965 31616143 31255333 4390983
9151 4390983 -23960225 -38928517 -50844565 -41370912 -11700226 2971051 -8884254
9144 -8884254 -27158446 -18229636 1002504 14345028 2229877 -11700162 -5574238 -2596110
9136 -2596110 -7597342 -2024691 14372971 13517135 2287185 17703459 11043879 7456402
$$ packed form
9189C1830033K6313749j986914l0431717j0138633J8049500p176295l3992320
9182g532597k5549017r189030J1351714J210531J7412124Q900487p137689j1889139
9174b2422616r629491k601955o214345p992682N149752Q841463O238146R448956
9166a9182772R533982j5643781J8119364L5008337Q184899j6540594k0371826
9159h92391r253004p915756P276981J9801171J7522964N076178l60810k6864350
9151D390983k8351208j4968292j1916048R473653K9670686J4671277j1855305
9144h884254j8274192Q928810J9232140J3342524j2115151j3930039O125924K978128
9136b596110n001232N572651J6397662q55836j1229950J5416274o659580l587477
$$ plain form
9128 7456402 3725732 26201412 36589262 5854027 -30432592 -36398269 -12457025 22594227
9120 22594227 39241419 27514110 -42433 -8223339 -24594406 -34262847 -26761672 -11803580
9112 -11803580 11607502 10125134 -14728806 -13640504 13579210 23386264 -5162573 -8844656
9104 -8844656 14726763 8333099 -768626 -4542357 9559065 25540323 7601849 -15958714
9096 -15958714 -15245539 50204 -467820 -17622761 -30530473 -33903095 -11388641 13997134
9088 13997134 25208894 58319376 89650866 73354887 64810191 81216152 64425173
9081 64425173 24477858 -387389 302598 32867281 63239543 58497078 48875957 52812993
9073 52812993 28335025 -13157738 -23031486 -820654 35562613 44154866 33660874
$$ packed form
9128G456402l730670K2475680J0387850l0735235l6286619n965677K3941244L5051252
9120B2594227J6647192j1727309k7556543q180906j6371067r668441P501175J4958092
9112a1803580K3411082j482368k4853940J088302K7219714R807054k8548837l682083
9104h844656K3571419o393664r101725l773731J4101422J5981258j7938474k3560563
9096a5958714P13175J5295743n18024j7154941j2907712l372622K2514454K5385775
9088A3997134J1211760L3110482L1331490j6295979q544696J6405961j6790979
9081F4425173l9947315k4865247O89987L2564683L0372262m742465r621121L937036
9073E2812993k4477968m1492763r873748K2210832L6383267Q592253j0493992
$$ plain form
9066 33660874 21093561 13820481 2751990 10066311 13094135 18871821 35769032 31360746
9058 31360746 10517226 -4915970 -1450636 3956934 24848094 40230453 31314781 19887232
9050 19887232 17240752 22962984 9039742 -14577685 -4652471 20608647 17157479 924564
9042 924564 24567971 63172713 49008873 26452667 2682385 -10979278 -15180062 -23115859
9034 -23115859 -26971636 -32412967 -32122492 -19238484 -840118 17323145 30128348 17716121
9026 17716121 4355874 -18342398 -32107579 -23189169 -15935053 -18858583 -11152723 -10238313
9018 -10238313 -21412031 -43232436 -49726598 -41052541 -28639118 -24525463 -5415082 1905245
9010 1905245 -2912213 -33043049 -31612903 1437925 31326475 25468833 5192619 9549185
$$ packed form
9066C3660874j2567313p273080j1068491P314321L027824N777686J6897211m408286
9058C1360746k0843520j5433196L465334N407570K0891160J5382359q915672j1427549
9050A9887232k646480N722232j3923242k3617427R925214K5261118l451168j6232915
9042I24564K3643407L8604742j4163840k2556206k3770282j3661663m200784p935797
9034b3115859l855777n441331K90475J2884008J8398366J8163263J2805203j2412227
9026A7716121j3360247k2698272j3765181Q918410P254116k923530P705860R14410
9018a0238313j1173718k1820405o494162Q674057J2413423M113655J9110381P320327
9010A905245m817458l0130836J430146L3050828K9888550n857642k0276214M356566
$$ plain form
9002 9549185 22591391 7261284 -12306414 15568696 46362155 46392496 35099267 10513638
8994 10513638 -1690348 6493383 19457410 37982642 57547191 49547790 21605680
8987 21605680 4329948 -8360826 -12517769 -5347129 -6926290 5386395 9627529 612574
8979 612574 1340258 -4980239 6092665 43124685 72355257 65566012 44440951 32208957
8971 32208957 42602785 46901131 32565140 17063648 15330659 18830566 23122922 19611653
8963 19611653 14709170 1739034 6262095 17459661 10616084 8490317 9013355 -611714
8955 -611714 -18966193 -16335436 -676423 11181676 10463580 15394376 18318402 6779835
8947 6779835 3889126 -4658006 -34782563 -41653978 -28581797 -13432966 -1019936 -7293587
$$ packed form
9002I549185J3042206j5330107j9567698K7875110L0793459L0341j1293229k4585629
8994A0513638j2203986Q183731J2964027J8525232J9564549p999401k7942110
8987B1605680j7275732j2690774m156943P170640j579161J2312685M241134r014955
8979F12574P27684o320497J1072904L7032020K9230572o789245k1125061j2231994
8971C2208957J0393828M298346j4335991j5501492j732989L499907M292356l511269
8963A9611653m902483j2970136M523061J1197566o843577k125767N23038r625069
8955f11714j8354479K630757J5659013J1858099p18096M930796K924026j1538567
8947F779835k890709q547132l0124557o871415J3072181J5148831J2413030o273651
$$ plain form
8939 -7293587 396230 4309773 19808171 22657061 17223956 -5875500 -28791842 -26972509
8931 -26972509 -5007341 -1387210 -1888293 -37216135 -73196392 -65573190 -52165768 -43973709
8923 -43973709 -34122964 -26555044 -26200003 -15992283 -16469260 -31467347 -38606022 -44274250
8915 -44274250 -25501134 -4614909 6020274 2760787 -2168820 4770540 11149689 10678707
8907 10678707 -8727604 -26471046 -48372277 -42451733 -25599934 -1117791 23770870
8900 23770870 6458130 -15342862 -11661488 13377406 30493177 46071846 50346692
8893 50346692 49238459 47272347 15726868 -16581465 -32422742 -22867691 -12898606 -1808151
8885 -1808151 8913717 12185766 15605752 19870995 6863780 -19412962 -29812556 -25768293
$$ packed form
8939g293587P689817L913543J5498398K848890n433105k3099456k2916342J819333
8931b6972509K1965168L620131n01083l5327842l5980257P623202J3407422Q192059
8923d3973709R850745P567920L55041J0207720m76977j4998087p138675n668228
8915d4274250J8773116K0886225J0635183l259487m929607O939360O379149m70982
8907A0678707j9406311j7743442k1901231N920544J6851799K4482143K4888661
8900B3770870j7312740k1800992L681374K5038894J7115771J5578669M274846
8893E0346692j108233j966112l1545479l2308333j5841277R555051R969085J1090455
8885a808151J0721868L272049L419986M265243j3007215k6276742j0399594M044263
$$ plain form
8877 -25768293 -11152885 -11695238 -10455024 -1349313 2550968 6000013 18523324 6563749
8869 6563749 2700101 -4932156 -19502538 -23691262 -12454520 12818319 27537191 22306608
8861 22306608 13593441 11521887 -5128295 -24181962 -32161587 -40201731 -33452093 -12639129
8853 -12639129 6840909 10710195 266517 -6131234 -18867385 -29586748 -4779912
8846 -4779912 9331944 9140621 -8817056 -6713829 20480953 25450528 -281099 -5052459
8838 -5052459 23226277 38610622 37524129 24782911 18583887 14714461 -3092374 -9108725
8830 -9108725 4985439 -114658 -14156549 -33324287 -37826912 -27652116 -29783383 -31367166
8822 -31367166 -21054427 -16179678 -33199874 -23943778 -1622612 1757234 -20375386 -22181416
$$ packed form
8877b5768293J4615408n42353J240214R105711L900281L449045J2523311j1959575
8869F563749l863648p632257j4570382m188724J1236742K5272839J4718872n230583
8861B2306608q713167k071554j6650182j9053667p979625q040144O749638K0812964
8853a2639129J9480038L869286j0443678o397751j2736151j0719363K4806836
8846d779912J4111856j91323j7957677K103227K7194782M969575k5731627m771360
8838e052459K8278736J5384345j086493j2741218o199024l869426j7806835o016351
8830i108725J4094164n100097j4041891j9167738m502625J0174796k131267j583783
8822c1367166J0312739M874749j7020196R256096K2321166L379846k2132620j806030
$$ plain form
8814 -22181416 10608160 19019455 4891852 -3350291 40488610 60810547 45402052
8807 45402052 19016290 2849440 3528824 -4365525 -19212794 -909331 33529136 29623920
8799 29623920 4550726 -28732864 -26686429 -17628971 -24118933 -22413497 -22498444 -4889311
8791 -4889311 -2389791 4689729 13526596 4106835 16852812 15346505 -758330 -4160556
8783 -4160556 -5744130 7092635 4473965 8360923 24626934 34832119 26712597 -1003513
8775 -1003513 -6690946 6659726 13408652 18038222 7009262 4663106 4396407 5892078
8767 5892078 -14265296 -32900471 -29419685 -9669583 24661262 37426862 37028637 32016016
8759 32016016 18376068 34695377 42357811 51836972 41180574 29875844 37926082 29240800
$$ packed form
8814b2181416L2789576Q411295j4127603q242143M3838901K0321937j5408495
8807D5402052k6385762j6166850O79384p894349j4847269J8303463L4438467l905216
8799B9623920k5073194l3283590K046435R057458o489962J705436q4947J7609133
8791d889311K499520P079520Q836867r419761J2745977j506307j6104835l402226
8783d160556j583574J2836765k618670L886958J6266011J0205185q119522k7716110
8775a003513n687433J3350672O748926M629570j1028960k346156k66699J495671
8767E892078k0157374j8635175L480786J9750102L4330845J2765600l98225n012621
8759C2016016j3639948J6319309P662434R479161j0656398j1304730Q050238q685282
$$ plain form
8751 29240800 26245637 31152294 35833406 29373621 54049423 61363254 47194686 41737785
8743 41737785 54628072 78464018 103784888 97814114 122597849 153649474 155738469
8736 155738469 163778915 202325688 221532398 218657858 236956082 253273018 233724911
8729 233724911 215018862 200147353 202246603 230972385 257527865 263437528 267109883
8722 267109883 253440113 253191728 234745313 235263462 286166685 331277536 391810933 423796224
8714 423796224 443160414 466663752 461444283 441716504 443993593 430714841 396572021
8707 396572021 362635864 336931371 338041279 330327428 318013666 324778732 301228708
8700 301228708 270310144 238284621 223539146 212592071 202854248 204356651 228945219
$$ packed form
8751B9240800k995163M906657M681112o459785K4675802P313831j4168568n456901
8743D1737785J2890287K3835946K5320870n970774K4783735L1051625K088995
8736A55738469Q040446L8546773J9206710k874540J8298224J6316936j9548107
8729B33724911j8706049j4871509K099250K8725782K6555480N909663L672355
8722B67109883j3669770k48385j8446415N18149N0903223M5110851O0533397L1985291
8714D23796224J9364190K3503338n219469j9727779K277089j3278752l4142820
8707C96572021l3936157k5704493J109908p713851j2313762O765066k3550024
8700C01228708l0918564l2025523j4745475j0947075r737823J502403K4588568
$$ plain form
8693 228945219 207564884 192465795 194333032 181803998 147755890 99163722 75974213
8686 75974213 78525604 68297641 46189040 39734646 58469452 70709606 53993847
8679 53993847 46840457 59092208 55469570 29974735 22669406 36390345 55114535 53533088
8671 53533088 50030389 28835321 10583593 11587421 23839988 35875459 18056150
8664 18056150 4408228 30055372 30144587 12868959 -4187928 -25267624 -30150087 -16509583
8656 -16509583 -10749156 -8369393 15613968 22318987 7942128 1875008 12644491 889886
8648 889886 -25331992 -35037700 -13133093 710373 -11320881 -22130505 -21645820 -12216597
8640 -12216597 -6056535 -5731856 -1109367 9838319 23302044 31625091 35967757 33281257
$$ packed form
8693B28945219k1380335j5099089J867237j2529034l4048108m8592168k3189509
8686G5974213K551391j0227963k2108601o454394J8734806J2240154j6715759
8679E3993847p153390J2251751l622638k5494835p305329J3720939J8724190j581447
8671E3533088l502699k1195068j8251728J003828J2252567J2035471j7819309
8664A8056150j3647922K5647144Q9215j7275628j7056887k1079696m882463J3640504
8656a6509583N760427K379763K3983361O705019j4376859o067120J0769483j1754605
8648H89886k6221878r705708K1904607J3843466j2031254j0809624M84685R429223
8640a2216597O160062L24679M622489J0947686J3463725Q323047M342666k686500
$$ plain form
8632 33281257 13476672 -10782108 -29735617 -26592911 -16210522 -27367154 -34138960
8625 -34138960 -20121971 -3197203 -7005571 -34847509 -45490389 -24195028 20463506
8618 20463506 46263371 39890146 23957275 -2957916 -8747037 -16390087 -27268797 -37072089
8610 -37072089 -44496509 -30685773 -14082407 2336691 5505712 9888732 21027611 6162796
8602 6162796 -13975952 -5922704 -3579917 -8734483 -20032195 -44390870 -58126873 -58025149
8594 -58025149 -38973556 -41818063 -46698899 -47870070 -34414066 -7914742 -3712151 -14670001
8586 -14670001 -48363006 -69322478 -57298603 -38450828 -11664271 14588870 5336179
8579 5336179 -40816948 -64117648 -61100733 -49345406 -27298520 -12244581 -20832532 -26682384
$$ packed form
8632C3281257j9804585k4258780j8953509L142706J0382389j1156632o771806
8625c4138960J4016989J6924768l808368k7841938j0642880K1295361M4658534
8618B0463506K5799865o373225j5932871k6915191n789121p643050j0878710r803292
8610c7072089p424420J3810736J6603366J6419098L169021M383020J1138879j4864815
8602F162796k0138748Q053248K342787n154566j1297712k4358675j3736003J01724
8594e8025149J9051593k844507m880836j171171J3456004K6499324M202591j0957850
8586a4670001l3693005k0959472J2023875J8847775K6786557K6253141r252691
8579E336179m6153127k3300700L016915J1755327K2046886J5053939q587951n849852
$$ plain form
8571 -26682384 -6556714 18746556 16195576 -10662863 -25130638 -21115395 -21856076 -12527579
8563 -12527579 518250 -13328851 -18162185 -14834382 -11553085 -24429631 -20909788 6331222
8555 6331222 24802377 30363678 19553262 35510909 32514471 8621038 4323703 14882658
8547 14882658 22239774 45665535 63724367 77212656 44709980 33913535 47889803
8540 47889803 31842181 18722412 32162613 25240961 16582064 -1832469 -13111417
8533 -13111417 -10781296 -14392178 -17909018 -20035519 -34122958 -51481176 -37966828 -18506985
8525 -18506985 7945595 24282727 33672807 56872431 54583572 29297892 14587371
8518 14587371 19884628 21234031 3495015 -12781474 1235505 2633287 -14053120 -45455748
$$ packed form
8571b6682384K0125670K5303270k550980k6858439j4467775M015243p40681R328497
8563a2527579J3045829j3847101m833334L327803L281297j2876546L519843K7241010
8555F331222J8471155N561301j0810416J5957647k996438k3893433m297335J0558955
8547A4882658P357116K3425761J8058832J3488289l2502676j0796445J3976268
8540D7889803j6047622j3119769J3440201o921652q658897j8414533j1278948
8533a3111417K330121l610882l516840k126501j4087439j7358218J3514348J9459843
8525a8506985K6452580J6337132R390080K3199624k288859k5285680j4710521
8518A4587371N297257J349403j7739016j6276489J4016979J397782j6686407l1402628
$$ plain form
8510 -45455748 -54753532 -55370674 -58302495 -48729434 -1335097 22802267 22265010 24625802
8502 24625802 18439154 15196743 15909047 31746834 24738522 2126399 -20527808 -29033376
8494 -29033376 -39486091 -58722195 -61945552 -73744483 -70755293 -59566687 -62225713 -50527969
8486 -50527969 -20471896 2347121 -2071965 -3586365 -2401072 -1067789 -8012730 -15953619
8478 -15953619 -11001608 -6264621 10906203 24624282 14907181 12036542 212061 -9500767
8470 -9500767 -603900 17071344 -9568738 -30725222 -16781243 -22830801 -37908348 -15872330
8462 -15872330 18018089 36933282 37452425 30778042 17834757 -7781531 -7998000 1748074
8454 1748074 -438933 -29426895 -53953394 -40088613 -4885212 29860064 37648474 24689504
$$ packed form
8510d5455748r297784o17142k931821R573061M7394337K4137364n37257K360792
8502B4625802o186648l242411P12304J5837787p008312k2612123k2654207q505568
8494b9033376j0452715j9236104l223357j1798931K989190J1188606k659026J1697744
8486e0527969L0056073K2819017m419086j514400J185293J333283o944941p940889
8478a5953619M952011M736987J7170824J3718079r717101k870639j1824481r712828
8470i500767Q896867J7675244k6640082k1156484J3943979o049558j5077547K2036018
8462a5872330L3890419J8915193N19143o674383j2943285k5616288k16469R746074
8454A748074k187007k8987962k4526499J3864781L5203401L4745276P788410j2958970
$$ plain form
8446 24689504 14174062 17115917 16893171 -3935590 -24875920 -15682148 9492318 38740419
8438 38740419 56317914 59056730 38595383 14226559 -1040823 8778092 20220394
8431 20220394 9583439 1547537 24184504 47516384 42032159 38928065 45293630 29378200
8423 29378200 -1658489 -24297369 -25158651 -24129560 -19399782 -27497001 -39722991 -30529920
8415 -30529920 -6026098 -6648838 15832264 43729443 47663388 29804862 2733358 901503
8407 901503 -10215331 -30542320 -32697349 -29922147 -35908616 -35748521 -38879288 -15843222
8399 -15843222 -3351992 650347 13071933 5263291 -22415542 -42590535 -33502054 -4509846
8391 -4509846 23028908 47643809 46948707 34474432 34399244 24409912 16536596 27823321
$$ packed form
8446B4689504j0515442K941855k22746k0828761k0940330R193772K5174466K9248101
8438C8740419J7577495K738816k0461347k4368824j5267382R818915J1442302
8431B0220394j0636955q035902K2636967K3331880n484225l104094O365565j5915430
8423B9378200l1036689k2638880q61282J029091M729778q097219j2225990R193071
8415c0529920K4503822o22740K2481102K7897179L933945j7858526k7071504j831855
8407I01503j1116834k0326989k155029K775202n986469J60095l130767K3036066
8399a5843222J2491230M002339J2421586p808642k7678833k0174993R088481K8992208
8391d509846K7538754K4614901o95102j2474275p5188r989332p873316J1286725
$$ plain form
8383 27823321 65515830 92761456 93361111 84973241 64064285 37973401 10050222 4853191
8375 4853191 16449833 37901149 43679547 48297697 30501616 39967654 53981086 56154687
8367 56154687 57897471 27546594 -3931080 -1215563 11762271 20947023 16555801 3681893
8359 3681893 13438924 38158193 25768894 5738571 -441223 16778401 18294173 18388916
8351 18388916 42126036 46009393 16844118 28462386 24332896 4301648 -17717294
8344 -17717294 -38381724 -45636199 -38633929 -23722919 -4996545 3287043 2517339 362810
8336 362810 -18173803 -30370281 -25569941 -14341755 -9853624 5919862 17311907 4592806
8328 4592806 -22417993 -30550948 -39481856 -39216128 -39255361 -31157138 -23822134 -12505043
$$ packed form
8383B7823321L7692509K7245626N99655q387870k0908956k6090884k7923179n197031
8375D853191J1596642K1451316N778398M618150j7796081R466038J4013432K173601
8367E6154687J742784l0350877l1477674K715517J2977834R184752m391222j2873908
8359C681893R757031K4719269j2389299k0030323o179794J7219624J515772R4743
8351A8388916K3737120L883357k9165275J1618268m129490k0031248k2018942
8344a7717294k0664430p254475P002270J4911010J8726374Q283588p69704k154529
8336C62810j8536613j2196478M800340J1228186M488131J5773486J1392045j2719101
8328D592806k7010799q132955q930908K65728l9233Q098223P335004J1317091
$$ plain form
8320 -12505043 3267425 4381927 9670167 31575565 31688713 33338307 32327057 428062
8312 428062 -32012668 -45495416 -35098834 -9263747 12980007 28217344 36293623 34723757
8304 34723757 32004271 36330922 35749482 55982989 74510785 78430054 89511456 105660866
8296 105660866 96955015 60502269 33178667 9480308 6498221 7286073 1155345 -9690924
8288 -9690924 518038 8415370 -421820 -14725420 -17493671 -25420953 -17250446 -10458470
8280 -10458470 -10330259 -14362819 -18890502 -2762121 4583816 -13652205 -3930685 5666076
8272 5666076 -13655347 -22762907 -10339760 -1722522 -17380007 -17671729 -7924443 4739205
8264 4739205 14513995 9627394 3858306 3468153 12516259 1009732 -6208325 -12208954
$$ packed form
8320a2505043J5772468J114502N288240K1905398J13148J649594j011250l1898995
8312D28062l2440730j3482748J0396582K5835087K2243754J5237337Q076279j569866
8304C4723757k719486M326651n81440K0233507J8527796L919269J1081402J6149410
8296A05660866q705851l6452746k7323602k3698359k982087P87852o130728j0846269
8288i690924J0208962P897332q837190j4303600k768251p927282Q170507O791976
8280a0458470J28211m032560m527683J6128381P345937j8236021R721520R596761
8272E666076j9321423r107560J2423147Q617238j5657485k91722R747286J2663648
8264D739205R774790m886601n769088l90153R048106j1506527p218057o000629
$$ plain form
8256 -12208954 -24859015 -13868232 -5633646 -14917730 -19044305 -16367510 -2990855 -1776867
8248 -1776867 -2917234 -17554848 -32916700 -27074872 -7991492 19878606 26467719 24509289
8240 24509289 29568569 33252662 42228737 13415858 -7162901 3213374 10623800 29440882
8232 29440882 56682792 64199743 56655275 29415976 -2609920 -33968794 -51943018
8225 -51943018 -35947102 -38303126 -37837170 -34167135 -40757624 -43909894 -53445917 -59983474
8217 -59983474 -42186538 -11363205 5491886 18210535 20918593 36063737 28242023
8210 28242023 4319028 -19963373 -32491135 -28606849 -41376832 -41925939 -47351745 -41328025
8202 -41328025 -15846932 21306535 23148222 9425156 16148557 35640102 30394093 24827757
$$ packed form
8256a2208954j2650061J0990783Q234586r284084m126575K676795J3376655J213988
8248a776867j140367j4637614j5361852N841828J9083380K7870098O589113j958430
8240B4509289N059280L684093Q976075k8812879k0578759J0376275P410426J8817082
8232B9440882K7241910P516951p544468k7239299l2025896l1358874j7974224
8225e1943018J5995916k356024M65956L670035o590489l152270r536023o537557
8217e9983474J7796936L0823333J6855091J2718649K708058J5145144p821714
8210B8242023k3922995k4282401j2527762L884286j2769983n49107n425806O023720
8202d1328025K5481093L7153467J841687j3723066O723401J9491545n246009n566336
$$ plain form
8194 24827757 19781090 23052069 26829993 28661556 19939594 27600340 21913565 -1211680
8186 -1211680 -15871833 -21159939 -8474845 -3729782 589883 1182172 -6876113 -7200289
8178 -7200289 -33047773 -43716348 -30756951 -16546451 3239764 -4354363 -16543227
8171 -16543227 -13747092 -5208248 -19172424 -23473829 -13224005 -5494234 -7183414 -26998251
8163 -26998251 -39180832 -5407268 19551762 17189887 19486637 4001241 -32324677
8156 -32324677 -33864566 5774946 14734193 5296602 -3784669 -10905882 -19793312 -9656630
8148 -9656630 -11846178 -10882266 8550602 6646330 -11173853 -18334998 -21550299 -2782107
8140 -2782107 15441338 30154439 42031318 44456849 40997755 24739185 2658154 -4964036
$$ packed form
8194B4827757n046667L270979L777924J831563q721962P660746n686775k3125245
8186a211680j4660153n288106J2685094M745063M319665N92289q058285l24176
8178g200289k5847484j0668575J2959397J4210500J9786215p594127j2188864
8171a6543227K796135Q538844j3964176m301405J0249824P729771j689180j9814837
8163b6998251j2182581L3773564K4959030k361875K296750j5485396l6325918
8156c2324677j539889L9639512Q959247r437591r081271p121213q887430J0136682
8148i656630k189548R63912J9432868j904272j7820183p161145l215301J8768192
8140b782107J8223445J4713101J1876879K425531l459094j6258570k2081031p622190
$$ plain form
8132 -4964036 -9142031 -10106970 -17363392 -16404065 -8946695 -14037523 -11152972 -11896510 -26195876
8123 -26195876 -28838626 -12748762 -8375926 10761547 25642346 38216299 44961376 31301480
8115 31301480 38663035 41626011 19178713 -9295099 -28999429 -41640995 -39343105 -51409209
8107 -51409209 -40073215 -38156504 -51239738 -43563654 -21328742 -8482777 -14463337 -15073453
8099 -15073453 -27821223 -48938148 -60339942 -25956802 15645438 30532136 28350412
8092 28350412 16271958 15241587 12547119 -4089481 -10658210 -32721793 -39987711 -16526972
8084 -16526972 11335803 15065036 4143589 832506 -2081529 2400264 2048723 4681748
8076 4681748 14655356 2216656 -8285015 -7120237 -7040304 -15147789 -5757627 5611059
$$ packed form
8132d964036m177995r64939p256422R59327P457370n090828K884551p43538j4299366
8123b6195876k642750J6089864M372836J9137473J4880799J2573953O745077j3659896
8115C1301480P361555K962976k2447298k8473812j9704330j2641566K297890j2066104
8107e1409209J1335994J916711j3083234P676084K2234912J2845965n980560o10116
8099a5073453j2747770k1116925j1401794L4383140M1602240J4886698k181724
8092B8350412j2078454j030371k694468j6636600o568729k2063583p265918K3460739
8084a6526972K7862775L729233j0921447l311083k914035M481793l51541K633025
8076D681748R973608j2438700j0501671J164778P9933q107485R390162J1368686
$$ plain form
8068 5611059 -8178497 -7154123 -4709312 -16576115 -40905501 -57432553 -47249550 -27185202
8060 -27185202 -27834684 -53213034 -41093113 -12991132 12291728 14659769 2445469 5537044
8052 5537044 14765504 10612183 -3513863 -2438022 1360815 -19929734 -33373888 -40216569
8044 -40216569 -45359452 -43000050 -26658864 -9440528 -14450072 -25578442 -28238200 -22982935
8036 -22982935 -19407683 -14144790 -2886058 -4659523 -14460463 -13091132 -4669695 4910399
8028 4910399 15919367 18641820 10884756 4427275 -3760987 -30779510 -51067497 -36401172
8020 -36401172 -10783668 -13013112 5836199 25609978 15598279 6034525 14737601 8009872
8012 8009872 27655082 47517258 35702769 -7571039 -30295630 -27697579 -32505087 -30782294
$$ packed form
8068E611059j3789556J024374K444811j1866803k4329386j6527052J0183003K0064348
8060b7185202o49482k5378350J2119921K8101981K5282860K368041j2214300L091575
8052E537044R228460m153321j4126046J075841L798837k1290549j3444154o842681
8044d0216569n142883K359402J6341186J7218336n009544j1128370k659758N255265
8036b2982935L575252N262893J1258732j773465r800940J369331Q421437R580094
8028D910399J1008968K722453p757064o457481q188262k7018523k0287987J4666325
8020c6401172K5617504k229444J8849311J9773779j0011699r563754Q703076o727729
8012H009872J9645210J9862176j1814489m3273808k2724591K598051m807508J722793
$$ plain form
8004 -30782294 -18871476 -20079697 -23911455 -30092500 -34195457 -35435234 -40064485 -42460676
7996 -42460676 -39107584 -42122639 -31020201 -23000508 13523449 24863795 19534054 23758910
7988 23758910 31184316 37330804 28850271 2477786 -2776725 3197451 1640942 919688
7980 919688 8230463 2019204 8859942 9400814 11815782 12988115 38956002 40558137
7972 40558137 19955778 19674286 22086537 8378971 -10640550 -6510432 -4512357 368781
7964 368781 3367930 -5691851 -18366333 -15983047 -103290 2953293 -14648832 -32371675
7956 -32371675 -27282352 -16338137 22141378 55725004 57473959 55850373 29338367 -4039933
7948 -4039933 -24852235 -25665398 -12042506 -18407884 -46974448 -60827754 -60041420 -77417917
$$ packed form
8004c0782294J1910818j208221l831758o181045m102957j239777m629251k396191
7996d2460676L353092l015055J1102438Q019693L6523957J1340346n329741M224856
7988B3758910P425406O146488q480533k6372485n254511N974176j556509p21254
7980I19688P310775o211259O840738N40872K414968J172333K5967887J602135
7972D0558137k0602359k81492K412251j3707566j9019521M130118J998075M881138
7964C68781K999149r059781j2674482K383286J5879757L056583j7602125j7722843
7956c2371675N089323J0944215L8479515L3583626J748955j623586k6512006l3378300
7948d039933k0812302q13163J3622892o365378k8566564j3853306P86334j7376497
$$ plain form
7940 -77417917 -85663600 -68175665 -46797884 -39808620 -32562938 -23488086 -2298904 12954046
7932 12954046 -10249705 -19654206 -5885188 386359 -12301398 -10344990 -6319750 -17414642
7924 -17414642 -25019133 -28450225 -29323576 -20741977 -35692512 -32670176 -23958644 -13268564
7916 -13268564 -6015308 -4184026 -9386257 -18480685 -42466756 -59455834 -44043357 -2554071
7908 -2554071 -1362245 -26427187 -12879051 8963956 1962439 -18075571 -29654837 -41474410
7900 -41474410 -54382413 -62031037 -56373050 -18025242 34479942 64226950 56703304 48607770
7892 48607770 43084449 53105862 67874914 62648145 42207496 11323763 -4487523
7885 -4487523 -9010863 -20416198 -19300951 -18003134 -22268866 -9533335 339741 13201991
$$ packed form
7940g7417917q245683J7487935K1377781O989264P245682R074852K1189182J5252950
7932A2954046k3203751r404501J3769018O271547j2687757J956408M025240j1094892
7924a7414642p604491l431092q73351Q581599j4950535L022336Q711532J0690080
7916a3268564P253256J831282n202231r094428k3986071j6989078J5412477M1489286
7908b554071J191826k5064942J3548136K1843007p001517k0038010j1579266j1819573
7900d1474410j2908003p648624N657987L8347808N2505184K9747008p523646q095534
7892D8607770n523321J0021413J4769052n226769k0440649l0883733j5811286
7885d487523m523340j1405335J115247J297817m265732J2735531R873076J2862250
$$ plain form
7877 13201991 17059336 -4849710 -35639792 -59083561 -55826641 -35662368 -28193892 -29929152
7869 -29929152 -36681026 -40003828 -27981994 -30839977 -7755564 7168835 22223697 18628839
7861 18628839 14281190 15848202 14417842 12846067 12683368 18512282 7139992 -10725506
7853 -10725506 -12093717 -5066034 6222806 -7117128 -25426147 1274464 41497385
7846 41497385 61962094 65102703 43012494 9063488 347487 -90457 -10557356 -43434233
7838 -43434233 -56644466 -48874114 -47113331 -67640780 -68382370 -53659481 -46402165 -62968923
7830 -62968923 -82150960 -103155649 -83018623 -58086149 -41074041 -45040254 -56371945
7823 -56371945 -56024496 -43323394 -29640803 -14875331 6114599 28145757 32888987 19514404
$$ packed form
7877A3201991L857345k1909046l0790082k3443769L256920K0164273P468476j735260
7869b9929152o751874l322802J2021834k857983K3084413J4924399J5054862l594858
7861A8628839m347649J567012j430360j571775j62699N828914j1372290j7865498
7853a0725506j368211P027683J1288840j3339934j8309019K6700611M0222921
7846D1497385K0464709L140609k2090209l3949006q716001m37944j0466899l2876877
7838d3434233j3210233P770352J760783k0527449p41590J4722889P257316j6566758
7830f2968923j9182037k1004689K0137026K4932474J7012108l966213j1331691
7823e6371945L47449J2701102J3682591J4765472K0989930K2031158M743230j3374583
$$ plain form
7815 19514404 -3439246 -14217630 -11033764 -543463 -2866171 -466801 10730593 25790989
7807 25790989 46711815 50673340 15618332 -17480154 -31565276 -37718088 -39737354 -40339541
7799 -40339541 -23737660 -8967687 10169786 1984508 -10653176 -16863245 -13893962 5964266
7791 5964266 21341162 28745019 21563678 20656746 12211064 486757 -7213436 3973965
7783 3973965 13267057 5410520 -13347781 -16624807 695819 14752407 39846955 60090249
7775 60090249 52734168 38468090 22717187 9841335 6960838 2591894 5671053 -7033809
7767 -7033809 -46604594 -65047784 -55672003 -36695666 -25527673 -13344945 -10506393 -9687852
7759 -9687852 -6233191 -7247534 -14979483 -33476356 -50994135 -36034613 -11655609 4447356
$$ packed form
7815A9514404k2953650j0778384L183866J0490301k322708K399370J1197394J5060396
7807B5790989K0920826L961525l5055008l3098486j4085122o152812k019266o02187
7799d0339541J6601881J4769973J9137473q185278j2637684o210069K969283J9858228
7791E964266J5376896P403857p181341r06932q445682j1724307p700193J1187401
7783C973965R293092p856537j8758301l277026J7320626J4056588K5094548K0243294
7775F0090249p356081j4266078j5750903j2875852k880497m368944L079159j2704862
7767g033809l9570785j8443190R375781J8976337J1167993J2182728K838552Q18541
7759i687852L454661j014343p731949j8496873j7517779J4959522K4379004J6102965
$$ plain form
7751 4447356 17616421 40619718 46420789 34039211 34668373 27671419 24535988 10361884
7743 10361884 -8600487 -4405586 23235858 28731009 10361267 3968823 -12440004 -12429591
7735 -12429591 -12889528 -20604939 -14637272 -6234831 4600770 1006719 -5278889 -4619220
7727 -4619220 -17476393 -25427030 -6374356 13935982 -2371447 -41316816 -57290053
7720 -57290053 -61660426 -33355359 -27433989 -31169633 -48790636 -64873634 -54386818 -43863019
7712 -43863019 -20637065 -9044586 -18788073 -17650737 -13998994 2353461 12401220 -3376908
7704 -3376908 -28013301 -38160056 -33840100 -19237637 -13046031 -23820302 -47528350 -54507401
7696 -54507401 -32240749 -10874024 -27231589 -39495408 -37170920 -11150173 1257669
$$ packed form
7751D447356J3169065K3003297N801071j2381578O29162o996954l135431j4174104
7743A0361884j8962371M194901K7641444N495151j8369742o392444j6408827J0413
7735a2429591m59937p715411N967667Q402441J0835601l594051o285608O59669
7727d619220j2857173p950637J9052674K0310338j6307429l8945369j5973237
7720e7290053m370373K8305067N921370l735644j7621003j6082998J0486816J0523799
7712d3863019K3225954J1592479r743487J137336L651743J6352455J0047759j5778128
7704c376908k4636393j0146755M319956J4602463O191606j0774271k3708048o979051
7696e4507401K2266652K1366725j6357565j2263819K324488K6020747J2407842
$$ plain form
7689 1257669 -14346589 -16390695 -1314321 9175887 19397050 7581701 -2264637 -8547091
7681 -8547091 -17237467 -32725586 -39356441 -33641280 -6954406 -4258537 -13557978 -3828626
7673 -3828626 15940873 4384762 -9823060 -9232911 -11668647 -25430132 -39772950 -43364593
7665 -43364593 -42054829 -30387184 -7652414 -2396145 -24267331 -40891611 -34214740 -7214878
7657 -7214878 2403240 2750320 16301373 1936841 -19232138 -34501103 -43459565 -29770845
7649 -29770845 -15503145 -15550917 -17600250 -14283710 -8971501 -18377830 -19210235 1345693
7641 1345693 33457874 49331199 54817921 50482548 43568829 41980453 7239173 -43044345
7633 -43044345 -70321759 -74108894 -61526396 -59777998 -60800573 -42427081 -32047908 -10197831
$$ packed form
7689A257669j5604258k044106J5076374J0490208J0221163j1815349r846338o282454
7681h547091q690376j5488119o630855N715161K6686874K695869r299441R729352
7673c828626J9769499j1556111j4207822N90149k435736j3761485j4342818l591643
7665d3364593J309764J1667645K2734770N256269k1871186j6624280O676871K6999862
7657g214878R618118L47080J3551053j4364532k1168979j5268965q958462J3688720
7649b9770845J4267700m7772k049333L316540N312209r406329q32405K0555928
7641A345693L2112181J5873325N486722m335373o913719j588376l4741280n0283518
7633d3044345k7277414l787135J2582498J748398j022575J8373492J0379173K1850077
$$ plain form
7625 -10197831 4671239 40138536 45140431 15691648 -19553423 -24827041 -23308934 -27711997
7617 -27711997 -21959795 -22512024 -30805631 -22051786 -34319148 -26917767 -20884637 -26653145
7609 -26653145 -26361529 -29033850 -37383849 -41444419 -39768654 -40364558 -30480430 -18729848
7601 -18729848 -19713473 -30057111 -28653465 -17480036 -11064606 2909999 1079223 -3195334
7593 -3195334 -16249498 -27536111 -28109864 -20711442 -40786914 -67726109 -84953384 -91208217
7585 -91208217 -82168599 -46982807 -16047655 -30514877 -56776783 -59506942 -50979419 -46723304
7577 -46723304 -41784946 -8461186 21980333 46277048 59881177 49313818 39827527
7570 39827527 48616646 43329893 15338851 -2979528 -9756462 -8070110 -8153637 -15895498
$$ packed form
7625a0197831J4869070L5467297N001895k9448783l5245071n273618J518107m403063
7617b7711997N752202n52229q293607Q753845j2267362P401381O033130n768508
7609b6653145K91616k672321q349999m060570J675765n95904R884128J1750582
7601a8729848r83625j0343638J403646J1173429O415430J3974605j830776m274557
7593c195334j3054164j1286613n73753P398422k0075472k6939195j7227275o254833
7585i1208217R039618L5185792L0935152j4467222k6261906k730159Q527523M256115
7577d6723304M938358L3323760L0441519K4296715J3604129j0567359r486291
7570C9827527Q789119n286753k7991042j8318379o776934J686352q3527p741861
$$ plain form
7562 -15895498 -24271947 -13467817 2814569 21724493 17260344 17507017 38726435 36175653
7554 36175653 2650488 -19717644 -10350664 2722691 -14817717 -38121268 -50977939
7547 -50977939 -31622670 -16761938 -3726836 8096790 23126222 33623623 25992822
7540 25992822 24884621 41411033 45838536 15467422 -19729091 -27701781 -22728459 -13845920
7532 -13845920 -9352701 -13901374 -8004732 13891574 28755537 47440302 50273258 3625124
7524 3625124 -32436555 -43919990 -41064328 -61082205 -72275420 -43859941 -23427045
7517 -23427045 -7329113 12235539 41724127 73537548 80739218 69898306 35659628
7510 35659628 11216972 2082485 -10309606 -25311209 -31046009 -6358126 22963310
$$ packed form
7562a5895498q376449J0804130J6282386J8909924m464149K46673K1219418k550782
7554C6175653l3525165k2368132R366980J3073355j7540408k3303551j2856671
7547e0977939J9355269J4860732J3035102J1823626J5029432J0497401p630801
7540B5992822j108201J6526412M427503l0371114l5196513p972690M973322Q882539
7532a3845920M493219m548673N896642K1896306J4863963J8684765K832956m6648134
7524C625124l6061679j1483435K855662k0017877j1193215K8415479K0432896
7517b3427045J6097932J9564652K9488588L1813421P201670j0840912l4238678
7510C5659628k4442656r134487j2392091j5001603n734800K4687883K9321436
$$ plain form
7503 22963310 44800881 32171621 12980832 7284149 3392903 -7041862 -25394423
7496 -25394423 -28343419 -22799267 -25758213 -17998791 11828204 34130791 30159497 15315500
7488 15315500 26575913 16398624 -7811421 -20959596 -36357036 -31338664 -1612088
7481 -1612088 21600457 6978545 -3595718 -15957068 -32606756 -32406923 -40305776 -49466535
7473 -49466535 -34774714 -26321870 -31933068 -32050493 -18562890 -14542316 -25262153 -47136353
7465 -47136353 -40834796 -15623627 26601101 34897925 10927829 1420668 -26583753 -34933223
7457 -34933223 -18395703 7138035 18005058 9286820 8478955 11561239 8685347 15148765
7449 15148765 27296610 47155048 66958112 62489313 42618453 20972485 -9369925
$$ packed form
7503B2963310K1837571j2629260j9190789n696683l891246j0434765j8352561
7496b5394423k948996N544152k958946P759422K9826995K2302587l971294j4843997
7488A5315500J1260413j0177289k4210045j3148175j5397440N018372K9726576
7481a612088K3212545j4621912j0574263j2361350j6649688J99833p898853r160759
7473d9466535J4691821Q452844n611198j17425J3487603M020574j0719837k1874200
7465d7136353O301557K5211169M2224728Q296824k3970096r507161k8004421q349470
7457c4933223J6537520K5533738J0867023q718238q07865L082284k875892O463418
7449A5148765J2147845J9858438J9803064m468799j9870860k1645968l0342410
$$ plain form
7442 -9369925 -44953821 -64942827 -69570931 -63965570 -57789490 -70803877 -72263274 -54298716
7434 -54298716 -13082870 549397 -11251560 -8027920 1047102 -8193990 -6968546 18800249
7426 18800249 38552093 34249224 28694164 17838703 16778013 18983148 20813217 18949077
7418 18949077 1480080 -22131846 -20080943 -26037835 -43290307 -49482148 -70440582 -77745329
7410 -77745329 -60574365 -38777270 -13172212 11227986 25559220 58665705 75915637
7403 75915637 55967673 35318650 15615755 -4057417 -13579651 -8300651 -1542648 705564
7395 705564 8579050 666018 -15103818 -21398685 -17355161 -20462554 -15566943 4861354
7387 4861354 40185776 62703838 58422981 37150965 18075466 8905844 10809819 1288491
$$ packed form
7442i369925l5583896j9989006m628104N605361O176080j3014387j459397J7964558
7434e4298716M1215846J3632267j1800957L223640R075022r241092J225444K5768795
7426A8800249J9751844m302869n555060j0855461j060690K205135J830069j864140
7418A8949077j7468997k3611926K050903n956892j7252472o191841k0958434p304747
7410g7745329J7170964K1797095K5605058K4400198J4331234L3106485J7249932
7403G5915637j9947964k0649023j9702895j9673172r522234N279000O758003K248212
7395G05564P873486p913032j5769836o294867M043524l107393M895611K0428297
7387D861354L5324422K2518062m280857k1272016j9075499r169622J903975r521328
$$ plain form
7379 1288491 -11904255 -17726351 -6075194 10958117 24341079 49527463 52883021 20343721
7371 20343721 -6937476 -25547126 -32306604 -25383142 -20066570 -1135683 16633175 19719759
7363 19719759 -6571614 -15315304 -8399102 -19040177 -30863570 -3733978 29610946
7356 29610946 49817955 54032366 53202272 49910480 41108059 40479607 44061459 31359861
7348 31359861 9667299 -22475788 -37440327 -27309340 -21837442 -8033282 1039529
7341 1039529 7805999 18884793 17229586 15723529 25673839 20990467 15897847 13646819
7333 13646819 9569116 5174488 -14022270 -46674639 -54375752 -56712034 -49390197 -49173373
7325 -49173373 -28997526 -8871464 -24313724 -13360295 14066545 11005821 7755093
$$ packed form
7379A288491j3192746n822096J1651157J7033311J3382962K5186384L355558l2539300
7371B0343721k7281197j8609650o759478O923462N316572J8930887J7768858L086584
7363A9719759k6291373q743690O916202j0641075j1823393K7129592L3344924
7356B9610946K0207009M214411q30094l291792q802421o28452L581852j2701598
7348C1359861k1692562l2143087j4964539J0130987N471898J3804160R072811
7341A039529O766470J1078794j655207j506057R950310m683372n092620k251028
7333A3646819m077703m394628j9196758l2652369p701113k336282P321837K16824
7325d9173373K0175847K0126062j5442260J0953429K7426840l060724l250728
$$ plain form
7318 7755093 -7275771 -2823478 -32785219 -76381724 -63629684 -28976151 -15012966
7311 -15012966 -14376216 -21435498 -35687456 -35869944 -10784650 6310310 -13871560 -44346796
7303 -44346796 -50138921 -37660796 -17362741 -8081875 197833 -6248234 -22095898 -26112669
7295 -26112669 -11505552 -97825 -5988622 -12761470 -11424771 436945 14511600 19898240
7287 19898240 10181199 -10374814 -23648420 -20235228 -40513146 -44696432 -25640224 17437446
7279 17437446 51585926 42702203 19393753 21897740 18792245 26369726 32231662 21193296
7271 21193296 6243855 6951740 1174468 4510281 11770944 21025938 6409590 -19996612
7263 -19996612 -19241830 -2161359 10547648 28471830 20100474 6027301 -712937 14610740
$$ packed form
7318G755093j5030864M452293k9961741m3596505J2752040L4653533J3963185
7311a5012966O36750p059282j4251958j82488K5085294J7094960k0181870l0475236
7303d4346796n792125J2478125K0298055R280866Q279708o446067j5847664m016771
7295b6112669J4607117J1407727n890797o772848J336699J1861716J4074655N386640
7287A9898240r717041k0556013j3273606L413192k0277918m183286J9056208M3077670
7279A7437446L4148480q883723k3308450K503987l105495P577481N861936j1038366
7271B1193296j4949441P07885n777272L335813P260663R254994j4616348k6406202
7263a9996612P54782J7080471J2709007J7924182q371356j4073173o740238J5323677
$$ plain form
7255 14610740 3221766 -6582203 -13704746 -30784082 -37998020 -43179391 -37623288 -29247332
7247 -29247332 -16228024 -6145548 2874581 11208307 -9209209 -20195910 -3177693
7240 -3177693 1227992 -21387088 -35117772 -44951410 -27981200 12013979 23504955 25281082
7232 25281082 18531695 5891188 3577465 6250358 9855169 8954822 -4322314 1904369
7224 1904369 7220780 -22622052 -52466722 -64773023 -48033785 -2827578 31119720
7217 31119720 42861857 49597391 47687417 63779236 54372649 30447751 8012625 -7823871
7209 -7823871 -4273014 -8555351 -22927928 -18558480 3052148 46528152 52280343 47870828
7201 47870828 51787380 51510639 54468010 58936315 56385513 37543211 22607701 7372990
$$ packed form
7255A4610740j1388974r803969p122543j7079336p213938n181371N556103Q375956
7247b9247332J3019308J0082476R020129Q333726k0417516j0986701J7018217
7240c177693M405685k2615080j3730684r833638J6970210L9995179J1490976J776127
7232B5281082o749387j2640507k313723K672893L604811r00347j3277136O226683
7224A904369N316411k9842832k9844670j2306301J6739238M5206207L3947298
7217C1119720J1742137O735534j909974J6091819r406587k3924898k2435126j5836496
7209g823871L550857m282337j4372577M369448K1610628M3476004N752191m409515
7201D7870828L916552k76741K957371M468305k550802j8842302j4935510j5234711
$$ plain form
7193 7372990 4361350 16377326 34177795 33335370 11019263 1829376 23902375 9819139
7185 9819139 -4558855 -19432060 -41520661 -46789596 -19768870 -4841459 -9947193 -10761920
7177 -10761920 -1599383 344173 -8870591 -14151833 -29955411 -23429514 -11595807 -1760886
7169 -1760886 -13695487 -26470212 -13494189 -3206167 -21973733 -52753484 -43665304
7162 -43665304 -37864649 -32666848 -38597830 -32748491 -35625522 -47969229 -40830523 -29014058
7154 -29014058 -44416926 -54816660 -39976248 -48559742 -68496978 -82016108 -90154873
7147 -90154873 -80293937 -52943463 -26320591 -3251723 10811945 -16324824 -46355895
7140 -46355895 -50868205 -64483261 -67490783 -60282767 -47308308 -34820046 -37704355 -34467850
$$ packed form
7193G372990l011640J2015976J7800469q42425k2316107r189887K2072999j4083236
7185I819139j4377994j4873205k2088601n268935K7020726J4927411n105734q14727
7177a0761920R162537J943556r214764n281242j5803578O525897J1833707R834921
7169a760886j1934601j2774725J2976023J0288022j8767566l0779751R088180
7162d3665304N800655N197801n930982N849339k877031j2343707P138706J1816465
7154b9014058j5402868j0399734J4840412q583494j9937236j3519130q138765
7147i0154873R860936K7350474K6622872K3068868J4063668k7136769l0031071
7140d6355895m512310j3615056l007522P208016J2974459J2488262k884309L236505
$$ plain form
7132 -34467850 -20108932 -1797763 17884574 26219536 -9676809 -12802706 -6242332 -3300865
7124 -3300865 -9839033 -12141106 8549317 24712204 34000183 20074527 -10958033 -22076864
7116 -22076864 -11753103 511834 1446197 -2175193 -6877974 -7108586 23381807 44428979
7108 44428979 33548296 24738993 7047842 -2764812 6408367 8573945 18958548 33447716
7100 33447716 33570690 30848540 31103596 43657090 58478538 32947435 361783 -11814390
7092 -11814390 -8462001 -10318754 -14334860 -20119000 -24852947 -18143192 42965 16632814
7084 16632814 40886573 63484627 78439289 58080048 17088630 -3268840 -4348519
7077 -4348519 16221564 41180575 36800560 31154252 6738125 -17245690 -30386629 -44527744
$$ packed form
7132c4467850J4358918J8311169J9682337Q334962l5896345l125897O560374K941467
7124c300865o538168k302073K0690423J6162887R287979j3925656l1032560j1118831
7116b2076864J0323761J2264937R34363l621390m702781k30612L0490393K1047172
7108D4428979j0880683q809303j7691151r812654R173179K165578J0384603J4489168
7100C3447716J22974k722150K55056J2553494J4821448k5531103l2585652j2176173
7092a1814390L352389j856753m016106n784140m733947O709755J8186157J6589849
7084A6632814K4253759K2598054J4954662k0359241m0991418k0357470j079679
7077d348519K0570083K4959011m380015n646308k4416127k3983815j3140939j4141115
$$ [...]
##END NTUPLES=NMR SPECTRUM
##END=
