##TITLE=31P Pdec_DE-81k_tfa 
 64 sc cdcl3
 21.2.2025
##JCAMPDX= 6.0         $$ Bruker NMR JCAMP-DX V2.0
##DATA TYPE= NMR SPECTRUM
##DATA CLASS= NTUPLES
##ORIGIN= UXNMR, Bruker Analytische Messtechnik GmbH
##OWNER= root
$$ XWIN-NMR		Version 3.5
$$ Fri Feb 21 16:20:35 2025 Russian Standard Time (UT+4h)  new_Human@DPX200
##.OBSERVE FREQUENCY= 81.013821
##.OBSERVE NUCLEUS= ^31P
##.ACQUISITION MODE= SIMULTANEOUS
##.ACQUISITION SCHEME= undefined
##.AVERAGES= 64
##.DIGITISER RES= 17
##SPECTROMETER/DATA SYSTEM= spect
##.PULSE SEQUENCE= zgpg30
##.SOLVENT NAME= CDCl3
##.SHIFT REFERENCE= (INTERNAL, CDCl3, 0, 198.062)
##AUDIT TRAIL= $$ (NUMBER, WHEN, WHO, WHERE, WHAT)
$$ ##TITLE= Audit trail, XWIN-NMR		Version 3.5
$$ ##JCAMPDX= 5.01
$$ ##ORIGIN= Bruker BioSpin GmbH
$$ ##OWNER= new_Human
$$ C:/Bruker/XWIN-NMR/data/yarkov/nmr/P31/2/pdata/1/auditp.txt
$$ ##AUDIT TRAIL=  $$ (NUMBER, WHEN, WHO, WHERE, WHAT)
(   1,<2025-02-21 16:17:03.90 +0400>,<new_Human>,<DPX200>,
      <created by zg, POWCHK disabled, PULCHK disabled
       configuration hash MD5:
       00 E9 B6 7A A2 85 ED C7 34 08 36 98 17 FE 4E 26
       data hash MD5: 32K
       05 55 B6 B8 06 08 5B 03 2C 3E 9C BF 6D FD 07 B5>)
(   2,<2025-02-21 16:17:41.84 +0400>,<new_Human>,<DPX200>,
      <Start of raw data processing
       efp BC_mod = 2 LB = 1.5 FT_mod = 6 PKNL = 1 PHC0 = 1772.874 PHC1 = 41.49541 SI = 64K 
       data hash MD5: 64K
       76 A8 C7 DB C9 1E 38 63 F7 B5 01 C5 0F A0 93 D1>)
(   3,<2025-02-21 16:19:19.28 +0400>,<new_Human>,<DPX200>,
      <pk PHC0 = 18.4 PHC1 = 0 
       data hash MD5: 64K
       95 67 75 C3 C0 58 4D D2 6E 7E 83 55 7E BD B4 35>)
$$ ##END=
$$ 
$$ hash MD5
$$ F1 47 C4 E1 59 98 0B 3F 7A 18 66 61 E1 24 E5 06
##$RELAX= 
##$RELAX= 
##$RELAX= 
##$RELAX= 
##$RELAX= 
##$RELAX= 
##$RELAX= 
##$RELAX= 
$$ Bruker specific parameters
$$ --------------------------
##$DU= <C:/Bruker/XWIN-NMR>
##$EXPNO= 2
##$NAME= <P31>
##$PROCNO= 1
##$TYPE= <nmr>
##$USER= <yarkov>
##$AMP= (0..31)
100 100 100 100 100 100 100 100 100 100 100 100 100 100 100 100 100 100 
100 100 100 100 100 100 100 100 100 100 100 100 100 100 
##$AQSEQ= 0
##$AQ_mod= 1
##$AUNM= <au_zg>
##$AUTOPOS= <>
##$BF1= 81.014009
##$BF2= 200.13
##$BF3= 200.13
##$BF4= 200.13
##$BF5= 200.13
##$BF6= 200.13
##$BF7= 200.13
##$BF8= 200.13
##$BYTORDA= 1
##$CFDGTYP= 0
##$CFRGTYP= 5
##$CHEMSTR= <none>
##$CNST= (0..31)
1 1 145 1 1 1 1 1 1 1 1 1 1 1 1 1 1 1 1 1 1 1 1 1 1 1 1 1 1 1 1 1 
##$CPDPRG= <waltz16>
##$CPDPRG1= <>
##$CPDPRG2= <waltz16>
##$CPDPRG3= <>
##$CPDPRG4= <mlev>
##$CPDPRG5= <mlev>
##$CPDPRG6= <mlev>
##$CPDPRG7= <mlev>
##$CPDPRG8= <mlev>
##$CPDPRGB= <>
##$CPDPRGT= <>
##$D= (0..31)
0 1 0 0 0 0 0 0 0 0.06 0 0.03 2e-05 3e-06 0 0 0.0002 0 0 0 0 0 0 0 0 0 
0 0 0 0 0 0 
##$DATE= 1740140223
##$DBL= (0..7)
120 120 120 11 120 120 24 19 
##$DBP= (0..7)
150 150 150 150 150 150 150 150 
##$DBP07= 0
##$DBPNAM0= <>
##$DBPNAM1= <>
##$DBPNAM2= <>
##$DBPNAM3= <>
##$DBPNAM4= <>
##$DBPNAM5= <>
##$DBPNAM6= <>
##$DBPNAM7= <>
##$DBPOAL= (0..7)
$$ [...]
##$SUBNAM3= <"">
##$SUBNAM4= <"">
##$SUBNAM5= <"">
##$SUBNAM6= <"">
##$SUBNAM7= <"">
##$SUBNAM8= <"">
##$SUBNAM9= <"">
##$SW= 400.765351723535
##$SWIBOX= (0..15)
0 1 3 0 0 0 0 0 0 0 0 0 0 0 0 0 
##$SW_h= 32467.5324675325
##$TD= 32768
##$TD0= 1
##$TE= 0
##$TE2= 300
##$TE3= 300
##$TEG= 300
##$TL= (0..7)
0 120 53 12 22 120 120 120 
##$TP= (0..7)
150 150 150 150 150 150 150 150 
##$TP07= 0
##$TPNAME0= <>
##$TPNAME1= <>
##$TPNAME2= <>
##$TPNAME3= <>
##$TPNAME4= <>
##$TPNAME5= <>
##$TPNAME6= <>
##$TPNAME7= <>
##$TPOAL= (0..7)
0.5 0.5 0.5 0.5 0.5 0.5 0.5 0.5 
##$TPOFFS= (0..7)
0 0 0 0 0 0 0 0 
##$TUNHIN= 0
##$TUNHOUT= 0
##$TUNXOUT= 0
##$USERA1= <user>
##$USERA2= <user>
##$USERA3= <user>
##$USERA4= <user>
##$USERA5= <user>
##$V9= 5
##$VALIST= <valist>
##$VCLIST= <CCCCCCCCCCCCCCC>
##$VD= 0
##$VDLIST= <DDDDDDDDDDDDDDD>
##$VPLIST= <PPPPPPPPPPPPPPP>
##$VTLIST= <TTTTTTTTTTTTTTT>
##$WBST= 1024
##$WBSW= 4
##$XGAIN= (0..3)
0 0 0 0 
##$XL= 0
##$YL= 0
##$YMAX_a= 6613
##$YMIN_a= -18695
##$ZGOPTNS= <>
##$ZL1= 120
##$ZL2= 120
##$ZL3= 120
##$ZL4= 120
##$ABSF1= 0
##$ABSF2= 0
##$ABSG= 0
##$ABSL= 0
##$ALPHA= 0
##$AQORDER= 0
##$ASSFAC= 0
##$ASSFACI= 0
##$ASSFACX= 0
##$ASSWID= 0
##$AUNMP= <proc_1d>
##$AZFE= 0.1
##$AZFW= 0.5
##$BCFW= 0
##$BC_mod= 2
##$BYTORDP= 0
##$COROFFS= 0
##$CY= -3
##$DATMOD= 1
##$DC= 0
##$DFILT= <>
##$DTYPP= 0
##$F1P= 0
##$F2P= 0
##$FCOR= 1
##$FTSIZE= 65536
##$FT_mod= 6
##$GAMMA= 0
##$GB= 0
##$INTBC= 1
##$INTSCL= 9.790993e-09
##$ISEN= 30
##$LB= 1.5
##$LEV0= 0
##$LPBIN= 0
##$MAXI= 10000
##$MC2= 0
##$MEAN= 0
##$ME_mod= 0
##$MI= 50
##$NCOEF= 0
##$NC_proc= -8
##$NLEV= 6
##$NOISF1= 182.463
##$NOISF2= 159.3651
##$NSP= 0
##$NTH_PI= 0
##$NZP= 0
##$OFFSET= 198.0616
##$PC= 4
##$PHC0= 1791.274
##$PHC1= 41.49541
##$PH_mod= 1
##$PKNL= yes
##$PPARMOD= 0
##$PSCAL= 0
##$PSIGN= 0
##$REVERSE= no
##$SF= 81.0140089999434
##$SI= 65536
##$SIGF1= 159.3651
##$SIGF2= -187.1042
##$SINO= 113.3802
##$SIOLD= 16384
##$SREGLST= <1H.CDCl3>
##$SSB= 0
##$STSI= 65536
##$STSR= 0
##$SW_p= 32467.5324675325
##$SYMM= 0
##$S_DEV= 0
##$TDeff= 32768
##$TDoff= 0
##$TI= <>
##$TILT= no
##$TM1= 0
##$TM2= 0
##$TOPLEV= 0
##$USERP1= <user>
##$USERP2= <user>
##$USERP3= <user>
##$USERP4= <user>
##$USERP5= <user>
##$WDW= 1
##$XDIM= 65536
##$YMAX_p= 384333309
##$YMIN_p= -222128248
$$ End of Bruker specific parameters
$$ ---------------------------------
##NTUPLES= NMR SPECTRUM
##VAR_NAME=  FREQUENCY,     SPECTRUM/REAL,   SPECTRUM/IMAG
##SYMBOL=    X,             R,               I
##VAR_TYPE=  INDEPENDENT,   DEPENDENT,       DEPENDENT
##VAR_FORM=  AFFN,          ASDF,            ASDF
##VAR_DIM=   65536,         65536,           65536
##UNITS=     HZ,            ARBITRARY UNITS, ARBITRARY UNITS
##FACTOR=    0.49542278885378, 1,            1
##FIRST=     16045.7642231865, 0,            0
##LAST=      -16421.768244346, 0,            0
##MIN=       -16421.768244346, -222128248,   0
##MAX=       16045.7642231865, 384333309,    0
$$ Real data points
##PAGE= N=1
##DATA TABLE= (X++(R..R)), XYDATA
$$ [...]
45805G931517k342852o24349R84559l15965k715856k377946O81992K302405N1727
45796C575232l209983l154782K31305K786894J618650j698912l800839l567258
45788g219693k274575r86105M62643K190626L525332L858655L363874K584532
45780E505289J835540J067622k6658j524570k576623j909761K73906J768436Q79923
45771E293104j259273k242831j550989n41405L5157M65878M44905o05276j588255
45762a548985o43386J604050K276856M73994j310807j046119J70375P05088J000191
45753A681257J668269J449408m80069k184854j657043k20590m42467j911805k030963
45744d128857j67300J834572K701074K573071J359282q91701k321809r76332J787731
$$ y = [7931517, 5588665, 4964316, 5948875, 5632910, 2917054, 539108, 1221100, 3523505, 3575232, 365249, -2789533, -2558228, 228666, 1847316, 148404, -3652435, -7219693, -9494268, -10480373, -10017730, -7827104, -4301772, -443117, 2920757, 5505289, 7340829, 8408451, 8381793, 6857223, 4280600, 2370839, 2644745, 4413181, 5293104, 4033831, 1791000, 240011, -301394, -266237, 199641, 644546, 39270, -1548985, -2192371, -588321, 1688535, 2162529, 851722, -194397, -24022, 681066, 1681257, 3349526, 4798934, 4318865, 2134011, 476968, 256378, -186089, -2097894, -4128857, -4296157, -2461585, 239489, 2812560, 4171842, 3280141, 958332, -18000, 1769731]
45735A769731K552816P47745o76253j3399Q18566k12906k105480k710560j668236
45726a497976p1061J020929O75764j379154l319194k461060Q59979K924180J622364
45717a625229n72761n85790O95922N35100q50541q81670Q65127J945465Q38222
45708C63845j177579k239974j933718q69733P058l29484j721336k076961P2592
45699i905290K561300J750551k095450m540069k975065J08344J444772J576784
45691a2074123K499908L309401J917493l36587q9455K158784J965066j988737
45683b638250m829401k151942L356451N509004K953719k8754l36963M44964m2173
45674B236655j203614j421557j041566j259539j697051j077596P22435K777943
$$ y = [1769731, 4322547, 5070292, 4394039, 4380640, 5199206, 4986300, 2880820, 170260, -1497976, -1569037, -548108, 127656, -1251498, -4570692, -7031752, -6171773, -3247593, -1625229, -2197990, -2783780, -2087858, -1552758, -2403299, -3284969, -2419842, -474377, 363845, -813734, -3053708, -4987426, -5857159, -5850101, -6179585, -7900921, -9977882, -9905290, -7343990, -5593439, -7688889, -12228958, -15204023, -15095679, -13650907, -12074123, -9574215, -6264814, -4347321, -4683908, -4773363, -2614579, -649513, -2638250, -7467651, -9619593, -6263142, -754138, 2199581, 2170827, 1833864, 2278828, 2236655, 1033041, -388516, -1430082, -2689621, -4386672, -5464268, -4741833, -1963890]
45666a963890M225020M102841J579360k130734l662175j396885J758375J783423
45658D295335j186996l408608k630340o3019K322086L655407L289037R05980j861459
45649E317423k422746p26624L69980q72248k671361k371797J97646L000993M078648
45640C899914K915082P82371j17674P15264P70230j930691m724727l311741J183065
45631A81093K767875m40106k756729N21076N533993N302216l20756n140247n317971
45622C30444k661603j1188J926775K886469K150269J70720j648909k984509m020344
45613c861876l549607p52505J848008J029223j732474j683615J957242M534041
45605b211563K952813q6830q55030K04410O25740J18378l43644j196760k996354
$$ y = [-1963890, 2261130, 6363971, 7943331, 5812597, 2150422, 753537, 2511912, 4295335, 3108339, -300269, -2930609, -2993628, -671542, 2983865, 6272902, 7178882, 5317423, 2894677, 2168053, 2538033, 1665785, -1005576, -3377373, -3179727, -178734, 3899914, 6814996, 7597367, 7479693, 8194957, 8965187, 7034496, 2309769, -1001972, 181093, 2948968, 2508862, -247867, 273209, 5807202, 11109418, 10788662, 5648415, 330444, -2331159, -2342347, -415572, 2470897, 4621166, 4791886, 3142977, 158468, -3861876, -7411483, -8163988, -6315980, -5286757, -7019231, -8702846, -6745604, -2211563, 741250, 654420, -200610, 3800, 629540, 747918, 404274, -792486, -3788840]
45596c788840m170011k952882m05555J059482J271452K037929L870010N186004
45588B107589M691301K878979J073679Q3492j69102k98630o41005p23575r3640
45579H909088O16260N93926M51067J229440K112556J365303n25920j323283p99747
45570A2628690r11708j788759j296097L67523o8106l097253m370830j568270J057441
45561I52631p51952m034625l269303O78481K316996M89831p36426M26726J324692
45552b602949O69775O57856J956757J891875m30702j869737m08872J475081J013068
45543B352152q15991j813700j923557j734868o33241J173006J522559m62293k501306
45534d837239k588649j686884j033688K19962K324024L054825J458078M84347
$$ y = [-3788840, -7958851, -10911733, -11317288, -10257806, -8986354, -6948425, -3078415, 2107589, 6798890, 9677869, 10751548, 10835040, 10665938, 10367308, 9726303, 9002728, 8909088, 9525348, 10119274, 10570341, 11799781, 13912337, 15277640, 14751720, 13428437, 12628690, 11716982, 9928223, 8632126, 8999649, 8931543, 5834290, 1463460, -104810, 952631, 200679, -3833946, -7103249, -6424768, -4107772, -3617941, -4354367, -3927641, -2602949, -1933174, -1275318, 681439, 2573314, 2142612, 272875, -135997, 1339084, 2352152, 1536161, -277539, -2201096, -3935964, -4569205, -3396199, -1873640, -2335933, -4837239, -7425888, -9112772, -10146460, -9926498, -7602474, -4547649, -3089571, -2605224]
45526b605224K503053M892145L921691P49597o09234M66595J289421Q93863N46754
45517A2048661K3693k089072m536882m247818j428134L00364m60046j099258P7360
45508a411132J074398J10847j134665m47310J377472K172385J570804N16819o40618
45499C189000j600810j178185J040589L131812K773088J59013k390660l191134
45491A932713k464975j416714j027804j407377j715263j117982m9139K12144n91308
45482g645705j198953n22274J043187K236465K098318O28335p94143j25125K772124
45473a507771M827824L064812j092516l211199j603019R39583J497514K37649
45465C152877j449448k942113l280267j161165K220742L258477Q89659j386976
$$ y = [-2605224, -102171, 4789974, 8711665, 9461262, 8852028, 9318623, 10608044, 11501907, 12048661, 12072354, 9983282, 5446400, 1198582, -229552, 70812, -389234, -1488492, -1411132, -336734, -225887, -1360552, -1807862, -430390, 1741995, 3312799, 3829618, 3189000, 1588190, 410005, 1450594, 4582406, 7355494, 7514507, 5123847, 1932713, -532262, -1948976, -2976780, -4384157, -6099420, -7217402, -7266541, -7054397, -7645705, -8844658, -9366932, -8323745, -6087280, -3988962, -3360627, -4154770, -4279895, -1507771, 3320053, 6384865, 5292349, 2081150, 478131, 1417714, 2915228, 3152877, 1703429, -1238684, -4518951, -5680116, -3459374, -200897, 688762, -698214]
45457f98214p35227P89805J47326j470345j061030Q05111J179393j79505j029007
45448b251693q98535j044560r81722O61239K287741Q78019k474123l153729N9181
45439f918182L044790K567411K90584j044154j449240j635833q30133R15679J487114
45430c571964K66796j76688J462453K312156k6406k932162k580038J61218J629114
45421c455521J152367P12687M49599q55178j770729L30067L851409L983883N3131
45412D451715k805962j079797K198877K459308K7662j576293j217307n51233k95973
45403A610997N51428K121106K952390K093149J58705j770674k920850k674192
45395B122059j135031J89351k48805j787112k047575j43614J889407J743258l9218
$$ y = [-698214, -1433441, -643636, -496310, -1966655, -3027685, -2222574, -1043181, -1222686, -2251693, -3150228, -4194788, -5176510, -4515271, -2227530, -1349511, -3823634, -6977363, -6918182, -3873392, -1305981, -1015397, -2059551, -3508791, -5144624, -5974757, -5059078, -3571964, -3305168, -3481856, -2019403, 292753, 266347, -2665815, -5245853, -5084635, -3455521, -2303154, -1590467, -1140868, -1996046, -3766775, -3436708, 414701, 4398584, 4451715, 1645753, 565956, 2764833, 5224141, 5251803, 3675510, 2458203, 1906970, 1610997, 2162425, 4283531, 7235921, 9329070, 9487775, 7717101, 4796251, 2122059, 987028, 1176379, 927574, -859538, -2907113, -3050727, -1161320, 581938, 542720]
45386E42720q74028K64973J544198J064981l46995m76601Q53538J558938O19012
45377D750736m20234k06296J35859p94501j852649j159556L55250J30313j686569
45368g47647k184917k99179J618514J712095J086980R84047M80068r53992j333487
45359C62482P30050L005664K745519J064655R13756K008293J541405n96850j280726
45350A0494248O86265K424439J231488j803635l844293l764916k262904m09963
45342B750729O41175O4712j456562k247670j872406j295893o49605R10765K706269
45333d48486K675669R39117J85551J116275R23093j478064k339137J282165N822418
45324H678601N644752J170181k256167k394585j813983j977243j244244L27278
$$ y = [542720, -331308, -66335, 1477863, 2542844, 2195849, 1719248, 2572786, 4131724, 4750736, 4330502, 4124206, 4260065, 3465564, 1612915, 453359, 808609, 938922, -747647, -2932564, -3231743, -1613229, 98866, 1185846, 2169893, 2649961, 1695969, 362482, 1092532, 4098196, 6843715, 7908370, 8822126, 10830419, 12371824, 11774974, 10494248, 11180513, 13604952, 14836440, 13032805, 9188512, 5423596, 3160692, 2750729, 3391904, 3456616, 2000054, -247616, -2120022, -3415915, -4065520, -3154755, -448486, 2227183, 3166300, 3351851, 4468126, 5391219, 3913155, 1574018, 2856183, 8678601, 14323353, 15493534, 13237367, 10842782, 9028799, 7051556, 5807312, 6134590]
45316F134590l19687l554975m869639j451897K919294L080734m29229l137377
45308a628186l069364j610220K33419K425541L735059K706854M30385p67944r09660
45299A545884j635234k603807k105918q48262j192124k458254j299915K177713
45291h419917L124750q68567n151983m024821J324444M769514L578857P98200
45283d869523k54194K8026n6419k34864P14067K293551K572085P80077j541755
45274e68949k154817n35065J412739J204919j421459l863712l375254k50036K470343
45265g081291K529115Q40900j13078M66831J100621O15688N4088R96954K694574
45256B104402K580853k0109k444162k188142m86711m33147k249791k858177m43623
$$ y = [6134590, 5814903, 2259928, -2609711, -4061608, -1142314, 1938420, 1509191, -1628186, -4697550, -6307770, -6074351, -3648810, 86249, 2793103, 3223488, 2455544, 1545884, -89350, -2693157, -4799075, -5647337, -6839461, -9297715, -10597630, -8419917, -5295167, -6163734, -11315717, -15340538, -14016094, -9246580, -5667723, -4869523, -5123717, -5095691, -5152110, -5386974, -4672907, -2379356, 192729, 972806, -568949, -2723766, -3258831, -1846092, -641173, -2062632, -5926344, -9301598, -9551634, -7081291, -4552176, -3711276, -3824354, -3357523, -2256902, -1641214, -1587126, -590172, 2104402, 4685255, 4665146, 2220984, 32842, -453869, -887016, -3136807, -5994984, -6438607]
45247f438607K772221L390875J009636j639866j952197o6347J355950j04245l470023
45238e142603m630352j240415L426831M088608O47400j628557J75231K605280
45230a698577J590857j439620k433651r00712O00544J192105J840892K068419
45222H20257O36121j112090o06549J489551K088865Q77993N83587J722399J502945
45213H003079r16552k377417q21891J327226J169373n35478j611012j906343j991878
45204C39107j093073J028621K443176J818759O26019K74156l78688k016437k241668
45195G99972N74645L358956K320092j082513k470812j284503n19772q48967j67688
45186F79410J250064N17726k216908l054056p69459R29902k39716j207294Q82199
$$ y = [-6438607, -3666386, -275511, 734125, -905741, -2857938, -2924285, -1568335, -1672580, -5142603, -9772955, -11013370, -7586539, -3497931, -2850531, -4479088, -4303857, -1698577, -107720, -1547340, -3980991, -4881703, -4281159, -3089054, -1248162, 820257, 1456378, 344288, -262261, 1227290, 3316155, 4194148, 4777735, 6500134, 8003079, 7086527, 4709110, 3887219, 5214445, 6383818, 5848340, 4237328, 2330985, 339107, -753966, 274655, 2717831, 4536590, 5162609, 5436765, 5058077, 3041640, 799972, 1374617, 4733573, 7053665, 5971152, 3500340, 2215837, 1696065, 847098, 679410, 1929474, 2447200, 230292, -2823764, -3593223, -2663321, -2903037, -4110331, -3228132]
45177c228132L216267J559214k779447m579843j940117J986311L850128L342989
45169A427370J712083l1674j015148p40487J24441N20000M16603K42462m27190
45160B228460j913341k799564j369466J489456K940655J977726N69025N24720
45152C647671J103857P03518n51939j214993p35234r2305l87155j549406k535484
45143a611470k495310j578424n47577J73299N52595J87486j372239l047818k382128
45134a2121586J337189N058376M952673J150784k345900k581284o24049Q41106
45126d332691J016195Q91956R71848P00899j64988q11462k51238J381009K529464
45117A930992J469655j683091m518086m725584k740653q89166r0401R58177L050658
$$ y = [-3228132, -11865, 1547349, -1232098, -5811941, -7752058, -5765747, -1915619, 1427370, 3139453, 3107779, 2092631, 1352144, 1476585, 1996585, 2413188, 2655650, 2228460, 315119, -2484445, -3853911, -2364455, 576200, 2553926, 3122951, 3647671, 4751528, 5455046, 4903107, 3688114, 2952880, 2860575, 2473420, 924014, -1611470, -4106780, -5685204, -6232781, -6059482, -5506887, -5319401, -6691640, -9739458, -12121586, -10784397, -5726021, -773348, 377436, -1968464, -4549748, -5173797, -4332691, -3316496, -2424540, -1452692, -751793, -916781, -1728243, -1979481, -598472, 1930992, 3400647, 1717556, -2800530, -7526114, -10266767, -11155933, -11246334, -10288157, -7237499]
45108g237499M847988M929007L784418K529696J217890o4661r5806J360090J738454
45099A3009577j254560n540404o731970m176222j659981j549353j717354J47645
45091i472622K452133K494568Q81627P8574K13242m34865j777605k038018j046955
45082h649921k20547N18401K390364M245595L281145J59955p13416K009929L592605
45073F614110J70994m714255m933030q48455J483683o06329l280841k759410k80527
45064i154060J249743J645789K014283J933481P91845k27062j08317j59480j612679
45055c626457k735909j299360J289375J607731n51782j943905j015422Q1565m10313
45046h604477q67420P06543L046789L461083J954063J017756J758624K479041
$$ y = [-7237499, -2389511, 2539496, 6323914, 8853610, 10071500, 10006839, 9911033, 11271123, 13009577, 11755017, 6214613, -517357, -4693579, -6353560, -7902913, -9620267, -9472622, -7020489, -4525921, -3644294, -3565720, -3352478, -3787343, -5564948, -7602966, -8649921, -8870468, -8352067, -5961703, -1716108, 1565037, 1724992, 1011576, 3021505, 6614110, 6785104, 2070849, -2862181, -3710636, -2226953, -2833282, -6114123, -8873533, -9154060, -7904317, -6258528, -4244245, -2310764, -1518919, -1745981, -1854298, -2013778, -3626457, -6362366, -7661726, -6372351, -4764620, -5316402, -7260307, -8275729, -8194164, -8604477, -9471897, -8765354, -5718565, -2257482, -303419, 714337, 2472961, 4952002]
45038D952002J386078j019270k931806l449661k973987k089484r17930N31460
45030f512598J935022K743788K570507J485032J9123j122691j468275j081884
45022a431976o28164j016905k554667m222560m218954j828170J360166K855164
45014a1686066K125450J246716K053149L466461K989669M93600j398751j259082
45006a968854j136640l206870n681472m737131j64679L763230L786874J495014
44998g850528K66107O05980P21194J94343L28856J267528J376483m5538j411589
44989d547164r71984J018785K853647L036085J068982k186576m476263l726516
44981g931004l81950K754907L542778K351825N09253j540310l426626l697919
$$ y = [4952002, 6338080, 5318810, 2387004, -1062657, -4036644, -6126128, -7044058, -6512598, -4577576, -1833788, 736719, 2221751, 2240874, 1118183, -350092, -1431976, -2060140, -3077045, -5631712, -9854272, -14073226, -15901396, -14541230, -11686066, -9560616, -8313900, -6260751, -2794290, 195379, 688979, -709772, -1968854, -3105494, -6312364, -11993836, -16730967, -16895646, -13132416, -9345542, -7850528, -7584421, -6978441, -6257247, -6062904, -5734048, -4466520, -3090037, -3135575, -4547164, -5519148, -4500363, -1646716, 1389369, 2458351, 271775, -4204488, -7931004, -8312954, -5558047, -2015269, 336556, 845809, -694501, -4121127, -7819046]
44973g819046j412750J704915K688167J051225n61464L5871J768758K058010L66559
44964a19755j342835j376345k12330O68241P77517O31858L98931l27558j412631
44955b314907j904773j291182k18829N40717J056312J530479J512376P99035L14122
44946B3350P62883J054847k37966k166996k156334L09467K744753L034376J811185
44937E179565N50059o85189k092652k544240j219668L90467L34289p05298m07249
44928a199916J491247K769687K026087K80549j034735j725885j964180j594739
44920i51885j039234j263881k051505j816809k989J819541K252702K033409K463561
44911A442910L151785K798279J328015k08168j213441j723762j605360q64575
$$ y = [-7819046, -9231796, -7526881, -4838714, -3787489, -4348953, -4313082, -2544324, -486314, -119755, -1462590, -2838935, -3051265, -2383024, -1605507, -973649, -574718, -902276, -2314907, -4219680, -5510862, -5729691, -5188974, -4132662, -2602183, -1089807, -290772, 23350, 786233, 1841080, 1603114, -563882, -2720216, -2410749, 334004, 3368380, 5179565, 5729624, 5044435, 2951783, 407543, -812125, -421658, -87369, -792667, -1199916, 291331, 3061018, 5087105, 5367654, 4332919, 2607034, 642854, -951885, -1991119, -3255000, -5306505, -7123314, -7126303, -5306762, -3054060, -1020651, 1442910, 4594695, 7392974, 8720989, 8512821, 7299380, 5575618, 3970258, 3105683]
44903C105683k82357n44443j179653j414136j437475j650301j453461k77441Q93976
44894d239608P53180j38476k42672L97040O26724P75045K152325L962481L680407
44885G726446J140409p71342o38490o08754k218279l312917j823008J76904l66897
44876f95928k387610k661592j313993r80618j360337M40790L912019M625432J204694
44867G82857j941201j265735P84145M60647j188532r14836Q65412J245750K6011
44858a145482p02450r26169k162773l292165j660234J718789K877492J378458
44850c914534J120611L341068M014881Q47005k061270n50189K513063J514496
44842F825131l018126n221651k625784J085836K241004J454365O55687j33332
$$ y = [3105683, 2823326, 2278883, 1099230, -314906, -1752381, -3402682, -4856143, -5133584, -4239608, -3486428, -3624904, -3867576, -3470536, -2843812, -2068767, 83558, 4046039, 7726446, 8866855, 8095513, 7457023, 6848269, 4629990, 1317073, -505935, -329031, -695928, -3083538, -5745130, -7059123, -8039741, -9400078, -8959288, -5047269, -421837, 782857, -1158344, -2424079, -1639934, -1179287, -2367819, -3282655, -2417243, -1171493, -1145482, -1847932, -2774101, -4936874, -8229039, -9889273, -8170484, -5292992, -3914534, -2793923, 547145, 4562026, 5409031, 3347761, 2797572, 5310635, 6825131, 3807005, -1414646, -4040430, -2954594, -713590, 740775, 1396462, 1263130]
44834A263130j224713j543640n28842M48009L14765M4223N56027P56907m36138
44825c50272j677804r54690J166144K093195O60849j578647k399177j111469J094023
44816c057848K194581J050743j313607k688625k366161j823267k082326j879570
44808a1966080J64586K871061L914819L092734K123354J645669O46247j039203
44800A453187j805062n53685J634169K800770K015092k94195k674917l132289
44792e56930p87379K459053L373703J148556j631664k423599j640432j193246
44784a251938j558226j656447p11585J036534K781959L329425J699940j313206
44776B356456l067600j883814P19624J906919J013986k57140n71935k13803K31511
$$ y = [1263130, 38417, -1505223, -2034065, -1586056, -1271291, -1227068, -671041, 85866, -350272, -2028076, -2982766, -1816622, 276573, 937422, -641225, -3040402, -4151871, -3057848, -863267, 187476, -1126131, -3814756, -6180917, -8004184, -10086510, -11966080, -11801494, -8930433, -5015614, -1922880, 200474, 1846143, 2492390, 1453187, -351875, -905560, 728609, 3529379, 5544471, 5250276, 2575359, -556930, -1344309, 1114744, 4488447, 5637003, 4005339, 1581740, -58692, -1251938, -2810164, -4466611, -5178196, -4141662, -1359703, 1969722, 3669662, 2356456, -711144, -2594958, -1875334, 31585, 1045571, 788431, 216496, 2693, 234204]
44767B34204P70760J302035J323546P54581J47205j45432k71648l64259n03295
44758C247697j042060k061158k672026j888529q7411J410180K045269K205615
44750A157577J929995P95295q68235j979683k100083j662655q17379O01068J894822
44741a049278J823727M31531q35706j157916j120070j175027p91605M16054J965207
44732a493083L161121L305827J551164j712019l747551k210221J151333K422786
44724B429357J178073N98581J481374P16668k499933l884130q32124K503513J444364
44715C135743j657311j573967R89878J110235j553450k593868j151943j247914
44707d542597l677279l520525J484869O066178M780667l08852l372530k593075
$$ y = [234204, 1004964, 2306999, 3630545, 4385126, 4532331, 4386899, 4115251, 3750992, 3247697, 2205637, 144479, -2527547, -4416076, -4503487, -3093307, -1048038, 1157577, 3087572, 3882867, 3014632, 1034949, -1065134, -2727789, -3545168, -2944100, -1049278, 774449, 1205980, 370274, -787642, -1907712, -3082739, -3874344, -3458290, -1493083, 1668038, 4973865, 6525029, 4813010, 1065459, -1144762, 6571, 2429357, 3607430, 4206011, 5687385, 6404053, 3904120, 19990, -812134, 1691379, 3135743, 1478432, -95535, 894343, 2004578, 451128, -2142740, -3294683, -4542597, -8219876, -11740401, -10255532, -4189354, 591313, 282461, -3090069, -5683144]
44699e683144j68367K365083M435712M242637O79525l562748m487015j851529
44691d029846J100430K226622K105614J748453J325731R34400O37044M1056q19205
44682E270299j071863o21419o36813j184889n93280J114192R51847k220162m517509
44673c509597k314868J759763K502500o2843j496394l98029L21479n98244r95498
44664d791731j73349l07382j540109o54944L197396N980291M704947J913693J122832
44655I451644J305482l75203k989441l081686j71645K497679K236177n90286l848104
44646D434617n429165m313599j480744Q05205J648311K280545L229705K708224
44638C883099l95045l732218m048359j398079J304131K088785J452663Q95830
$$ y = [-5683144, -5851511, -3486428, 949284, 5191921, 5871446, 2308698, -2178317, -4029846, -2929416, -702794, 1402820, 3151273, 4477004, 5411404, 6048448, 6089504, 5270299, 4198436, 3577017, 2940204, 1755315, 1162035, 2276227, 3228074, 1007912, -3509597, -5824465, -4064702, -1562202, -1625045, -3121439, -3519468, -3197989, -3796233, -4791731, -4965080, -5272462, -6812571, -7467515, -4270119, 1710172, 6415119, 8328812, 9451644, 10757126, 10381923, 7392482, 4310796, 4139151, 6636830, 8873007, 8282721, 4434617, -994548, -5308147, -6788891, -5983686, -4335375, -2054830, 1174875, 3883099, 3488054, -244164, -4292523, -5690602, -4386471, -2297686, -845023, 50807]
44630E0807J523506L236292M102206J911398k401771m839703l524747j490012
44622a432024j964195l379270k391408K77869J231852L25025N23716K151758K090887
44613b565790m71341j997365r6296K657367K739817O68325n25224K26098J464418
44604B100009J796096J040800l06758j282224r43696K55606N59625o77906j804371
44595G37181j154956N18561J092184j21139j571029j194611J357249L865668L378659
44586F907767j08849k695106j212895K040533K178906j029030k748438o83913
44578B648975J376988q5967k654947k316546q2796L46453p83926k15539J860312
44569I3007J757780j039685k433444l62647J804356R08351r76858l65373J828046
$$ y = [50807, 1574313, 4810605, 8912811, 10824209, 8422438, 3582735, 57988, -1432024, -3396219, -6775489, -9166897, -8889028, -7657176, -7332151, -6808435, -4656677, -2565790, -3037131, -5034496, -5130792, -2473425, 266392, 934717, 409493, 635591, 2100009, 3896105, 4936905, 4630147, 3347923, 2404227, 2659833, 3219458, 2541552, 737181, -417775, 100786, 1192970, 1071831, -499198, -1693809, -336560, 3529108, 6907767, 6798918, 4103812, 2890917, 4931450, 7110356, 6081326, 3332888, 2648975, 4025963, 3939996, 1285049, -1031497, -1114293, -767840, -1551766, -1767305, 93007, 1850787, 811102, -1622342, -1984989, -180633, 727718, -249140, -614513, 1213533]
44560A213533K079894Q5620j034880K20725J878377J919991P88008k91152j251316
44551E608800k308024k737319j887206n08128J43386M2591J44761O22073N34544
44542c44522m21311q97302L78120K344914K473403J91241j906522j301493J039449
44533A555977K097398J079285J72545P76988J221572m49407l064577l638568j399497
44524a648284J323959K147598J060973l54994q57434k73386P56580J282764Q37240
44515D275016q0070p60210j332902k189846k544874r89842K057616L916679K818936
44506E170503N30532K19381K061012K776640J12411l724650m550723j597334J269232
44497B267004L10343l361287n228540l129295J91391Q89700j187632k992030k573173
$$ y = [1213533, 3293427, 3379047, 2344167, 2564892, 4443269, 6363260, 7151268, 6860116, 5608800, 3300776, 563457, -1323749, -1831877, -1688491, -1645900, -1501139, -879066, -344522, -765833, -1663135, -1285015, 1059899, 3533302, 3724543, 1818021, 516528, 1555977, 3653375, 4732660, 4905205, 5682193, 6903765, 6454358, 3389781, -248787, -1648284, -324325, 1823273, 2884246, 2529252, 1671818, 1398432, 2155012, 3437776, 4275016, 4194946, 3434736, 2101834, -88012, -2632886, -3622728, -1565112, 2351567, 5170503, 5701035, 5920416, 7981428, 10758068, 10870479, 7145829, 2595106, 997772, 2267004, 2577347, -783940, -6012480, -9141775, -8950384, -8060684, -9248316, -12240346, -14813519]
44488a4813519q63809O85267K058185L485788M126819L295193J806763P33450
44480E14137j95450j499417k231666j216280O37032J380669J128817J721479L079291
44471C318612K619023n45800l364709k853038m42962K15656j402806k461977j457877
44462f375878n8290L23181Q67506K648268L819754J918572k017015m010661j894546
44453d779109K215917M570169L662731J009469r36241r48460L58047J469349J571098
44444H192970J202261J076605P05206p94303k611783k516685j9847K105359J030408
44435H370191k123532l410334j227561J572199J532990j052127l051784k766783
44427b156741j540973j240918j688592j253805P19884K758539K611293j72618
$$ y = [-14813519, -15677328, -14992061, -12933876, -9448088, -5321269, -2026076, -219313, 514137, 318687, -1180730, -3412396, -4628676, -3991644, -2610975, -1482158, 239321, 3318612, 5937635, 5391835, 2027126, -825912, -1268874, -1053218, -2456024, -4918001, -6375878, -6434168, -6110987, -5243481, -2595213, 1224541, 3143113, 1126098, -2884563, -4779109, -2563192, 2006977, 5669708, 6679177, 5742936, 4794476, 5152523, 6621872, 8192970, 9395231, 10471836, 11177042, 10382739, 7770956, 5254271, 5234424, 7339783, 8370191, 6246659, 2836325, 1608764, 3180963, 4713953, 3661826, 610042, -2156741, -3697714, -4938632, -6627224, -7881029, -7161145, -4402606, -1791313, -1963931]
44419a963931l115936k976000N09846L828266L523491J70169k632709k660632
44411e317436r37717M70700O71621k51157j727543k324867o84955K147628L024882
44402d928844O93055k014944j707719J064681K880164K190363O90915J91271M71430
44393d69628O92627Q84384J096222O39471o49607j427842l22871K115223L865196
44384F423175L594360J745458l13349j666566k388098l013955l613641l521604
44376b754220k151485Q4764J935981K293516R52624j164857k361400j454124P97446
44367c821755K292369K159298J685337J860827J497924m89664k284661j267734
44359A631941J666101K869242J162405p97873j137204j483521l367469m926515
$$ y = [-1963931, -5079867, -8055867, -7546021, -3717755, -194264, -24095, -2656804, -5317436, -6255153, -5784453, -5112832, -5363989, -7091532, -9416399, -10101354, -7953726, -4928844, -4235789, -6250733, -7958452, -6893771, -4013607, -1823244, -1132329, -941058, -469628, 222999, 1107383, 2203605, 2843076, 2193469, 765627, 442756, 2557979, 6423175, 10017535, 11762993, 11449644, 9783078, 7394980, 4381025, 767384, -2754220, -4905705, -4820941, -2884960, -591444, 361180, -803677, -3165077, -4619201, -3821755, -1529386, 629912, 2315249, 4176076, 5674000, 5184336, 2899675, 1631941, 3298042, 6167284, 7329689, 6531816, 5394612, 3911091, 543622, -4382893]
44351d382893l853393j381702k52434k84635O54756K211205J811640n79156j644526
44342g701138K82140K565529K359365P64369O03727J916805K373823J227364J02760
44333D494744n9825l37451j478333k335014j847135j051398j538273k780956k689106
44324i622747n98999J772751K516749J476925j86504j187849n93086J518300L284770
44315a619690K454270m33221j781675N34863L713798L341895o05436l730221l097608
44306a223025l78857J488804J993744J975730J279259l54703j601133j012514
44298B167305O62974J539035J300786J019336Q15047k64762k080505k978188j981066
44289A99962j14416R13987M98477o34023j295266q53439J24307M17681k73991
$$ y = [-4382893, -8236286, -9617988, -9870422, -10155057, -9500301, -7289096, -5477456, -6056612, -7701138, -7418998, -4853469, -2494104, -1729735, -1126008, 790797, 3164620, 4391984, 4494744, 4434919, 4097468, 2619135, 284121, -1563014, -2614412, -4152685, -6933641, -9622747, -10221746, -8448995, -5932246, -4455321, -4641825, -5829674, -6422760, -4904460, -1619690, 834580, 401359, -1380316, -845453, 2868345, 6210240, 5604804, 1874583, -1223025, -1601882, -113078, 1880666, 3856396, 5135655, 4780952, 3179819, 2167305, 2830279, 4369314, 5670100, 6689436, 7504483, 7239721, 5159216, 2181028, 199962, 85546, 999533, 1498010, 863987, -431279, -1284718, -1160411, -742730, -1016721]
44280a016721q82888o48350l25591p41768j100318j37340J722754K896902K784788
44271B551468J831902J03440k265874l652532k324576O35535K102938J111441
44263I3742K6727O66388J512698L17853k272419l614675k606900n72030R17244
44254e531372J567260J760875J582610Q11180m70531j415304q30552J397315L502282
44245B373763L409530J150670j273142k403533k413155j697313k25150J138725
44237F0395O73638j562537k819035j028579K180290L634268K735563J417364P08288
44228E999655l01383k008584k992674j964870L67512K199571K507541J446510
44220E253278l37421k087632l027760k696694j309604K81277J138135J135543
$$ y = [-1016721, -1899609, -2547959, -2873550, -3615318, -4715636, -4852976, -3130222, -233320, 2551468, 4383370, 4486810, 2220936, -1431596, -3756172, -3120637, -1017699, 93742, 120469, 786857, 2299555, 2617408, 344989, -3269686, -5876586, -6448616, -5531372, -3964112, -2203237, -620627, 190553, -279978, -1695282, -2525834, -1128519, 2373763, 5783293, 6933963, 5660821, 3257288, 844133, -853180, -1078330, 60395, 734033, -828504, -3647539, -4676118, -2495828, 1138440, 3874003, 5291367, 5999655, 5698272, 3689688, 697014, -1267856, -900344, 1299227, 3806768, 5253278, 4915857, 2828225, -199535, -2896229, -4205833, -3924556, -2786421, -1650878]
44212a650878J308992K582065L941564L049892m85141l654941l396082o14761
44204A080710J019791m5700j768125k126234j777359j918429j641745M23994K987952
44195c765145L085261J78285k775149k958550q79358R35241J208559O82079L38307
44186c950470K71567L14083O17703J158751J354577P18247l68728q85813j45786
44177i15869J413316K250073R24382k057514l929267k355845J480709L863543
44169F73528L054198J184985O30841L92145j729281m644592m753707j245900K345527
44160d092256K898967J504411Q98269J191152M86311j371987k208641p13531J651525
44151B44220K503775J231409o57039j308901l73502O95313K30321j662996l135898
$$ y = [-1650878, -341886, 2240179, 6181743, 9231635, 8746494, 5091553, 1695471, 1080710, 2100501, 2054801, 286676, -1839558, -3616917, -5535346, -7177091, -6753097, -3765145, -679884, -501599, -3276748, -6235298, -7114656, -6179415, -4970856, -4288777, -3950470, -3678903, -3364820, -2747117, -1588366, -233789, 484458, 115730, -770083, -915869, 497447, 2747520, 3671902, 1614388, -2314879, -4670724, -3190015, 673528, 3727726, 4912711, 5543552, 5935697, 4206416, -438176, -5191883, -6437783, -4092256, -1193289, 311122, 1209391, 2400543, 2886854, 1514867, -693774, -1407305, 244220, 2747995, 3979404, 3322365, 2013464, 1639962, 2335275, 2565596, 902600, -2233298]
44142b233298k803571j233150J82541R72947J422733J434975P40282o6330J29686
44133a453185J408410K377844J641616n13134k024280q68855K580877N225820
44125H375113M229955M21393k544435k752095k096715k834925l919482k794824
44117c916015K90284K300400J631203L594m06540J87944K53929n22692j134927
44108a312820j069670q86804q89496k85369J502902L111125K189297j237477l658405
44099b536717k069070J610610K570764k92529k739360j358718J604547K021684
44091a188789N2414q16087N10464J695163J292186N30799L26383l00310j767079
44082C35144k507531j379523L74272P89036n17953k381314l163961j641433J561245
$$ y = [-2233298, -5036869, -6270019, -6087478, -5114531, -3691798, -2256823, -1516541, -1582871, -1453185, -44775, 2333069, 3974685, 3461551, 1437271, 568416, 3149293, 8375113, 12605068, 13026461, 10482026, 7729931, 5633216, 2798291, -1121191, -3916015, -3625731, -1325331, 305872, 309466, -97074, 90870, 344799, -177893, -1312820, -2382490, -3269294, -4158790, -4444159, -2941257, 169868, 2359165, 1121688, -2536717, -4605787, -2995177, -424413, -716942, -3456302, -4815020, -3210473, -1188789, -1136375, -1952462, -1441998, 253165, 1545351, 2076150, 2402533, 2102223, 335144, -2172387, -3551910, -3177638, -2388602, -2906555, -5287869, -8451830, -10093263, -8532018]
44073h532018L467899J821000j322223j716013J028279K737585J041336j131026
44065b605181n56333J095184L42056k212637k938995j005505O49770J06144j067596
44056h193093p75100P45208J992646K253923J559212m7786k137460l511656k991549
44047a1105655m67084K862626N010395M347320J021351k755812m373856k888099
44039h348814N30441L642261M501521K711461p1116j551581j166488l20098j10186
44030a82599j29258N5980l0803k83028N49151K398795K646416m80874m563991
44021b0211n543992k940240p2856O09700l9312k57697J35398L99028L48371L02330
44011g079481N07042J057103J723398J888760J339100P34627N01923m340j135423
$$ y = [-8532018, -5064119, -3243119, -4565342, -6281355, -5253076, -2515491, -1474155, -2605181, -3161514, -2066330, -1724274, -3936911, -6875906, -7881411, -7231641, -7125497, -8193093, -8968193, -8222985, -6230339, -3976416, -2417204, -2464990, -4602450, -8114106, -11105655, -11572739, -8710113, -3699718, 647602, 1668953, -1086859, -5460715, -8348814, -7818373, -4176112, 325409, 3036870, 2965754, 1414173, 247685, -72413, -182599, -311857, -255877, -286680, -569708, -20557, 2378238, 5024654, 4543780, -20211, -5564203, -8504443, -8577299, -7967599, -8006911, -8264608, -8129210, -7730182, -7381811, -7079481, -6572439, -5515336, -3791938, -1903178, -564078, 170549, 672472, 668132, -467291]
44002d67291j700987o59762P67183N26057j318693k915933l275867k590527o85773
43993a2321593K331221M342974K980534p92560l475403l547541k545875j584108
43985a4612351K4064K068717K679815J506085P06271J355018J685812M61144p93190
43976d918615q08027r87477k480901l411177j726338J275292L001767L324435
43968f731041L534908L270423J516641n75548q99364L61163J293166J230650P42416
43959C743414k90578j947055k633156r73497J540936K539544K344131K546562
43951F870301K283445k93533l638856m162542j846107k20523m59983m0314J823839
43942C15727K158267m75769k963464k381060q7063J434185K264905K860439J768661
$$ y = [-467291, -2168278, -2828040, -2060857, -1534800, -2853493, -5769426, -9045293, -11635820, -12321593, -9990372, -5647398, -2666864, -3459424, -6934827, -10482368, -13028243, -14612351, -14588287, -12519570, -9839755, -8333670, -7627399, -6272381, -4586569, -4125425, -4918615, -5726642, -6714119, -9195020, -12606197, -14332535, -13057243, -10055476, -6731041, -3196133, 74290, 1590931, 1015383, 116019, 477182, 1770348, 3000998, 3743414, 3452836, 1505781, -1127375, -2100872, -559936, 1979608, 4323739, 6870301, 9153746, 8860213, 5221357, 1058815, -787292, -1007815, -1467798, -1508112, 315727, 2473994, 1998225, -965239, -3346299, -3433362, -1999177, 265728, 3126167, 4894828]
43933D894828j114469k322254K58592L079170J789189k033810l640207k525664
43925a614625j908137k243456j061382J135135Q79875j577116j556997K200616
43917e746087M593271K001096j932869k215087L9523O61506l92448j84619J024563
43908b151151L67430j669012j402393J515870K869469O10641j754974q32625J500692
43899i46053J705680L68129O18181K486076K773726K36085k511645k857877j349302
43890E23000J7446O60439J245191J915244K045584J266616j25210j467779j968919
43881D111612j140753M26389J129102j21993k503312l891659k997838p02893Q45801
43872d845544N01613o11967m20834J448689L009065K448182N75956m27122k17617
$$ y = [4894828, 3780359, 1458105, 1716697, 4795867, 6585056, 4551246, 911039, -1614625, -3522762, -5766218, -6827600, -5692465, -4812590, -6389706, -7946703, -5746087, -1152816, 848280, -1084589, -3299676, -3260153, -2598647, -2991095, -3175714, -2151151, -1783721, -3452733, -4855126, -3339256, -469787, 140854, -1614120, -2446745, -946053, 759627, 1127756, 1745937, 4232013, 7005739, 7241824, 4730179, 1872302, 523000, 540446, 1200885, 2446076, 4361320, 6406904, 7673520, 7548310, 6080531, 4111612, 2970859, 3397248, 4526350, 4404357, 1901045, -1990614, -4988452, -5691345, -4845544, -4343931, -4955898, -5376732, -3928043, -918978, 1529204, 2105160, 1678038, 1460421]
43863A460421m85980j749787k005599J70541K766487K515613p64524l911729m311329
43854f315886k298407L72566K549895L524185K575096J8827k224253k416496r65354
43845e179827L53765P32071Q37394J173668J115824Q039j532939k132750j350827
43836e975582l04507l22075j215824j410557O9789K292694L557259L355979K448807
43827B495983J384420J14221q96387n08991J474650L432961L426713J128284k097093
43818I954761m361707m247328j714009J277516K040657J4477k395322k670920
43810b101875j016310O25417J339190J582217J569197J069573M85571M66182N37593
43801D556755l66046k055783l231146l377142k979921j986637J07956K517196
$$ y = [1460421, 974441, -775346, -2780945, -2610404, 156083, 2671696, 1907172, -2004557, -6315886, -8614293, -8241727, -5691832, -2167647, 407449, 426276, -1797977, -4214473, -5179827, -4826062, -4093991, -3256597, -2082929, -967105, -959066, -2492005, -4624755, -5975582, -6280089, -6602164, -7817988, -9228545, -9158756, -6866062, -3308803, 47176, 2495983, 3880403, 3994624, 3098237, 2589246, 4063896, 7496857, 10923570, 12051854, 9954761, 5593054, 1345726, -368283, 909233, 2949890, 2964367, 569045, -2101875, -3118185, -2492768, -1153578, 428639, 1997836, 3067409, 3552980, 4019162, 4556755, 4190709, 2134926, -1096220, -4473362, -7453283, -9439920, -9331964, -6814768]
43793f814768L494474K874467K362395K667146K375904O82361p40625q2059J873222
43784H692517K868961J954120j04302k097660k922423j990884k19613N29995p6724
43775F633987m08949J90354J31538j279428j895663l14196R29604r89153m166863
43766a168769m510619k141267q41516j426806n20493L070466N374502K901319
43758G36817k240456n377509m718137j506000K593126N651809N388325J901404
43750B429379j153697q60702J003184J006284o10066r60996L00826O25973q42048
43741I38137k001769j683653j510419k687391l642863k455392K78150K466727
43733a0298473L009784K102087L65903j168572j275842J94219J973844K938284
$$ y = [-6814768, -3320294, -445827, 1916568, 4583714, 6959618, 7641979, 6901354, 6819295, 8692517, 11561478, 13515598, 13411296, 11313636, 8391213, 6400329, 6180716, 6710711, 6633987, 6225038, 6415392, 6546930, 5267502, 3371839, 3057643, 3987247, 2998094, -1168769, -5679388, -7820655, -8662171, -10088977, -10609470, -7539004, -2164502, 736817, -1503639, -6881148, -11599285, -13105285, -10512159, -4860350, 527975, 2429379, 1275682, 414980, 1418164, 2424448, 1814382, 853386, 1154212, 1780185, 938137, -1063632, -2747285, -4257704, -6945095, -10587958, -13043350, -12765200, -10298473, -7288689, -5186602, -4820699, -5989271, -7265113, -7070894, -5097050, -2158766]
43725b158766L153149K936572K081214P09175k53000l00812q1520j80054k72387
43716E633571k74801j030196k635665l252929j242560K123623L731184K280243
43708E332470m44495j932923j403698J46197J201269P55272j000079k604121k543152
43699b493260q42983R59074J514255Q58301j06004o70096n97688J33080J365695
43690A20374K583699K933501J683301r83092l570198m249428k715529o48246K30161
43681d615457P3681J19682N50885M93450K6808N20716K310333L464267K098497
43672E042862r06889k776334k012262L86989K502478L101406J916232l01766j845587
43663E107129j395827L50891J420655J140463P06012P91515K32309j781685l584135
$$ y = [-2158766, 994383, 3930955, 6012169, 6721344, 6468344, 6167532, 6086012, 5905958, 5633571, 5358770, 4328574, 1692909, -1560020, -2802580, -678957, 3052227, 5332470, 4887975, 2955052, 1551354, 1697551, 2898820, 3654092, 2654013, 49892, -2493260, -3336243, -2377169, -862914, -4613, -110617, -780713, -1378401, -1245321, 120374, 2704073, 5637574, 7320875, 6337783, 2767585, -1481843, -4197372, -4845618, -4615457, -4541776, -4422094, -3871209, -3377759, -3350951, -2830235, -519902, 2944365, 5042862, 4135973, 1359639, -652623, -265634, 2236844, 5338250, 7254482, 6952716, 5107129, 3711302, 4062193, 5482848, 6623311, 7329323, 8120838, 8353147, 6571462, 2987327]
43654B987327k840750J63081K746033L191122K404356K111935K653652K861357
43646A6278113J302211k330747o207206p087841l473034J959120M597950K980043
43638H018609K13906k14542J459948K449341J458637p0460n26807m95089j758420
43629A0535123m287246n314332k526940K102182L662823M89090l099940k394208
43621h33448J236623K735822R30981o53446l62502o53722k412692k274141J361174
43612i25351M213151K210234j919047k957045j263370j051696k476036j562263
43604e731423K255758M438700K282618j319088k611576j423727O46228K754465
43596A291955L856529K607975n8626j234746l26108K7689j386898k256634j018425
$$ y = [2987327, 146577, 309658, 3055691, 6246813, 8651169, 10763104, 13416756, 16278113, 17580324, 15249577, 9042371, 1954530, -1518504, 440616, 5038566, 8018609, 8232515, 8017973, 9477921, 11927262, 13385899, 13315439, 12788632, 12293543, 10535123, 6247877, 933545, -1593395, 508787, 4171610, 4660700, 1560760, -833448, 403175, 3138997, 4069978, 3416532, 3054030, 2400308, -12384, -2286525, -925351, 3287800, 5498034, 3578987, 621942, -641428, -1693124, -4169160, -5731423, -3475665, 963035, 3245653, 1926565, -685011, -2108738, -1462510, 1291955, 5148484, 7756459, 7697833, 6463087, 6136979, 6164668, 4777770, 2521136, 1502711]
43587A502711L22209j13874r01492l88985J48281p43188j633317q95260J72743
43578b530172M0385J95273K215052L931701K469289o28619j362068Q11124K881272
43569H023237L128380K195756J68797l219053n714194m168426L77758L020253
43561C812508J381164j571279k141113l46860J534359K225667J708450K03353
43553F806249j648874k860668l177331l005014k159298k14293J924666K668116
43545a666447K084611J687146J782012J118120n74382j859071j868230j292403
43537e88644o51704M05883J566339J612411M23992m68567R8508J730105L353238
43528G481561L804385K024021j279337k832603m23948L163311L181466k78605
$$ y = [1502711, 1824920, 1711046, 809554, 420569, 568850, -174338, -1807655, -2702915, -2530172, -2489787, -2294514, -79462, 3852239, 6321528, 5692909, 4330841, 5141965, 8023237, 11151617, 13347373, 13516170, 10297117, 4582923, 414497, 792255, 3812508, 5193672, 3622393, 1481280, 1134420, 2668779, 4894446, 6602896, 6806249, 5157375, 2296707, -880624, -3885638, -6044936, -6259229, -4334563, -1666447, 418164, 2105310, 3887322, 5005442, 4431060, 2571989, 703759, -588644, -1240348, -834465, 731874, 2344285, 2768277, 2299710, 2398218, 4128323, 7481561, 11285946, 13309967, 12030630, 9198027, 8774079, 11937390, 15118856, 14840251]
43520A4840251k430319j123869M41176k99982j231998r2478J099735k83595k535945
43511H382976k278602P8335J330456N00448n87660p52568m13060R3895M78004
43502F832224l35232k484795l664102j935349R85786J944278P82615k98496p19949
43493A106980j534381k191476r91718J265381J714247r66j025658n7208N94019
43484a120780p14625j685620M54382M231705N438955K674104r55175j937242o04516
43475E781188k55984k427198m375243k512219K209180M661043K141186j867987
43467C353966k627088o24618J00542j323381j741346K14624J746848O79142j007208
43458a228519n97688J161068J797940J047158M36676K77629l51265j258313j127913
$$ y = [14840251, 12409932, 11286063, 11727239, 11427257, 10195259, 10102781, 11202516, 10918921, 8382976, 6104374, 6182709, 7513165, 8013613, 7425953, 6673385, 6260325, 6354220, 6832224, 6496992, 4012197, 348095, -1587254, -601468, 1342810, 2125425, 1826929, 1106980, -427401, -2618877, -3610595, -2345214, -630967, -631933, -1657591, -1714799, -1120780, -1835405, -3521025, -3066643, 1165062, 6604017, 9278121, 8322946, 6385704, 5781188, 5525204, 3098006, -1277237, -3789456, -1580276, 3080767, 5221953, 3353966, 726878, 102260, 202802, -1120579, -2861925, -2647301, -900453, -221311, -1228519, -1826207, -665139, 1132801, 2179959, 2616635, 2894264, 2542999, 1284686, 156773]
43449A56773J52367R44847m2457k216219l833456l590727j600262O10149J323300
43440h095685M32409k98713O92530K817929M029659L131672Q69249j041857j555540
43431I81653j113863r57556j424218j279720M77522K531232K453845J79103j463463
43422C84535n07136J487495J877693O86477L6940O26935R41878N2254p94867k36840
43412D555364Q93439O12247j280918k519778j090678J903727L002568L93557l518899
43403B950629m588905j836853J430356J849437m5718j265081o53558J61253p4705
43394b073145k07545J235251L287158L459250J126117j409486j676701P1745J501056
43385E313700J195378n310o00840k11722P17188J922055K979289K673653K08680
$$ y = [156773, 309140, 1253987, 1211530, -1004689, -4838145, -8428872, -10029134, -9418985, -8095685, -7663276, -7961989, -7269459, -4451530, -421871, 2709801, 3579050, 2537193, 981653, -132210, -1089766, -2513984, -3793704, -3316182, -784950, 1668895, 1847998, 384535, -122601, 1364894, 3242587, 3929064, 3966004, 4592939, 5534817, 5587071, 4792204, 4555364, 5448803, 6061050, 4780132, 2260354, 1169676, 3073403, 6075971, 6469528, 2950629, -1638276, -3475129, -2044773, -195336, -241054, -1506135, -2159693, -1998440, -2073145, -2280690, -1045439, 2241719, 5700969, 6827086, 5417600, 3740899, 3812644, 5313700, 6509078, 6503768, 5902928, 5691206, 6408394, 8330449, 11309738, 13983391, 14192071]
43376A4192071k972278m036138j982858J036219K261510J274086l42958j369053
43368H060601j777903j668753p50311Q44777K151355K275452J315248J32005m95220
43359A0087251l83952O412q8079r53847j774732j273711O12508K133602J536009
43350I901461o02898j685977r0758K825355M326298L398965J399684j36131j191283
43341A8144716k430102l578011l444705j392502J638056L613895L068983O34658
43333A6254988j312705j178518o6084j41076j270635r71949J728357M168317L229809
43324B0440504n13018l525816l600089j754735r5669N59579N74567K30486o93332
43315A1622477k317640l822966l460018k70403L905873N402377K710354j501176
$$ y = [14192071, 11219793, 7183655, 5200797, 6237016, 8498526, 9772612, 9429654, 8060601, 6282698, 4613945, 3863634, 4708411, 6859766, 9135218, 10450466, 10582471, 10087251, 9703299, 9709711, 9621632, 8667785, 6893053, 5619342, 6231850, 8365452, 9901461, 9298563, 7612586, 7521828, 10347183, 14673481, 18072446, 19472130, 19335999, 18144716, 15714614, 12136603, 8691898, 7299396, 8937452, 12551347, 15620330, 16254988, 14942283, 13763765, 13697681, 13556605, 12285970, 11314021, 13042378, 17210695, 20440504, 19927486, 16401670, 12801581, 11046846, 10951177, 11510756, 12085323, 12315809, 11622477, 9304837, 5481871, 2021853, 1751450, 5657323, 11059700, 13770054, 12268878]
43307A2268878l486624k557706q00128K59523Q83022J646285K528656L156364
43299A3898270K643035O2874l361255l958548m976M731169N037680J234529j545529
43290A8737249r48670m363j175081k296845r21150J054447N88279j226433r30339
43281A2877094J590765K873325J125140j378315j658812L65723K377126K505910
43273B0677956J207166Q34268L155779O895756Q526488O214822K081621k72408
43265D9321448N68511L567189P269269J0565220J2384172J2425511J1973261J2791221
43257A20865802J5419456J9211959K3266982K6440177K7337201K5424594K1585477
43250B79551648J6828890J1166730M228178m074112j3687928k3452809k9674320
$$ y = [12268878, 8782254, 6224548, 5424420, 5683943, 6566965, 8213250, 10741906, 13898270, 16541305, 16604179, 13242924, 9284376, 9279400, 14010569, 19048249, 20282778, 18737249, 17788579, 17784216, 16609135, 14312290, 13391140, 14445587, 15033866, 13807433, 12877094, 14467859, 17341184, 18466324, 17088009, 15429197, 15794920, 18172046, 20677956, 21885122, 22719390, 25875169, 32770925, 41297413, 47512235, 49593856, 49321448, 49889959, 53457148, 60726417, 71291637, 83675809, 96101320, 108074581, 120865802, 136285258, 155497217, 178764199, 205204376, 232541577, 257966171, 279551648, 296380538, 307547268, 311775446, 307701334, 294013406, 270560597, 240886277]
43243B40886277k8434574k0798525j3112909j0080088r926950q629709n975968
43236A43927554m018573k098933J971294P058203R825348J0445304J2611405J7412722
43228A97134324K1624241K3259282K4641936K7868958L0538595K8538649K0910233
43221C74516218R817091k508588j4678921k5176899l2320246l5031737l3361431
43214B41255487k9085249k5387570k4031608k2924861j8816038j2463133q238477
43207A00308551q084264r137895q527675p042516o050785m249813o29490J963060
43199E8549173M1407n056413q394091p480551m092764o45174K064574L462246
43191C8448407K728408O93322j42652J306946L233123L585592K809850K655603
$$ y = [240886277, 212451703, 191653178, 178540269, 168460181, 158533231, 149903522, 143927554, 139908981, 137810048, 139781342, 146839545, 156664893, 167110197, 179721602, 197134324, 218758565, 242017847, 266659783, 294528741, 325067336, 353605985, 374516218, 384333309, 381824721, 367145800, 341968901, 309648655, 274616918, 241255487, 212170238, 186782668, 162751060, 139826199, 121010161, 108547028, 100308551, 92224287, 83086392, 74558717, 67516201, 61465416, 57215603, 56586113, 58549173, 58590580, 53534167, 45140076, 37659525, 33566761, 32921587, 34986161, 38448407, 41176815, 41870137, 41727485, 43034431, 46267554, 49853146, 52662996, 55318599]
43183E5318599L187180K575914l059k433853j648040K508207O520045P203075
43175G3228068N615021N357866P412492R155129R223127J0609646J6612258K5323868
43167A62537475L0979221L0450706K6093797K2051438J9805982J7949457J4694079
43160C24562155R624159L746010j564397n969648j0463095j5703969k0440160
43153B83791055k2643474k2111175k0789912k0377560k0701508k0751040k0175923
43146A36240463j9098319j7253344j4191160j0134866o175244l670235l428742
43139F2288553m991818o570346o345806m343010k596272k852186m361261m703260
43131B5524594k841191m99323J1673j339909k561644k472498k037878k513512
$$ y = [55318599, 58505779, 61081693, 61078634, 58644781, 56996741, 59504948, 66024993, 73228068, 78843089, 84200955, 91613447, 100768576, 109991703, 120601349, 137213607, 162537475, 193516696, 223967402, 250061199, 272112637, 291918619, 309868076, 324562155, 334186314, 337932324, 336367927, 330398279, 319935184, 304231215, 283791055, 261147581, 239036406, 218246494, 197868934, 177167426, 156416386, 136240463, 117142144, 99888800, 85697640, 75562774, 69387530, 65717295, 62288553, 57296735, 50726389, 44380583, 40037573, 37441301, 34589115, 30227854, 25524594, 22683403, 22184080, 22195753, 20855844, 18294200, 15821702, 13783824, 11270312]
43123A1270312l393397l135766j344005O99201J439610L88123j591078k774497
43115A558503j856389O41252K731143L194798K602903J612824k43199k856330
43107G385505m271957l122578j046627l46315l94306Q21208K584746K406843O44990
43098D661509J54452J046431J88783k860601l966207q12269K926393L022856Q45017
43089E206364L05007J498333J634730K87117p40413j495020l300220m694442k542211
43080c840755K420499N333761L633812K80544q19716L27081J204269P11828k23036
43071I028287n73519k18780K49845l9117j313264k455511k149284o70276O23533
43062B481914J366002K213203K896335K105367k03289j943499j189813J456355
$$ y = [11270312, 7876915, 4741149, 3397144, 4096345, 5535955, 5924078, 4333000, 1558503, -297886, 343366, 3074509, 6269307, 8872210, 10485034, 10241835, 7385505, 3113548, -9030, -1055657, -1401972, -1796278, -975070, 1609676, 4016519, 4661509, 4815961, 5862392, 6051175, 3190574, -775633, -1587902, 1338491, 4361347, 5206364, 5511371, 7009704, 8644434, 8931551, 8191138, 6696118, 3395898, -1298544, -3840755, -1420256, 3913505, 7547317, 7827861, 7008145, 7335226, 8539495, 9251323, 9028287, 8454768, 8235988, 8485833, 8446716, 7133452, 4677941, 2528657, 1858381, 2481914, 3847916, 6061119, 8957454, 11062821, 10859532, 8916033, 7726220, 9182575]
43054I182575L308413K169854j333184l914779l097770o36812m72569k646017
43046B559711k507397J820061M957413J613568m514844n256958j06941L127625
43038A692238M70488k662075q80219K725406K350237j103038k180399K55867K012646
43029B681151M53493k381484l528248k305596L63997K882564L184233O02770k473456
43020e20576l053488j346457J68292Q94445K415650M634001M836184J786275j732217
43011H082109k234894J4565J577165K81638k354158l362303k072902o89993j057477
43002a816250k061644j514940K32692Q04979j40897j68784J691136K879217J408364
42993A313873o05405k01458J742212K242807J063114L48566M44645j78073j200706
$$ y = [9182575, 12490988, 14660842, 13327658, 9412879, 6315109, 5678297, 5205728, 2559711, 52314, 1872375, 6829788, 8443356, 3928512, -1328446, -1435387, 1692238, 2162726, -499349, -1379568, 1345838, 3696075, 2593037, 412638, 668505, 2681151, 3134644, 753160, -2775088, -5080684, -4716687, -1834123, 1350110, 1952880, -520576, -3574064, -4920521, -4752229, -3857784, -1442134, 3191867, 8028051, 9814326, 8082109, 5847215, 5861780, 7438945, 7720583, 5366425, 2004122, -68780, -758773, -1816250, -3877894, -5392834, -5160142, -4355163, -4496060, -4664844, -2973708, -94491, 1313873, 708468, 507010, 2249222, 4492029, 5555143, 5903709, 6348354, 6170281, 4969575]
42984D969575n09239J664400K277064P9422k522635l338577l066093k711413j409581
42975d567077J152442K785150J790718m7839q2141J079831Q38993r33372j658305
42966C58400k61055J064818J81291j830533k226944m08390J255495N24554j680072
42957c022436k155320O26686M263031M941956J866721j938702l319725k309731
42949a047520j225181j444729k102323j720451l10536N59680j98301j478419j142354
42940a0110134R25226K269775J372927K03829J296452L493070L506392J257364
42932D214901J13044J245381J556517j043611l890142l867275k386306k427953
42924f485444l002075j045988K426726L069290K52767j442824P97806L781694
$$ y = [4969575, 4460336, 6124736, 8401800, 8481222, 5958587, 2620010, -446083, -3157496, -4567077, -3414635, -629485, 1161233, 1113394, 1031253, 2111084, 2950077, 2016705, 358400, 97345, 1162163, 1343454, -487079, -2714023, -3122413, -1866918, -1342364, -3022436, -5177756, -4551070, -288039, 4653917, 6520638, 4581936, 1262211, -1047520, -2272701, -3717430, -5819753, -7540204, -7850740, -7291060, -7489361, -8967780, -10110134, -9184908, -6915133, -5542206, -5338377, -4041925, -548855, 2957537, 4214901, 4327945, 5573326, 7129843, 6086232, 2196090, -1671185, -4057491, -6485444, -9487519, -10533507, -8106781, -5037491, -4784724, -6227548, -5429742, -1648048]
42916a648048L402399N95732p96291K58699J602688J764177J113833j25954k153107
42907D014128l976679l976374k296326o86388K57863J708639L939345M949751
42899C933959K934052r63512l524749k769185J83550K367887J861834m56709k123219
42890A443908k042506j511788j918475k546993j788811L53241K364759L143803
42882b502862K442949K97696k210412k634515k4444K649865J848681j232508k175523
42873c541073r9040J289199K15740l28920J548756K640242N6634l293270l113255
42864d624987n45633L57553l96704K10316J749336R05909j872957k230317R19002
42855e528482L519416K922659J205193M06151m87284j759222j177490J303293
$$ y = [-1648048, 1754351, 2350083, 1553792, 1812491, 3415179, 5179356, 6293189, 6167235, 4014128, 37449, -3938925, -6235251, -6921639, -6663776, -4955137, -1015792, 3933959, 6868011, 5904499, 2379750, -389435, -205885, 2162002, 4023836, 3567127, 1443908, -598598, -2110386, -4028861, -6575854, -8364665, -8011424, -5646665, -2502862, -59913, 237783, -1972629, -4607144, -4631588, -1981723, -133042, -1365550, -3541073, -3640113, -2350914, -2135174, -2464094, -915338, 1724904, 1781538, -1511732, -4624987, -5170620, -4813067, -5209771, -4999455, -3250119, -2344210, -4217167, -6447484, -5528482, -2009066, 913593, 2118786, 2524937, 2037653, 278431, -899059, 404234]
42847D04234J742778j621276m700975l693744q62157k7869l1720K324897N654533
42838h11299N739730K325671q75802k034733k454122k617445j428980P02505J868926
42829D14451J720446J290815L84083j470479k406425m95252K174222J991381k28244
42820C374998n48839J120050P42845k560934m541626k788180m20278l79216q49069
42811f850249M92018J899786J042924k73953J006680L815231M416447J998691
42803G547575n81020j027423L1982O09452m30346k292135k619453j90773K380651
42794C428510J069335l532683n770915k416421K614231L801804J338024o65132
42786a33247q43235j068121j562664k09272K997701M678227K444553j930393m737882
$$ y = [404234, 2147012, 525736, -4175239, -7868983, -8731140, -8759009, -8790729, -6465832, -811299, 4928431, 7254102, 6378300, 4343567, 1889445, -728000, -2156980, -1454475, 414451, 2134897, 3425712, 3809795, 2339316, -67109, -562361, 1611861, 3603242, 3374998, 2826159, 3946209, 4689054, 2128120, -2413506, -5201686, -5621964, -6001180, -6850249, -6358231, -4458445, -3415521, -3689474, -2682794, 1132437, 5548884, 7547575, 6966555, 5939132, 5971114, 6580566, 6150220, 3858085, 1238632, 1047859, 3428510, 4497845, 965162, -4805753, -7222174, -4607943, -806139, 531885, -133247, -976482, -2044603, -3607267, -3816539, -818838, 3859389, 6303942, 4373549, -364333]
42777c64333m077735q74208K407781L647408K647732R55909k75445j389234k553784
42768A24091k568704q02659J083585J152121j85326j223798j405942j001258J76818
42759d651072J759750K079718O31619l64887P06567J859591Q26022n85509P00452
42750B962251L369573L405677P14808q00169J02845K80833j788981l109668j359515
42741C777654J129906J264837j96371p24068j16567K88230M58605R74283R84989
42732G841498n51438k542473k859536j202938O99149J189294p9853k147611l117539
42723b771447j616306J322361L044486K527434J245054K60383j248082l389711
42715f25828m013103j821376R19593J152697q66411k451631k235032p50316J616444
$$ y = [-364333, -4442068, -5316276, -2908495, 738913, 3386645, 4342554, 4067109, 2677875, 124091, -2444613, -3247272, -2163687, -1011566, -1196892, -2420690, -3826632, -4827890, -4651072, -2891322, -811604, -179985, -544872, 161695, 2021286, 2847308, 2261799, 2962251, 6331824, 9737501, 10452309, 9652140, 9754985, 10035818, 8246837, 5137169, 3777654, 4907560, 6172397, 5976026, 5251958, 5135391, 5423621, 5882226, 6856509, 7841498, 7290060, 4747587, 1888051, 685113, 1384262, 2573556, 2493703, 346092, -2771447, -4387753, -3065392, -20906, 2506528, 3751582, 4011965, 2763883, -625828, -4638931, -6460307, -5540714, -4388017, -5254428, -7706059, -9941091, -10691407, -9074963]
42706i074963M636244O694296N779959K215677j424016l244041l421209k820598
42698f58651j857089q95612l92489k54434Q0093P58810J309852J241213M48872
42689b19435o04743q54793M48445K429072L251767K530838J650743J083029o04804
42680I110119l687252n323430k983160J549194M107262L215472Q27526j206732
42672E608999k661702l219771k098296J46439J701861J874596J487952P74643
42664C614721q65656k631529k374562P2683J848774P97518j482665j886418K29723
42655b677411K877201M202628L865934K352128M15257j071252j837879k527184
42647E599422l390938l270647j233890J093209P03316k598623m845583k492742
$$ y = [-9074963, -4438719, 2255577, 8035536, 10251213, 8827197, 5583156, 2161947, -658651, -2515740, -3411352, -3803841, -4058275, -3978182, -3219372, -1909520, -668307, -219435, -824178, -1678971, -1230526, 1198546, 4450313, 6981151, 8631894, 9714923, 9110119, 5422867, 99437, -2883723, -1334529, 2772733, 5988205, 6815731, 5608999, 2947297, -272474, -2370770, -2224331, -522470, 1352126, 2840078, 3614721, 2749065, 117536, -2257026, -2184343, -335569, 461949, -1020716, -2907134, -2677411, 199790, 4402418, 8268352, 10620480, 11035737, 9964485, 8126606, 5599422, 2208484, -1062163, -2296053, -1202844, -499528, -3098151, -7943734, -10436476]
42639a0436476K398253L934480o5702m678255l997034J090208M390560L046410
42631d317556P20352J152392K649374J860464j79260K2734K133693K228667q88187
42622E382673l802823l685155j757243l69378K17942O09251O04808M66830J446711
42613h86384L324529L690464J480874r93682j476913q83544p01769K06202L004436
42604F764213N149828L338984q13501k426714p26696k78077l583301o724623n136084
42595d435971n09626J780522L80257j003427L3581J259900K04532j434380n54729
42586d279341K017782K371624m99896k784667j140789K580148L955877J796170
42578D016908j044053j890619q65756N95015J527604J371458J54130p18354K15186
$$ y = [-10436476, -8038223, -4103743, -4169445, -8847700, -12844734, -11754526, -7363966, -4317556, -3597204, -2444812, 204562, 2065026, 1885766, 1908500, 4042193, 6270860, 5382673, 1579850, -2105305, -3862548, -4231926, -4013984, -3404733, -2799925, -2333095, -886384, 2438145, 6128609, 7609483, 6615801, 5138888, 4255344, 3553575, 3759777, 6764213, 11914041, 15253025, 14439524, 12012810, 11286114, 11008037, 7424736, 700113, -4435971, -4945597, -3165075, -2784818, -3788245, -3754664, -2494764, -2290232, -3724612, -4279341, -2261559, 110065, -389831, -3174498, -4315287, -1735139, 2220738, 4016908, 2972855, 1082236, 216480, 811495, 2339099, 3710557, 3864687, 3146333, 3361519]
42569C361519J783843J008127k379183m531004k336705K180694M404522K714381
42561F206194n75974k748269k845459j079567J463999K729926J501822o37895
42553D014777j057378K70605R06562j79239j176312n42492O36433O74252K7664
42544C574872L53467J637334J847476m56561l994469n653268l614616M26548K725654
42535c153563J606789o33404q25996R08839J641132j27192k522611k870373p61127
42526f737506J890971K876662J637609m1068K98903K458711L001617j87001m036172
42517A162726l970378p18316N00234k083795m130307k182160J047355J450405
42509h924236n4115P5075J783281K196021J168011J394801L333967M285582K905969
$$ y = [3361519, 5145362, 6153489, 3774306, -756698, -3093403, -912709, 3491813, 6206194, 5630220, 2881951, 36492, -1043075, 420924, 3150850, 4652672, 4014777, 2957399, 3228004, 4134566, 3955327, 2779015, 2236523, 2872956, 3547208, 3574872, 3928339, 5565673, 7413149, 6956588, 2962119, -2691149, -6305765, -5879217, -3153563, -1546774, -2180178, -3006174, -2097335, -456203, -583395, -3106006, -5976379, -6737506, -4846535, -1969873, -332264, -373332, -74429, 2384282, 5385899, 5198898, 1162726, -2807652, -3525968, -3025734, -5109529, -9239836, -11421996, -10374641, -8924236, -8978351, -8903276, -7119995, -4923974, -3755963, -2361162, 972805, 5258387, 8164356]
42500H164356R49950q1618p03641j240000j098217r15492k082822l362555j764195
42491b134234J892202K507224j740133n411439l108985K476921M505032J904421
42483H91009P089J744172L665238K129361j094550k162167j044482q26977k576427
42474G32266l916471k584411O73839L123085K791601L9081k769416l060915k62981
42465e234322L533807N459349M450146J771927o92534k025674k179910j177761
42457C905028Q18711K802760L191327J436074r89581k013913j361449o48827q84975
42448F255155j026460J31298J611837J276300j117640l372045l585359k177280
42440b004194p45541m8686J52885J68760K58174Q88699K085308K697778J349486
$$ y = [8164356, 9114306, 9032688, 8329047, 7089047, 5990830, 5075338, 2992516, -370039, -2134234, -242032, 2265192, 525059, -4886380, -7995365, -5518444, -1013412, 891009, 898098, 2642270, 6307508, 8436869, 7342319, 5180152, 4135670, 3308693, 732266, -3184205, -5768616, -5094777, -1971692, 819909, 858990, -1910426, -4971341, -5234322, -1700515, 3758834, 8208980, 9980907, 9288373, 7262699, 5082789, 3905028, 4723739, 7526499, 10717826, 12153900, 11164319, 9150406, 7788957, 7140130, 6255155, 5228695, 5359993, 6971830, 8248130, 7130490, 3758445, 173086, -2004194, -2749735, -2798421, -2645536, -2476776, -2218602, -1329903, 755405, 3453183, 4802669]
42431D802669j536480l371390j874213K030453M504108K728107j638571l958972
42423A685711j940191J634716K409798k88062l155727l250663p76725K298803
42415a382340M297360M057868J253731k420216m116586l161519j953636k245663
42407e671001k392335k80781K730856L588057K205455J188330J231114K38438
42399B838133k395194m030541k831787o88321n268K3423J362677L241970L398892
42390I13984K149504J924391K952036K664456L1470k525003k932111k581805l513854
42381i16932m417838k325659K354419N389858L954518J88555j708523n68262J093119
42372C043255Q34464r64660k247414j768561K41774K871378M873313M752328J916717
$$ y = [4802669, 3266189, -105201, -1979414, 51039, 4555147, 7283254, 5644683, 1685711, -254480, 1380236, 3790034, 3501972, 346245, -2904418, -3681143, -1382340, 2915020, 6972888, 8226619, 5806403, 1689817, -1471702, -3425338, -5671001, -8063336, -8344117, -5613261, -2025204, 180251, 1368581, 2599695, 2838133, 442939, -3587602, -6419389, -7107710, -7112978, -7089555, -5726878, -2484908, 913984, 3063488, 4987879, 7939915, 10604371, 10635841, 8110838, 5178727, 2596922, -916932, -5334770, -7660429, -5306010, 83848, 4038366, 4226921, 2518398, 1950136, 3043255, 3877719, 2913059, 665645, -1102916, -861142, 2010236, 6883549, 11635877, 13552594]
42363A3552594j996211m043623k866921j2975K118916K856252L001220K809317
42355A5418569J640028m26570j964252j762308k91708Q68818O27991q29748k339630
42346A0941190k656166j645805p49492j484932l164924l085966J69761M322851
42338B646517N465881K454514j736845l266190j370861J229135J431518j120418
42330E733251l911534m307430k198065K84009J409005J506098J803067K440246
42322B758647K367497Q51989j558358l412107l382632j425310O74284O90166j356954
42313c792778k793477j706560K21889J16077j544469j371619J653588M141933
42305e075416K970141k58086j561413J05711K306169L058978K752255K174302
$$ y = [13552594, 11556383, 7512760, 4645839, 4632864, 6751780, 9608032, 12609252, 15418569, 17058597, 16632027, 14667775, 12905467, 12613759, 13482577, 14110568, 13280820, 10941190, 8285024, 6639219, 5889727, 4404795, 1239871, -1846095, -1676334, 2646517, 8112398, 10566912, 8830067, 5563877, 4193016, 5422151, 6853669, 5733251, 1821717, -2485713, -4683778, -4399769, -2990764, -1484666, 318401, 2758647, 5126144, 5978133, 4419775, 1007668, -2374964, -3800274, -3125990, -2435824, -3792778, -6586255, -8292815, -8070926, -7954849, -9499318, -10870937, -9217349, -5075416, -2105275, -2363361, -3924774, -3819063, -1512894, 1546084, 4298339, 6472641]
42297F472641J075547n54084j570711j112059R1192O31521q8826j711810l360775
42288a27364l787898k118558Q45218K892670K719980J312956L72966J56213k08531
42279B057652r01163j124568n14671K16877K92574j62308m78259l63170j39613
42270a116649j95220m48103m88629j93024J14135K98552P80783J707709K149120
42261B608674J086698q39628j682924o05687J070615J702733J197712L90421m24252
42252D504362j329860j891918j561888o51104j5695k466l05024m36166J52201
42243a537558J648846K915221K010471j167334l776656l113496l2058K429109
42235f23455L120061L286728L337290J803240j715742m798361m760023j682929
$$ y = [6472641, 7548188, 6994104, 5423393, 4311334, 4402526, 5034047, 4945221, 3233411, -127364, -3915262, -6033820, -5188602, -2295932, 424048, 1737004, 2109970, 2266183, 2057652, 1156489, 31921, -482750, -265873, 26701, -135607, -613866, -977036, -1116649, -1311869, -1759972, -2248601, -2441625, -2327490, -2028938, -1248155, 459554, 2608674, 3695372, 2855744, 1172820, 567133, 1637748, 3340481, 4538193, 4928614, 4504362, 3174502, 1282584, -279304, -930408, -946103, -948569, -1253593, -1689759, -1537558, 111288, 3026509, 5036980, 3869646, 92990, -3020506, -3052564, -623455, 2496606, 5783334, 9120624, 10923864, 9208122, 4409761, -350262, -2033191]
42227b033191K062080M172356L591612P31374k420729l445862j761531Q78402
42219A774511K530677K703579J688630j16791j665767j826392j265655j808431
42211B014361l016085j965296J862292M291728J983074k030648k212726J368607
42203B295307L220312O09414k963596l667373k568521k518661k974956j269899
42195i837973K481236M946691L934168R85649p57867n563J772099K300031J101434
42186F919905J825O74105K110185J719659j066750l754655l798075j383129J281187
42177B704257K237253R64708j349296k375328r88585P49290n8344k572505k790746
42168c479296L87342L011372K067587K81127J590127M480182M195711K15197l063159
$$ y = [-2033191, 28889, 4201245, 7792857, 8524231, 6103502, 2657640, 896109, 1774511, 4305188, 7008767, 8697397, 8580606, 6914839, 5088447, 3822792, 2014361, -1001724, -2967020, -1104728, 3187000, 5170074, 3139426, 926700, 2295307, 5515619, 6125033, 3161437, -505936, -3074457, -5593118, -8568074, -9837973, -7356737, -2410046, 1524122, 2509771, 1751904, 1746341, 3518440, 5818471, 6919905, 6921730, 7595835, 9706020, 11425679, 10358929, 6604274, 2806199, 1423070, 2704257, 4941510, 5906218, 4556922, 2181594, 1193009, 1942299, 1883955, -688550, -3479296, -3091954, -80582, 1987005, 2268132, 3858259, 8338441, 12534152, 12749349, 9686190]
42159I686190k856183r42059L40618R95126J230786J35364j918065k671803j528235
42150B471739q70416k016021k664166p08454J884469J875836k98284j393670k41267
42141a960234J054000N86613r65063j691875p37684R67129J562468K31948j319407
42132b272105n47371K177901L337272J047276j970465k222649l45926N14793k77881
42123e59155p32312l02318n12102j494054j368914K39489J260555Q62085J069640
42114a537086L034512M366323K516555j079185k810831j768087l35426l21609
42106B065166q03819k42437R56036J003595p54637k739725k797970p59186J213483
42097b859494J236723R6104O6472J691670L126487K831296J443392L28842m34268
$$ y = [9686190, 6830007, 5887948, 6228566, 7223692, 8454478, 8589842, 6671777, 3999974, 2471739, 1601323, -414698, -3078864, -3787318, -1902849, -27013, -325297, -1718967, -1960234, -906234, -319621, -1284684, -2976559, -3714243, -2747114, -1184646, -952698, -2272105, -2819476, -641575, 2695697, 3742973, 1772508, -450141, -796067, -281274, -559155, -1291467, -1593785, -2105887, -3599941, -4968855, -4729366, -3468811, -2606726, -1537086, 1497426, 5863749, 8380304, 7301119, 4490288, 2722201, 2386775, 2065166, 1261347, 1018910, 1974946, 2978541, 2223904, -515821, -3313791, -4072977, -2859494, -1622771, -1526667, -1460195, 231475, 3357962, 6189258, 7632650, 7961492, 7527224]
42088G527224j585279k988635l499506k337863l3671J919902K308588J416280
42080B727040P79684J149422J224334m58499k889849l561972j982514k90206j21327
42071c423887r04974j760996k794205l524126k387520O12473K804317K280845
42063i098073P18860P70130K190411K777524J853923M50507r23250k217579k355378
42054e832925m04621K132995K605015O22894j853810l375205l677150k129965
42046a1912772J549470N034847M923086J286563j898561j758435L82382J752177
42038f41243J527267L15305j377397k591396j840052O66030K343936J481662k84027
42029c99915m37382Q06727J274735K42297q89012q39283K73393J617910K275151
$$ y = [7527224, 5941945, 2953310, -546196, -2884059, -2917730, -997828, 1310760, 2727040, 3506724, 4656146, 5880480, 5421981, 2532132, -1029840, -3012354, -3302560, -3423887, -4328861, -6089857, -8884062, -12408188, -14795708, -14183235, -11378918, -9098073, -8379213, -7609083, -5418672, -2641148, -787225, -336718, -1259968, -3477547, -5832925, -6237546, -4104551, -1499536, -876642, -2730452, -6105657, -9782807, -11912772, -10363302, -5328455, -405369, 881194, -1017367, -2775802, -2393420, -641243, 886024, 1201329, -176068, -2767464, -4607516, -3941486, -1597550, -115888, -399915, -837297, -30570, 1244165, 1486462, 597450, -241833, 31560, 1649470, 3924621]
42020C924621J480866n34075k172216j992008m11169R46439J264401J035582Q82999
42011D425440P83320L85653m77258j502603j953184j444373p97083j238925k470440
42002d289453k641644q64099J368211K132068J482484R12418J163326J595755
41994H59066J312076J99377q40138n67926R76201J782732K71555j769166r51923
41985A271854K531982M360652K138294r33845q88453J086306R26971j834910l747055
41976D911796k943190j266373p08856r51177j037605p94079O5460J829914L195734
41967B301624K119279j057832l512978l596925k415970j214467L35305K247170
41959d794794L076201K144069R47863Q30643R14649j51295j858564k764791k562889
$$ y = [3924621, 5405487, 4871412, 2699196, 707188, 296019, 1242458, 2506859, 3542441, 4425440, 5208760, 5594413, 5117155, 3614552, 1661368, 216995, -580088, -1819013, -4289453, -6931097, -7795196, -6426985, -4294917, -2812433, -1900015, -736689, 859066, 2171142, 2370519, 1530381, 962455, 1938656, 3721388, 3992943, 2223777, 1271854, 3803836, 8164488, 10302782, 9368937, 8480484, 9566790, 10493761, 8658851, 4911796, 1968606, 702233, -6623, -957800, -1995405, -2789484, -2724024, -894110, 2301624, 4420903, 3363071, -149907, -3746832, -6162802, -7377269, -7041964, -4794794, -1718593, 425476, 1373339, 2203982, 3118631, 2967336, 1108772, -1656019, -4218908]
41950d218908j855666q62731M63624J856444L074106L923497L598154J470190
41942G448710j064651j554503j20538J57465k189560m419318l497830n15995J270777
41933d485443J188511J170640K058744K657895K120163R27764l25877j195013
41925D117384p90230J103451K688608J991422j99299j288139o29305j64676j150946
41916E678270k364007k138328n16245J266770K190806J932198R31457P4431n29302
41907F526050j943689m359867n494296l026462J766313M996923M742666K539749
41899E747387M10334j153016j967157j533612m76697l65580j182172j037501P05533
41890h52481K157826J750936K43775j134229k251090k596482q50404K280777L344068
$$ y = [-4218908, -6074574, -6937305, -6473681, -4617237, -1543131, 2380366, 5978520, 7448710, 6384059, 4829556, 4709018, 4866483, 2676923, -1742395, -5240225, -5756220, -4485443, -3296932, -2126292, -67548, 2590347, 4710510, 5638274, 5312397, 4117384, 3327154, 4430605, 7119213, 9110635, 8911336, 7623197, 6993892, 6829216, 5678270, 3314263, 1175935, 659690, 1926460, 4117266, 6049464, 6980921, 7055352, 6526050, 4582361, 222494, -5271802, -8298264, -6531951, -1535028, 3207638, 5747387, 6157721, 5004705, 3037548, 1503936, 1027239, 661659, -520513, -1558014, -852481, 1305345, 3056281, 3300056, 2165827, -85263, -2681745, -3532149, -1251372, 2092696]
41881B092696O77764k463859k131340O39545J478369j006466l712923l546740
41873g972954p06978K570985M307260L743670J868939Q33570J282679J056482
41865F983653j476522l944431k734331J436412M113763L288457J433522P47200
41857I847723N2697k032824m128011m431971l432142k099570J73715L328543M563163
41848A841323J660775k941477m567226k193447Q75719J920301J628675J780698
41840E341K584692L138868K870324J767554K53050q84784j365142k067369l645911
41831B656623m829442l677380m64907K321916K999516K137016R08887k24548q62136
41822I65545n64098p8429q73364k546569k512667L48990L273590K686310j133242
$$ y = [2092696, 2770460, 306601, -1824739, -1185194, 293175, -713291, -4426214, -7972954, -8679932, -6108947, -1801687, 1941983, 3810922, 4644492, 5927171, 6983653, 5507131, 1562700, -1171631, 264781, 4378544, 7667001, 9100523, 9847723, 9900420, 7867596, 3739585, -692386, -4124528, -6224098, -6050383, -2721840, 1841323, 3502098, 560621, -4006605, -6200052, -5324333, -3404032, -1775357, 5341, 2590033, 5728901, 8599225, 10366779, 10619829, 9735045, 8369903, 6302534, 2656623, -2172819, -5850199, -6315106, -3993190, -993674, 1143342, 2052229, 1827681, 965545, 401447, 323018, -550346, -3096915, -5609582, -5260592, -1987002, 699308, -433934]
41813d33934m279434l863926q95309J594112K030186J343395J166398J700244
41805a638268J678228L65441j124533j276118m06428r5210n13957j21273J482348
41796a649770K340149J009545r97947j325062m8137J070262J574384K219781K424430
41787F617635N75221k666002l936011j464587J963362K142229j340193m752189
41779b860535m829709k173055K81899Q69199K95154j83836k95081j67502O06353
41770h457113K270929L799561L716061J977880o5617j588930k851659l674287
41762d873175l002598p67302J275247J625544Q23522K39871L67144J217172K765679
41753c28896L789279K286324j104888k314043Q33697M516930L733530l01276k019266
$$ y = [-433934, -4713368, -8577294, -9472603, -7878491, -5848305, -4504910, -3338512, -1638268, 39960, 405401, -719132, -1995250, -2401678, -2496888, -3010845, -3132118, -1649770, 690379, 1699924, 701977, -623085, -671222, 399040, 1973424, 4193205, 6617635, 7192856, 4526854, 590843, -873744, 1089618, 3231847, 1891654, -2860535, -7690244, -9863299, -9581400, -8712201, -8417047, -8600883, -8895964, -9063466, -8457113, -6186184, -2386623, 1329438, 3307318, 3241701, 1652771, -1198888, -4873175, -7875773, -8643075, -7367828, -5742284, -4918762, -4678891, -4311747, -3094575, -328896, 3460383, 5746707, 4641819, 2327776, 3161473, 7678403, 11411933, 11110657, 9091391]
41744I091391j16172Q63862j689681m361194l668098j469436j042365j475048
41736c866741j22121J923086J337362j708131l555706k500875o25738l0379l43706
41727i492949m92175l32416J68714J287685K440004K427065J248640J92014j28119
41718b681537l68061r37409j293165q98550K88914K077290L535722K865215l98844
41709B189575l575895l489697p59481R90518K95596n27480M08316J577476Q24555
41700b066517j118679j880230p76956R21185K063802K347064J688060L32479q14372
41691F95836j095737j049414j590205k522045k562298p57546K368860M887105
41683a625444M895331K504421K4856p76549j012468k689019m905569m452190n29916
$$ y = [9091391, 8975219, 9839081, 8149400, 3788206, 120108, -1349328, -2391693, -3866741, -3988862, -2065776, -728414, -2436545, -5992251, -8493126, -9118864, -9149243, -9492949, -9985124, -10317540, -10148826, -8861141, -6421137, -3994072, -2745432, -2553418, -2681537, -3049598, -3987007, -5280172, -6178722, -5889808, -3812518, -276796, 2588419, 2189575, -1386320, -4876017, -5635498, -4644980, -4349384, -4876864, -4468548, -2891072, -2066517, -3185196, -5065426, -5842382, -4921197, -2857395, -510331, 1177729, 1510208, 695836, -399901, -1449315, -3039520, -5561565, -8123863, -8881409, -6512549, -1625444, 3269887, 5774308, 5799164, 5022615, 4010147, 1321128, -3584441, -8036631, -8566547]
41674h566547L596845M649897K922458P45057m78546l73584J066087K481531J487193
41665G530391j970687m402304l159145l44702K23967j488589k227777m73173K127031
41656d184988L884239M546030L687119P07569l011389m651111l519265j891752
41648d433548j588157j801094j051643P44151K919984M767581M911228K240729
41640F709231j519101k532532L29645L476801L173226K46777j819875j822336
41632F241836j343560j406802j337774p35356k42299j22054J27397M73377J81664
41623A836429p94731j587793j777860j739398j486914n21658Q58920J413040O46804
41614c153161m30253p59822m26808J36563J056615K316655L013541K290623N40662
$$ y = [-8566547, -4969702, -319805, 2602653, 3347710, 2869164, 2495580, 3561667, 6043198, 7530391, 5559704, 1157400, -2001745, -2346447, -2122480, -3611069, -5838846, -6312019, -4184988, -300749, 4245281, 7932400, 8639969, 5628580, 977469, -2541796, -4433548, -6021705, -7822799, -8874442, -8130291, -5210307, -442726, 4468502, 6709231, 5190130, 2657598, 2987243, 6464044, 9637270, 9884047, 8064172, 6241836, 4898276, 3491474, 2153700, 1418344, 1176045, 1053991, 1181388, 1654765, 1836429, 1041698, -546095, -2323955, -4063353, -5550267, -6071925, -5213005, -3799965, -3153161, -3583414, -4343236, -4770044, -4633481, -3576866, -1260211, 1753330, 4043953, 4584615]
41605D584615j072965j846195j652378m90183J140810J941924J125718j43328
41597C588018P3985J707298K426130P82981j645271k371918j380307r23832k261689
41588d605m120427m631299l467343j526663L66707J712461K224131K257865K528637
41579d660536K720174J527677r00010k000844r2038K570167K541109L32266l31749
41570A706216J445921K054086q10799m062920l671616o63767O69689r73128k931904
41561g238222l053092j682318M82494L031025M187544K076127j670526k998982
41553f865950j101196N46502M7519j21032J599288K137012q86811l908504k494245
41544a1047417J074649J170631j761096j767847K552801N423338L231214J40417
$$ y = [4584615, 3511650, 1665455, 13077, -477106, 663704, 2605628, 3731346, 3588018, 3662003, 5369301, 7795431, 8578412, 6933141, 4561223, 3180916, 2257084, -4605, -4125032, -8756331, -12223674, -13750337, -13383630, -11671169, -9447038, -7189173, -4660536, -1940362, -412685, -1312695, -3313539, -3405577, -835410, 1705699, 2037965, 1706216, 3152137, 5206223, 4395424, 332504, -3339112, -4002879, -3333190, -4306318, -7238222, -10291314, -11973632, -11491138, -8460113, -4272569, -2196442, -3866968, -6865950, -7967146, -7420644, -7373125, -7494157, -5894869, -3757857, -4644668, -8553172, -11047417, -9972768, -8802137, -10563233, -12331080, -9778279, -4354941, -1123727, -983310]
41536i83310Q70237L254577K687142j42507j363380r40807j788761l387255k217101
41527d011165J517010L168666Q06141j698664o85273K119720K883812J084105
41519E184352j001852k008300k076139j224063M72159J870837J764071M02376
41511C383441j053968j783759j238607P94097L001305K973275K85943k250090
41503D111637k088274m01632j13627j553469k341730j105687R25344K091861K206760
41494A731183J913722J497246P75816n17933k198848l014144j386912K225768
41486A025898M685588L413598m00201l395251m059090l232191j467270J330118
41478b098801L697954L178368R2117j926759p30065J282227Q62193j288168k011005
$$ y = [-983310, -113073, 3141504, 5828646, 5686139, 4322759, 3381952, 1593191, -1794064, -4011165, -2494155, 674511, 1480652, -218012, -903285, 1216435, 4100247, 5184352, 4182500, 2174200, 98061, -1126002, -653843, 1216994, 2981065, 3383441, 2329473, 545714, -692893, 101204, 3102509, 6075784, 6361727, 4111637, 2023363, 1621731, 1508104, -45365, -2387095, -3492782, -2567438, -475577, 1731183, 3644905, 5142151, 5917967, 5400034, 3201186, 187042, -1199870, 1025898, 5711486, 9125084, 8724883, 5329632, 1270542, -1961649, -3428919, -2098801, 1599153, 4777521, 4869638, 2942879, 2212814, 3495041, 4357234, 3069066, 1058061]
41469A058061p13888J84356l64550l33193J673475L550646K525900o44744k643738
41460D292325k171597j147061j137237j122799q4851M15035j402906l909468l698380
41451i966939n63531K050888J979063Q33405N84407N67087k95048q83989N2274
41442e642383J268019J065640K14299Q1034l21497k111422l100558p76731K386140
41433f937459J556340k572157l856621J45923M368397L978103J138378N51003
41425a628093K189407K702843J235237n35536k191825m116391m655231k024069
41417i023658J784097L098346K036094J771620K690822J844091j255897k933756
41409A1759j068433J498184J515964o136k49946R49541J827248J853062J482688
$$ y = [1058061, 344173, 528529, 163979, -169214, 1504261, 5054907, 7580807, 6936063, 4292325, 2120728, 973667, -163570, -1286369, -1371220, -956185, -2359091, -6268559, -9966939, -10530470, -8479582, -6500519, -5667114, -5082707, -4515620, -4810668, -5694657, -5642383, -4374364, -3308724, -3094425, -3013391, -3334888, -5446310, -8546868, -9323599, -6937459, -5381119, -7953276, -11809897, -11663974, -7295577, -3317474, -2179096, -1628093, 561314, 3264157, 4499394, 3963858, 1772033, -2344358, -6999589, -9023658, -7239561, -4141215, -2105121, -333501, 2357321, 4201412, 2945515, 11759, -1056674, 441510, 1957474, 1951338, 1701392, 2650933, 4478181, 6331243, 7813931]
41400G813931L27667j749292k889238j271268J759933L019962J580261o04784
41392G987172j853422k331664k428342j685919J7552J677389K196122J399847
41384D978735o3080j051293n03387J204997J922709J87061k353715k742644p35580
41375H43803J056142J126324P15311Q21674K87994j498069k402902n42387K146156
41366B554046K208776k67813j863421r42807L99145P4334j115606j603891j667694
41357b224931k056194j820243K12017K797924L406431J684437j70733n41641j16412
41348A170655j32333m95274m38447M5103L44716K41143P1019J64999N41975R39103
41338B452659R14020J79632r81549j867331k033204j619603r63500j03503J202148
$$ y = [7813931, 8141598, 6392306, 3503068, 2231800, 3991733, 7011695, 8591956, 7987172, 6133750, 3802086, 1373744, -312175, -294623, 1382766, 3578888, 4978735, 4915655, 3864362, 3360975, 4565972, 6488681, 6675742, 4322027, 1579383, 843803, 1899945, 3026269, 3741580, 4563254, 4851248, 3353179, 950277, 407890, 2554046, 4762822, 4495009, 2631588, 1688781, 2087926, 2162260, 1046654, -557237, -2224931, -4281125, -6101368, -5889351, -3091427, 315004, 1999441, 1828708, 1287067, 1170655, 1038322, 543048, 104601, 149704, 494420, 735563, 806582, 971581, 1513556, 2452659, 3366679, 3546311, 2564762, 697431, -1335773, -2955376, -3918876, -4022379, -2820231]
41329b820231K906880M068663L220962J11414l091831l632761j626632k28580
41321a092116j428071l258025k778750l76668J221259J248754J407993K340795
41313b714829K554234J336935J7722n33358j131874j971936j603595M25282K239110
41304a382309K405190J703248O72231j746144m938167n091310l38864M955077
41296c761048N103648P16156k874938l669784m480851o385500o129969j867935
41288b3350221L011687M553203L432825K622787K533378J659798K12882j82347
41280e506008M64284N69117k67054q18058l82258M46431J014180J164548Q70426
41271b444392N51202J130461K437818K458485m7430l005093l312204j187851K41380
$$ y = [-2820231, 86649, 4155312, 7376274, 7487688, 4395857, 763096, -863536, -1092116, -2520187, -5778212, -8556962, -8933630, -7712371, -6463617, -5055624, -2714829, -160595, 1176340, 1194062, 660704, -471170, -2443106, -4046701, -3621419, -1382309, 1022881, 2726129, 3398360, 1652216, -3285951, -8377261, -8716125, -3761048, 1342600, 2058756, -816182, -4485966, -8966817, -15352317, -21482286, -23350221, -20338534, -15785331, -12352506, -9729719, -7196341, -5536543, -5323661, -5506008, -5041724, -4472607, -4739661, -5557719, -5939977, -5493546, -4479366, -3314818, -2444392, -1893190, -762729, 1675089, 4133574, 4086144, 1081051, -2231153, -3419004, -3177624]
41262c177624l65708j031705j87901R29475J072500J587792L817216N664952L850073
41253A2159070q97388l923291k573406M70005J143012o62235j784975p30559O04092
41244C804325K64078r85661j321400p01937m35472p52374n85513L42492P95665
41235D24203k09580k023385l161706k630050l06016K814748M444744K636000j452336
41226E36622l853958k354882M12819M32224j923019k267348J353079N216216M740135
41217B291888M94548k935083k966281j253610j44925K77310P37874Q18482K75429
41208b404368N60074K629465M176665J846053l660119p360181n863786j230087
41200a1306284K435124M041957M917293M921501K553208j351626l458250k495450
$$ y = [-3177624, -3543332, -4575037, -4762938, -3833463, -2760963, -1173171, 2644045, 8308997, 12159070, 11261682, 7338391, 4764985, 5234990, 6378002, 5715767, 3930792, 3200233, 3804325, 4068403, 3082742, 1761342, 1059405, 623933, -128441, -713954, -371462, 424203, 214623, -1808762, -4970468, -7600518, -7906534, -5091786, -647042, 1988958, 536622, -3317336, -5672218, -5259399, -4827175, -6750194, -9017542, -7664463, -2448247, 2291888, 2786436, -148647, -3114928, -4368538, -4513463, -4236153, -3498279, -2679797, -2404368, -1844294, 785171, 4961836, 6807889, 3147770, -4212411, -10076197, -11306284, -8871160, -4829203, 88090, 5009591, 7562799, 6211173, 2752923, 257473]
41192B57473j171010j847539k718953q18488K789713M014602J578512j250217
41184H34093j422908J26869R02560O83401P00945N72420j058432l283157l304019
41175e248228o62650J495325P19500j319248j573463q3777P64961M65827R96118
41166d445635L106504M600416L267680j92529l095187l417152j076005K096495
41158H44587L357267J573991j030220j466343l07526p22069k780722k499424J595323
41149a435136M902613L214261n00764m56305K897060L617463n18712n015829n615424
41140A089227l346304j111095L79454J198548O04057p31307k45373K275219L190798
41131C303224M62459k579230k204332q8427j82802k134300k416267o33118J65167
$$ y = [257473, -913537, -2761076, -5480029, -6298517, -3508804, 505798, 2084310, 834093, -588815, -461946, 440614, 1124015, 1824960, 2397380, 1338948, -1944209, -5248228, -5910878, -4415553, -3696053, -5015301, -6588764, -6672541, -5907580, -5441753, -4445635, -1339131, 3261285, 6528965, 6336436, 3241249, -175903, -1251908, 844587, 4201854, 5775845, 4745625, 3279282, 2971756, 2249687, -531035, -3030459, -1435136, 3467477, 6681738, 6180974, 5724669, 8621729, 12239192, 11720480, 6704651, 1089227, -2257077, -3368172, -2988718, -1790170, -1186113, -1917420, -2162793, 112426, 3303224, 3765683, 1186453, -1017879, -1106306, -1289108, -3423408, -5839675, -6472793, -6307626]
41122f307626q11908p64772J542209L367715K264666l91309j864242j635005q90326
41113e490598l62045j59327k16345K66372K313689N054710N758537L298716R0320
41104A0554029r44429j01442R0560j362853l034278l577420l259699k748816j917054
41095f301402o33490K71952l0554p88822l01991J480636K189138R5583k809434
41086f828384k824777K44397K313234P12525j751342r20535K314656L281306O31264
41077b827656j788005j001065R49880J010170N7139O25913J798918L34730l622961
41068d462937n818647l704891J48140K047340K027457K388137L175118K194853
41060b005430q49058l187364k687862m20888J594270L073691M185704L543674
$$ y = [-6307626, -7119534, -7884306, -6342097, -2974382, -709716, -1101025, -2965267, -4600272, -5490598, -5852643, -6011970, -6228315, -5961943, -3648254, 1406456, 7164993, 10463709, 10554029, 9609600, 9508158, 9598718, 8235865, 5201587, 1624167, -1635532, -4384348, -6301402, -6934892, -6662940, -6693494, -7482316, -7784307, -6303671, -4114533, -4018950, -6828384, -9653161, -9408764, -7095530, -6383005, -8134347, -9054882, -6740226, -3458920, -2827656, -4615661, -5616726, -4666846, -3656676, -3599537, -2973624, -1174706, -839976, -4462937, -10281584, -13986475, -13838335, -11790995, -9763538, -7375401, -4200283, -2005430, -2854488, -6041852, -8729714, -9150602, -7556332, -4482641, -296937, 3246737]
41052C246737J95473l399718l535918m45936J702948O96039q57215J1051K161274
41043b25265K717676J662444J073669J161441K66573j722977k985013k820638
41035h72090k356453j890851k38851K496257L976580K738932L61342p95188m76866
41026B942812Q7953K78044R0413q23615k532009l844229l420739j641677k05335
41017i068382P7812Q2837Q05942J850564K011130R99421q8508j90742M46844R90768
41007b082314J398531J871644J340829j449618m905925n098119q83469L642152
40999f166289M087070J363144m08873N851M87081K28030P20398J955008J773917
40990D045337O159n48555J249541K808303K207782J236283J650206J648195q27158
$$ y = [3246737, 3442210, 42492, -3493426, -3939362, -2236414, -1540375, -2397590, -2386539, -225265, 2492411, 4154855, 5228524, 6389965, 6656538, 4933561, 1948548, -872090, -3228543, -5119394, -5358245, -2861988, 1114592, 3853524, 4214866, 3419678, 2942812, 3030765, 3308809, 3399222, 2575607, 43598, -3800631, -7221370, -8863047, -9068382, -8990570, -8907733, -8101791, -6251227, -4240097, -3240676, -3329184, -3519926, -3073082, -2082314, -683783, 1187861, 2528690, 1079072, -3826853, -8924972, -9808441, -6166289, -2079219, -716075, -1124948, -1119097, -632016, -403986, 316412, 2271420, 4045337, 4051496, 3502941, 4752482, 7560785, 9768567, 11004850, 12655056, 14303251, 13476093]
40981A3476093l889679m356082k799287k358133l562299l832640j837340O58383
40973h500984J484421L89745j410643k315240j231587J104991K332592J433613
40965f713092L86808J070803K032672R29696j117372r52840J361187K262517j2125
40956g51746l040047l896667k430671N1076K706084M514170M030659J293093j662097
40947H13854l235177l581179k831867l16014L127485M387240J768953k091916
40939a958621l210693j188265Q54993O01926j210244k613074k654003j606434
40931a2984415k34168Q55530J849219L534608N699816O312445L713294n78576
40923H167753k988323k251359r96747j943058l986209l885307j068764J581464
$$ y = [13476093, 9586414, 5230332, 2431045, 72912, -3489387, -7322027, -9159367, -8500984, -7016563, -6626818, -8037461, -10352701, -11584288, -10479297, -8146705, -6713092, -6326284, -5255481, -3222809, -2293113, -3410485, -4363325, -3002138, -739621, -751746, -3791793, -7688460, -10119131, -10068055, -7361971, -2847801, 1182858, 2475951, 813854, -2421323, -6002502, -8834369, -9150383, -6022898, -1635658, 133295, -1958621, -5169314, -6357579, -5502586, -4900660, -6110904, -8723978, -11377981, -12984415, -13218583, -12363053, -10513834, -6979226, -1279410, 5033035, 8746329, 8167753, 5179430, 2928071, 1931324, -11734, -3997943, -7883250, -8952014, -7370550]
40915g370550K014875J696297K648331L826552K861502L42008o26678P76359J686281
40906G854977j9604k530410l112388k179162k008837k794397k569330n58676J676690
40897f241137K507943K028932J468837J832664K899066L007006Q41139j968786
40889F375664j977088J022385K613944j06609l636367k998347O25081K020222
40881C938885L23552n35829L96906n27328l825624m166383J007442N816575L928516
40872F356712j995581m448809j767546J235546J651429J423003K054577J842575
40864F351906m87580l460805n337059n750626m253185m73145L565866M516094
40856e328534K097637l86258o80021J60220P57649J316562J437623m43054l647964
$$ y = [-7370550, -5355675, -3659378, -1011047, 2815505, 5677007, 6019015, 5392337, 6168696, 7854977, 7835373, 5304963, 2192575, 13413, -1995424, -4789821, -7359151, -7917827, -6241137, -3733194, -1704262, -235425, 1597239, 4496305, 7503311, 8344450, 6375664, 4398576, 5420961, 8034905, 7928296, 4291929, 1293582, 1918663, 3938885, 4262437, 3726608, 4123514, 3596186, -229438, -4395821, -3388379, 2428196, 6356712, 4361131, -87678, -1855224, -619678, 1031751, 2454754, 4509331, 6351906, 5864326, 2403521, -2933538, -8684164, -12937349, -13410494, -9844628, -5328534, -3230897, -3617155, -4297176, -4136956, -3379307, -2062745, -625122, -1068176, -4716140]
40847d716140m549082j529237K139726K733473P71451j168558k539399l616980
40839a2474746k766328J128137N119336N219433K166585K29295P08566P99656
40831A29934q55165j826749m43085J113262L66840j640502k350118j338432J40113
40822f703902J423569K171147J432167q15316k431750j579539N06441J213997
40814d783186J84874p57441n82403J56083R96099J884565K100664J030349n3439
40805A76165Q13161L134577M226845L065291J537552J002547J2190k848382n741120
40796E378826n528468k128551J238851K038829Q64107l52045r22550j288242j347789
40787b047032l29602J589511K663226J445344j130265k585936j850813k45197
$$ y = [-4716140, -9265222, -10794459, -8654733, -5921260, -5149809, -6318367, -8857766, -12474746, -15241074, -14112937, -8993601, -3774168, -1607583, -1378288, -669722, 129934, -725231, -2551980, -2995065, -1881803, -1514963, -3155465, -5505583, -6844015, -6703902, -5280333, -3109186, -1677019, -2492335, -4924085, -6503624, -5997183, -4783186, -4598312, -5355753, -5938156, -5782073, -4785974, -2901409, -800745, 229604, 176165, 989326, 4123903, 8350748, 11416039, 12953591, 13956138, 13968328, 11119946, 5378826, -149642, -2278193, -1039342, 999487, 1863594, 1511549, 588999, -699243, -2047032, -2376634, -787123, 1876103, 3321447, 2191182, -394754, -2245567, -2490764]
40779b490764P55778J241186J475474N15061j938877l586875j943668J791918
40771d180767L831624K676377L34721j370306k679048l447881k153394J030150
40763e958524L052143K003489j00291p30386n81655j235177j443563P45798L691076
40754e57090L789324Q44932j651433j486369J54712J513996K108311J499201p32640
40745E482944l170298l478776j830157q18261j354547j462448j4429J311588J134406
40736d199978N26648L44857p46938l245895m360023j684867K356230L154050L39963
40727g515953j666201K16668L814144M912378K476281o87211j518417K23007K231807
40718B486503K239983J34435k257971l153542k325287q44691J31569K16368q1713
$$ y = [-2490764, -1734986, -493800, 981674, 1496735, -442142, -4029017, -5972685, -4180767, -349143, 2327234, 2661955, 1291649, -1387399, -4835280, -6988674, -5958524, -2906381, -902892, -1003183, -1733569, -2315224, -3550401, -4993964, -4248166, -557090, 3232234, 4077166, 2425733, 939364, 1094076, 2608072, 4716383, 6215584, 5482944, 2312646, -1166130, -2996287, -3814548, -5169095, -6631543, -6645972, -5334384, -4199978, -3673330, -3328473, -4075411, -7321306, -11681329, -13366196, -11009966, -7855916, -7515953, -9182154, -8965486, -5151342, -238964, 2237317, 1550106, 31689, 254696, 2486503, 4726486, 4860921, 2602950, -550592, -2875879, -3720570, -3589001, -3372633, -3454346]
40709c454346J12989J082401K044043J955272P15923p51194j426919r16936L22239
40700c16528J127527O55290l52803l58054M23588q0221k275237l434953j788301
40691f399692J95305k89037j248475R97302M806647M672326j14100l838875k901550
40682d120149n75240p11903j852066j242554j36786n13564k95542K866653N895597
40673f85554M212427l88233j892862N04458J348236j941369m830938k936070J289442
40664e320463K582337M55258r73971O73420L103863K832156l94181l426907l456958
40655c925446j260683k2764r77204j787975k71591K064009K281966M56812q16039
$$ y = [-3454346, -3341357, -2258956, -214913, 1740359, 2456282, 1705088, 278169, -638767, -316528, 810999, 1466289, 1113486, 755432, 1179020, 1098799, -1176438, -4611391, -6399692, -6204387, -6493424, -7741899, -6744597, -1937950, 2734376, 2620276, -1218599, -4120149, -4695389, -5407292, -7259358, -8501912, -8638698, -9152262, -9447804, -6581151, -685554, 3526873, 3138640, 1245778, 1750236, 3098472, 1157103, -3673835, -6609905, -5320463, -2738126, -2282868, -3256839, -2583419, 520444, 3352600, 2958419, -468488, -3925446, -5186129, -5208893, -6186097, -7974072, -8245663, -6181654, -3899688, -3442876, -4258915]
$$ [...]
##END NTUPLES=NMR SPECTRUM
##END=
