##TITLE=31P_LR_724-R2-CR7 
 64 sc cdcl3
 25efp.2.2025
##JCAMPDX= 6.0         $$ Bruker NMR JCAMP-DX V2.0
##DATA TYPE= NMR SPECTRUM
##DATA CLASS= NTUPLES
##ORIGIN= UXNMR, Bruker Analytische Messtechnik GmbH
##OWNER= root
$$ XWIN-NMR		Version 3.5
$$ Tue Feb 25 14:22:00 2025 Russian Standard Time (UT+4h)  new_Human@DPX200
##.OBSERVE FREQUENCY= 81.013821
##.OBSERVE NUCLEUS= ^31P
##.ACQUISITION MODE= SIMULTANEOUS
##.ACQUISITION SCHEME= undefined
##.AVERAGES= 64
##.DIGITISER RES= 17
##SPECTROMETER/DATA SYSTEM= spect
##.PULSE SEQUENCE= zgpg30
##.SOLVENT NAME= CDCl3
##.SHIFT REFERENCE= (INTERNAL, CDCl3, 0, 198.062)
##AUDIT TRAIL= $$ (NUMBER, WHEN, WHO, WHERE, WHAT)
$$ ##TITLE= Audit trail, XWIN-NMR		Version 3.5
$$ ##JCAMPDX= 5.01
$$ ##ORIGIN= Bruker BioSpin GmbH
$$ ##OWNER= new_Human
$$ C:/Bruker/XWIN-NMR/data/yarkov/nmr/P31/2/pdata/1/auditp.txt
$$ ##AUDIT TRAIL=  $$ (NUMBER, WHEN, WHO, WHERE, WHAT)
(   1,<2025-02-25 14:18:27.87 +0400>,<new_Human>,<DPX200>,
      <acquisition in progress>)
(   2,<2025-02-25 14:20:02.17 +0400>,<new_Human>,<DPX200>,
      <Start of raw data processing
       efp BC_mod = 2 LB = 1.5 FT_mod = 6 PKNL = 1 PHC0 = 1791.274 PHC1 = 41.49541 SI = 64K 
       data hash MD5: 64K
       7F 23 19 9C 1E B9 FC 03 97 BB 75 EE 95 01 68 8F>)
$$ ##END=
$$ 
$$ hash MD5
$$ 25 BE 2B 9D 0C CB 2A FA 30 B6 4F 58 82 6A A0 55
##$RELAX= 
##$RELAX= 
##$RELAX= 
##$RELAX= 
##$RELAX= 
##$RELAX= 
##$RELAX= 
##$RELAX= 
$$ Bruker specific parameters
$$ --------------------------
##$DU= <C:/Bruker/XWIN-NMR>
##$EXPNO= 2
##$NAME= <P31>
##$PROCNO= 1
##$TYPE= <nmr>
##$USER= <yarkov>
##$AMP= (0..31)
100 100 100 100 100 100 100 100 100 100 100 100 100 100 100 100 100 100 
100 100 100 100 100 100 100 100 100 100 100 100 100 100 
##$AQSEQ= 0
##$AQ_mod= 1
##$AUNM= <au_zg>
##$AUTOPOS= <>
##$BF1= 81.014009
##$BF2= 200.13
##$BF3= 200.13
##$BF4= 200.13
##$BF5= 200.13
##$BF6= 200.13
##$BF7= 200.13
##$BF8= 200.13
##$BYTORDA= 1
##$CFDGTYP= 0
##$CFRGTYP= 5
##$CHEMSTR= <none>
##$CNST= (0..31)
1 1 145 1 1 1 1 1 1 1 1 1 1 1 1 1 1 1 1 1 1 1 1 1 1 1 1 1 1 1 1 1 
##$CPDPRG= <waltz16>
##$CPDPRG1= <>
##$CPDPRG2= <waltz16>
##$CPDPRG3= <>
##$CPDPRG4= <mlev>
##$CPDPRG5= <mlev>
##$CPDPRG6= <mlev>
##$CPDPRG7= <mlev>
##$CPDPRG8= <mlev>
##$CPDPRGB= <>
##$CPDPRGT= <>
##$D= (0..31)
0 1 0 0 0 0 0 0 0 0.06 0 0.03 2e-05 3e-06 0 0 0.0002 0 0 0 0 0 0 0 0 0 
0 0 0 0 0 0 
##$DATE= 1740478812
##$DBL= (0..7)
120 120 120 11 120 120 24 19 
##$DBP= (0..7)
150 150 150 150 150 150 150 150 
##$DBP07= 0
##$DBPNAM0= <>
##$DBPNAM1= <>
##$DBPNAM2= <>
##$DBPNAM3= <>
##$DBPNAM4= <>
##$DBPNAM5= <>
##$DBPNAM6= <>
##$DBPNAM7= <>
##$DBPOAL= (0..7)
0.5 0.5 0.5 0.5 0.5 0.5 0.5 0.5 
##$DBPOFFS= (0..7)
0 0 0 0 0 0 0 0 
##$DE= 6
##$DECBNUC= <off>
##$DECIM= 4
##$DECNUC= <off>
##$DECSTAT= 4
##$DIGMOD= 1
##$DIGTYP= 9
##$DL= (0..7)
0 0 52 120 120 21 21 25 
##$DP= (0..7)
150 150 150 150 150 150 150 150 
##$DP07= 0
##$DPNAME0= <>
##$DPNAME1= <>
##$DPNAME2= <>
##$DPNAME3= <>
##$DPNAME4= <>
##$DPNAME5= <>
##$DPNAME6= <>
$$ [...]
##$SUBNAM3= <"">
##$SUBNAM4= <"">
##$SUBNAM5= <"">
##$SUBNAM6= <"">
##$SUBNAM7= <"">
##$SUBNAM8= <"">
##$SUBNAM9= <"">
##$SW= 400.765351723535
##$SWIBOX= (0..15)
0 1 3 0 0 0 0 0 0 0 0 0 0 0 0 0 
##$SW_h= 32467.5324675325
##$TD= 32768
##$TD0= 1
##$TE= 0
##$TE2= 300
##$TE3= 300
##$TEG= 300
##$TL= (0..7)
0 120 53 12 22 120 120 120 
##$TP= (0..7)
150 150 150 150 150 150 150 150 
##$TP07= 0
##$TPNAME0= <>
##$TPNAME1= <>
##$TPNAME2= <>
##$TPNAME3= <>
##$TPNAME4= <>
##$TPNAME5= <>
##$TPNAME6= <>
##$TPNAME7= <>
##$TPOAL= (0..7)
0.5 0.5 0.5 0.5 0.5 0.5 0.5 0.5 
##$TPOFFS= (0..7)
0 0 0 0 0 0 0 0 
##$TUNHIN= 0
##$TUNHOUT= 0
##$TUNXOUT= 0
##$USERA1= <user>
##$USERA2= <user>
##$USERA3= <user>
##$USERA4= <user>
##$USERA5= <user>
##$V9= 5
##$VALIST= <valist>
##$VCLIST= <CCCCCCCCCCCCCCC>
##$VD= 0
##$VDLIST= <DDDDDDDDDDDDDDD>
##$VPLIST= <PPPPPPPPPPPPPPP>
##$VTLIST= <TTTTTTTTTTTTTTT>
##$WBST= 1024
##$WBSW= 4
##$XGAIN= (0..3)
0 0 0 0 
##$XL= 0
##$YL= 0
##$YMAX_a= 2929
##$YMIN_a= -24422
##$ZGOPTNS= <>
##$ZL1= 120
##$ZL2= 120
##$ZL3= 120
##$ZL4= 120
##$ABSF1= 0
##$ABSF2= 0
##$ABSG= 0
##$ABSL= 0
##$ALPHA= 0
##$AQORDER= 0
##$ASSFAC= 0
##$ASSFACI= 0
##$ASSFACX= 0
##$ASSWID= 0
##$AUNMP= <proc_1d>
##$AZFE= 0.1
##$AZFW= 0.5
##$BCFW= 0
##$BC_mod= 2
##$BYTORDP= 0
##$COROFFS= 0
##$CY= -3
##$DATMOD= 1
##$DC= 0
##$DFILT= <>
##$DTYPP= 0
##$F1P= 0
##$F2P= 0
##$FCOR= 1
##$FTSIZE= 65536
##$FT_mod= 6
##$GAMMA= 0
##$GB= 0
##$INTBC= 1
##$INTSCL= 9.790993e-09
##$ISEN= 30
##$LB= 1.5
##$LEV0= 0
##$LPBIN= 0
##$MAXI= 10000
##$MC2= 0
##$MEAN= 0
##$ME_mod= 0
##$MI= 50
##$NCOEF= 0
##$NC_proc= -9
##$NLEV= 6
##$NOISF1= 182.463
##$NOISF2= 159.3651
##$NSP= 0
##$NTH_PI= 0
##$NZP= 0
##$OFFSET= 198.0616
##$PC= 4
##$PHC0= 1791.274
##$PHC1= 41.49541
##$PH_mod= 1
##$PKNL= yes
##$PPARMOD= 0
##$PSCAL= 0
##$PSIGN= 0
##$REVERSE= no
##$SF= 81.0140089999434
##$SI= 65536
##$SIGF1= 159.3651
##$SIGF2= -187.1042
##$SINO= 113.3802
##$SIOLD= 16384
##$SREGLST= <1H.CDCl3>
##$SSB= 0
##$STSI= 65536
##$STSR= 0
##$SW_p= 32467.5324675325
##$SYMM= 0
##$S_DEV= 0
##$TDeff= 32768
##$TDoff= 0
##$TI= <>
##$TILT= no
##$TM1= 0
##$TM2= 0
##$TOPLEV= 0
##$USERP1= <user>
##$USERP2= <user>
##$USERP3= <user>
##$USERP4= <user>
##$USERP5= <user>
##$WDW= 1
##$XDIM= 65536
##$YMAX_p= 108412070
##$YMIN_p= -490679314
$$ End of Bruker specific parameters
$$ ---------------------------------
##NTUPLES= NMR SPECTRUM
##VAR_NAME=  FREQUENCY,     SPECTRUM/REAL,   SPECTRUM/IMAG
##SYMBOL=    X,             R,               I
##VAR_TYPE=  INDEPENDENT,   DEPENDENT,       DEPENDENT
##VAR_FORM=  AFFN,          ASDF,            ASDF
##VAR_DIM=   65536,         65536,           65536
##UNITS=     HZ,            ARBITRARY UNITS, ARBITRARY UNITS
##FACTOR=    0.49542278885378, 1,            1
##FIRST=     16045.7642231865, 0,            0
##LAST=      -16421.768244346, 0,            0
##MIN=       -16421.768244346, -490679314,   0
##MAX=       16045.7642231865, 108412070,    0
$$ Real data points
##PAGE= N=1
##DATA TABLE= (X++(R..R)), XYDATA
$$ [...]
##PAGE= N=2
##DATA TABLE= (X++(I..I)), XYDATA
9218 -16319472 -8192165 -2611771 1414 2026949 4537420 5669621 3538020 -561738
9210 -561738 -3419612 -3933844 -3995700 -5253750 -7257819 -9576023 -13010960 -16822355 -17517173
9201 -17517173 -13593965 -9270132 -9196083 -10782128 -7107209 2203692 8474690 4465916
9193 4465916 -6926971 -16927713 -20034009 -16254269 -8209521 -80126 3228002 255909
9185 255909 -4756772 -6885524 -6401576 -6882704 -9416762 -12034893 -13111318 -11698235 -6402028
9176 -6402028 1533681 5373145 -1382359 -15945216 -27600880 -29223296 -23602038 -17471020
9168 -17471020 -13596105 -10865643 -8631221 -7754863 -8571779 -9633129 -8210228 -2486501
9160 -2486501 5213259 8581848 3859528 -4457569 -8355681 -6575185 -5425394 -8640215
9152 -8640215 -11881527 -9834939 -3935241 618644 1859202 1190598 -531739 -3054249
9144 -3054249 -4961235 -5557699 -6907404 -10870184 -15914568 -19834162 -23241506 -26644664
9136 -26644664 -26404187 -18469111 -5169316 6267320 11686483 12588696 11329297 8165624
9128 8165624 3308849 -2162192 -8027672 -14077400 -17521082 -15490890 -10748163 -10300285
9120 -10300285 -16552705 -23714944 -25086255 -20456354 -13984231 -8047034 -2296103 3303876
9112 3303876 7416314 8332734 4572872 -3865469 -13633124 -19609959 -19932067 -17434266 -15052104
9103 -15052104 -12785637 -10762511 -11394863 -15361104 -18880326 -19006228 -18727182 -22015280 -26197295
9094 -26197295 -25224164 -19599640 -16513832 -19061443 -21353575 -16986446 -7543827 757763
9086 757763 5124401 6821253 6295167 2270018 -4712922 -11355139 -14834158 -15159157 -14262443
9077 -14262443 -14225592 -16123695 -18939806 -19523897 -15122746 -6578335 1630897 4953115 2353380
9068 2353380 -3349729 -8310470 -10621308 -10288118 -6879239 531948 9577088 13348699
9060 13348699 7185171 -3798109 -8840999 -4436812 1666268 1682085 -2067956 -2423279
9052 -2423279 1648326 5378027 6731246 7770043 8483588 6221264 1876489 145572
9044 145572 1967129 2554771 -931429 -5419973 -8157632 -10945812 -14490603 -14425353 -8346556
9035 -8346556 -2195684 -3338822 -10223924 -14984085 -14326618 -12139847 -12818229 -17352587 -24450011
9026 -24450011 -30062708 -27715626 -15844796 -3526685 -1535434 -7974381 -10689683 -4688020
9018 -4688020 1572013 -82231 -6188074 -8943258 -7531670 -5824854 -4328240 -1423409
9010 -1423409 1002944 -55598 -2811261 -2920858 -125691 2197881 2504245 1627063 -303417
9001 -303417 -3097619 -4664890 -4297966 -5354102 -9933422 -13908706 -13068611 -11005763 -13402023
8992 -13402023 -16978363 -13495591 -4258387 -298016 -5894707 -11823565 -9545792 -3443352
8984 -3443352 -2598457 -7297978 -11128671 -11600144 -10883640 -8886775 -3218459 4685003 9489018
8975 9489018 8258482 2819296 -3400752 -7222395 -6045823 -776631 2924268 1040977
8967 1040977 -2313521 -58565 6942784 10176889 5227491 -2967082 -8567546 -12597716
8959 -12597716 -18555879 -24986038 -27486230 -25592591 -22690634 -20019193 -15338071 -8013355
8951 -8013355 -1636175 52100 -2529476 -6254210 -9299356 -11649446 -12707216 -11239396
8943 -11239396 -8275222 -7610171 -11479298 -17028778 -19475106 -18351956 -17975549 -21210747
8935 -21210747 -25440469 -26330323 -23687613 -21497599 -23065726 -27849602 -32601617 -34409008
8927 -34409008 -33072093 -31259069 -31618047 -33463709 -33800272 -31835105 -29856745 -28594295
8919 -28594295 -25082779 -17673301 -10056124 -6617816 -6176716 -4621166 -1869779 -977367
8911 -977367 -1112091 2725718 11982061 21631004 26782924 27923204 27589377 26017142 22824653
8902 22824653 19479204 16872197 13104064 6821506 562537 -2454626 -3305756 -5959017
8894 -5959017 -11653686 -17192668 -18536513 -14657637 -8653029 -6000764 -10069900 -18081650
8886 -18081650 -23313583 -22379584 -17815760 -12347954 -4744358 5437162 12948065 11973216
8878 11973216 4216889 -3245862 -6981995 -8890202 -9847057 -7985588 -4288342 -3977175
8870 -3977175 -9749443 -18003075 -24244820 -28177198 -30690141 -29897925 -24068958 -15708525
8862 -15708525 -8875598 -4412438 -1252842 -358071 -3250113 -7851433 -9933319 -8422825
8854 -8422825 -5776978 -3369578 -109778 4227037 7894336 10071777 11625365 12189278
8846 12189278 9811752 4767895 515142 -878480 -1265596 -2341204 -2149377 1269768
8838 1269768 5184669 4989446 579778 -3818219 -5905023 -7869324 -12106005 -17238405
8830 -17238405 -19548225 -16699914 -9711237 -2921144 -1670612 -7294165 -14125730 -14572143
8822 -14572143 -8213547 -2758087 -4209536 -9211105 -10078438 -5135120 -255054 -785849
8814 -785849 -5257503 -7551470 -3200804 6774363 16769475 21293643 19913983 17104628
8806 17104628 16419373 16513105 14670520 11935198 11270935 12191521 11641229 9586881 8577813
8797 8577813 7251736 278880 -12522667 -22495167 -22248428 -15626715 -12001479 -12974834
8789 -12974834 -11241362 -2648687 6883496 8974388 3037396 -4407569 -8192307 -8711792
8781 -8711792 -8499558 -8108664 -6879993 -6003069 -8026876 -12408258 -13687977 -7130857 3970810
8772 3970810 10141947 6464087 -1590159 -5561689 -4324124 -3287286 -5609358 -9169787
8764 -9169787 -11453850 -12244081 -11172718 -7782405 -5161852 -8268955 -16376896 -21938189
8756 -21938189 -19770618 -12902418 -6266585 194389 7488486 11760393 9339764 4198828
8748 4198828 2611974 2318147 -4325777 -16545109 -23946570 -21561340 -17070572 -18210196
8740 -18210196 -20975832 -17469270 -9420970 -5156177 -6452581 -7447573 -5620225 -5199049
8732 -5199049 -8626155 -12343334 -13535335 -14573541 -17498008 -19538698 -17920557 -14685066
8724 -14685066 -12827826 -11514533 -9317409 -8849665 -13520256 -21976112 -29925041 -35144680
8716 -35144680 -36474416 -30828200 -17319868 -2942394 2605206 -1577974 -6823205 -6481502
8708 -6481502 -2759576 -649027 -1022627 -2689687 -6036430 -10577732 -12938184 -11509717
8700 -11509717 -9754483 -10512038 -10230186 -4158312 4964703 9331192 6326531 642557
8692 642557 -3778939 -7791367 -11616291 -11466321 -5355997 1753004 3023419 -2046520 -8160039
8683 -8160039 -11606657 -13494147 -16070878 -19240978 -21433138 -21565910 -19233380 -14593391
8675 -14593391 -8937550 -4128136 -685337 2543544 6134778 8683654 8766700 7359775
8667 7359775 6637403 6582649 4559092 -1183926 -8955842 -15375302 -18461235 -18067855 -14804698
8658 -14804698 -10305672 -7251943 -6501258 -4893261 793461 7587192 8059732 75434
8650 75434 -8938778 -10661413 -6017892 -2603579 -3737825 -4928520 -1266182 6081375 12044660
8641 12044660 13006263 8571569 900832 -5959085 -8371253 -6591885 -4407527 -4223900
8633 -4223900 -4629230 -4082274 -4228876 -6931152 -9939492 -8777051 -2404747 5569198 11188519
8624 11188519 13553334 14016721 13997566 13941396 13069554 10015592 4830312 126542 -1146749
8615 -1146749 1003852 3806557 5017319 4705534 4081481 4199746 5695859 7988769 8736862
8606 8736862 6193615 2387429 1451386 3847860 4940206 1158339 -4896441 -8246828
8598 -8246828 -8435583 -8967510 -11037753 -12454791 -13212581 -17072436 -25026666 -31333329 -30121626
8589 -30121626 -23291120 -17300600 -13894429 -9457892 -3203331 180892 -2079910 -6347226
8581 -6347226 -8939023 -12368822 -20223814 -28894595 -30490180 -23317829 -13997910 -8520527
8573 -8520527 -6027917 -3057816 400421 2049362 1730410 1477731 2199848 2811809 2513712
8564 2513712 2332142 3996704 7592700 10467186 9303071 4242224 -119929 195233 3265528
8555 3265528 3637008 -518749 -5882900 -9600297 -12295916 -14336720 -13543073 -9447511 -6230182
8546 -6230182 -7678567 -11641150 -13244668 -11782367 -10517804 -10991936 -11682881 -11741337 -11928024
8537 -11928024 -11700373 -9272856 -5324576 -3125966 -3850078 -4988151 -4895955 -5825036 -10247884
8528 -10247884 -16549807 -20870372 -21630997 -19894902 -16644238 -12540802 -9786902 -11037624
8520 -11037624 -15527313 -18535210 -16342257 -10539228 -5790000 -4071718 -3229064 -1398116
8512 -1398116 -446586 -3257297 -9027644 -13752566 -15087631 -14259175 -12823556 -10302239 -6524439
8503 -6524439 -3947075 -5047426 -8435441 -10067026 -8209680 -5208453 -4040217 -4750705
8495 -4750705 -5121679 -4082605 -3518197 -6199085 -11832741 -16138530 -15278470 -10704070 -7323777
8486 -7323777 -6736503 -5381606 -763259 3768112 3276862 -2077586 -7910804 -11405145 -12582303
8477 -12582303 -11103964 -6235771 -118854 3044767 2333460 1634288 4535547 10010032
8469 10010032 14186983 14258877 9775559 2373943 -4480998 -7314856 -5618056 -2087627
8461 -2087627 408442 696308 -1716859 -6978859 -13300918 -17269111 -17236713 -14992596 -12939511
8452 -12939511 -10991524 -7456374 -1874955 4265760 9058129 11459731 11189110 7889936
8444 7889936 1119033 -7793524 -14303917 -13864735 -7985749 -4154801 -6945356 -11873151
8436 -11873151 -11845649 -7145910 -3859568 -4218165 -4951646 -4826139 -6720519 -10965886 -13558183
8427 -13558183 -13381922 -14509317 -18101719 -18919435 -14569727 -11639027 -16152975 -23162152
8419 -23162152 -23342491 -16381124 -10012806 -8082516 -7648738 -7028030 -8514068 -12095138 -13599587
8410 -13599587 -11213070 -8175915 -6889657 -5364108 -1759889 2037360 3731402 3565200
8402 3565200 1891064 -2069462 -6479743 -6022309 1474138 10256826 12249092 5979621
8394 5979621 -2927229 -8772552 -10454443 -10033624 -9461981 -9032239 -7655393 -4508357 -715696
8385 -715696 1462046 1516735 1506143 3424641 7153489 11488365 15306959 16877837 14238612
8376 14238612 7895847 1371914 -2700466 -5353754 -8198009 -9499915 -6571548 -1276703
8368 -1276703 615843 -3463010 -9356476 -11498342 -9469754 -6756009 -4579505 -703920
8360 -703920 5264284 9153726 7273213 1821319 -2001637 -3133746 -5360301 -11080229
8352 -11080229 -17944158 -22211950 -21932728 -16071279 -4809153 7272269 12671086 9066478
8344 9066478 2683779 237148 1032461 1083153 1023954 3779794 6970439 4895630 -2371267
8335 -2371267 -8524231 -10063607 -9569163 -9140268 -7025865 -2773965 98624 -745044 -3460164
8326 -3460164 -6394879 -10528675 -15250556 -17037564 -15386205 -14945427 -18259005 -21357308
8318 -21357308 -20441009 -17881294 -16874184 -14970672 -8694006 -753360 3486646 3836939
8310 3836939 3627310 2908040 -256187 -3722346 -3404521 -644046 -797487 -4414480 -6034478
8301 -6034478 -2536993 2804051 5527871 4262398 -907013 -9067112 -16129530 -16890087
8293 -16890087 -11596625 -6646578 -7054446 -11560334 -16063250 -17899086 -15698985 -9525378
8285 -9525378 -3032819 -1457127 -5304618 -9399843 -9745750 -7625778 -5527976 -3583713
8277 -3583713 -2390392 -4738911 -11052350 -16727627 -17555291 -14862795 -12290977 -10765513
8269 -10765513 -9924112 -10921313 -13624970 -14112054 -9702557 -4188654 -3254614 -6527151 -9100601
8260 -9100601 -9458758 -10415980 -12663086 -12840210 -8792747 -2363866 3726125 7707580 7075790
8251 7075790 -41471 -10119165 -15196721 -11349649 -3298482 1693769 1819922 322365
8243 322365 -270567 -415514 -1429579 -3807598 -7210259 -10457284 -12055241 -11783470 -10910237
8234 -10910237 -10217860 -9358217 -8837631 -10190983 -12569792 -11912885 -6528014 -1452466 -3167690
8225 -3167690 -10529767 -15160756 -11728550 -4271170 -650159 -3723002 -10344490 -16633152
8217 -16633152 -20797663 -21618201 -17693431 -9399675 29231 6418934 7319999 3231978
8209 3231978 -2605847 -6118945 -6011098 -5611358 -9133566 -15711438 -19532450 -16954265 -10960525
8200 -10960525 -6746157 -5512167 -5526235 -6864770 -10538397 -13910499 -12437544 -7035654
8192 -7035654 -4647783 -8901323 -14456054 -14243298 -8963445 -4994661 -5172576 -6609553 -6717925
8183 -6717925 -6479762 -7427070 -9552473 -12968804 -17992847 -22731946 -24035294 -21787309 -18967587
8174 -18967587 -16786504 -13709697 -10325284 -10339165 -14335363 -17298365 -15891088 -13803256
8166 -13803256 -15260701 -17181153 -13773658 -6213390 -899182 637755 2780907 6533317
8158 6533317 6705168 757754 -6066674 -8188911 -7210800 -7906084 -10795612 -13068040 -13674740
8149 -13674740 -13069100 -10308905 -4708801 1453257 5699581 8897601 12273101 13251997
8141 13251997 9038143 2528729 -759994 -798937 -2557839 -7674953 -12437847 -14727357
8133 -14727357 -17003413 -20491964 -21926580 -18993812 -14442330 -11563479 -9594672 -7041061
8125 -7041061 -5786434 -7731785 -10240691 -9447687 -6349662 -5434278 -8300715 -12352463 -15132812
8116 -15132812 -16517971 -16819344 -15689822 -13276394 -10705378 -9475438 -11026210 -15348324
8108 -15348324 -19151236 -18220074 -13421060 -10893291 -13300120 -14806792 -9432274 -840468
8100 -840468 2711317 1100355 2312987 9579452 16190937 15314797 8391128 591382 -6257199
8091 -6257199 -11988527 -14064899 -10451007 -4018106 250789 888779 -405797 -2775444
8083 -2775444 -6417916 -10253057 -12667172 -13793997 -14704634 -15599298 -16955359 -20453957 -25733541
8074 -25733541 -28002704 -22762538 -12348800 -4299448 -3220205 -7188770 -12039295 -15782640
8066 -15782640 -17978389 -17889680 -15390764 -12333213 -11260523 -12990017 -16190405 -19149727
8058 -19149727 -21419295 -23391460 -24357636 -22123004 -15967618 -9363286 -7384822 -11005394
8050 -11005394 -16154289 -18852374 -18553196 -15819463 -10694152 -5569507 -5497303 -11560116 -16903741
8041 -16903741 -14242934 -5564896 622373 599517 -1428265 -1320607 -222099 -215279 1998
8032 1998 2095101 4445180 4732401 3612525 2858234 1877986 -779172 -3649424 -3195264
8023 -3195264 1635699 8011981 12851025 16190621 19883337 23616601 23827530 17891716
8015 17891716 8980804 4391552 7561939 13596115 15121199 11192986 7091510 5881394
8007 5881394 4429409 -757305 -7187668 -8836011 -3832819 2500000 2686054 -5130367
7999 -5130367 -14576913 -17242649 -12154526 -7100302 -8560666 -12956797 -11992027 -4783286
7991 -4783286 1264645 1610099 -168313 -356868 -1601190 -6822385 -11852227 -10372357 -3568860
7982 -3568860 1078379 -300739 -4262136 -5999764 -4626635 -2035652 46355 910320
7974 910320 718537 -277822 -3210547 -9489971 -16584859 -18148482 -12291580 -7003383 -11503582
7965 -11503582 -23041625 -28632517 -21028600 -7227790 1227104 1290370 -1799039 -3689139
7957 -3689139 -4904403 -7097662 -9702871 -11202695 -11782351 -13711483 -18876780 -25466175
7949 -25466175 -28012647 -22932944 -13850780 -8513938 -9807508 -12895601 -12266646 -7939505
7941 -7939505 -2711621 2674215 7847551 9451260 4580114 -3550574 -8160554 -7123117
7933 -7123117 -4421859 -3105157 -1394409 2496958 5820792 4757290 -28119 -4506497
7925 -4506497 -6536919 -6877366 -5721304 -1757382 4459462 8961579 8234272 3424552 -1251782
7916 -1251782 -3829551 -6154831 -9601150 -11611348 -9072801 -4387426 -4714921 -13492035
7908 -13492035 -25091322 -30711404 -28346112 -23557199 -20682611 -17657245 -11535978 -5269001
7900 -5269001 -4605001 -9588891 -13667810 -11885769 -6242452 -1339617 1951082 5567652
7892 5567652 9196211 9958939 6882761 2291358 -2079419 -7399652 -14308460 -19415707
7884 -19415707 -18361816 -12050539 -6914599 -7690161 -11734313 -12534107 -8175392 -3868060
7876 -3868060 -5151874 -10517854 -13024572 -8803663 -1515458 2538273 1770917 -40117
7868 -40117 600579 2882636 3474235 533309 -4877007 -10268499 -13549130 -13688468 -10594446
7859 -10594446 -5226943 -202233 718681 -4051098 -10358339 -10463126 -1306780 10519184
7851 10519184 14964907 9345487 152153 -5637553 -7310184 -7808951 -8832257 -11193319
7843 -11193319 -16391924 -23729789 -27980729 -24462884 -15833996 -9704095 -9264397 -10174109
7835 -10174109 -7727748 -3358087 -1810770 -4549752 -8676861 -10828604 -9573389 -5032328
7827 -5032328 956568 4452981 2253662 -3713833 -7285886 -5460150 -3158577 -7484981
7819 -7484981 -17738850 -25016724 -23132491 -16321751 -13092267 -15309997 -17844197 -17385248
7811 -17385248 -15951003 -15313034 -13821890 -11164830 -11297134 -16895368 -24304478 -27680563
7803 -27680563 -25594100 -20576103 -15350487 -12916832 -16442153 -24100134 -27389298 -20682920
7795 -20682920 -10035852 -5792405 -8217946 -8235888 -1977985 4038285 3994026 926654 359117
7786 359117 2495770 4707899 5995695 5046888 -486957 -8500867 -11920530 -8612736 -6036013
7777 -6036013 -9894258 -13808262 -8437910 3145331 8731554 4170117 -2095465 -2430661
7769 -2430661 653812 1212547 -1168239 -3070312 -3127938 -2518119 -2739908 -5527898 -12114786
7760 -12114786 -20344041 -25049269 -23259575 -17105073 -10775156 -7253810 -8452834 -14533965
7752 -14533965 -21356635 -22446016 -16238141 -8603509 -5758676 -7368179 -9106788 -8990389
7744 -8990389 -7633384 -4585751 1060799 6861792 7772723 1832985 -6983791 -12451581
7736 -12451581 -11534308 -6092230 -550652 1526212 -718593 -6013419 -12487196 -18190259
7728 -18190259 -21136927 -20552669 -18028330 -15922331 -14722259 -13649339 -13372793 -15317729
7720 -15317729 -17920494 -16772598 -9988888 -865112 6405314 11055235 13765476 13073257
7712 13073257 7012533 -2887282 -12097755 -17127006 -17206747 -13086096 -6577894 -731402
7704 -731402 1949732 1691967 573778 -162043 -817159 -2129116 -4775463 -8946501 -12930823
7695 -12930823 -13411997 -9168566 -3406930 -133937 960490 3417575 8208495 11925406
7687 11925406 11478298 8378287 6948403 9152600 12230403 11668890 6661874 2166673
7679 2166673 4014135 11545062 17082865 14065867 4039907 -5811520 -10080533 -8360079
7671 -8360079 -3725737 -1052822 -4688564 -13813095 -21153904 -20170549 -12914620 -7116279
7663 -7116279 -6413163 -7920908 -8760064 -9170747 -8301617 -3171109 5256710 10264620 7748727
7654 7748727 2321693 547025 1531489 -252206 -4972710 -6684333 -2762441 1538329
7646 1538329 -104406 -7674317 -16435214 -22802778 -25913806 -25707985 -22951559 -20514851
7638 -20514851 -21324927 -24131530 -23546080 -15946436 -4256364 4781898 7550018 6112213
7630 6112213 4217692 3118534 2075557 690177 -989897 -3059804 -4629064 -3588332
7622 -3588332 570089 5388392 9127750 13443220 18793559 19621104 9889102 -7092841
7614 -7092841 -20637323 -25375306 -25564720 -24931027 -20040844 -8923146 520638 -1033893
7606 -1033893 -10683565 -16268347 -12107780 -4393845 -481967 122960 1823184 5575668
7598 5575668 8898398 10059446 9675457 9881907 12674005 16921517 17467120 10868136 1921761
7589 1921761 -333703 5888949 12734508 13689582 11442426 11292677 11948847 8502211 1479410
7580 1479410 -3183469 -2413016 665920 1606388 -1191284 -7270590 -15154555 -21687152 -23521846
7571 -23521846 -20803474 -17621591 -17858639 -21642706 -25959052 -27513712 -25180068 -20908161
7563 -20908161 -17922060 -17019179 -15621420 -11728164 -7143630 -4656198 -3746251 -2137770
7555 -2137770 -331676 -949684 -4218228 -7999544 -12043918 -17763607 -23303033 -23924033 -19454456
7546 -19454456 -16835272 -21770768 -30945388 -36185956 -34192573 -28613610 -24173656 -22564651
7538 -22564651 -23392401 -25464222 -26673905 -25147772 -21103205 -16186161 -11355209 -6984673
7530 -6984673 -4229417 -4156746 -6038692 -8517708 -11706113 -15767608 -18343432 -16692603 -12311482
7521 -12311482 -9943608 -11368486 -13623874 -14488238 -15815193 -18864581 -19726966 -13577158
7513 -13577158 -2163335 6908852 8461421 4314827 -643580 -3820917 -5176145 -4983244
7505 -4983244 -3912266 -4079688 -7303389 -12183739 -15050378 -14599833 -13795646 -15654113 -18600553
7496 -18600553 -18664882 -16046395 -16109894 -22071028 -29422358 -30935208 -25861746 -20200778 -17846356
7487 -17846356 -15987078 -11264160 -6464086 -6998147 -12550188 -16601081 -14367174 -7729276
7479 -7729276 -1475412 2242355 4031337 4350457 3183027 1719729 1864943 3770507 5557295
7470 5557295 6094436 6649313 8617765 10555001 9313568 4319680 -1077894 -3602153 -3880289
7461 -3880289 -4470448 -5350834 -4485524 -2882993 -5218473 -13215405 -21290758 -22261283 -16121990
7452 -16121990 -9716621 -8086860 -9625589 -10250538 -8825829 -6661562 -4397600 -2185749
7444 -2185749 -1755850 -5489229 -13069291 -20695417 -24443273 -23847227 -21576191 -19677252 -16900745
7435 -16900745 -10752621 -2179613 3570693 2361940 -3471205 -7132469 -4487276 2496413
7427 2496413 8866125 10870303 7222916 -700384 -8792764 -12768537 -12247843 -10612718
7419 -10612718 -10081881 -9349806 -7124086 -4862832 -3820898 -2274066 1253163 4278909
7411 4278909 3518667 300744 -938775 1129503 3566710 3846914 2244313 -269035 -2895816
7402 -2895816 -3604148 -599489 4081428 6067955 4665919 3515316 3910673 1985115 -4500813
7393 -4500813 -10553423 -9579938 -2389227 3923333 4966148 2642840 210188 -1754864
7385 -1754864 -3590894 -4674093 -5119943 -6430309 -8394491 -7807465 -2881034 2703338 3065322
7376 3065322 -3098265 -11477092 -17549974 -20281104 -20163149 -16902591 -11159410 -6304851
7368 -6304851 -5343037 -6792952 -6437200 -3004177 753102 2884875 4738351 7240410 8139095
7359 8139095 5746603 2723633 2395178 3067289 443149 -4887589 -7126684 -3231830 3191929
7350 3191929 7779220 11251665 16512028 22813234 26360085 25428938 22042566 19138613
7342 19138613 17969891 17512438 14943797 7891547 -2263335 -10714415 -14362388 -14796812
7334 -14796812 -14435413 -12321563 -6839481 -272247 3643592 5427503 8313915 11340233
7326 11340233 9368751 1327056 -6638958 -9007327 -7770739 -7952729 -9720302 -9857884
7318 -9857884 -9246480 -12996017 -22076006 -29551165 -28187144 -19281710 -10622657 -6776793
7310 -6776793 -4995549 -1250382 3236621 4113456 474706 -4355309 -8244943 -12451958
7302 -12451958 -17127463 -18586197 -14343398 -8230663 -6113521 -7499534 -6066789 858425
7294 858425 7731880 7835213 1710286 -4299721 -6097245 -5552896 -6905370 -11887855 -18580122
7285 -18580122 -23440542 -23929299 -19944828 -13367863 -6600482 -1863386 -1221700 -5618463
7277 -5618463 -13157518 -19344875 -20116407 -14841166 -6585163 274055 3440789 4737298
7269 4737298 8099056 14365480 19154105 17852253 11596704 5447639 1401340 -2905918
7261 -2905918 -8196232 -10543739 -6322251 2932494 12444914 18214229 17738334 10467065
7253 10467065 82347 -6994685 -8350727 -7936641 -9059803 -9025954 -4860807 -329169
7245 -329169 -1184318 -5843394 -7416013 -3951505 33213 2112241 5026886 9965456 13535940
7236 13535940 14003993 14494991 16527296 15735280 8459544 -1513398 -7410040 -7627585 -5249851
7227 -5249851 -2369228 460293 1460496 -548665 -2727561 -1362769 2124062 2795351
7219 2795351 -262423 -2477875 -699890 2335969 2069651 -2091113 -6637171 -7807164
7211 -7807164 -4505962 1072827 4822792 3797930 -1491886 -8211424 -13890445 -17054302
7203 -17054302 -16700223 -13366081 -9757302 -7870681 -6307006 -3034970 246550 -2546
7195 -2546 -3399987 -5677207 -4699762 -2508789 -696558 2117489 6835014 11794513 15777742
7186 15777742 19318166 21361004 18953821 12612102 7342062 5052492 810047 -8745236
7178 -8745236 -17867843 -18783486 -12902078 -8021117 -6854593 -6269116 -6480541 -11494239 -19105581
7169 -19105581 -19988212 -10838761 -492662 2437559 1165922 3373765 8086668 8319896
7161 8319896 3401246 -393033 -652689 -1686215 -5321148 -6547716 -1668228 4780565
7153 4780565 5299195 -1608865 -10716811 -15737109 -13525416 -5515279 2466891 4196862
7145 4196862 -530289 -5261972 -4690151 -882278 676980 -1091763 -2437824 -867269
7137 -867269 2046996 3930745 4563335 4681562 3954048 1482177 -2406950 -5670337 -6127554
7128 -6127554 -4028781 -2897724 -6329878 -13286911 -18248195 -17428967 -13490998 -12361454
7120 -12361454 -16315217 -21907404 -24093225 -20868170 -14384506 -8800726 -6598824 -6360156
7112 -6360156 -5234115 -3834989 -6061366 -12672244 -18384207 -18440714 -15131260 -13426400 -12459412
7103 -12459412 -7291852 1296401 5345615 212899 -8545001 -12057131 -8491538 -3273490
7095 -3273490 -1387661 -2726718 -3911735 -2203358 2027484 5585399 5892816 4188225
7087 4188225 3401006 2954689 -1016734 -9317942 -17201996 -20174515 -18925121 -16189770 -12389181
7078 -12389181 -7766998 -5501290 -8097426 -12661611 -14268835 -12760874 -11823459 -12249368
7070 -12249368 -10867127 -6282488 -1339437 1057033 1207888 910003 1317353 2978985 5307301
7061 5307301 5835505 2861515 -1103880 -1606870 1964701 6133646 8758555 10648090 11325609
7052 11325609 7947605 367503 -6730405 -9196332 -7817360 -5417992 -2884772 -212841
7044 -212841 1859775 3613760 6339608 8260515 4750664 -3834212 -8951783 -3758239
7036 -3758239 6964282 12655853 10550016 6906200 5866636 4579154 672509 -2340255
7028 -2340255 -656194 3478989 4868506 1943536 -2862373 -6997047 -9117030 -8293451
7020 -8293451 -4797147 -959309 671319 -538008 -3919723 -8709947 -13256286 -14676597
7012 -14676597 -11413572 -5530935 -1009686 -61348 -1664958 -2823178 -931248 3549567
7004 3549567 6289021 3041756 -4664212 -10213527 -9814708 -7156132 -7847721 -11688910 -13840471
6995 -13840471 -12086779 -9002889 -7335455 -7090997 -7822183 -10401141 -14952852 -19279652
6987 -19279652 -20989804 -19984367 -17897073 -16175057 -15330996 -14962513 -13983589 -11831484 -9645929
6978 -9645929 -9041055 -9572099 -8886916 -5769756 -1689099 1027763 1265490 -769722 -3893545
6969 -3893545 -6071520 -5925705 -4673709 -4996114 -7540736 -10275423 -11631233 -12034575 -11622154
6960 -11622154 -9098852 -4387905 192 2224587 3621753 5725006 6826007 4429536
6952 4429536 -154522 -2707240 -1125897 2743988 5554623 4541233 -1493436 -10144467
6944 -10144467 -15286945 -12821418 -6562292 -4573520 -8991674 -13401227 -11770376 -6122617
6936 -6122617 -2742888 -3940442 -7130799 -10235433 -14063796 -19400532 -24712989 -27697438
6928 -27697438 -27697253 -26011246 -24433960 -23530195 -22118050 -19059814 -15720919 -15186906 -18079282
6919 -18079282 -20685503 -19053002 -14092183 -10605981 -11390969 -14112435 -14496418 -11301972
6911 -11301972 -7215106 -5311747 -5648529 -5959247 -5305118 -5500836 -8017255 -11086374 -12082070
6902 -12082070 -11677950 -12448602 -13695747 -11855731 -7123962 -5122903 -9136871 -14517274
6894 -14517274 -14727339 -10041519 -5790101 -4245011 -3408820 -2530863 -3142177 -4638021 -4402890
6885 -4402890 -3296310 -5648849 -11851256 -15914687 -13399603 -7775650 -5446294 -7502957
6877 -7502957 -9918114 -9570464 -6668743 -3032246 -1208110 -3776523 -10390534 -16719488
6869 -16719488 -19167049 -19177307 -19761282 -19523638 -14546988 -5636176 1201488 2620097 2118775
6860 2118775 4233376 7802051 7954459 2855833 -4660023 -11445564 -17014365 -21614027
6852 -21614027 -23712909 -21262084 -14851163 -8095562 -4620529 -5431446 -9089161 -12888447
6844 -12888447 -13366003 -8035211 995614 6705968 3975928 -3563206 -7242716 -4398479
6836 -4398479 -1423587 -4180583 -10086773 -13258723 -13499556 -15022602 -18570927 -20395530
6828 -20395530 -18364344 -14104292 -9267995 -4455728 -1869530 -3816046 -7631857 -7294157
6820 -7294157 -1945282 1984555 -417710 -6181281 -9908962 -11127350 -12009091 -11519315 -7351802
6811 -7351802 -1989352 -1453125 -7782031 -16503342 -22052645 -23078343 -22280552 -23184095 -26950257
6802 -26950257 -30752553 -30199531 -25027080 -20565233 -20953747 -22942663 -20226612 -12538046
6794 -12538046 -5945900 -4663988 -7325637 -11497179 -16540562 -20480179 -19264410 -12394787
6786 -12394787 -5644297 -4714695 -8652868 -12436558 -13550256 -12700073 -10201419 -5735974
6778 -5735974 -990884 1013802 -440795 -3025770 -4296283 -3777804 -2582335 -2495058 -4822460
6769 -4822460 -8718681 -11458321 -11535552 -10098160 -8172452 -5030931 -1624559 -2539760 -10193111
6760 -10193111 -18880380 -19776542 -11668618 -2033411 2748026 3422777 3507159 4287238 6114477
6751 6114477 9610427 12529281 9719339 -130889 -11083293 -16744350 -17155800 -15373842
6743 -15373842 -11251017 -4026105 1987313 1211842 -4460147 -7321049 -4999256 -3987919
6735 -3987919 -9945073 -19395036 -24270015 -21664603 -16158564 -14081056 -17390033 -22311639
6727 -22311639 -23454838 -20246031 -18313040 -22153403 -28041000 -28502689 -22944725 -18098650
6719 -18098650 -17477943 -17105583 -14002050 -11893519 -13949361 -16000994 -13195156 -8657618
6711 -8657618 -8381337 -10863424 -9660678 -4340731 -677037 -414209 658258 3171287 1230277
6702 1230277 -7341458 -14803083 -12727644 -2804637 6431763 9988597 8652307 3909606
6694 3909606 -3556080 -11035385 -14280174 -11729084 -5868539 -359565 2529748 2513256 1323054
6685 1323054 1368246 2570558 1618284 -3671777 -10407017 -13326624 -10790601 -6138510 -3753295
6676 -3753295 -5408109 -9545368 -12514056 -11655148 -8687965 -8333627 -11838498 -14456436 -12277885
6667 -12277885 -8707302 -9548356 -13670739 -14562952 -10812056 -8373314 -10652105 -12729227
6659 -12729227 -9438558 -4257930 -4642475 -11095522 -16526054 -15965323 -12034390 -9793294
6651 -9793294 -9960537 -9448195 -6757902 -4571987 -6800185 -13725708 -20641295 -21992614 -16985208
6642 -16985208 -10169904 -6309120 -6164420 -7866704 -10117420 -12086253 -11959049 -8489360
6634 -8489360 -3488659 -351723 -364237 -2657979 -7269298 -15135537 -24471498 -30114977 -28323848
6625 -28323848 -20890554 -13411052 -10492665 -12874905 -17343018 -18777674 -14426078 -7418352
6617 -7418352 -4212636 -7264824 -12245770 -14096237 -13420456 -14203820 -17127611 -18811175 -17177761
6608 -17177761 -14216416 -13130984 -15387726 -20687083 -27068827 -30767837 -29028773 -23919060
6600 -23919060 -20521615 -20463699 -20375244 -17924779 -15523825 -15650496 -16383322 -15381678 -14983737
6591 -14983737 -18133940 -21319528 -17926285 -8618424 -1923288 -2491931 -4596912 -1030513
6583 -1030513 6184502 9118541 5160523 -750528 -4112379 -5350971 -5544350 -3095899
6575 -3095899 2292151 5992007 2998802 -5183236 -11901576 -13554511 -13159137 -14795125
6567 -14795125 -17524856 -17393848 -13890699 -11064635 -11829885 -14039446 -14058470 -12437080 -13314906
6558 -13314906 -18402444 -24074464 -25479441 -21942033 -16882567 -13321077 -11223454 -9335042
6550 -9335042 -7945859 -8508576 -10952114 -12945621 -12734680 -11893198 -13797120 -19306863 -25313492
6541 -25313492 -28035487 -26578647 -22754550 -18842329 -16348698 -15357585 -13954573 -10110316
6533 -10110316 -5590819 -5587365 -11897024 -18832439 -19617202 -14985256 -10824122 -8754063 -5201932
6524 -5201932 91284 1794797 -2310033 -6916157 -7513237 -7273865 -10311414 -13279740 -10783227
6515 -10783227 -5654491 -5630736 -10929667 -13248792 -8069012 -755619 1895897 94752
6507 94752 -2196516 -4101429 -7513168 -12957918 -19091440 -24479880 -27848986 -28501390 -27774063
6498 -27774063 -27640021 -26979384 -22709175 -16042949 -13342166 -17798795 -24006827 -24657869 -19802094
6489 -19802094 -15274289 -14074211 -13917392 -12247912 -9078665 -4799034 776564 6174698
6481 6174698 8102514 4988968 -863926 -5478329 -6714171 -5644528 -5183685 -6800002
6473 -6800002 -8125158 -5414497 724601 4581808 2378652 -2562116 -4753375 -4191952
6465 -4191952 -4879976 -7479388 -8610739 -7055311 -5389836 -4797250 -3294648 -506537 709381
6456 709381 -436460 -373822 2926395 6057264 5851855 5065681 7656485 11277048 10119853
6447 10119853 4117890 -263773 1030132 4464643 4046693 -1782635 -9891793 -16429988
6439 -16429988 -19538832 -20027165 -20509783 -22485558 -24048524 -22474638 -18974976 -17765452
6431 -17765452 -19615845 -19821421 -14629655 -6758569 -1911941 -2176491 -5640608 -10083432
6423 -10083432 -13224923 -11129877 -1360365 11985703 20476294 19667614 12358432 3423021
6415 3423021 -4680369 -10441399 -12065565 -10404542 -9496605 -11141218 -12149254 -10297815
6407 -10297815 -9462506 -13976270 -20526848 -21699471 -16608797 -11846581 -11630391 -13238069
6399 -13238069 -13554913 -13690771 -14129075 -11460792 -4867918 -1079535 -6585308 -17504439
6391 -17504439 -23456819 -20544186 -14871268 -13440787 -17043416 -22775733 -28220262 -31284264
6383 -31284264 -30388376 -27213029 -25629005 -25653059 -22328707 -13760992 -6544275 -8313208 -16743904
6374 -16743904 -21326642 -16337949 -7399463 -3500346 -6334342 -10589388 -12434453 -13557891
6366 -13557891 -16590322 -20064721 -20275243 -16749714 -13333660 -13691836 -17621529 -22425666
6358 -22425666 -26161009 -28275075 -28527176 -27249017 -25965767 -25710839 -24922572 -21048686 -14445560
6349 -14445560 -8677511 -6276476 -5952516 -4916421 -2414788 174613 1430327 693315
6341 693315 -2253278 -6778912 -10986854 -12842879 -11769648 -8713160 -5064928 -1986886
6333 -1986886 -252541 -128632 -1591039 -4655624 -8856576 -12584332 -14241700 -14295392 -14761710
6324 -14761710 -16283622 -17480191 -17939526 -19681863 -23859602 -27581095 -26280141 -18710092
6316 -18710092 -8153399 452403 3413289 178932 -5280943 -6585983 -1661096 3499347
6308 3499347 1336626 -7360067 -14155412 -14012750 -10874223 -10248185 -11080521 -9171023 -5351807
6299 -5351807 -4855601 -9571133 -15804387 -19783726 -20932222 -19096669 -13356372 -5775132
6291 -5775132 -2261757 -6286231 -14274732 -20399202 -23534123 -25667904 -25594772 -19692172 -9033884
6282 -9033884 -266617 2676708 3439419 6907925 11598077 12334795 8199573 3286581 516036
6273 516036 -734842 -716571 2285001 7882319 11662586 10039507 4710399 -177914 -3327408
6264 -3327408 -6057986 -8367741 -8513788 -6228948 -3628817 -2594245 -3081913 -3953226 -3739839
6255 -3739839 -1111080 3076760 4614502 -27514 -7992089 -11652801 -7412972 -34160
6247 -34160 3609541 2134667 -1471178 -5354181 -8974763 -9812488 -5219377 2373778 6876194
6238 6876194 6108298 3571610 1497137 -2549100 -9104732 -12177494 -6833026 1771238
6230 1771238 3675814 -2391828 -7425561 -4946578 861879 2451051 -1036541 -5072992
6222 -5072992 -7165953 -8077598 -7901853 -5965659 -4018413 -5138316 -9040939 -11840694 -11093285
6213 -11093285 -8284203 -5691445 -3457988 -917056 1170130 1031009 -2297418 -7841066
6205 -7841066 -12665007 -13852259 -12183985 -12682471 -18688958 -26150642 -27529485 -21635111
6197 -21635111 -15505052 -15260050 -19164430 -21967211 -22104866 -21012350 -18447184 -13246912
6189 -13246912 -7404641 -4849974 -6096037 -7569567 -6533056 -3712389 -811082 1608999
6181 1608999 3171409 3320918 2733633 2760925 2869477 1253598 -1110623 32849 6787227
6172 6787227 15427627 20288256 19612991 15502002 9855719 3183739 -3565320 -9048769
6164 -9048769 -13418037 -17704417 -21223283 -22135450 -21103077 -21660494 -25485736 -29509830 -29789572
6155 -29789572 -26709052 -23901047 -22871478 -21508947 -18169365 -14637984 -13705132 -15417233
6147 -15417233 -17291214 -17401925 -15802911 -13208015 -9597572 -4549678 1477567 6485675
6139 6485675 7874118 4595045 -1730600 -8586975 -15099515 -21330822 -25349507 -23858931
6131 -23858931 -17086576 -10256207 -7539154 -6728994 -3506175 588082 -680891 -8850533
6123 -8850533 -17477186 -20316727 -18936906 -19352449 -24006659 -30304190 -34986574 -36535257
6115 -36535257 -34479029 -29553003 -23948429 -18835763 -12671318 -4904624 -40110 -3462873
6107 -3462873 -12773077 -18010270 -13120774 -3931703 -1066485 -6455847 -10933564 -5918872
6099 -5918872 5661836 12563194 8259570 -1955246 -7731061 -5256122 307451 2696882
6091 2696882 926971 -3095103 -9056665 -16721697 -22522212 -22657597 -19346799 -19285451 -24568932
6082 -24568932 -29073836 -26038987 -16083021 -5125432 2676100 6278669 4376104 -4030045
6074 -4030045 -15234779 -21617864 -19349369 -12887814 -9534832 -11293422 -14471234 -15764763
6066 -15764763 -15381322 -14320500 -12125047 -8920013 -7218229 -9253763 -13470458 -15670446
6058 -15670446 -13373645 -7809896 -2314945 -121288 -2647165 -7788870 -10497329 -7561567
6050 -7561567 -1802490 908479 -1161482 -4226557 -5186627 -5731760 -8545778 -12486471 -14292203
6041 -14292203 -13208954 -11231516 -9878721 -9049418 -8291066 -7256091 -5518657 -3413649
6033 -3413649 -2305994 -2958394 -4742749 -7174511 -10314284 -12805343 -12306679 -9484943 -8454656
6024 -8454656 -10950628 -13326219 -12141986 -9031711 -6344999 -2194182 4749876 9348275
6016 9348275 6061663 -1361685 -4101827 -1101573 568858 -2026209 -4349160 -4886423
6008 -4886423 -9049586 -18282256 -24298291 -20781425 -13904276 -13788812 -20611453 -26639277
6000 -26639277 -27993931 -26591613 -23288034 -17282487 -11293799 -9938977 -12854305 -15425196
5992 -15425196 -16078610 -16926986 -17639717 -15452333 -11823750 -12060032 -16467922 -18643160 -15603697
5983 -15603697 -13210572 -16843933 -21999408 -20454008 -12757344 -7817140 -10599465 -16331969
5975 -16331969 -18295434 -16361785 -14803976 -15019012 -14564184 -12289406 -10403915 -10824866 -12731547
5966 -12731547 -15115465 -18594358 -22237109 -21692607 -14730159 -6762524 -5506447 -10546608
5958 -10546608 -14027940 -12404301 -10728638 -12604292 -13083488 -7190964 149332 260823
5950 260823 -6379810 -11189887 -10187056 -8179129 -10046547 -14658788 -18794788 -21278182
5942 -21278182 -21404361 -18219204 -13307106 -10239843 -9906195 -10209512 -10754253 -12749277 -13506042
5933 -13506042 -7409285 4902141 14104288 12933360 4982942 -1134516 -2466198 -2383075
5925 -2383075 -3953505 -7149684 -10390168 -11109628 -6985086 66170 3671706 358352
5917 358352 -5445505 -7504374 -6173538 -6498936 -10591000 -16745056 -23750532 -30357201 -32094003
5908 -32094003 -25100213 -12996561 -3910711 -239342 2649456 6803896 7824496 3420661
5900 3420661 -802584 792320 4794593 3405281 -4404209 -12228501 -15638790 -16481150
5892 -16481150 -17131235 -15735278 -9934109 -2075618 2813144 3280713 2807446 4485634 6232138
5883 6232138 2727750 -8057720 -21239340 -28706433 -26672399 -19220856 -13988465 -14630812
5875 -14630812 -18256743 -20196320 -19898527 -20753506 -24515675 -27930357 -26282024 -19544317
5867 -19544317 -13284449 -12904398 -17845535 -22244870 -21081835 -15056906 -9165594 -6830405
5859 -6830405 -6427573 -4489107 -1585237 -2666328 -10418708 -20273651 -24499098 -20559483
5851 -20559483 -12963204 -7058796 -3867133 -1833766 -944306 -2983590 -8812076 -16888008
5843 -16888008 -23966272 -26739760 -24059323 -18444732 -14262987 -13456045 -14039498 -13475200 -12111381
5834 -12111381 -12215706 -14870246 -19028199 -22563708 -23157054 -19391019 -12434191 -5807695
5826 -5807695 -2229548 -1367783 -1455848 -1726378 -1976647 -1263482 925649 3005593 2796885
5817 2796885 458146 -1623103 -1755408 -673770 -689780 -3973153 -10863401 -18625365 -22603927
5808 -22603927 -20265134 -14174971 -10064271 -11890014 -18900205 -26610096 -30116998 -27605090
5800 -27605090 -21614449 -16339264 -13458002 -11594453 -9427691 -6929054 -3411682 2130275
5792 2130275 7184926 5819368 -4329768 -17591160 -25952717 -27379922 -25569048 -23665552
5784 -23665552 -22081682 -21003148 -20686241 -19567530 -15788882 -10625340 -7301373 -6657288
5776 -6657288 -7058300 -8137139 -11122186 -15442575 -18423862 -18800252 -17727923 -16223867 -14372910
5767 -14372910 -12954670 -12996987 -13896036 -14618043 -15826026 -17553264 -16212809 -8559441 2036305
5758 2036305 8325693 8064377 4973409 1124709 -5010496 -11872012 -13635580 -9162438
5750 -9162438 -5820767 -9795353 -17484734 -21313362 -20081509 -18622798 -20237694 -24038632
5742 -24038632 -27346035 -26761214 -19384544 -6776010 4696404 10736057 13375345 15291420
5734 15291420 14307930 8409935 2040326 953772 3475704 3392448 -419587 -3919623 -6063410
5725 -6063410 -9959240 -16003959 -20409147 -21122320 -19579218 -16513634 -11961594 -9407498
5717 -9407498 -13125292 -20384281 -22992190 -18248943 -12005944 -9215707 -8378042 -7607222 -8555937
5708 -8555937 -10597708 -8729245 -2469247 281771 -5126750 -10951749 -7667774 1152168
5700 1152168 3852640 -2276575 -8741635 -9817638 -8981918 -9781937 -9248576 -4494480 696326
5691 696326 873202 -3406161 -7074278 -7180491 -4905206 -3035051 -3842482 -7637572 -11678047
5682 -11678047 -12463084 -10254089 -8700931 -8914532 -7595146 -3207222 -32204 -2308432
5674 -2308432 -7287812 -8690723 -5500611 -2838734 -4720031 -10124782 -16190496 -21171965
5666 -21171965 -23606903 -22594527 -20557142 -22355561 -29281754 -36248375 -37374160 -32761439
5658 -32761439 -27447115 -24960510 -24534628 -24003682 -22460650 -19429862 -14012315 -6808363
5650 -6808363 -1432501 -1589090 -6134361 -9004817 -5762471 750560 3585340 416517
5642 416517 -3904620 -4923309 -5422222 -10918166 -19980481 -24095332 -18085821 -6408360
5634 -6408360 2983620 7456501 9561767 11298226 12689630 14487770 17796823 20812318
5626 20812318 19470784 12347651 2710350 -4777624 -7541077 -5540082 -923025 2395092
5618 2395092 1473856 -2452307 -5647572 -7206045 -10010467 -15419654 -20004215 -19643185 -14782406
5609 -14782406 -9510668 -6915124 -7092668 -8189810 -7622436 -3851683 1119108 2587821
5601 2587821 -1397772 -7025730 -9563401 -9484494 -10450619 -12396676 -11046101 -4970895 865120
5592 865120 791072 -4889386 -11331009 -15577875 -18612525 -21204497 -20703680 -14004146 -2781974
5583 -2781974 6639960 9572772 7376973 3943678 -398388 -7921269 -16959826 -21320158
5575 -21320158 -18470026 -14165169 -15138192 -20180404 -22942790 -21298080 -18534881 -16422539
5567 -16422539 -13226074 -9156453 -7769128 -9784539 -10601591 -6913322 -1644052 841979
5559 841979 657900 -8011 -1636565 -5304949 -8497771 -7791329 -4188217 -1299590 498094
5550 498094 3311459 6019708 4858860 250326 -2429918 -874078 136478 -4217346
5542 -4217346 -11444266 -15181485 -13511057 -9981341 -7776338 -6718714 -5683639 -4504431
5534 -4504431 -2998586 -826579 1032828 1090251 418331 2395091 7839931 12544168 11923200
5525 11923200 6818625 2113527 196739 -1249970 -4481197 -7688623 -7775711 -5336587
5517 -5336587 -4267520 -6831879 -11308190 -14686782 -15682959 -14374705 -10702929 -5020175
5509 -5020175 394995 1810570 -3270615 -13569311 -23901667 -28318961 -24920053 -17897921
5501 -17897921 -13627324 -14362891 -17017826 -18201638 -18089453 -18040615 -16941038 -12899700 -7475502
5492 -7475502 -4851847 -6453165 -9141955 -9777854 -9252063 -10247127 -12432979 -12160491 -7204005
5483 -7204005 -618422 1195098 -5062144 -15120774 -20445501 -17166463 -10599225 -8918357
5475 -8918357 -13217721 -16833332 -14576258 -8988381 -5916420 -7306317 -11126775 -15623265
5467 -15623265 -19834479 -21559439 -19143043 -14971279 -13193683 -13621076 -11727707 -5634886
5459 -5634886 661259 2546742 -244387 -5728950 -12893339 -19925938 -22850745 -20086841
5451 -20086841 -15882098 -14780879 -14755994 -11015434 -5130471 -3874993 -8606419 -12565931
5443 -12565931 -11077442 -8137167 -8759177 -10113499 -6158504 2155464 7693117 6978144
5435 6978144 3517832 1394496 804416 810025 1701790 2693694 1000951 -4421091 -10725183
5426 -10725183 -14715134 -16572328 -18456142 -21067472 -22841114 -21087178 -13493552 -841812
5418 -841812 11073237 15247627 10884461 4449487 1578431 745285 -2700317 -9224512
5410 -9224512 -15404180 -19332324 -21435630 -20908939 -15939348 -8088134 -2644830 -3026344 -7246657
5401 -7246657 -11276658 -13908720 -16850399 -21411985 -26595905 -29983786 -29701756 -25572224
5393 -25572224 -18385765 -8346180 4243001 16005226 20707782 15456285 5480075 -809431
5385 -809431 -1249062 -751997 -2776947 -4921662 -4949046 -6227230 -12637442 -20801168 -22669312
5376 -22669312 -15664605 -6108356 -1707742 -3667014 -7392845 -8562162 -6750615 -4376488
5368 -4376488 -3842462 -5812435 -9591986 -14458431 -19665505 -23199659 -22666068 -19044204 -17635445
5359 -17635445 -22200805 -28932582 -29877598 -22765393 -13804025 -9356379 -8494585 -6491537
5351 -6491537 -2612756 -329323 -1165767 -2717825 -3118793 -3767957 -6187099 -8854654 -9166876
5342 -9166876 -7156451 -5612207 -7085931 -11571005 -16431120 -18217661 -15636180 -11217269
5334 -11217269 -8925605 -9714813 -10824670 -9780245 -6967078 -3285830 2095146 9209521
5326 9209521 14417309 13500196 7429712 2190483 2282944 6397293 9964466 10088152 7286575
5317 7286575 4018158 2475247 2925275 3662033 3110187 1690575 629057 -406842 -2777664
5308 -2777664 -6405920 -9792442 -12133317 -13211876 -11777577 -7242088 -2978933 -3930302
5300 -3930302 -9785971 -14628676 -15323987 -15815836 -19626593 -22330958 -17076758 -5458567
5292 -5458567 3122344 2850500 -2798753 -7242771 -7942215 -6106949 -3560140 -2055656 -2643431
5283 -2643431 -3828211 -2920844 -544939 -774083 -5091733 -9304995 -8654945 -3248479 3671357
5274 3671357 9625207 12336562 8949596 214631 -7163787 -7588240 -4552819 -6014928
5266 -6014928 -12296551 -14896251 -8751076 399921 4271923 2905465 2718162 6675864
5258 6675864 11304481 12311472 9021952 3614281 -596138 -395261 4382327 8988307
5250 8988307 8050349 2198699 -2560930 -2563168 -289212 463748 -438258 -1395480 -2779751
5241 -2779751 -5641877 -8728451 -9884326 -9324814 -8982001 -9632107 -10975204 -13275385 -16258970
5232 -16258970 -17558029 -15286494 -11448617 -9919820 -11852924 -15937184 -21583318 -27592154
5224 -27592154 -29082021 -21856748 -10329406 -4671895 -8015035 -12759219 -12707368 -11991896
5216 -11991896 -16453502 -22377389 -21977696 -16348712 -13710364 -16046424 -17109025 -14896015
5208 -14896015 -16469512 -25875897 -34917640 -32673508 -19914948 -7589789 -3213733 -4568498
5200 -4568498 -5932889 -5113870 -3560014 -3465584 -6172044 -11148976 -15698001 -17268169 -16340191
5191 -16340191 -15495687 -15617012 -14719995 -10895761 -5057082 -342589 362842 -3738206 -11118004
5182 -11118004 -19228101 -26150495 -30723708 -31744788 -29088769 -25809299 -25969093 -28565137
5174 -28565137 -26967799 -17952109 -8363140 -7259670 -12706965 -13336231 -4411894 4718715
5166 4718715 3395297 -5892201 -12064426 -10657262 -6699426 -3702067 1523551 10703200
5158 10703200 18032841 17071831 9110253 -134888 -8432926 -16164524 -20447698 -17072914
5150 -17072914 -7996455 -679613 1036037 56125 -986258 -3792829 -8816358 -11562119
5142 -11562119 -9041627 -5426811 -5960078 -8673996 -8122247 -4854309 -4322517 -7219347 -8072641
5133 -8072641 -4509096 -1304014 -2647061 -5954396 -6867415 -5861876 -5723595 -5894045 -3959769
5124 -3959769 -718294 624701 -731278 -2925651 -5201551 -8225833 -10966247 -11003087 -8520423
5115 -8520423 -6745387 -7358336 -8242190 -7204709 -5457648 -5332393 -6278229 -5626368 -2646744
5106 -2646744 460356 1573825 533132 -2356925 -7375435 -13563859 -17854509 -18335939
5098 -18335939 -17118117 -17122281 -16919891 -12736133 -5975908 -3998760 -10822500 -20961280 -26171045
5089 -26171045 -25173467 -22354335 -19719148 -15981608 -12138907 -11301447 -12587490 -11410131
5081 -11410131 -7263498 -5431309 -8906281 -14241708 -18070975 -21961066 -27016846 -29232472
5073 -29232472 -25462165 -19722983 -17816070 -18939909 -18503431 -16501339 -16566769 -18408522 -18131251
5064 -18131251 -15841644 -16321606 -21151479 -25957779 -27046217 -25641880 -23804731 -21213327
5056 -21213327 -18514115 -19150510 -24277148 -29258762 -28895191 -23695549 -17642287 -12059498
5048 -12059498 -5690384 461397 2708562 -491192 -6383574 -11294673 -13754496 -13732736
5040 -13732736 -11524038 -8846899 -8664296 -11652637 -14546418 -14602520 -14059020 -16218045 -17996417
5031 -17996417 -12349742 -94573 6990969 233019 -13283935 -19441566 -15977649 -13878736
5023 -13878736 -19806053 -26664440 -25221822 -16958965 -9730482 -6886826 -7095047 -9958429
5015 -9958429 -14476769 -15173123 -7454817 4179486 9725136 5406231 -3047829 -8332937
5007 -8332937 -8267563 -5286544 -3693835 -6972221 -14078404 -19244986 -18597176 -14953213 -12644141
4998 -12644141 -10925123 -7507497 -5064761 -7449021 -11831085 -11936709 -7710585 -4580622
4990 -4580622 -4352209 -4332575 -4333267 -6193071 -6857607 -992865 8909442 14048179 12033061
4981 12033061 8876150 6899950 1076556 -9396400 -16457243 -15404411 -12428147 -13751355
4973 -13751355 -15674319 -12521640 -7279495 -6578846 -10503281 -14454606 -16657336 -17672817
4965 -17672817 -16864603 -14919035 -15328567 -18283929 -18261322 -12776782 -7571890 -7340742 -7853360
4956 -7853360 -4340221 -1323637 -5658292 -14900208 -21226855 -22601626 -21629759 -17830491
4948 -17830491 -10461950 -5386851 -9042521 -17579474 -21250201 -17968537 -13773423 -11784818
4940 -11784818 -10143721 -9693433 -13849570 -20605236 -23619550 -21980596 -20851981 -21981470
4932 -21981470 -21561252 -18172172 -15009743 -13175930 -10168911 -6362289 -6247343 -11816258
4924 -11816258 -20214243 -28115287 -32971833 -31171182 -21913663 -12213826 -10818701 -17424131
4916 -17424131 -24557695 -28854636 -32812042 -36599262 -36770677 -33082503 -28841241 -24993756
4908 -24993756 -21296383 -21447405 -28188299 -35165042 -33578890 -25627539 -21286952 -23473455
4900 -23473455 -27331600 -32058144 -40585488 -48712629 -48385903 -41796999 -38641714 -39855395
4892 -39855395 -38702176 -37098825 -43948795 -57013705 -64485641 -65402381 -69298154 -75153680
4884 -75153680 -72875928 -66803529 -72039495 -84858734 -86478743 -80487583 -90654266 -113574614
4876 -113574614 -118081918 -107995322 -128891021 -174220070 -143391568 35566114 274620458
4869 274620458 399768821 351880250 237816181 174288083 160908433 138800865 100428240
4862 100428240 80869732 83514360 78515612 58725231 45745816 46073987 42677672 29557433
4854 29557433 20716964 22571027 24961373 22338314 20902215 22371418 20742748 17129681
4846 17129681 19765229 27574218 30093601 24847092 19561921 16844274 12029209 6701115
4838 6701115 8714067 17101676 21552515 18779010 15540946 13924752 8299296 -380056
4830 -380056 -2066753 5814530 12465941 9906149 3525945 1040594 1635988 1856710 2615666
4821 2615666 4545546 4883114 4104055 7513333 15606115 21143377 20499676 19480297 22704775
4812 22704775 25560797 22660751 16718807 12821751 10786622 9396768 11474517 17844920
4804 17844920 22110314 18760637 12081146 10218114 13926569 17288499 16495347 12334870
4796 12334870 6596707 1011662 -2196423 -2251795 -141928 4659016 13337198 21776886
4788 21776886 21998115 13401939 6020168 7577199 13746492 16951899 17846407 20380916
4780 20380916 21741497 16726308 8012223 2526937 616122 -1635934 -1904746 5748387
4772 5748387 18322885 24806855 21256960 15305166 13223290 11888148 7505033 3550325
4764 3550325 4142132 6248042 5239221 3528727 6665053 13414400 16537461 13124995
4756 13124995 8553099 8721630 12180430 12565227 7438980 2079688 3398939 11223064
4748 11223064 17895994 17147738 10985479 6051193 5522132 7534235 9689359 11101743
4740 11101743 10654837 7281902 2382175 -1083178 -1993792 -1030080 1679889 5241821 5530949
4731 5530949 -968327 -10979852 -17278078 -18117150 -18295703 -20000241 -19112205 -13080841 -6023527
4722 -6023527 -2107252 250782 2665978 889917 -8606605 -20029744 -23897393 -19572701
4714 -19572701 -14925711 -14070519 -12926464 -8363597 -4816127 -8001776 -16409317 -23131643
4706 -23131643 -24024286 -20835623 -17331619 -14912674 -12146155 -7385197 -1356872 3225334
4698 3225334 4901100 5159187 5724818 5711284 3812266 1995770 3470504 7115277 7708091
4689 7708091 2743858 -4131886 -7867320 -7388868 -4771053 -1872131 114846 137705 -1250383
4680 -1250383 -1603771 66875 1297546 -252828 -2852569 -2896661 158025 3585444 4987044
4671 4987044 3473728 -1454740 -8830151 -14752125 -15915792 -14794096 -17322844 -24397291
4663 -24397291 -29642531 -27727952 -21424734 -17430872 -17799980 -18959063 -17493274 -13181032
4655 -13181032 -7002438 254982 7031467 11299840 12382062 10790014 6767647 1258514
4647 1258514 -2517192 -1841891 1228864 2193284 1233167 3489800 10277171 14683519 9906437
4638 9906437 -1184221 -9421831 -10421197 -7604711 -5224335 -3577990 -1886063 -1463979
4630 -1463979 -4000564 -9183631 -15201432 -19522763 -19014481 -12402513 -3411422 1802452
4622 1802452 1753780 1267093 4607334 10083183 13431038 13574502 12532160 12109115 13230882
4613 13230882 16221376 19059489 17640625 10761380 2837085 -1369015 -2677690 -4872594
4605 -4872594 -8274993 -9875166 -8285394 -4600159 76249 3736078 2193106 -5571793
4597 -5571793 -12063983 -8249883 3548883 10617167 5545406 -5519051 -12794910 -14217933
4589 -14217933 -12952829 -10325188 -7318298 -7960138 -14000912 -19443122 -17665298 -12024348
4581 -12024348 -11857189 -18471933 -22674706 -17565416 -7234262 -225945 337611 -2875592
4573 -2875592 -6491211 -8274319 -6943484 -3783886 -2831504 -6599206 -12535532 -15714444
4565 -15714444 -14266573 -10794487 -9342816 -12089211 -18066970 -24060481 -27216847 -27046267
4557 -27046267 -24332747 -18994100 -10968930 -2572134 2914977 5231710 6883113 8477766
4549 8477766 7533351 3016755 -2108443 -4617088 -4714307 -4333467 -4173646 -4027672 -3771312
4540 -3771312 -2805864 -1077267 -1260763 -5963195 -11609966 -10573222 -2287133 3823244 1589050
4531 1589050 -1682787 3909299 14081630 14856516 3098119 -8187000 -7942944 -1193116
4523 -1193116 231027 -6059106 -13001941 -15988992 -17357992 -20156433 -23281364 -23498239
4515 -23498239 -18937492 -10347414 -1108081 4463126 4855575 2870245 2016218 2824195 4248353
4506 4248353 6373658 8952596 9236115 4902800 -1804182 -6414556 -8259997 -10611741
4498 -10611741 -14702425 -17283438 -15372346 -10647970 -7426504 -7883914 -10496861 -12019191
4490 -12019191 -10160010 -5317472 -316187 2175558 1947645 286338 -2531084 -7217148
4482 -7217148 -13442628 -19678696 -24793784 -27933720 -27403922 -22454403 -16228229 -13636033
4474 -13636033 -15130758 -15571972 -11078039 -4289257 -295525 413578 1534364 4612879
4466 4612879 6887874 5856905 2754097 -44448 -2759205 -7105683 -12590458 -16406862
4458 -16406862 -17264688 -17354574 -19409899 -23036698 -25410674 -24986601 -22869746 -20651420 -18686658
4449 -18686658 -16858201 -15156132 -12671737 -7923007 -1497856 3434302 4938792 4868886
4441 4868886 5506948 5519014 2209505 -3559186 -8175688 -10219321 -10870737 -9897525 -5746988
4432 -5746988 -274250 1270660 -3095602 -9258864 -12991646 -15155179 -18330477 -21718629
4424 -21718629 -22835348 -21749664 -20108286 -17783604 -13862475 -9643990 -7627446 -8480240
4416 -8480240 -11246740 -14985631 -17929660 -17142606 -11879405 -5408445 -878836 2050850
4408 2050850 3480315 -104653 -10423598 -21552181 -25730401 -23373399 -20930234 -20207008
4400 -20207008 -17410352 -12603603 -11495750 -15707382 -19223111 -17945357 -15424698 -14697171
4392 -14697171 -11542792 -2040346 8762322 12764919 9666017 5296009 2233293 -1008581
4384 -1008581 -3644907 -2816780 362834 1380614 -817953 -3017976 -3909236 -5607860 -8445423
4375 -8445423 -9536978 -7737836 -5396485 -4005980 -2528185 -1161896 -2113681 -4976787
4367 -4976787 -5958088 -4016639 -3536018 -7982491 -14475649 -17849854 -17151327 -14748735 -11493938
4358 -11493938 -6721422 -1939862 -829167 -5051984 -11956878 -16936647 -17566469 -15741148
4350 -15741148 -15705950 -19030498 -22060683 -20293679 -14720739 -10761518 -10805936 -11567605 -9817592
4341 -9817592 -6673018 -4250261 -2092996 221684 607207 -1893627 -4270235 -4347851 -5391565
4332 -5391565 -11094757 -18432272 -21220758 -19448668 -18829237 -21103891 -21262291 -16048706 -9302541
4323 -9302541 -5811459 -4800168 -3485135 -3114925 -6498662 -11897420 -14656077 -14204200 -14523657
4314 -14523657 -17172075 -18420102 -15172918 -10015542 -7377047 -6988410 -4563805 1889688
4306 1889688 9499329 14145275 14032807 9627056 2916135 -2621909 -4315875 -3868502 -5676779
4297 -5676779 -9943499 -11130836 -6334295 -1278033 -2671263 -7367136 -6332934 1108726
4289 1108726 5080394 -644034 -9848548 -13639486 -12354724 -11513823 -11239231 -7974591 -4062704
4280 -4062704 -6498229 -15365984 -21207757 -16766136 -5933586 2110424 3514626 1229581
4272 1229581 -860080 -1375917 -383413 1827110 4575355 6710799 6931767 4330095 -532869
4263 -532869 -5332308 -8078523 -9362323 -11190516 -14066441 -16827701 -18588486 -18764385 -16248322
4254 -16248322 -11534288 -8812726 -12043825 -18833510 -22268955 -19611110 -15036736 -12468997
4246 -12468997 -10270966 -5771182 -1066010 -303532 -3355074 -5851819 -4587829 -445965
4238 -445965 3011060 2092551 -4211173 -12021088 -14991356 -11088230 -5234711 -3268623 -5531758
4229 -5531758 -8726067 -11098388 -12025124 -9105690 -1017095 7571973 9387954 3614305
4221 3614305 -2995087 -5192733 -4875658 -5673004 -6532705 -4567707 -1189534 -616008 -3401281
4212 -3401281 -6000707 -6884582 -8594110 -12070032 -12969101 -7153585 2376694 8115754 6970620
4203 6970620 2649093 -942173 -4170129 -7821831 -9159272 -5479393 1188186 6899487
4195 6899487 11264137 15908302 19294140 18306109 14401164 12583105 13553143 12236522 5753728
4186 5753728 -2069591 -6352670 -6762307 -4945095 -968340 4202071 6653322 4131756
4178 4131756 -72644 -1555510 -518934 580184 2383947 7136755 13376869 16457005
4170 16457005 14108320 8640433 4069207 2873751 4272509 4175706 -1041410 -9158762
4162 -9158762 -13310234 -10318619 -4433735 -879977 -91101 -964289 -4502795 -10123614 -13486087
4153 -13486087 -12832100 -12459063 -14855559 -15344762 -10841966 -7318731 -10239079 -13862346 -10124784
4144 -10124784 -2585052 -128784 -1922907 -1604281 -1612208 -8061845 -15386037 -14120844 -10593429
4135 -10593429 -15336052 -11260480 35899827 121646567 184941577 171451127 98402738
4128 98402738 31253650 7103594 8317397 5544739 -4938629 -12858728 -16564013 -19482505
4120 -19482505 -18859469 -11250179 -1124582 5083648 7405067 8748478 9135294 8519123
4112 8519123 9135664 10581068 8754414 3745894 2048335 6263381 9253286 4101724
4104 4101724 -5886001 -13055942 -16226921 -19129492 -21770689 -20280312 -13978890 -7078279
4096 -7078279 -3355463 -2432070 -1145710 3045899 8959191 11317527 5797173 -5048738
4088 -5048738 -14032286 -17818129 -18959605 -18933147 -14890179 -5730949 4034539 10054089 13443913
4079 13443913 16983389 20051654 20600554 18217570 12232650 1222715 -12217572 -20873818
4071 -20873818 -21037236 -16932177 -13410722 -9474899 -3661884 -97393 -2647513 -7576175
4063 -7576175 -9170686 -9084375 -12559654 -18134202 -19120766 -13945527 -7529742 -3244927 -699731
4054 -699731 -836571 -5521024 -11576749 -12583687 -8105944 -4804152 -6854337 -11145479 -13438889
4045 -13438889 -13320170 -11132377 -5916100 773734 3978830 1376851 -3496450 -6333066
4037 -6333066 -6879828 -7067700 -8126773 -11103361 -16271968 -20479805 -19210501 -12945900 -7317901
4028 -7317901 -5468948 -5000764 -4257831 -6039505 -11855131 -17610448 -19217165 -18519338 -19532514
4019 -19532514 -22328384 -24782051 -27059031 -29831620 -30699785 -27028534 -20593349 -15414571
4011 -15414571 -12534338 -10404332 -8611610 -7664743 -6761563 -5057491 -3338920 -1529845
4003 -1529845 2658463 8854266 11065093 4875849 -4746049 -8874753 -6507555 -4558960
3995 -4558960 -6363760 -7400241 -4240733 -1091608 -3435241 -9572919 -12939279 -10479855
3987 -10479855 -4921090 76927 3732691 7169765 10929080 14256455 16193817 16837437
3979 16837437 17077209 16952688 15299874 11905770 8676214 6880893 4344584 -2084053
3971 -2084053 -11537176 -19040500 -20701132 -17146706 -11788420 -7514280 -5093917 -3106623
3963 -3106623 418373 4745766 5646570 116643 -8876011 -15044273 -15606763 -12608811 -8329687
3954 -8329687 -3416935 357862 59914 -4136277 -8234103 -9603244 -9632188 -9745092 -8457426
3945 -8457426 -4639274 -408937 1814163 2317646 1806606 -719245 -4986141 -7673708 -7216384
3936 -7216384 -7267660 -11036232 -15014303 -13794982 -9134587 -7666368 -10004206 -9299026 -2467208
3927 -2467208 3869670 2667096 -3363669 -5916813 -2088126 4193987 9557951 13884070
3919 13884070 16000190 13115986 6546040 2532371 3728993 4199880 -2031014 -10470237
3911 -10470237 -10993050 -2824784 2665384 -3080887 -14400722 -20156616 -19209842 -19805808
3903 -19805808 -25354933 -29114252 -24794351 -15541250 -8474187 -5307952 -3202321 -1461840
3895 -1461840 -1906629 -4081831 -5169811 -4574448 -4568822 -6178245 -7929345 -8950278 -9841548
3886 -9841548 -9973118 -7587859 -3764222 -2697644 -6088999 -10387308 -12062492 -12707242 -15525235
3877 -15525235 -18973572 -18365936 -13318917 -9141733 -9669687 -12441628 -13260392 -12637218 -14247200
3868 -14247200 -18237734 -19927381 -15981565 -9136360 -4977048 -5393364 -7084018 -6213340
3860 -6213340 -3042295 -1370645 -3784100 -8025065 -8919802 -4577466 287960 -777216
3852 -777216 -7830439 -13900260 -13634867 -9949434 -9754464 -15123215 -21736914 -24849485 -23545211
3843 -23545211 -19730269 -16174541 -15336131 -17072966 -17880489 -15621789 -14123027 -18531586
3835 -18531586 -26478393 -29698596 -25495162 -20163664 -18485541 -16751529 -10987728 -5653628
3827 -5653628 -7000279 -12270047 -13694830 -10632126 -9201015 -11009904 -11260988 -8782856
3819 -8782856 -8938199 -13715407 -17017225 -14209623 -9508129 -8431613 -8677221 -5117112 287098
3810 287098 1051089 -3247471 -6175403 -4279880 -1368924 -1512774 -3108818 -2645973 -518846
3801 -518846 389402 -261164 -324390 252830 -1645731 -7499522 -13678981 -15462238 -13676662
3792 -13676662 -13887741 -18026263 -20493941 -15615986 -6087355 518701 1850275 1652852
3784 1652852 1099940 -3563315 -12566676 -18817945 -17222194 -12366376 -11170757 -12255361
3776 -12255361 -9607513 -3967066 -2452828 -7200312 -12117996 -12703191 -12542230 -16854196
3768 -16854196 -24300950 -28775916 -26440132 -18431579 -9102837 -3493433 -3834206 -6567039
3760 -6567039 -5373136 1066709 7086490 7563805 4123861 1310610 33185 -1429043
3752 -1429043 -2631554 -1869226 -579094 -2177745 -6547103 -9639941 -9007735 -6238079 -3316202
3743 -3316202 -107210 3284962 4927900 3913416 2455909 2893819 4134644 3154012 -950458
3734 -950458 -6073310 -9397794 -9152434 -5116825 892847 5711071 7601317 7813259 8037765
3725 8037765 7434050 4360503 202958 -1551139 -250330 996022 351588 164503 2832288
3716 2832288 6366656 7039649 4789285 2654494 1712476 325343 -1379096 -179714 5329992
3707 5329992 11365420 12908949 9420521 4491490 1140727 -253273 -215362 1017513 2786571
3698 2786571 4123937 5137626 6831760 8934753 9140046 5477677 -1095061 -7231912
3690 -7231912 -10223699 -10157212 -9208003 -9146047 -9695724 -9227242 -6676114 -2515004 1785968
3681 1785968 4663347 5095058 3216100 360764 -2263707 -4926029 -8551002 -12702048
3673 -12702048 -15568755 -15947377 -13831607 -9035373 -1223376 7991514 14937518 17163457
3665 17163457 15548208 12365776 8968727 6213143 4767600 3342548 -904682 -7730264
3657 -7730264 -11814668 -8715416 -1333620 3138417 1850613 -1766022 -3988869 -4313361
3649 -4313361 -2616073 2372140 9561948 14181233 13035472 8910736 6979038 8371077
3641 8371077 9830778 8399688 3684658 -3634355 -12298854 -19118959 -20127434 -14876654
3633 -14876654 -8004210 -4504797 -4038022 -1980242 3711863 9061643 9138791 4842639 1790620
3624 1790620 2906409 5463526 6319043 6511741 8130021 9335382 6297034 -786733 -7010487
3615 -7010487 -8374281 -5794426 -3307658 -3921888 -7023328 -8448997 -3868793 6206631
3607 6206631 15651576 18632326 15108118 8956409 3101370 -739087 -497562 3236011
3599 3236011 4520761 -1948218 -12711187 -18968071 -17968977 -15017999 -13873371 -12233588
3591 -12233588 -8751466 -7403335 -10974409 -15959089 -18288719 -19185142 -20845930 -21024215
3583 -21024215 -17049622 -11360561 -7848391 -6131933 -4566060 -5265518 -10121183 -14938234
3575 -14938234 -14356208 -10601947 -10387706 -14301376 -16530941 -14982013 -14156238 -16443900 -17444815
3566 -17444815 -13146111 -6652620 -4053122 -6739554 -10908869 -12703110 -11551639 -9475816
3558 -9475816 -8231730 -6784512 -2541209 3622601 5921947 559380 -8012913 -12339518
3550 -12339518 -11993928 -12742074 -16363643 -18041605 -14968445 -10777015 -8712763 -6526079
3542 -6526079 -2035162 1527152 797868 -734978 3490234 13862790 23397637 25171674
3534 25171674 18137848 6413567 -4756349 -12723689 -18304347 -22234001 -21533151 -13009065
3526 -13009065 -693429 5636456 2263096 -3037647 -1691146 3819625 4579072 -1242667
3518 -1242667 -6501208 -6169892 -3663728 -4482070 -8664823 -12296536 -13294340 -12920040 -13053622
3509 -13053622 -13951885 -14278269 -12580510 -8898851 -4669175 -857954 2492488 4220397
3501 4220397 1971952 -3751261 -7951532 -6988604 -4313445 -6094422 -12066295 -15713193
3493 -15713193 -13828556 -10558141 -10089466 -10333982 -7403993 -2714004 -1207277 -4340051
3485 -4340051 -8819386 -11368333 -11148614 -8061383 -2512818 2740842 4148969 2109039
3477 2109039 1211992 3967907 6823233 4839926 -1552145 -7386771 -9665994 -9843196 -9979199
3468 -9979199 -9729689 -8184816 -6036787 -4306528 -2893539 -2075896 -3671099 -8578321 -14310304
3459 -14310304 -17085000 -15776604 -12182434 -8240974 -4771631 -2105432 84038 3029833
3451 3029833 7078882 10261209 10451808 8086073 4798855 758080 -3916661 -6525220
3443 -6525220 -4444855 101326 2166735 1392049 3022196 10298195 19366717 23456459
3435 23456459 19504670 9694106 -742565 -6641012 -7243188 -8143606 -15176421 -25814955
3427 -25814955 -31376666 -28787438 -24274353 -23037059 -21882985 -16629299 -10709091 -9846718
3419 -9846718 -12383908 -12083578 -8142968 -5659406 -7619595 -12659369 -19476018 -27039297
3411 -27039297 -31280571 -28434231 -21884931 -19092083 -20855940 -20195587 -13547838 -6499928
3403 -6499928 -5247509 -7873387 -8213594 -4508065 -144550 1705105 794653 -1186469 -1833441
3394 -1833441 389067 4163059 6327758 5645138 3509375 529238 -4451693 -10831682
3386 -10831682 -15201776 -15829108 -15307916 -16565874 -18780773 -19501927 -18413887 -16445987 -13140630
3377 -13140630 -7788250 -2208726 35948 -2728332 -8249059 -11577118 -8741519 -867406
3369 -867406 5821723 6560985 3967171 3785819 5240955 1300290 -9766608 -19205435 -18404171
3360 -18404171 -10168420 -4180602 -4391575 -6670372 -7194062 -7141515 -8919233 -12615849 -17138155
3351 -17138155 -21237778 -22675090 -19586307 -13487883 -8160945 -4937102 -1852184 1782546
3343 1782546 2917867 -1422448 -9663743 -16546989 -17605972 -12320114 -4240808 1339116
3335 1339116 1253638 -2942910 -6895981 -8212059 -8125795 -8178801 -7353906 -4406846 -1820430
3326 -1820430 -4354793 -12645165 -20620302 -21791756 -17022988 -12826984 -12010810 -10408068
3318 -10408068 -5073721 -1082660 -4897132 -13523681 -17131605 -12669093 -8076379 -10478359
3310 -10478359 -16035304 -15727226 -7259596 3188020 8512895 6308280 -642812 -5920455
3302 -5920455 -3804440 4322811 9972109 7302239 354748 -3221044 -2606027 -2769403 -5370217
3293 -5370217 -7108353 -6570260 -6576011 -9034334 -12575852 -15985849 -19219199 -20542026 -17783015
3284 -17783015 -13129816 -11185876 -11175527 -7272609 1190840 6574560 3948553 -997831
3276 -997831 -909183 1273968 -3215716 -14912484 -24296335 -24364973 -18459298 -13555502 -11025933
3267 -11025933 -7673328 -3014130 -1348093 -6296893 -15351731 -21289761 -19503242 -13471491
3259 -13471491 -11402135 -16733009 -23826037 -24947746 -19902265 -15645612 -16763667 -19961981
3251 -19961981 -19366501 -14404997 -9721143 -8508743 -8911053 -7480092 -3837808 -186337
3243 -186337 2533658 5417961 8250048 8126312 3640950 -1159279 -315550 6401473 12506543
3234 12506543 12694533 8967971 6727966 7039828 6196558 2349409 -963108 777660 7053650
3225 7053650 12352789 11864258 6383193 1470157 1696202 5803265 8333505 6321121 2911640
3216 2911640 3088591 7306657 11757739 14128709 15758626 17441154 16479549 10271458 819246
3207 819246 -6920615 -10100313 -9181182 -5433852 -442820 2389183 -256011 -7011371 -12314317
3198 -12314317 -13312835 -13443881 -16751696 -21502533 -23161693 -21722318 -21236403 -22500124 -21475544
3189 -21475544 -16325689 -11093930 -9499790 -9163015 -6140661 -2333328 -3194906 -8976818
3181 -8976818 -13373499 -11857586 -7352778 -5639537 -7804378 -9631276 -7383884 -2435647
3173 -2435647 -124373 -4173387 -11937645 -16142146 -12863486 -6727836 -5459167 -9727419
3165 -9727419 -12145665 -7240396 1545294 7144746 7655216 6203754 4640084 2291203
3157 2291203 296363 1966398 7349683 11501663 10630882 6980666 4719877 3476846
3149 3476846 -111416 -5597049 -7995859 -4595828 1284339 4965405 5591363 4411946
3141 4411946 1092755 -4494305 -8696121 -6814006 674325 8404467 12938411 15605245
3133 15605245 17916288 18299079 15323014 10742410 6979555 4371883 2955442 3716827
3125 3716827 5480503 4147193 -1282510 -5237716 -2803577 2325629 2775674 -1440013
3117 -1440013 -3371208 -434592 1572389 -2527191 -10102903 -15126943 -14952565 -9953467
3109 -9953467 -1012611 9073269 15444001 16359945 15807127 17478144 18981420 15932222
3101 15932222 9233435 3664643 892844 -1235667 -3271445 -3222485 -1495733 -1818784 -5401321
3092 -5401321 -8266181 -7127718 -4736245 -5697658 -8780605 -7767966 -382300 7358645
3084 7358645 7874547 1030875 -6174499 -7907649 -4562341 372316 5036268 9102084
3076 9102084 11660997 11974711 10988097 9612867 6623337 876350 -5295775 -7855448 -5905580
3067 -5905580 -2254181 202041 -80184 -4286728 -11656727 -17255968 -15941670 -9283701
3059 -9283701 -4182539 -3582212 -3343693 -261937 1856308 -2249331 -11257708 -18739693 -20532352
3050 -20532352 -17647079 -13854680 -12940103 -16238726 -20534208 -20572317 -15637730 -10937350 -10557757
3041 -10557757 -12583621 -13645106 -14050394 -14755423 -13516907 -9055206 -5678987 -8230073
3033 -8230073 -14798497 -19680969 -21176787 -20969427 -18437081 -12316796 -6255575 -5250178
3025 -5250178 -7100572 -4924792 1559301 5153519 3004440 1156492 4000005 6681537
3017 6681537 3236581 -3410488 -5737983 -2563959 31960 -2842972 -10009569 -16953712
3009 -16953712 -20005694 -18238354 -13705519 -9665213 -7538509 -6520874 -6194255 -6859451
3001 -6859451 -6719836 -2579301 4608570 8610433 5539220 -283861 -1756372 1861669
2993 1861669 5127883 4336105 1173728 -1201339 -1978362 -1811019 -803098 1341706 4364468
2984 4364468 7294913 8793999 7999524 5723701 4156888 4467634 5336749 4805285 2941796
2975 2941796 1655704 2155911 3276940 2370524 -1813306 -6645209 -7178405 -1981771 3727346
2966 3727346 3852821 -178664 -968754 4101917 8447198 5295382 -2957655 -8418488 -7842595
2957 -7842595 -4545591 -1965693 -406455 -90030 -2726583 -8389454 -13702126 -14821239
2949 -14821239 -10814473 -3631797 3399819 6486901 2956573 -6336899 -16826117 -23580079
2941 -23580079 -25043377 -23609024 -22941960 -24551033 -26347718 -24585392 -17664206 -7966103
2933 -7966103 251219 4418374 5034331 4342199 4267452 5199072 6203513 6398741 5834864
2924 5834864 4556521 1542152 -4011677 -10666254 -15669175 -17809322 -17568576 -14740348
2916 -14740348 -8623806 -1171989 2943987 1069351 -4476556 -9291472 -10748948 -8151384
2908 -8151384 -1994387 4878677 7877666 5106710 -221868 -3798236 -4968884 -5570514
2900 -5570514 -6190325 -6330197 -6581000 -7526543 -7613983 -5268406 -2466345 -2984207 -6971884
2891 -6971884 -9987221 -8049296 -1857430 4306394 6408849 3394528 -2451240 -7629776
2883 -7629776 -10643037 -12740393 -15086523 -16629487 -16058553 -14486943 -14303762 -16055381 -17997407
2874 -17997407 -18210578 -16157394 -13052250 -11512077 -13453480 -17370035 -19279716 -17253989
2866 -17253989 -12992535 -8127200 -2039887 4880520 9162795 8375021 4786470 2063112
2858 2063112 820357 309212 1482856 4672372 7030952 6500486 5666956 7018451 7110703
2849 7110703 1210049 -8189128 -13763649 -13200661 -10344836 -7428322 -3460668 -719867
2841 -719867 -4902916 -16108925 -26205787 -28721450 -26266288 -24820313 -25389808 -25086332
2833 -25086332 -22615999 -18852223 -14688557 -11288241 -9937387 -9469364 -6830975 -2150064
2825 -2150064 420705 -829786 -2113802 -757992 -586425 -6111289 -14437947 -18069314
2817 -18069314 -14317997 -7696897 -3992958 -5620282 -11777950 -19399972 -24207156 -23931691
2809 -23931691 -20633704 -17921373 -16644247 -15257291 -13123179 -10869043 -8271447 -4266341
2801 -4266341 1160372 6556510 9670473 7608064 -1534356 -15166045 -26286142 -29585063
2793 -29585063 -26164690 -20509821 -15251788 -11438538 -10844530 -13582784 -15273272 -11552982
2785 -11552982 -4856558 -2080096 -5512864 -10642515 -13332083 -14196432 -14433378 -12486543
2777 -12486543 -8116804 -5771090 -9422392 -16228289 -19799961 -18776007 -17580377 -18518779
2769 -18518779 -17998600 -12685127 -5196342 162924 4378431 11127118 18325494 18717883
2761 18717883 10593607 1937042 45452 2002991 946195 -2302571 -1538828 2540905
2753 2540905 1136644 -9660780 -21864330 -25261988 -19089416 -10541800 -5792417 -5941795
2745 -5941795 -8291653 -8131841 -2165677 6785349 11162824 7199313 -924635 -7353626
2737 -7353626 -10749004 -11601781 -8545007 -1830135 3793956 4727241 3543658 3602465 2684563
2728 2684563 -2175752 -7368348 -7352478 -3960804 -3498744 -6236007 -6684480 -3735136 -2423699
2719 -2423699 -4833669 -6865577 -5911062 -4989898 -6853157 -9828996 -11975720 -14012764 -15643692
2710 -15643692 -13996132 -8404056 -2325729 1877486 5792208 10421639 13241465 12198480
2702 12198480 8533155 3500305 -3313138 -10240550 -13057534 -11161196 -9444953 -10697353
2694 -10697353 -10955395 -6463005 -623730 1054003 -657926 -840336 1487510 2748182
2686 2748182 1010914 -1686455 -2576951 -495871 3847230 7228758 5563197 -835441
2678 -835441 -6142908 -6600832 -6182608 -10076355 -15353405 -14377636 -6371985 1064198 2702608
2669 2702608 1935295 4165328 8808961 10972764 8034783 1796505 -3943996 -6002601
2661 -6002601 -3931362 -1446170 -3988373 -12732652 -22235539 -26143178 -24334034 -21963936
2653 -21963936 -21704084 -20094233 -13378808 -4631187 -1430091 -6418703 -13820768 -16973767
2645 -16973767 -15843153 -13876395 -10605205 -2864317 7684435 14417155 14322508 11434114
2637 11434114 9810666 8169302 4237485 -389988 -3422399 -5816877 -8612531 -9589450
2629 -9589450 -7364674 -5195711 -5853282 -6148158 -2276370 2295940 1011060 -5308021 -9109739
2620 -9109739 -6934489 -2998955 -1522921 -1863586 -2547923 -4091517 -5768258 -5063408 -2892799
2611 -2892799 -4401270 -11505644 -18878514 -20594229 -17094840 -12223884 -6864965 168833
2603 168833 7024126 9035726 4035527 -5042751 -12764460 -15145154 -12029234 -7071856
2595 -7071856 -4695655 -6022008 -8356800 -8835249 -7205728 -4839254 -2769896 -1145497
2587 -1145497 930179 4897154 10183452 12881959 10012959 4627499 2706662 4803264
2579 4803264 5320473 997795 -4977979 -9131988 -12349995 -15071089 -13421866 -5488900
2571 -5488900 2572990 2906537 -3774899 -10055180 -12352502 -13532626 -15683968 -16848258
2563 -16848258 -16199867 -16636005 -19289746 -19658348 -12976567 -1459719 7070767 7426453 1969444
2554 1969444 -2816148 -3475073 -2452808 -3689345 -6540558 -6369283 -1530515 3295408 2946130
2545 2946130 -1469978 -4764922 -4924311 -4563190 -5968949 -8298488 -9570904 -8333786 -3614010
2536 -3614010 3594278 9121998 9458765 6696647 5901197 7684605 7945834 5428410 4017946
2527 4017946 5486949 5452699 296890 -6357604 -8708966 -6861779 -4661787 -2110569 3789196
2518 3789196 11408888 14208910 9598787 2920532 -47231 -639008 -3939402 -10404001
2510 -10404001 -14856691 -13465770 -8593017 -5817218 -7925599 -12997750 -17453312 -19443346
2502 -19443346 -18992199 -16220060 -11205697 -5707472 -3027749 -4464867 -6768247 -5284553
2494 -5284553 34444 3570713 169233 -8552381 -15319917 -14542358 -7572936 -385363
2486 -385363 3014293 3625291 4053340 4073010 1480844 -3404366 -6877300 -6442289 -4029916
2477 -4029916 -2817874 -2560615 -621535 3247650 6160082 6374060 5522777 5331338 4313143
2468 4313143 -137780 -7224891 -12358004 -11715031 -6311567 -980458 562384 -781671
2460 -781671 -1289390 751195 3500932 5355512 8014752 13313608 18347363 17514763 9979029
2451 9979029 1709924 -1509098 -343591 827645 277762 -453236 -693195 -1983878 -5498024
2442 -5498024 -10568260 -15674621 -18943715 -18181748 -12695557 -4864153 2140354 7622816
2434 7622816 11966180 12923826 7194698 -3690204 -12753133 -14589870 -10463270 -5182574
2426 -5182574 -1924517 -1865905 -5529605 -11233066 -14310246 -11286955 -3921613 3178959 7374260
2417 7374260 8051557 4463408 -2266100 -6593109 -3433556 4129339 7267882 3180182
2409 3180182 -448113 4201327 14275609 20153425 17806920 12451394 10404150 11865855
2401 11865855 12974171 11480842 7926289 3049390 -3082334 -9273643 -12565136 -10716277
2393 -10716277 -4917503 996427 4245413 5219016 5449739 4542077 594524 -6562168 -14124480
2384 -14124480 -18650789 -18477390 -13928385 -7238497 -2999604 -6069918 -16457269 -27346004
2376 -27346004 -30894653 -26099443 -18983914 -14986592 -13439268 -10386625 -4715747 503671
2368 503671 1999534 -264303 -3853518 -6828274 -9247790 -12190350 -15903239 -18986010
2360 -18986010 -19254528 -15598122 -9372802 -3916030 -2027693 -3413990 -4931148 -3917215
2352 -3917215 -1083374 483421 -1062316 -4538091 -7437504 -8327161 -7303131 -5203990
2344 -5203990 -3119498 -1995541 -1930507 -2029924 -1224171 939626 3956796 6047293 4841941
2335 4841941 227312 -3597495 -1577114 5479513 10164987 6837547 -920476 -4046515
2327 -4046515 1467834 10472329 14994815 12191677 5555685 334473 -1296358 -1567192
2319 -1567192 -3990795 -8370709 -10027321 -5767910 679440 2408359 -1821722 -6366046
2311 -6366046 -7193731 -7458263 -12032404 -19790303 -25064436 -25076738 -22194022 -19389337 -16969208
2302 -16969208 -14356313 -12451620 -12887990 -15931703 -19589565 -20418860 -16135871 -8786245
2294 -8786245 -4386094 -7254727 -14849927 -20097806 -18737921 -12585220 -6047928 -2185938
2286 -2185938 -2503415 -7340103 -14399654 -18815658 -17107085 -10757897 -4764104 -3092454
2278 -3092454 -5959113 -10265019 -11877480 -8956761 -4277107 -2904530 -6182272 -9555974
2270 -9555974 -8329916 -4072984 -2344266 -4687132 -6461829 -3449734 2697945 7646632
2262 7646632 10433340 13206626 16109521 16090619 11621049 5861777 3252654 4290303 5465902
2253 5465902 3643469 -1191982 -6976191 -11207328 -11477835 -6889204 -221326 3337042
2245 3337042 1629179 -1706401 -2262386 -1482227 -4922802 -13850493 -22201987 -23557572 -18435465
2236 -18435465 -12587974 -10317213 -11994440 -16215980 -20889568 -22761570 -19286833 -11699484
2228 -11699484 -4151580 459215 1934561 433001 -4392471 -11299913 -17306167 -20948970
2220 -20948970 -23491735 -25666304 -25696335 -22457559 -18397560 -16744081 -17184795 -16820937 -14387120
2211 -14387120 -10983511 -7460400 -4035477 -2291408 -4276855 -8692172 -10798198 -7970325
2203 -7970325 -3501992 -2779095 -6678584 -10909766 -11671082 -9848124 -8809607 -9538018 -9583655
2194 -9583655 -6650026 -1720444 2162445 3423055 3182888 3251600 4072380 4945988 5402854
2185 5402854 5784358 6757005 8405429 9735059 9684284 9087003 10245525 12952485 12537187
2176 12537187 5171529 -5403122 -10719225 -8127161 -4057406 -4537537 -7059463 -5836155
2168 -5836155 -1178225 1958348 2376990 3351124 5805890 7156067 7483149 10690477 17484436
2159 17484436 22390490 20501984 13206724 4776877 -2870895 -9385784 -13653979 -15352821
2151 -15352821 -15996153 -15966243 -13573247 -9290971 -7029985 -8201118 -8672039 -5525276 -2626114
2142 -2626114 -4332450 -7354049 -5255895 1288175 5529400 4741496 2432266 717872
2134 717872 -2416851 -7079327 -9380770 -7828954 -6190218 -7063179 -7506802 -4471829 -502298
2125 -502298 -191358 -3683709 -6956738 -6598835 -2082400 4467745 8903162 8000035 3468358
2116 3468358 127035 -1301725 -5439925 -13840038 -19975693 -16935929 -6700191 2899512
2108 2899512 7712206 8953943 7943346 4906090 1722220 149613 -2211673 -8632199
2100 -8632199 -16018711 -16999290 -10430925 -4006473 -3933792 -7185616 -7567627 -5239860 -5414553
2091 -5414553 -9832303 -14392957 -15133582 -12948307 -11361517 -11637319 -11407763 -7825574 -1561695
2082 -1561695 2941009 1945985 -3244535 -7704094 -8382720 -6566887 -5071239 -5300548 -7554953
2073 -7554953 -11738086 -16443143 -19157656 -18603826 -15465268 -10390439 -3710242 2076054
2065 2076054 2943250 -1173062 -4428963 -1906289 3670329 5775260 3255579 1409422
2057 1409422 4136692 9276711 12712217 13315175 11855424 7946348 842861 -8128415
2049 -8128415 -16281466 -22166899 -25911625 -27614114 -27023307 -24618241 -21639911 -18934308
2041 -18934308 -16702981 -15314926 -15140137 -15295080 -14064964 -11860215 -12533606 -19075412 -27706704
2032 -27706704 -29649095 -21393474 -10572860 -7188429 -10370298 -10066906 -2733019 2318766
2024 2318766 -3069289 -12296036 -12683655 -3877687 2643817 1872603 1916993 8902610 15538989
2015 15538989 12099478 1609494 -4873047 -3934419 -1554367 -1185430 440612 4835576
2007 4835576 7550046 5465092 2087722 2058716 4809268 6726405 5914404 2103871 -4620199
1998 -4620199 -12071037 -15922985 -14269785 -9908635 -6120113 -3128332 -757049 -785263 -3380994
1989 -3380994 -4515422 -908260 4855004 7841427 7015913 4197914 -448530 -6988536
1981 -6988536 -11885635 -11294119 -7403234 -6074730 -8377853 -9834748 -8193853 -6138342
1973 -6138342 -5205794 -2987151 1223810 3375687 734092 -3132016 -3070524 1180067 6481345
1964 6481345 10958497 13462260 11372681 3460976 -6736637 -14469573 -19466005 -24346781
1956 -24346781 -28668553 -28944123 -24422330 -18803794 -15518090 -14366813 -13397876 -11292404
1948 -11292404 -7325543 -1689719 3296899 4668207 2390945 -499487 -1893119 -2584273
1940 -2584273 -3754068 -5140114 -6964205 -11060362 -17812199 -23605864 -23900799 -18398119
1932 -18398119 -11276257 -6552084 -4997319 -5725264 -8759673 -14475390 -21146001 -24882276
1924 -24882276 -23084162 -17516211 -12944512 -12572022 -15454471 -18276943 -18484425 -15449365
1916 -15449365 -10210582 -5193172 -2984311 -4042336 -6470131 -9061178 -13028042 -18915011
1908 -18915011 -23458612 -22611237 -17256264 -12790157 -12659531 -15167895 -17290196 -18409388
1900 -18409388 -18669163 -16755085 -12322323 -8804964 -10291846 -15815949 -19692050 -18241654
1892 -18241654 -13959144 -11744114 -12570198 -12761395 -9158826 -3174203 1065388 1482255 -408074
1883 -408074 -2339185 -3943688 -5963544 -8394532 -10881426 -14068896 -18789414 -24017724
1875 -24017724 -27069292 -26096274 -21692811 -16399790 -13385012 -14548577 -18258459 -19794042
1867 -19794042 -16205050 -10199399 -6748898 -6371399 -5138513 -1457162 1502518 1916748
1859 1916748 3472059 9564714 16156509 15332652 5439724 -6528467 -13214831 -14087101
1851 -14087101 -13083189 -11970962 -8535564 -648832 9516487 15900551 13532281 3566461
1843 3566461 -7114240 -12080640 -10587279 -6061088 -1153851 3376892 5992495 4165742
1835 4165742 -2289982 -10226632 -16510359 -20198900 -20685296 -16750668 -9474080 -3340495
1827 -3340495 -1359884 -830906 2649910 8155198 10402537 7525115 3332394 516868
1819 516868 -3843523 -12669606 -22068722 -24995440 -20822499 -16584296 -17805570 -21986065
1811 -21986065 -23302486 -20859991 -19047148 -20736205 -23172938 -21245881 -13280872 -2933061
1803 -2933061 3981452 4377100 370117 -2762134 -1342943 3741347 8456588 9330870 5823434
1794 5823434 158391 -4565894 -6896668 -8159135 -10187499 -11783100 -9454228 -2934587
1786 -2934587 2301155 815011 -5624173 -9801249 -7775981 -2629404 986731 2495087
1778 2495087 3587837 3589360 49003 -6629958 -12062319 -12342618 -8353970 -4725040 -4882305
1769 -4882305 -7678041 -8891731 -5664198 845016 6754801 8463547 4610971 -2937981
1761 -2937981 -8957456 -7780645 961701 10195460 11691415 4679358 -3959420 -8073468
1753 -8073468 -8186944 -8496252 -10773104 -13170256 -13596098 -12315932 -11244541 -11352207 -11176305
1744 -11176305 -8868631 -5964915 -6681900 -11456773 -14093655 -9517928 -2222000 -1112339
1736 -1112339 -6727102 -10716279 -9083393 -7919999 -12311613 -17250638 -15919536 -11049474
1728 -11049474 -10049461 -12493096 -11003774 -3277128 4817171 8546940 9746606 11430897
1720 11430897 12704326 11210918 6685262 551746 -5079486 -7936676 -8369308 -10714277
1712 -10714277 -17619016 -24240951 -23764192 -17986260 -15544685 -19120803 -21994626 -19379972
1704 -19379972 -15490016 -15600510 -18158423 -19746589 -21593983 -25053704 -25828828 -19798093
1696 -19798093 -11109707 -7383007 -8979801 -9728695 -7001166 -4537668 -5521767 -8758735
1688 -8758735 -12201471 -15208363 -16686441 -15600579 -14127819 -16094025 -21243274 -24681842
1680 -24681842 -22935239 -17393279 -11347166 -7108144 -6519738 -10359810 -15842257 -17982199
1672 -17982199 -15010956 -10039908 -6704170 -6077822 -8422574 -14180761 -21611715 -26906207
1664 -26906207 -28823045 -30193681 -32402382 -31435385 -23121807 -10661399 -2772738 -3813099
1656 -3813099 -8594566 -8622141 -2227869 3516448 1626673 -5608722 -8896795 -3714375 3640386
1647 3640386 4451647 -798595 -3759174 60047 6155369 8167022 5218185 503596
1639 503596 -3111233 -3930920 -1739311 369326 -1889564 -7629931 -10513790 -7769438 -5068628
1630 -5068628 -8077606 -13290270 -13300546 -8460828 -6163168 -9112063 -11383103 -7570157 205588
1621 205588 7051040 12071471 16691392 19604094 17592835 10139320 154995 -9345402
1613 -9345402 -17114350 -22604539 -24984553 -23632714 -18824283 -11772893 -4293240 1585872
1605 1585872 3863599 1152122 -5541752 -11559883 -11757837 -6793480 -3854439 -8072336
1597 -8072336 -15163336 -16602938 -10693717 -3499390 579897 2992108 4847042 3310706
1589 3310706 -2559726 -8210605 -10348163 -12435015 -18163156 -23794900 -23571440 -19526458
1581 -19526458 -18202022 -19180601 -15507222 -6378402 -870157 -5366012 -13999404 -16784926
1573 -16784926 -12620021 -8454643 -8358280 -9625235 -9434593 -9919686 -14396666 -21366091 -25054653
1564 -25054653 -21844955 -14692031 -10052785 -10619124 -12677046 -11494726 -7309934 -3853134
1556 -3853134 -2958077 -4147885 -7968468 -14677410 -19891534 -17552060 -8883949 -2702100
1548 -2702100 -4000072 -7647313 -7089755 -3767535 -2592083 -2888390 -700646 2971124 3469894
1539 3469894 416188 -2411871 -3862857 -5003158 -2897077 6716620 19350938 22857063
1531 22857063 12184323 -3509975 -12356774 -12586997 -9855623 -7811367 -7199264 -9895224
1523 -9895224 -16783153 -23225687 -22579001 -14265351 -4541725 342445 -1275961 -7501969
1515 -7501969 -14736427 -18725885 -16907464 -10365243 -2378545 4116785 6934667 5135266
1507 5135266 1175967 -10951 3315588 7465767 9405069 11769493 17812773 24488586
1499 24488586 26007439 22382156 18491903 15431975 9021240 -2464883 -14784421 -23409134
1491 -23409134 -27690598 -27628971 -21616658 -10539254 -259402 3771884 2436232 764311
1483 764311 1348109 2120220 -411247 -7312008 -15720531 -20366953 -17805228 -9775152 -1293913
1474 -1293913 4408784 7359552 7987512 5964028 2340912 -245287 -762688 -1027228 -2987252
1465 -2987252 -6625429 -10431252 -11516337 -6156793 5622965 16086309 15598139 3937071
1457 3937071 -8878490 -14800586 -15623511 -16194171 -15886490 -11990329 -7107068 -6696036 -11112937
1448 -11112937 -15486939 -16499504 -14782853 -11566902 -7303618 -3132443 -39718 2799385
1440 2799385 5681712 5866607 1222764 -5094240 -7955193 -7017610 -5494063 -3435936 1922321
1431 1922321 9265978 13004529 11426205 9324442 10278843 11654779 10210323 7568558
1423 7568558 6026429 3238340 -3660896 -11363567 -13589767 -10236428 -8055005 -11276803
1415 -11276803 -15745500 -14566800 -7089140 378162 2136596 -748775 -2634630 -593826
1407 -593826 2171511 878241 -4253655 -7870228 -5665772 1283744 8603513 12870864
1399 12870864 12860637 8677886 1684194 -5473886 -10370763 -12313589 -11933814 -10180640 -8439686
1390 -8439686 -8457875 -10738146 -13576728 -14990682 -15253021 -16186182 -17983531 -18212697 -14805854
1381 -14805854 -9222872 -5360506 -5203193 -6796760 -7432491 -7649449 -9957468 -13877149 -15217853
1372 -15217853 -11559356 -5720888 -1460099 1909745 7274286 13711888 16867237 14993786
1364 14993786 10627676 5932357 435694 -5573676 -9460631 -10007230 -9251608 -8228826
1356 -8228826 -4234844 4388964 13174629 15020332 7969202 -3074999 -11494852 -13680025
1348 -13680025 -10052157 -4304140 -1132451 -2290929 -4974198 -5566816 -4044546 -2984423
1340 -2984423 -3700375 -5814636 -9313425 -13842914 -16651909 -14796412 -9672496 -6073908
1332 -6073908 -5864676 -5612375 -2087302 2338594 2069298 -4976055 -14731848 -20785559 -19973955
1323 -19973955 -14659952 -10084786 -9233243 -10308562 -9777507 -7347289 -6383184 -9287441 -14249034
1314 -14249034 -17491748 -17415841 -15274437 -12659125 -9954465 -7363706 -6161472 -7887214
1306 -7887214 -12248852 -16478381 -17569863 -15414355 -13147288 -13804042 -16908418 -19059240
1298 -19059240 -18019226 -15810353 -17304753 -25240123 -36324763 -42960885 -40045375 -30130272
1290 -30130272 -20842320 -17302487 -18443907 -20484103 -21402741 -20947359 -18792012 -14989157
1282 -14989157 -10867403 -7465169 -4215544 -954042 360144 -1600381 -4382324 -4440151
1274 -4440151 -2394810 -2435133 -6389742 -11402856 -14074443 -14108357 -12837427 -10703812 -7929746
1265 -7929746 -6042512 -6817562 -9945404 -12472715 -10649381 -3091784 6870295 12921555
1257 12921555 11666005 6304793 2600401 2054927 1701113 -86339 -1234919 172152
1249 172152 3267807 6686864 10063636 11812879 9072338 2377448 -2655257 -1502553
1241 -1502553 3522296 6862321 7274580 8137814 11099661 13410666 12353212 9309827 7653000
1232 7653000 7939585 6826779 848527 -9276436 -18593176 -22489955 -20836522 -16741225
1224 -16741225 -12124656 -6804516 -1872617 -710582 -4828720 -10923488 -14291042 -13825291
1216 -13825291 -11928707 -11088725 -12549838 -16691284 -21922745 -23971566 -19042299 -8001119
1208 -8001119 4036472 12016353 13804753 10066046 3518618 -2111334 -4416364 -3860811
1200 -3860811 -2367528 -1399418 -2418939 -7193933 -15048710 -21001274 -19831966 -12240418
1192 -12240418 -4682119 -2599502 -5230200 -7206556 -4263488 2297508 6176209 2366297
1184 2366297 -6285653 -11137569 -8223878 -3915390 -6953773 -17283226 -26990569 -30393973
1176 -30393973 -27947372 -21207122 -10502356 993805 6794895 4084445 -2325091 -5697038
1168 -5697038 -4280903 -698640 2149965 2036166 -2550455 -9958177 -14988114 -14044864 -9509920
1159 -9509920 -6788783 -8383672 -12845092 -17835628 -21681813 -22986120 -21180263 -17279893
1151 -17279893 -12861787 -8931525 -6354028 -5760703 -6101942 -5216320 -3001546 -1969254 -3413058
1142 -3413058 -5341931 -5609842 -4444134 -2231698 1959492 7105861 8747389 4364541
1134 4364541 -2234391 -5607223 -5514400 -5060510 -4264208 -627894 4829996 7349964 4626255
1125 4626255 -903212 -6176747 -9978431 -11286789 -9621223 -7651095 -8932331 -11848701
1117 -11848701 -10304324 -2278513 6686082 11091950 12483908 15367958 19513056 20717605
1109 20717605 17379488 11939078 6450761 763489 -4513313 -6825234 -5133799 -2442292
1101 -2442292 -2902105 -7133487 -11896262 -14248879 -14632912 -15134496 -15795423 -14514661 -10814692
1092 -10814692 -7673996 -8173598 -11637831 -14739837 -15245927 -12760805 -7208699 366385
1084 366385 6081559 5941801 1141495 -2217536 57341 5830603 9859235 9142868 4119041
1075 4119041 -3012934 -9591817 -13868020 -16343532 -18356380 -19030865 -16144119 -10794284
1067 -10794284 -8043001 -10992876 -16854297 -21064233 -22800409 -23834232 -24361318 -23488381
1059 -23488381 -22446110 -23559107 -26142755 -26483259 -22488252 -16345527 -11983482 -11067891
1051 -11067891 -11674558 -10204023 -4913723 1988596 6510382 7293735 6398148 5565796 4250154
1042 4250154 2180446 719109 -64207 -2220909 -5216722 -4224895 2603983 8298280 4218505
1033 4218505 -8259743 -18849653 -20830461 -16988382 -12895341 -10197474 -8413525 -8154000
1025 -8154000 -9427168 -10198476 -9244639 -7707496 -6119267 -3243433 259132 931748 -1950910
1016 -1950910 -3761956 -1024011 2902080 3068900 1010478 1994028 5657841 5611720 -895674
1007 -895674 -8405231 -10642451 -8393983 -7010557 -8891257 -11863468 -13563140 -13995310 -13753841
998 -13753841 -12442240 -9914736 -7531866 -6887705 -7828224 -8715346 -8557734 -8077354 -8429326
989 -8429326 -9523012 -10212637 -9820698 -8701742 -7306216 -5591003 -3937733 -4124751 -8343670
980 -8343670 -16621999 -25358151 -29287885 -25991371 -18605258 -12986553 -11519123 -10793344 -6572640
971 -6572640 42033 3495536 586861 -5954082 -11394820 -14330109 -16446339 -18442777
963 -18442777 -18670991 -16087752 -12763108 -12102889 -14909921 -18386518 -19548067 -18655463 -17928745
954 -17928745 -17454638 -14830438 -9657531 -5738761 -6571120 -10558027 -13526123 -14517183 -15529989
945 -15529989 -16347094 -14003906 -8068710 -2410707 -101890 125091 531048 573155 -1302172
936 -1302172 -4558036 -7493999 -9305730 -9595722 -8212623 -7113484 -9304899 -13821563 -15259361
927 -15259361 -11288790 -7016251 -7792826 -10969549 -9971398 -4075444 1829675 5622727 9303260
918 9303260 12193676 10090731 3079459 -2282739 -1728814 1197598 2031646 2640430 6500595
909 6500595 10657319 8830113 1127635 -5390385 -6284805 -4803600 -5817273 -8911559 -10386737
900 -10386737 -9418716 -8520264 -8518096 -6656712 -1162056 4604752 5304110 558438 -3926584
891 -3926584 -3076683 1844291 5590063 4879243 -9489 -7389239 -14693072 -18228754 -16271070
882 -16271070 -12128172 -10590649 -11606166 -11457385 -9946351 -11011195 -14972819 -16133352
874 -16133352 -11359980 -5738829 -4918376 -6180337 -3262874 2705420 4123174 -1746966
866 -1746966 -8957641 -11637491 -10987446 -11089374 -12114554 -11174039 -7593331 -4170716 -3753005
857 -3753005 -6198746 -8537813 -7841302 -4589840 -2678565 -4611230 -7543651 -6609055 -1661654
848 -1661654 2560769 3089270 1627733 -254299 -4411516 -11692976 -17791825 -17853386 -13538479
839 -13538479 -11123971 -12791081 -13744768 -9044246 -338279 6009638 5904074 1003377 -3883347
830 -3883347 -5326017 -3316181 -155059 1727730 1074083 -1934959 -5774681 -8314904 -8557483
821 -8557483 -7689622 -7470509 -7711078 -6802322 -4903486 -4640691 -7559850 -11555054 -13444663
812 -13444663 -12915548 -12036551 -11617028 -10227908 -6948864 -3263423 -1465405 -2139964 -3884944
803 -3884944 -5107344 -5605875 -6182279 -6617552 -4757557 983629 8243861 11982420 10251376
794 10251376 6641084 5068451 4208814 353407 -5375010 -7038050 -1994372 4848020
786 4848020 7175679 4928672 2880407 3294963 3526831 761626 -4101561 -8419386 -11218148
777 -11218148 -12708592 -11951745 -7779500 -2092556 446003 -2365267 -6959857 -8097346
769 -8097346 -5409651 -3236636 -4082833 -5486753 -4591937 -2675945 -2632208 -4241124 -4940781
760 -4940781 -3686551 -976248 3403653 9012615 12514291 11342020 8882641 10585590
752 10585590 14611706 12728117 2740571 -6382430 -6175403 -185495 1945528 -1964140
744 -1964140 -5723259 -5224130 -2663956 -598957 1483214 3403936 2929222 423158 247130
735 247130 4898554 11232503 14781325 14737700 12592088 8988977 4521112 1198233 559903
726 559903 1924909 4125340 7006844 9809225 10475259 8352462 5434192 3380791 1607256
717 1607256 -389426 -1726031 -2688581 -5125459 -8222242 -7843555 -3132695 251442 -2361281
708 -2361281 -7427638 -8326976 -4646972 -675085 2913619 9025336 16503800 19356756 14808179
699 14808179 6823273 278610 -3947716 -7110101 -10159316 -14159606 -19149075 -22020445
691 -22020445 -19693396 -14583178 -12166889 -13054197 -13094077 -11516288 -11900822 -13762240 -11405964
682 -11405964 -4527637 -1614206 -7289655 -13819917 -12433880 -6774852 -6441906 -11719211
674 -11719211 -14179393 -10000959 -3531916 1298073 4435739 4854142 740962 -4661273
666 -4661273 -5217764 -1221558 646048 -2179801 -5306114 -6647463 -10127755 -16887857 -20912329
657 -20912329 -18212559 -13386018 -11663268 -10803814 -7037087 -3316283 -4410779 -8046134
649 -8046134 -8435311 -5655010 -4176909 -4248952 -2152668 2144545 4800117 5149802 6016436
640 6016436 6809243 3363857 -4007338 -8877443 -7482576 -3639195 -2312444 -3217915 -3764391
631 -3764391 -3973669 -5064377 -6572195 -8169890 -11530089 -17235598 -22181773 -23046763 -20520170
622 -20520170 -17596624 -15611243 -14521822 -15224671 -18511715 -22555772 -23913326 -20869743
614 -20869743 -14645100 -8118202 -4111874 -3519814 -4427091 -4767613 -5960044 -10894566 -17730387
605 -17730387 -20015641 -15276725 -9297183 -8265989 -10217040 -8670741 -2013395 5564935
597 5564935 10346633 11222827 7310065 -772753 -7820531 -8000616 -2417589 2169662 2430966
588 2430966 1031835 -228592 -3500273 -9039760 -12377515 -11020529 -9270417 -12187102
580 -12187102 -18331475 -22684435 -23941860 -24683196 -26279609 -27581390 -27444988 -25441596 -21302062
571 -21302062 -16283001 -13497995 -14328883 -16310121 -17053075 -17851215 -20258679 -21709245 -18783709
562 -18783709 -13149903 -9884163 -10811708 -13380063 -15078820 -14999335 -12124647 -6456992 -1102686
553 -1102686 1090224 2051866 4912183 7076217 2986040 -6227560 -12499920 -11545380 -7445940
544 -7445940 -4687376 -2441761 66641 -484503 -5011415 -7352603 -2699052 3474292 2148539
535 2148539 -5980993 -11351570 -9015158 -4373567 -4400173 -8929166 -13001363 -13816501 -12671223
526 -12671223 -12169910 -13389031 -14726658 -13013085 -6928088 776631 5722030 5947404 2176922
517 2176922 -4329143 -11485658 -15194570 -12246747 -4848823 594595 -63010 -5300165 -10675571
508 -10675571 -12590484 -9633536 -3166867 2873568 5105557 4176009 3448065 4572550 6394284
499 6394284 7384010 6383588 1959240 -5201672 -9817348 -6692347 1343438 4811456 -1287277
490 -1287277 -11620981 -17687502 -16908250 -12198329 -6407222 -761916 3756950 6972207
$$ [...]
##END NTUPLES=NMR SPECTRUM
##END=
