##TITLE=31P_LR_724-R2-CR17 
 64 sc cdcl3
 26.2.2025
##JCAMPDX= 6.0         $$ Bruker NMR JCAMP-DX V2.0
##DATA TYPE= NMR SPECTRUM
##DATA CLASS= NTUPLES
##ORIGIN= UXNMR, Bruker Analytische Messtechnik GmbH
##OWNER= root
$$ XWIN-NMR		Version 3.5
$$ Wed Feb 26 15:59:31 2025 Russian Standard Time (UT+4h)  new_Human@DPX200
##.OBSERVE FREQUENCY= 81.013821
##.OBSERVE NUCLEUS= ^31P
##.ACQUISITION MODE= SIMULTANEOUS
##.ACQUISITION SCHEME= undefined
##.AVERAGES= 64
##.DIGITISER RES= 17
##SPECTROMETER/DATA SYSTEM= spect
##.PULSE SEQUENCE= zgpg30
##.SOLVENT NAME= Acetone
##.SHIFT REFERENCE= (INTERNAL, Acetone, 0, 198.062)
##AUDIT TRAIL= $$ (NUMBER, WHEN, WHO, WHERE, WHAT)
$$ ##TITLE= Audit trail, XWIN-NMR		Version 3.5
$$ ##JCAMPDX= 5.01
$$ ##ORIGIN= Bruker BioSpin GmbH
$$ ##OWNER= new_Human
$$ C:/Bruker/XWIN-NMR/data/yarkov/nmr/P31/2/pdata/1/auditp.txt
$$ ##AUDIT TRAIL=  $$ (NUMBER, WHEN, WHO, WHERE, WHAT)
(   1,<2025-02-26 15:57:25.90 +0400>,<new_Human>,<DPX200>,
      <created by zg, POWCHK disabled, PULCHK disabled
       configuration hash MD5:
       00 E9 B6 7A A2 85 ED C7 34 08 36 98 17 FE 4E 26
       data hash MD5: 32K
       7A 54 AE 5E 63 B2 4C AD 9D 85 F0 D9 0A E8 D2 EC>)
(   2,<2025-02-26 15:57:49.71 +0400>,<new_Human>,<DPX200>,
      <Start of raw data processing
       efp BC_mod = 2 LB = 1.5 FT_mod = 6 PKNL = 1 PHC0 = 1796.663 PHC1 = 34.09541 SI = 64K 
       data hash MD5: 64K
       09 80 CB 30 26 6C A8 F5 79 46 1B 2E B6 72 0B FB>)
(   3,<2025-02-26 15:58:27.03 +0400>,<new_Human>,<DPX200>,
      <pk PHC0 = 12.42586 PHC1 = -27.19999 
       data hash MD5: 64K
       DC AB AC 10 B0 3C 61 F7 CE 46 6C A6 13 BB 31 94>)
(   4,<2025-02-26 15:58:34.31 +0400>,<new_Human>,<DPX200>,
      <abs ABSG = 5 
       data hash MD5: 64K
       1B 3C DE 8D 5A E7 DE E5 17 53 02 10 71 B0 18 BA>)
$$ ##END=
$$ 
$$ hash MD5
$$ EA 6C 22 EB ED 2F 57 8D 48 1A EB CA EB 0F C9 35
##$RELAX= 
##$RELAX= 
##$RELAX= 
##$RELAX= 
##$RELAX= 
##$RELAX= 
##$RELAX= 
##$RELAX= 
$$ Bruker specific parameters
$$ --------------------------
##$DU= <C:/Bruker/XWIN-NMR>
##$EXPNO= 2
##$NAME= <P31>
##$PROCNO= 1
##$TYPE= <nmr>
##$USER= <yarkov>
##$AMP= (0..31)
100 100 100 100 100 100 100 100 100 100 100 100 100 100 100 100 100 100 
100 100 100 100 100 100 100 100 100 100 100 100 100 100 
##$AQSEQ= 0
##$AQ_mod= 1
##$AUNM= <au_zg>
##$AUTOPOS= <>
##$BF1= 81.014009
##$BF2= 200.13
##$BF3= 200.13
##$BF4= 200.13
##$BF5= 200.13
##$BF6= 200.13
##$BF7= 200.13
##$BF8= 200.13
##$BYTORDA= 1
##$CFDGTYP= 0
##$CFRGTYP= 5
##$CHEMSTR= <none>
##$CNST= (0..31)
1 1 145 1 1 1 1 1 1 1 1 1 1 1 1 1 1 1 1 1 1 1 1 1 1 1 1 1 1 1 1 1 
##$CPDPRG= <waltz16>
##$CPDPRG1= <>
##$CPDPRG2= <waltz16>
##$CPDPRG3= <>
##$CPDPRG4= <mlev>
##$CPDPRG5= <mlev>
##$CPDPRG6= <mlev>
##$CPDPRG7= <mlev>
##$CPDPRG8= <mlev>
##$CPDPRGB= <>
##$CPDPRGT= <>
##$D= (0..31)
0 1 0 0 0 0 0 0 0 0.06 0 0.03 2e-05 3e-06 0 0 0.0002 0 0 0 0 0 0 0 0 0 
0 0 0 0 0 0 
##$DATE= 1740571045
##$DBL= (0..7)
120 120 120 11 120 120 24 19 
##$DBP= (0..7)
$$ [...]
##$SUBNAM3= <"">
##$SUBNAM4= <"">
##$SUBNAM5= <"">
##$SUBNAM6= <"">
##$SUBNAM7= <"">
##$SUBNAM8= <"">
##$SUBNAM9= <"">
##$SW= 400.765351723535
##$SWIBOX= (0..15)
0 1 3 0 0 0 0 0 0 0 0 0 0 0 0 0 
##$SW_h= 32467.5324675325
##$TD= 32768
##$TD0= 1
##$TE= 0
##$TE2= 300
##$TE3= 300
##$TEG= 300
##$TL= (0..7)
0 120 53 12 22 120 120 120 
##$TP= (0..7)
150 150 150 150 150 150 150 150 
##$TP07= 0
##$TPNAME0= <>
##$TPNAME1= <>
##$TPNAME2= <>
##$TPNAME3= <>
##$TPNAME4= <>
##$TPNAME5= <>
##$TPNAME6= <>
##$TPNAME7= <>
##$TPOAL= (0..7)
0.5 0.5 0.5 0.5 0.5 0.5 0.5 0.5 
##$TPOFFS= (0..7)
0 0 0 0 0 0 0 0 
##$TUNHIN= 0
##$TUNHOUT= 0
##$TUNXOUT= 0
##$USERA1= <user>
##$USERA2= <user>
##$USERA3= <user>
##$USERA4= <user>
##$USERA5= <user>
##$V9= 5
##$VALIST= <valist>
##$VCLIST= <CCCCCCCCCCCCCCC>
##$VD= 0
##$VDLIST= <DDDDDDDDDDDDDDD>
##$VPLIST= <PPPPPPPPPPPPPPP>
##$VTLIST= <TTTTTTTTTTTTTTT>
##$WBST= 1024
##$WBSW= 4
##$XGAIN= (0..3)
0 0 0 0 
##$XL= 0
##$YL= 0
##$YMAX_a= 13221
##$YMIN_a= -14725
##$ZGOPTNS= <>
##$ZL1= 120
##$ZL2= 120
##$ZL3= 120
##$ZL4= 120
##$ABSF1= 198.0616
##$ABSF2= -202.7028
##$ABSG= 5
##$ABSL= 3
##$ALPHA= 0
##$AQORDER= 0
##$ASSFAC= 0
##$ASSFACI= 0
##$ASSFACX= 0
##$ASSWID= 0
##$AUNMP= <proc_1d>
##$AZFE= 0.1
##$AZFW= 0.5
##$BCFW= 0
##$BC_mod= 2
##$BYTORDP= 0
##$COROFFS= 0
##$CY= -3
##$DATMOD= 1
##$DC= 0
##$DFILT= <>
##$DTYPP= 0
##$F1P= 0
##$F2P= 0
##$FCOR= 1
##$FTSIZE= 65536
##$FT_mod= 6
##$GAMMA= 0
##$GB= 0
##$INTBC= 1
##$INTSCL= 9.790993e-09
##$ISEN= 30
##$LB= 1.5
##$LEV0= 0
##$LPBIN= 0
##$MAXI= 10000
##$MC2= 0
##$MEAN= 0
##$ME_mod= 0
##$MI= 50
##$NCOEF= 0
##$NC_proc= -6
##$NLEV= 6
##$NOISF1= 182.463
##$NOISF2= 159.3651
##$NSP= 0
##$NTH_PI= 0
##$NZP= 0
##$OFFSET= 198.0616
##$PC= 4
##$PHC0= 1809.089
##$PHC1= 6.89542
##$PH_mod= 1
##$PKNL= yes
##$PPARMOD= 0
##$PSCAL= 0
##$PSIGN= 0
##$REVERSE= no
##$SF= 81.0140089999434
##$SI= 65536
##$SIGF1= 159.3651
##$SIGF2= -187.1042
##$SINO= 113.3802
##$SIOLD= 16384
##$SREGLST= <1H.CDCl3>
##$SSB= 0
##$STSI= 65536
##$STSR= 0
##$SW_p= 32467.5324675325
##$SYMM= 0
##$S_DEV= 0
##$TDeff= 32768
##$TDoff= 0
##$TI= <>
##$TILT= no
##$TM1= 0
##$TM2= 0
##$TOPLEV= 0
##$USERP1= <user>
##$USERP2= <user>
##$USERP3= <user>
##$USERP4= <user>
##$USERP5= <user>
##$WDW= 1
##$XDIM= 65536
##$YMAX_p= 343283855
##$YMIN_p= -60872395
$$ End of Bruker specific parameters
$$ ---------------------------------
##NTUPLES= NMR SPECTRUM
##VAR_NAME=  FREQUENCY,     SPECTRUM/REAL,   SPECTRUM/IMAG
##SYMBOL=    X,             R,               I
##VAR_TYPE=  INDEPENDENT,   DEPENDENT,       DEPENDENT
##VAR_FORM=  AFFN,          ASDF,            ASDF
##VAR_DIM=   65536,         65536,           65536
##UNITS=     HZ,            ARBITRARY UNITS, ARBITRARY UNITS
##FACTOR=    0.49542278885378, 1,            1
##FIRST=     16045.7642231865, 0,            0
##LAST=      -16421.768244346, 0,            0
##MIN=       -16421.768244346, -60872395,    0
##MAX=       16045.7642231865, 343283855,    0
$$ Real data points
##PAGE= N=1
##DATA TABLE= (X++(R..R)), XYDATA
$$ [...]
42987A038888k28144k51643j49299J40753L69233J86274j30002P5956O98429Q15652
42977B566097P0987p23710p99437m50797k86217k06905J29950M24268J64416m19653
42967D68999o63040n09086m59030n99468m85335n4009R8258l63968q63524n69520
42957c999723N51762J649085J863176J135865J84713k48687r1686J57286J39100
42948A340891j11j0118K4494j01910k94657k79775n1706R1261m2290k85823l08486
42937H1770K287L34492J83858n44625j233372j142259k95963N54687Q47744O56684
42927e54697K34330k75027n31713j23751O71366R41614M01901j06357O7192L36790
42917A061648n8512o79757o21568p4438M5519l12446l85393p0565j4069k29862
$$ plain form
42987 1038888 810744 559101 409802 550555 919788 1106062 976060 1052016 1750445 2566097
42977 2566097 2637084 1913374 1113937 663140 376923 170018 299968 724236 888652 468999
42967 468999 -194041 -703127 -1162157 -1761625 -2246960 -2300969 -2202711 -2566679 -3430203 -3999723
42957 -3999723 -3447961 -1798876 64300 1200165 1384878 1136191 1044505 1201791 1340891
42948 1340891 1340780 1330662 1355156 1253246 958589 678814 627108 718369 676079 390256 81770
42937 81770 84057 418549 602407 57782 -1175590 -2317849 -2613812 -2059125 -1211381 -554697
42927 -554697 -320367 -595394 -1127107 -1250858 -579492 362122 764023 657666 724858 1061648
42917 1061648 1003136 323379 -298189 -372627 -327108 -639554 -1024947 -1095512 -1109581 -1339443
42907a339443l2903M61710K50922p00107j013287o9636P91409L24302n98965l79599
42897b305597Q14597J472025J078801M80573J80405j79984o11756m93770K12077
42888F47371O72956M76103J35070m6753n01489j276840j495996o90440K58711
42879a821307L95202J22457L54975Q66216O90021j33286m78286J10235O99127
42870H05354L84212m31010p09761j72546N26857O92896K11635n23408r60736p84330
42860i60837k08322K08771J91182M0814J64845M97689O11760L02561j40839k51436
42850D56188J04840N33961M93842k8084l73988l9133N09163L36971o20900j360924
42840A1936j175352n47542k18995j3612O36439J440439J511250P61278M8575j91179
$$ plain form
42907 -1339443 -1372346 -910636 -659714 -1359821 -2373108 -2442744 -1651335 -1327033 -1925998 -2305597
42897 -2305597 -1491000 -18975 1059826 1540399 1720804 1540820 929064 435294 647371
42888 647371 1320327 1796430 1931500 1884747 1383258 106418 -1389578 -2080018 -1821307
42879 -1821307 -1426105 -1303648 -948673 -82457 607564 474278 -4008 106227 805354
42870 805354 1189566 758556 48795 -123751 403106 1096002 1307637 784229 -176507 -960837
42860 -960837 -1169159 -960388 -769206 -728392 -563547 -65858 545902 848463 707624 456188
42850 456188 561028 1094989 1588831 1560747 1186759 1147626 1656789 1993760 1372860 11936
42840 11936 -1163416 -1710958 -1929953 -1943565 -1307126 133313 1644563 2405841 2454416 2263237
42830B263237m83398j128985j416663p03959L90558P24386K05121j99534J10125
42821b39112P03300R35490P36061L58613r7796n59090p28108l84179J88299M06978
42811A320456O8236l87319m05231k7056J18541l78313j086822j187825m98318
42802b463651L11321O06356M91958L97444L68414K12114O9188K66258O48883O11258
42792A519543o7982q29606r82962m80781J53373M81670N24039N27891N18110J91503
42782A554798o30041j486826j537343n37657O90036J092054N20707k85760o60865
42773a280897n05458K5191P38306J233700J060736K91039m22396n77606l44382
42764B18233j89752k52082k81013k3199M69762Q16093N98344j49783q32838r08278
$$ plain form
42830 2263237 1779839 650854 -765809 -1469768 -1079210 -354824 -149703 -349237 -239112
42821 -239112 464188 1399678 2135739 2494352 2396556 1837466 1109358 725179 913478 1320456
42811 1320456 1388692 1001373 596142 569086 687627 309314 -777508 -1965333 -2463651
42802 -2463651 -2152330 -1545974 -1054016 -656572 -288158 -76044 -6856 259402 908285 1519543
42792 1519543 1451561 621955 -361007 -841788 -688415 -206745 317294 845185 1363295 1554798
42782 1554798 924757 -562069 -2099412 -2637069 -1947033 -854979 -334272 -620032 -1280897
42773 -1280897 -1786355 -1761164 -1022858 210842 1271578 1562617 1140221 562615 218233
42764 218233 28481 -223601 -504614 -527813 -58051 758042 1356386 1206603 373765 -534513
42754e34513m91588o2926K05932L77790K52430l60373r59676p59413J28881P44931
42744a458525P02304O55157R88541J035375K66410o17448o90484k45497k13284
42735D22549n83099m99922K36620Q23771O73384J01949l56536n94396o81552n74466
42725a031698k99516n514K65936N03926M99110J57312q8015K25977P64553P37027
42715A729098L6513o84814j082281j412833j624524j112938J69048J187063J053644
42706a742024K05462k74287n5131L47951N20138N07143L91359J09606k80064n19257
42696g89104l67866K30113J016660J338004N89026r27327j940271j484191l9953
42687b374909J024754J005693M21534J19704K93487M90151K94477j84100m81829
$$ plain form
42754 -534513 -1026101 -1089027 -883095 -505305 -252875 -613248 -1572924 -2332337 -2203456 -1458525
42744 -1458525 -756221 -101064 887477 1922852 2189262 1571814 881330 635833 422549
42735 422549 -160550 -660472 -423852 399919 1073303 1175252 818716 224320 -457232 -1031698
42725 -1031698 -1331214 -1336728 -1070792 -566866 -67756 89556 1541 227518 992071 1729098
42715 1729098 1765611 1080797 -1484 -1414317 -3038841 -4151779 -3982731 -2795668 -1742024
42706 -1742024 -1536562 -1810849 -1865980 -1518029 -997891 -490748 -99389 10217 -269847 -789104
42696 -789104 -1156970 -926857 89803 1427807 2016833 1089506 -850765 -2334956 -2374909
42687 -2374909 -1350155 -344462 77072 196776 490263 980414 1274891 1090791 608962
42678F08962l88071k22426k90112k56779L95439J303100J365738K61426r25114
42669A852163j127964o64450m43286m62019j31573L26739Q9257o91891q14572
42660b067596J19838R38010O17357j82936j94137N28709P91094J09146o41393
42651A8092n59218O7371K56882l50993j059911r30988J38329J208414J238322
42642B6300K39342o94187o04268L15282J108066J177663O72905j8683o28971q66133
42632G27316m76855K95557P20438M02849j65295k75411m1752k36639j035092j504737
42622a589621p60639P18174J524487J039766J09494k16530m3384k02901q38579
42613b59733j185219p73359j10623J57002J73560M53688R36909J089875P80780
$$ plain form
42678 608962 220891 -1535 -291647 -548426 -152987 1150113 2515851 2777277 1852163
42669 1852163 724199 59749 -383537 -845556 -977129 -650390 -561133 -1253024 -2067596
42660 -2067596 -1947758 -1009748 -392391 -575327 -769464 -240755 550339 659485 18092
42651 18092 -541126 -473755 -216873 -567866 -1627777 -2558765 -2420436 -1212022 26300
42642 26300 265642 -428545 -1032813 -717531 390535 1568198 2241103 2222420 1593449 727316
42632 727316 250461 546018 1266456 1669305 1504010 1228599 1186847 950208 -84884 -1589621
42622 -1589621 -2350260 -1632086 -107599 932167 1041661 825131 781747 578846 -259733
42613 -259733 -1444952 -2218311 -2328934 -2171932 -1998372 -1544684 -607775 482100 1262880
42604A262880M23819K60135R8026j17997r0351J90904J43265n94888j431860j472914
42594a328981o99779O7405K95322K35812K62730L13590K20368J08458J38985J95669
42584a90421J36129O9741R7641O2092j28807k03837Q0975M91979O31708M73688
42574A520888K00663k04889p11693q69889l56516K82799K09458m25037o13077
42565i67293k3099N08436L38566l6886M3653L05004J66648j73719j79970k8547
42555d7207k43844n81906l30920L55338N04970j21191n43267l5981P75669Q79175
42545F10836K71565k87492m58419n07842n30304k39866L68761P25423L53663m28975
42535a22650p75469k53724O40117R99969M91170l16039o19674k17936M38744Q10085
$$ plain form
42604 1262880 1686699 1946834 2044860 1926863 1836512 2027416 2170681 1575793 143933 -1328981
42594 -1328981 -2028760 -1961355 -1666033 -1430221 -1167491 -853901 -633533 -525075 -386090 -190421
42584 -190421 -54292 15449 113090 175182 46375 -157462 -76487 415492 1047200 1520888
42574 1520888 1721551 1516662 804969 -64920 -421436 -138637 70821 -354216 -967293
42565 -967293 -990392 -481956 -143390 -180276 -136623 168381 335029 161310 -18660 -47207
42555 -47207 -291051 -872957 -1203877 -848539 -343569 -464760 -1008027 -1044008 -268339 610836
42545 610836 882401 594909 136490 -371352 -901656 -1141522 -772761 -47338 306325 -122650
42535 -122650 -898119 -1151843 -511726 488243 979413 663374 43700 -174236 264508 1074593
42525A074593O59462R7492m41690m40351R1555M03060j07656r29592j024609l54412
42515i72148R299m61174q77527l08958P05630Q84558L5768p59191o84612p9656
42505b508011L00633K13003r0871k63812k0094O65665J307893J258030N17999
42496A380435j60369k06212J09979K11543M2031k4783J55660L54687L65535J68827
42486B397333k18192o88062q79211m79735K26785N07036N0524o26513q76994p01198
42476a288227m82161k33028L25219R89450J039759K58947n40641n04685O8328
42467c67039J26610o30434j287723r37870J40428Q86467P45350J64308q6114K49727
42457i96290P82493R67046O21175K1629m35680n92402n12438k62739Q0707K93123
$$ plain form
42525 1074593 1734055 1831547 1389857 949506 1041061 1444121 1336465 406873 -617736 -972148
42515 -972148 -962849 -1424023 -2301550 -2610508 -1904878 -1020320 -984552 -1743743 -2428355 -2508011
42505 -2508011 -2207378 -1994375 -2085246 -2349058 -2369152 -1703487 -395594 862436 1380435
42496 1380435 1220066 1013854 1123833 1335376 1377407 1352624 1508284 1862971 2228506 2397333
42486 2397333 2179141 1491079 611868 132133 358918 865954 916478 289965 -587029 -1288227
42476 -1288227 -1770388 -2003416 -1678197 -688747 351012 609959 69318 -435367 -367039
42467 -367039 -240429 -870863 -2158586 -3096456 -2956028 -2069561 -1324211 -1159903 -1246017 -996290
42457 -996290 -213797 753249 1374424 1396053 960373 367971 -144467 -407206 -326499 -33376
42447c3376J82184n7416L756M10752O77341M32109r7407m65913n54129m33481
42437F4420k4013O43518J033159N56810n43377j269113r92751j32547M85092N75360
42427C96558M15924K18730o2144l52941l47797L4674L72230K03004l70083q34884
42417c26729r49532q94835p38721k46305N31368R67070O37992N0709j1685L69366
42407f11302M65105J33028r316K73874M15740P6469k60572k04699j69155n21082
42397d11910p49561l09461K87691J91997l62658l86773K85683P64943M79616j39130
42387c49563m94351n27479l75650n4736K55270K32597k6225j4688M17597Q49979
42377h7249J009005J107721J245315J076826M24208k65381m19986L5727P66871
$$ plain form
42447 -33376 148808 91392 95148 505900 1183241 1615350 1517943 1052030 497901 64420
42437 64420 40407 683925 1717084 2273894 1730517 461404 -531347 -663894 -178802 396558
42427 396558 812482 1031212 969068 616127 268330 303004 675234 878238 508155 -326729
42417 -326729 -1276261 -2171096 -2909817 -3156122 -2624754 -1657684 -1019692 -968983 -980668 -611302
42407 -611302 -146197 -13169 -22485 251389 667129 743598 483026 278327 109172 -411910
42397 -411910 -1161471 -1470932 -1183241 -991244 -1353902 -1740675 -1454992 -690049 -210433 -349563
42387 -349563 -843914 -1371393 -1747043 -1801779 -1546509 -1313912 -1340137 -1354825 -937228 -87249
42377 -87249 921756 2029477 3274792 4351618 4775826 4510445 4090459 4126186 4893057
42368D893057J395220J672021J678579J905763K697303L667469M256090M754285
42360B6919787N946407P735095R185274J0210772J2105427J5857470K0984368
42353A08944600K6726632L3198315L9975664M4065445M0818416K7552600O334669
42346C27616341j6456179l3396193m0225170l8200667l2282045k6553007k1755402
42339A18747678j7201936j3388730j1340127j0507337r260291p228760n556062
42332D4264435m867752m469312l706764k796947k056707j462911j200552j558283
42324B2145207k096728k009568j451474j341325j710599j579910p50019k60209
42316A0945375n60505p00091p2224M60333J45590k80342K1217L91130j61369j106342
$$ plain form
42368 4893057 6288277 7960298 9638877 11544640 14241943 17909412 22165502 26919787
42360 26919787 32866194 40601289 49786563 59997335 72102762 87960232 108944600
42353 108944600 135671232 168869547 208845211 252910656 293729072 321281672 327616341
42346 327616341 311160162 277763969 237538799 199338132 167056087 140503080 118747678
42339 118747678 101545742 88157012 76816885 66309548 57049257 49820497 44264435
42332 44264435 39396683 34927371 31220607 28423660 26366953 24904042 23703490 22145207
42324 22145207 20048479 18038911 16587437 15246112 13535513 11955603 11205584 10945375
42316 10945375 10384870 9684779 9612555 10072888 10218478 9938136 9959353 10350483 10189114 9082772
42306I082772j204850n48188k83774o73964q74755n01651p9535P8849K30390L22554
42296E547848j27579j021255j485893j030004j85726K69490J74806r3024q2128
42287A966535M07583J034192J041904J48405q90748j150897o98971k34163P9870
42278A703710N44204R44053O92735p2480n55819n31796n18004o23722k98569N11112
42268A795424J001645P17641K05461M5475R5312J12522K53829M81496L29415k27158
42258D811062n06054k36470n2922l01797l41418K12062N40736p1471q55365o53693
42248B544670K56038O82114L79142R7241Q0349j60946o61432q32279n51320l13124
42238A520453k01388K00880P50283P28311J44972p4709L83922O12185k2272p75950
$$ plain form
42306 9082772 7877922 7329734 7045960 6371996 5497241 4995590 4916055 4994904 5225294 5547848
42296 5547848 5420269 4399014 2913121 1883117 1697391 1966881 2141687 2048663 1966535
42287 1966535 2374118 3408310 4450214 4598619 3707871 2556974 1858003 1623840 1703710
42278 1703710 2247914 3191967 3884702 3812222 3256403 2724607 2206603 1582881 1284312 1795424
42268 1795424 2797069 3514710 3720171 3765646 3860958 3973480 4227309 4708805 5038220 4811062
42258 4811062 4305008 4068538 4015616 3713819 3372401 3584463 4125199 4053728 3198363 2544670
42248 2544670 2800708 3482822 3861964 3959205 4039554 3878608 3217176 2384897 1833577 1520453
42238 1520453 1319065 1519945 2270228 2998539 3143511 3068802 3452724 4064909 4042637 3266687
42228C266687p16076j79126j08832n05498n34563O9936O22572N25636r35l79129
42218B060672l98118k86349l03079m25120m14238j60488J52969L56280N70194
42209A152723Q51756P86141J9398q99863r89898k51899K53512L6021j01487M37770
42199A294174Q26053J07675j036425j129579j56571M14300q7244n84681l3219
42190c85517J000926J304176P61599K36334J40895O0408k49759k99552L86963
42181B956473J428752J981013J905171K081347L214696M545995M360683K007220
42173B4481350j115408l042586l297147k857683k484505k029616j353113q61023
42165G440269p66093o64302l48825l23146r02724j434478j143805l04227K03386
$$ plain form
42228 3266687 2550611 2371485 2262653 1757155 1222592 1292528 1915100 2440736 2439801 2060672
42218 2060672 1662554 1376205 1073126 648006 233768 73280 226249 582529 1152723
42209 1152723 2004479 2790620 2810018 1910155 920257 668358 921870 957891 856404 1294174
42199 1294174 2120227 2227902 1191477 61898 -94673 319627 232383 -352298 -385517
42190 -385517 615409 1919585 2681184 2917518 3058413 3118821 2869062 2569510 2956473
42181 2956473 4385225 6366238 8271409 10352756 13567452 18113447 22474130 24481350
42173 24481350 23365942 20323356 17026209 14168526 11684021 9654405 8301292 7440269
42165 7440269 6674176 6009874 5661049 5337903 4435179 3000701 1856896 1552669 1756055
42156A756055J71312J14963K51646K48987m3912l60002n55499p12882o51753n4143
42146A64772P66567R43827K11664o35629p94479m08030p0739Q8039K98120N28945
42136A093057N56291M15699K88002J20967j80798l96904l10183j77530l15425
42127A093176l91339J56578J009127J099762J31058q00192o20135K68640O63087
42118B609762L13228J09245N31766Q32969K02180q93162j231231m61964M81472
42109B494265O49185J50774k99751m25956m95902o34659n91097k36290J32788
42100G43357J63163j28946m33071m58157j14026L97005O33488L43392j17792j65029
42090H63384J41292J00662n19675r78932o46581l6489k4123m32544l41212L46069
$$ plain form
42156 1756055 1927367 2042330 2293976 2542963 2499051 2139049 1583550 870668 218915 164772
42146 164772 931339 1875166 2086830 1451201 656722 248692 177953 265992 564112 1093057
42136 1093057 1649348 2065047 2353049 2474016 2293218 1896314 1586131 1408601 1093176
42127 1093176 701837 858415 1867542 2967304 3098362 2298170 1678035 1946675 2609762
42118 2609762 2922990 3032235 3564001 4396970 4599150 3705988 2474757 2012793 2494265
42109 2494265 3143450 3294224 2994473 2568517 2072615 1437956 846859 610569 743357
42100 743357 906520 777574 344503 -113654 -227680 169325 802813 1146205 1028413 863384
42090 863384 1004676 1105338 585663 -393269 -1039850 -1076339 -1100462 -1533006 -1874218 -1528149
42080a528149O97634K69169k16958j31095P4650j96601n49621k65548M29596O97796
42070g19127L79704N3526n026k3782M444L16273O02931K33170n44885o38771K31998
42059a09545Q98586M28140m24580l66609M77126Q54581L06137l46481m21038k30104
42049A066213k76189m77290n67697n51523l61858K57643J059299J139343J32166
42040A420107r65185r48409m6756M58583J02514k42797J35907P11923O29523j699
42030A253711m16903m00755m25456o86632p15912j54197N90178Q10185M00351
42021B54570m4935m970L51346M61721J73955j6559L03543P30708M90753l66007
42011B334125q13409k58763M43124R8864r99064j308716k04922J052266J015291
$$ plain form
42080 -1528149 -830515 -561346 -778304 -909399 -834749 -1031350 -1580971 -1846519 -1416923 -719127
42070 -719127 -339423 -285897 -290923 -314705 -310261 6012 608943 842113 297228 -341543 -109545
42059 -109545 789041 1217181 792601 425992 903118 1757699 2063836 1717355 1296317 1066213
42049 1066213 790024 312734 -254963 -806486 -1168344 -910701 148598 1287941 1420107
42040 1420107 454922 -493487 -540243 -81660 20854 -221943 -86036 625887 1255410 1253711
42030 1253711 836808 436053 10597 -676035 -1391947 -1546144 -955966 -145781 254570
42021 254570 209635 204665 556011 1017732 1191687 1175128 1478671 2209379 2700132 2334125
42011 2334125 1520716 1261953 1705077 1803941 804877 -503839 -708761 343505 1358796
42002A358796n5956p64875n44534j21545j61320l78625k15509K87595O70562O86052
41992G60641M34947J35875l3321q1152k61928o94717r36994m44798M45881O68761
41982f805q6094p12325j52253J011236J287311L16246p90131j122509r73784q80662
41972b109770o32061J15839R10580J013330N15073J79304K99963M23032K17144
41963I32434m5640m7443R9796J97209L13783M76739L95530j02434o24766o34871
41953I60337j83263J81446J62860j3501q0041q7067j80858l43796n06523o64187
41943g54593p25336m83213O1397N31080N44127J46462k92170m83075l57487J8139
41933a794669M06601M15344j10428p19862p13242L2290Q44575R99391M89911r5740
$$ plain form
42002 1358796 1302840 537965 -6569 -128114 -289434 -668059 -883568 -595973 74589 760641
41992 760641 1195588 1331463 1298142 1216990 955062 260345 -676649 -1121447 -675566 -6805
41982 -6805 -92899 -805224 -957477 53759 1341070 1657316 867185 -255324 -1229108 -2109770
41972 -2109770 -2741831 -2625992 -1715412 -702082 -187009 -7705 292258 715290 932434
41963 932434 886794 839351 939147 1136356 1450139 1926878 2322408 2219974 1595208 960337
41953 960337 777074 958520 1121380 1107879 1027838 940771 759913 416117 -90406 -754593
41943 -754593 -1479929 -1963142 -1901745 -1370665 -826538 -680076 -972246 -1455321 -1812808 -1794669
41933 -1794669 -1388068 -972724 -1083152 -1803014 -2516256 -2483966 -1639391 -640000 -150089 -245829
41923b45829l00959j84331k4511J19443L96822P71828Q64199L82120l55565o34857
41913G88360k02045L76590M41122P1845j46483n088J33587l4855l93419p13296
41903C16318q95006q16917l79063J65820L47275J01423j59596k30743l27169m12055
41893b289713n439Q80501J306724O36109l39814m09543K73152M64084k12353p17609
41883d13901k49396O11298R10831O17131K36358j69800p54418j116396o75736
41874a004029K99242Q46565N77981J24449J18911L26807J74165k67405l62826
41865H33860J03792N27086K74289m16718p08084k72471K91598L22590l3801k09538
41855G12603j55327k91105o18988o01113q6355L12642J19882k99219l82500k01755
$$ plain form
41923 -245829 -546788 -731119 -755630 -636187 -239365 532463 1396662 1778782 1423217 788360
41913 788360 586315 962905 1404027 1475872 1329389 1324301 1457888 1423033 1029614 316318
41903 316318 -578688 -1395605 -1774668 -1608848 -1261573 -1160150 -1319746 -1550489 -1877658 -2289713
41893 -2289713 -2295152 -1414651 -107927 528182 188368 -221175 51977 516061 303708 -413901
41883 -413901 -663297 -51999 858832 1475963 1712321 1542521 788103 -328293 -1004029
41874 -1004029 -704787 141778 719759 844208 963119 1289926 1464091 1196686 833860
41865 833860 937652 1464738 1739027 1322309 614225 341754 633352 955942 922141 712603
41855 712603 557276 266171 -352817 -953930 -1040285 -727643 -607761 -906980 -1289480 -1491235
41845a491235q6011J20260O88910J201840R57598J07606m42933l43503j81069
41836E31463l33385l03046K98315Q36780M96257l99524p46723j99444M48187M85482
41826A114362J51839m742j6177k41119n93266o01079j44618L51109M97888L29617
41816H43814L0225l26652n83732m32896J09083M28991j0211q21096j022128k97977
41806b082579N56495P00761L21842J93229M40857L95539k58837q28311n43221
41797a104225K32786M00436k80132p22006m2812J033391J096664J14874m53096
41788B75880J88202R66077N87057m76459p50080l3108L95226j69621q68385p10268
41778e95479P4517O78920Q56049P77721M69343N0713m6176K77069M69856K10943
$$ plain form
41845 -1491235 -1577246 -1456986 -768076 433764 1391362 1498968 1056035 712532 531463
41836 531463 198078 -104968 193347 1030127 1526384 1126860 380137 180693 628880 1114362
41826 1114362 1266201 1261459 1245282 1004163 410897 -190182 -334800 16309 514197 843814
41816 843814 874039 547387 -36345 -469241 -360158 68833 58622 -762474 -1784602 -2082579
41806 -2082579 -1526084 -825323 -503481 -310252 130605 526144 267307 -561004 -1104225
41797 -1104225 -871439 -471003 -751135 -1473141 -1515953 -482562 614102 728976 275880
41788 275880 464082 1430159 2017216 1540757 790677 757569 1152795 983174 114789 -595479
41778 -595479 -520962 157958 1014007 1791728 2261071 2311784 2265608 2542677 3012533 3223476
41768C223476o3965j10870m97499j398197j674745m43595J126535J156158j52140
41759A165158p75778N6316Q27849K28255r49636j242390n51960K28655O25688
41750c87843O27065J07134p97866j320791r58305k55740N4099J45084N29631R53365
41740a304167P90946J56657k86723l43103k83308j30440K14448M12669J27862
41731f45159k10911K0385N24361N00160J9454q1147L27655M26938j10454n03392
41721B67890r5693O83964J073741R44660N33140j04583q06857j032932n02946
41712I60384K17240K98183l68759j119528j277546p33797M2412M31498L02235
41703a247678K11558O41841J167869R79490J94712j64965K88772O79943K33323
$$ plain form
41768 3223476 3159511 3048641 2551142 1152945 -521800 -965395 161140 1317298 1165158
41759 1165158 389380 445696 1273545 1501800 552164 -690226 -1242186 -1013531 -387843
41750 -387843 239222 346356 -451510 -1772301 -2730606 -2986346 -2932247 -2787163 -2257532 -1304167
41740 -1304167 -513221 -356564 -643287 -986390 -1269698 -1400138 -1185690 -773021 -645159
41731 -645159 -856070 -835685 -311324 188836 208290 127143 454798 881736 771282 267890
41721 267890 172197 856161 1929902 2874562 3407702 3303119 2496262 1463330 960384
41712 960384 1177624 1475807 1107048 -12480 -1290026 -2023823 -1981411 -1549913 -1247678
41703 -1247678 -1036120 -394279 773590 1753080 1947792 1782827 2071599 2751542 2984865
41694B984865n47934p49026m21981k71584m31852m55612k78275k98339n24135
41685i93873m42094J08316N58315L68753k37518n41855j26058P05802J198173
41676E97961Q82915J32956k14327R5185M11900J62281l01169l07046P4335K32997
41666A767988L0673j26225j20672k68771n93085o92699m77825l23828k91316O0472
41656a035288P34728R21822J48156p77684o99330L30205J144648R70271J59120
41647A896648n57488q71064p84772l01785L92941Q06445O24344J62616l9949O687
41637A334623k03906p90986j103771n45672N06050J081442Q43834M09999L39816
41628A871429L77011O0561m01250m74864k39617k61938n79970n57996O3451O49471
$$ plain form
41694 2984865 2436931 1687905 1265924 994340 562488 106876 -171399 -469738 -993873
41685 -993873 -1435967 -1327651 -769336 -400583 -638101 -1179956 -1306014 -600212 597961
41676 597961 1480876 1613832 1399505 1494690 1906590 2068871 1767702 1460656 1534991 1767988
41666 1767988 1798661 1672436 1551764 1282993 689908 -2791 -480616 -804444 -1095760 -1035288
41656 -1035288 -300560 621262 769418 -8266 -707596 -377391 767257 1737528 1896648
41647 1896648 1339160 468096 -316676 -618461 -225520 580925 1205269 1367885 1327936 1334623
41637 1334623 1130717 339731 -764040 -1309712 -803662 277780 1121614 1531613 1871429
41628 1871429 2248440 2309001 1907751 1432887 1193270 931332 351362 -206634 -143183 506288
41618E06288N68416P0495j81620l8750J78311L10269L79375K06510l57375q77896
41608G64023o49681L08496J091447R67373K08240l79804m21979j74994k804l925
41598A706392j06988k74780n34043q52015j004074o71836J42967Q70120Q66170
41589A41913K29911k38055p0876K59443J05369l58656m46282o4764J66046m5917
41579c21868j78899K37103P98255P43843j0248q11931j058412o40744J92044R34499
41569a16358R48307P9610q53535q22156L2700M48631k16684r89184o35509N31387
41559a592791J091090N43136r6108J12163P57994R13955N37650K88589L15340
41550B871018P9077o04493j098130q22860j08192K50587K6750k54290r2982L64997
$$ plain form
41618 506288 1074704 1145199 963579 924829 1103140 1413409 1792784 1999294 1641919 764023
41608 764023 114342 422838 1514285 2481658 2689898 2310094 1888115 1713121 1710317 1706392
41598 1706392 1599404 1324624 790581 -61434 -1065508 -1737344 -1594377 -724257 141913
41589 141913 371824 133769 62893 322336 427705 69049 -377233 -441997 -275951 -321868
41579 -321868 -500767 -263664 534591 1278434 1268186 456255 -602157 -1242901 -1050857 -116358
41569 -116358 831949 911559 58024 -764132 -731432 -282801 -499485 -1488669 -2124178 -1592791
41559 -1592791 -501701 41435 -54673 57490 815484 1729439 2267089 2555678 2871018
41550 2871018 2950095 2345602 1247472 424612 316420 567007 593757 339467 246485 611482
41540F11482N60278J72518n56630j066595r86628m45778R3069L04047K58720K02580
41530h52937J97328J28448N669M2557L62063P61044Q81098N59507n3940o65341
41520A365496j050700j156818j071069q82466n59613l1475N95414J027595J080861
41511f82775Q76476O24822L26267j30375o36616q64085o46600k04702Q3083M6319
41501a208186j61685k24135O2167N63052Q61470O43928K7627n83632q95534q39358
41491a754286m31617J93957O69079O56912K82490k6601j63985l95611o91674n52807
41481b214143J67386P66542N48233j68440n00229k47995j5260j28970j62910K69281
41471a686505Q45803J004565O81598K47243k3740j30459j89851l26385n63936
$$ plain form
41540 611482 1171760 1344278 787648 -278947 -1265575 -1711353 -1618284 -1314237 -1055517 -852937
41530 -852937 -655609 -527161 -521492 -478935 -116872 644172 1525270 2084777 2030837 1365496
41520 1365496 314796 -842022 -1913091 -2795557 -3355170 -3386645 -2791231 -1763636 -682775
41511 -682775 193701 818523 1144790 1014415 377799 -486286 -1132886 -1337588 -1254505 -1208186
41501 -1208186 -1369871 -1594006 -1531839 -968787 -107317 536611 564238 -19394 -914928 -1754286
41491 -1754286 -2185903 -1991946 -1322867 -665955 -383465 -410066 -574051 -969662 -1661336 -2214143
41481 -2214143 -2046757 -1280215 -731982 -900422 -1400651 -1648646 -1663906 -1792876 -1955786 -1686505
41471 -1686505 -840702 163863 845461 1092704 1068964 938505 748654 422269 -141667
41462a41667p00139m94405p6824J10795q6279l07383k11567R7983L82511O09106
41452h17869P02466L84109l12883p41173l94279K94067M83758P5517k89928k50887
41442h67102o2448M7993J26039K0783n25322j085304p02295O78926J709190J273044
41432F13504K9156n26901q9705L62244K73400J68050M39527N63577N9846n57722
41422A334976n06397O7573L26131p1718o44045q35035n53950k3035M23155M03879
41412g8466j64470p46511o60575L8192N89821N73591M28526O51918R45217O57966
41402B235209j61511p22013n08552J02810L92232J41549k63092l74840j29030
41393G12762J67788J48224k58296o83972o24362M018O91821Q67025N26180J51780
$$ plain form
41462 -141667 -841806 -1336211 -1413035 -1302240 -1388519 -1695902 -1907469 -1809486 -1426975 -817869
41452 -817869 -115403 268706 -44177 -785350 -1179629 -885562 -401804 -326287 -616215 -867102
41442 -867102 -929550 -881557 -755518 -734735 -1260057 -2345361 -3047656 -2368730 -659540 613504
41432 613504 642660 115759 26054 388298 661698 829748 1269275 1832852 1892698 1334976
41422 1334976 828579 896152 1222283 1150565 506520 -328515 -882465 -905500 -482345 -78466
41412 -78466 -242936 -989447 -1650022 -1611830 -1022009 -448418 -19892 632026 1577243 2235209
41402 2235209 2073698 1351685 843133 945943 1338175 1479724 1216632 841792 712762
41393 712762 880550 1028774 770478 86506 -537856 -533838 157983 1025008 1551188 1702968
41383A702968N2464N8545o7844k26016j95152l5529K0760n5721j38114k55241
41373H61120m74628n28486m6702P36995J027337M88195k22169l05410J59017M79905
41363B175174L17604j12830n41174p96812o60776j49296J95669q9773o19784o59363
41353i41361k68297j22702k46140N3627P95637J005312K75431m43367l55697r3664
41343c41221m59214q13490q7289J188154J427112M00948m56828l26997o2449m43028
41333B5698p75147j69257Q15342R39302J18537n75256m71956O1107M38930N19536
41323I26836M01988J85352K7929K743j27736n80997j023241q39170J937P84610
41313b39749Q88040M32510n5669k78594k52478n2204K15824L18300P8816l31631
$$ plain form
41383 1702968 1755432 1813977 1746133 1520117 1324965 1289436 1310196 1254475 1116361 861120
41373 861120 386492 -141994 -188696 548299 1575636 2063831 1841662 1536252 1695269 2175174
41363 2175174 2492778 2379948 1838774 1041962 381186 231890 427559 337786 -281998 -941361
41353 -941361 -1209658 -1332360 -1578500 -1524873 -729236 276076 551507 108140 -247557 -341221
41343 -341221 -800435 -1613925 -1701214 -513060 914052 1315000 858172 531175 468726 25698
41333 25698 -749449 -918706 -103364 835938 954475 379219 -92737 -31630 407300 926836
41323 926836 1328824 1514176 1542105 1544848 1417112 836115 -187126 -1026296 -1024359 -239749
41313 -239749 648291 1080801 1025132 746538 494060 441856 657680 975980 1054796 723165
41303G23165n13990l34032j33357k97635o95216p51522j30498Q20913J405003
41294I2831J221477M02498n87647j181347r40866O1941J105682J374437P30267
41285B279273k46088r33167j125869q93074l85609J26833L68761L42301K51862
41276b14777J15287k20898o36302p13325k94331L04530P57163J004506R52317
41267A054170M05176m40883r29763p17279k02050J28024L08684M88532M50931
41258E45542Q8440j36504J30481M14360J33390l11115j05011M94938L35849q12954
41248G77416j663748j128175J81515Q45476M87461k5775J7835L36595L04849j06400
41238B7049l56876j08562L22687L63085r1368n29626m62181j1009L22942L35773
$$ plain form
41303 723165 209175 -124857 -258214 -555849 -1251065 -2002587 -2133085 -1312172 92831
41294 92831 1314308 1716806 1129159 -52188 -993054 -931113 174569 1549006 2279273
41285 2279273 2033185 1100018 -25851 -918925 -1304534 -1177701 -808940 -466639 -214777
41276 -214777 -99490 -320388 -956690 -1670015 -1964346 -1659816 -902653 101853 1054170
41267 1054170 1459346 1018463 88700 -628579 -830629 -702605 -393921 94611 545542
41258 545542 633982 497478 627959 1042319 1175709 864594 759583 1254521 1590370 777416
41248 777416 -886332 -2014507 -1832992 -987516 -500055 -525830 -507995 -171400 133449 27049
41238 27049 -329827 -438389 -115702 247383 156015 -373611 -835792 -846801 -523859 -188086
41228a88086K78075L74659M92053L75791K1280l03375l35413j03957M3459j73427
41218D81059n05535l70812K99403P64237M20377k69793l88418Q2375K59169k51879
41208E20183p65099o19436j39726M3747O1389M50469J036877R99319J09029p88773
41198I07979q30777j95589K97708L53248M35548Q53412J123110N82115n97765
41189B928989j443285j271717m30623J92415J52271k51270m62194k25762K47533
41180e63643M93645K38587k67755n00236l24855j68855l63472o30848n19521n8316
41170b665269M14891Q19296J230439J389948R12719j0469o73136p39318o02713
41161G6388o99261q87824p56085k29451L78099P29876O99611L78131j3598k81225
$$ plain form
41228 -188086 89989 464648 956701 1332492 1353772 1050397 714984 611027 654486 481059
41218 481059 -24476 -395288 -95885 668352 1088729 818936 430518 512893 772062 520183
41208 520183 -244916 -864352 -1004078 -960331 -898942 -448473 588404 1587723 1696752 907979
41198 907979 77202 -118387 179321 532569 968117 1821529 2944639 3526754 2928989
41189 2928989 1485704 213987 -216636 -24221 128050 -123220 -585414 -811176 -563643
41180 -563643 -69998 168589 -99166 -599402 -924257 -1093112 -1456584 -2087432 -2606953 -2665269
41170 -2665269 -2250378 -1431082 -200643 1189305 2102024 2091555 1418419 679101 76388
41161 76388 -622873 -1510697 -2266782 -2496233 -2118134 -1388258 -688647 -310516 -324114 -605339
41151f05339l65475k74628l1424K12559K09004n6454k87190l33243m06700n52146
41141b491036l38043M26928J092342R65436L80165J61820K86334M7105n45404
41132a4353o42760J975N58194M37580P9012o7458l47567r96857j288995m98367
41122b779596Q30914J461332J009730K04362j69668L6880M98956P18888L18540
41113B130338n21251j072984q71320k90192P734q9422k00663o1945K74513O08343
41103h6849O89911M07354J8246j72647l92145j027828j616873j144321L00284
41094c024868J215724P04251k05315j49568N79848P91480L91437K62691N90708
41085A156388P08455M48462L44760M90214L98739R8161K30849R01931J491665
$$ plain form
41151 -605339 -970814 -1245442 -1276866 -1064307 -855303 -911757 -1198947 -1532190 -1938890 -2491036
41141 -2491036 -2829079 -2402151 -1309809 -344373 35792 197612 483946 531051 -14353
41132 -14353 -657113 -655138 -96944 340636 419648 352190 4623 -992234 -2281229 -2779596
41122 -2779596 -1948682 -487350 522380 726742 557074 593954 1092910 1811798 2130338
41113 2130338 1609087 536103 -335217 -625409 -617675 -707097 -907760 -969705 -695192 -86849
41103 -86849 603062 1010416 1028662 856015 463870 -563958 -2180831 -3325152 -3024868
41094 -3024868 -1809144 -1104893 -1310208 -1459776 -879928 -88448 302989 565680 1156388
41085 1156388 1864843 2313305 2658065 3148279 3547018 3645179 3876028 4777959 6269624
41076F269624J830033K528910L841352N123740N740860N599727M482078J891450
41068C7307774j805530m900587n813447m691372l046944k124097j997412j974356
41060A0954029j515771q56790p56895j436884j991136j408707l6687P26068K43429
41051C920656o30304q33052l63042O1330j34m09082p12187m85893J97061O18003
41041A363356K33087m28881l86694L22363O69762K14411l31813l70128k33424
41032A052039l11168l20259j6794K19791J26057Q9114L16607K65375l82722r19533
41022A18507o01536J89994O13588O19654O61685O72113K95057k20182l34430k05548
41012A808902m20092q56309p50861L8608O70767M36263l88852j040640j142699
$$ plain form
41076 6269624 8099657 10628567 14469919 19593659 25334519 30934246 35416324 37307774
41068 37307774 35502244 30601657 24788210 20096838 17049894 14925797 12928385 10954029
41060 10954029 9438258 8581468 7824573 6387689 4396553 2987846 2951159 3677227 3920656
41051 3920656 3290352 2457300 2094258 2155588 2155454 1746372 1034185 548292 745353 1363356
41041 1363356 1596443 1167562 780868 1103231 1772993 1987404 1655591 1285463 1052039
41032 1052039 740871 420612 403818 623609 749666 838780 1155387 1420762 1038040 118507
41022 118507 -483029 -293035 320553 940207 1601892 2274005 2569062 2348880 2014450 1808902
41012 1808902 1388810 532501 -218360 -179752 491015 927278 538426 -502214 -1644913
41003a644913q41907m07566K4906L91699N43156K97106k22950m79528j16480M51765
40993b004712N63260L30400M12369P58159N40079l84887r92138o08810Q1168K55659
40983a049453J90552L87486M36975j00928n16567r727P04828L59065o98805r09691
40973a206265L5788P77039N02274P552P0258K09531j76746o13053m05855J30682
40963f68795K17504j84523n18497n67888n14470l44251J12718O52020P72845L41300
40953g02037j78888k53460J31608M81946L80383J1632n5112L33804O25250L14599
40943A089725l04008n38567k29397J72002K95038J63638o1805k32010k24948j69542
40933c9874l98204p94946o34139L31428J111379O73985m59549q52764k00560L91550
$$ plain form
41003 -1644913 -2486820 -2894386 -2869480 -2477781 -1934625 -1637519 -1860469 -2339997 -2456477 -2004712
40993 -2004712 -1441452 -1111052 -698683 59476 599555 214668 -777470 -1386280 -1305112 -1049453
40983 -1049453 -858901 -471415 -34440 -135368 -651935 -661662 43166 402231 -296574 -1206265
40973 -1206265 -1170477 -393438 108836 116388 186646 396177 219431 -393622 -799477 -668795
40963 -668795 -451291 -635814 -1154311 -1722199 -2236669 -2580920 -2468202 -1816182 -1043337 -702037
40953 -702037 -880925 -1134385 -1002777 -520831 -140448 -128816 -183928 149876 775126 1089725
40943 1089725 785717 247150 17753 189755 484793 648431 586626 354616 129668 -39874
40933 -39874 -438078 -1233024 -1867163 -1535735 -424356 249629 -209920 -1062684 -1263244 -871694
40923h71694J84586l02554m09298k46781r7975J35609M16255L39129r0463k08936
40913a152122K75655P13312N04403J9341m9366K79531M70728K98189m7910l92954
40903I18807o86579q51456p77939l67018L85129J112802J152776L93955k57088
40894A023389P506O29967M94390k87924o33856l76349m08965q53030p44232N0164
40884a098940L27609l39967p05804l496O98512N05232L63581J157804J713176
40875B617707O70876r01776j015859R50J68984p24595q91232K50880J085017N39856
40865A800808l41842m37360k95225p32328j141538m99250Q52569J588784J064901
40856A859519j93215j253888j488051r13365k08719j5959j13040J74133P63315
$$ plain form
40923 -871694 -687108 -989662 -1398960 -1645741 -1743716 -1608107 -1191852 -852723 -943186 -1152122
40913 -1152122 -876467 -163155 341248 360589 311223 590754 1061482 1359671 1311761 918807
40903 918807 232228 -619228 -1397167 -1764185 -1379056 -266254 886522 1280477 1023389
40894 1023389 1030895 1660862 2155252 1867328 1233472 857123 448158 -404872 -1149104 -1098940
40884 -1098940 -771331 -1111298 -1817102 -1820598 -1122086 -616854 -253273 904531 2617707
40875 2617707 3288583 2386807 1370948 1371898 1540882 816287 -74945 175935 1260952 1800808
40865 1800808 1458966 1021606 726381 -5947 -1147485 -1646735 -794166 794618 1859519
40856 1859519 1666304 412416 -1075635 -1989000 -2197719 -2213678 -2326718 -2152585 -1389270
40847a389270Q56825K85624j59196n696K61713K18359J86899M27423N58244L45633
40837A586558K20680M15435M03170j60156p23180p54373o09825p33948p25888
40828a081527q6748O91057P22842L3254n73218o16653j81763N62743J289618J301334
40818B060939K67360j005400j340470o34113J61365L64774J67161r447l6579P4660
40808G0250K60290K89008L1756j98327l4234L27791M00576J65005J370k3847j82196
40797A107442m27170l46412J51950O46642P86993O00970J91960l61061p48918
40788A602396o20578j61146Q101l28535o82006n73423j31831K22514L23685K68007
40778g2816J72172J30049J93790K59258J58621p1956k30373k72545l45649m82676
$$ plain form
40847 -1389270 -532445 -246821 -406017 -411713 -150000 68359 255258 682681 1240925 1586558
40837 1586558 1807238 2222673 2625843 2465687 1742507 988134 378309 -355639 -1081527
40828 -1081527 -1168275 -477218 245624 278878 -294340 -910993 -1092756 -530013 759605 2060939
40818 2060939 2328299 1322899 -17571 -651684 -490319 -125545 41616 32169 -4410 70250
40808 70250 330540 619548 651304 452977 418743 746534 1147110 1312115 1313485 1289638 1107442
40797 1107442 680272 333860 485810 1132452 1919445 2520415 2712375 2351314 1602396
40788 1602396 981818 820672 828773 500238 -181768 -755191 -887022 -664508 -340823 -72816
40778 -72816 99356 229405 423195 682453 841074 769118 538745 266200 -79449 -562125
40768e62125n31663m04534j37471K67785P60869J041129P95501J43806m78771
40759H94526q41976r65039p55528j31061N05594N14882j00822n97568m68806l3623
40749a979421J67857O7749j20769l25127n03591m79009j91406J81242N44904R53010
40739a684561J206082R29497K98037M8886L62642L88907n02175j571727j600135
40730b124547n40699N26305Q40246N44866K511n83591q42222l83533N09366R96614
40720a054684P02741Q6160l20017m44281l39323K7121M25007M44301J86558K28459
40710e7958N91723M83158m40298j255153r56034N4592N18807Q4262l84552k14109
40700a575562K34953L62958K42948K80366M18346K41786k58404n24705j85759
$$ plain form
40768 -562125 -1093788 -1498322 -1635793 -1368008 -607139 433990 1229491 1373297 894526
40759 894526 52550 -912489 -1668017 -1799078 -1293484 -778602 -879424 -1476992 -1945798 -1979421
40749 -1979421 -1811564 -1743815 -1864584 -2189711 -2693302 -3172311 -3363717 -3182475 -2637571 -1684561
40739 -1684561 -478479 451018 749055 797941 1160583 1549490 1047315 -524412 -2124547
40730 -2124547 -2665246 -2138941 -1298695 -753829 -751318 -1334909 -2177131 -2560664 -2051298 -1054684
40720 -1054684 -351943 -265783 -585800 -1030081 -1369404 -1342283 -917276 -472975 -286417 -57958
40710 -57958 533765 1016923 576625 -678528 -1634562 -1579970 -1061163 -976901 -1361453 -1575562
40700 -1575562 -1340609 -977651 -734703 -454337 -35991 205795 -52609 -577314 -763073
40691g63073L40262L23851k56816n84899j14119N69912N12452j86858m50475J70948
40681d38815P67888L96850n29664q68277l37049K90048L88862J36218m2519l5723
40671b72181N6184J15886K6428j49399o9736M01305P60851M64224j70728l27342
40661H35492P0750K43510k05164p17655p37342n00327m59429n47469m91624l31755
40651b841013j48999K22595P20460Q07070K89494j03748L02396R49841O99009
40642H97105m96579j437414j261841l94619L02546O18325Q26338R63556Q23556
40633H40973M51255J65075R4462L0798j79814l41775j95945J19440J70728j47990
40623A007207l90857k11353J6947l15471j051842j331345p63432M4693M08604
$$ plain form
40691 -763073 -422811 -98960 -355776 -940675 -1054794 -484882 27570 -159288 -609763 -438815
40681 -438815 329073 725923 196259 -672018 -1009067 -719019 -330157 -193939 -236458 -272181
40671 -272181 -215997 -100111 -73683 -223082 -292818 108487 869338 1333562 1162834 835492
40661 835492 906242 1149752 944588 226933 -510409 -1010736 -1470165 -2017634 -2509258 -2841013
40651 -2841013 -2990012 -2767417 -2046957 -1239887 -950393 -1054141 -751745 198096 897105
40642 897105 400526 -1036888 -2298729 -2693348 -2390802 -1772477 -946139 17417 840973
40633 840973 1292228 1457303 1551765 1582563 1402749 1060974 865029 984469 1155197 1007207
40623 1007207 616350 404997 421944 106473 -945369 -2276714 -3040146 -2995453 -2586849
40614b586849M50750O18008Q00982N66331Q570k87135r3964J84432J51564q8649
40604b75960j82864R445K98655L67625R8570k37486k66571n3645o8717m66628
40594g77576p82294o06018j56315J71969M00309O42876O10821M2515o73920r28710
40584b056343p09787m14748j24657K82278N74580M76655L06869N04774P38000
40575d22379L95813j98507j56196M01051L41267o42471j389952r74555K3273O01468
40565b021188P33803Q73648Q80343M09119j76379k40226J02450K25095j4721k84295
40555D87649n14939q14368q24489o3550J070725J500525Q90123J34587Q0126L88775
40545B335164K10648m45834p26611k55057K50752J3722o29399p00190n7590L59957
$$ plain form
40614 -2586849 -2136099 -1518091 -717109 -150778 -142208 -429343 -523307 -338875 -187311 -275960
40604 -275960 -458824 -449379 -150724 216901 315471 77985 -188586 -242231 -310948 -777576
40594 -777576 -1559870 -2165888 -2322203 -2150234 -1749925 -1107049 -496228 -453713 -1127633 -2056343
40584 -2056343 -2766130 -3180878 -3305535 -3023257 -2448677 -1972022 -1665153 -1160379 -422379
40575 -422379 -26566 -225073 -381269 19782 361049 -281422 -1671374 -2645929 -2622656 -2021188
40565 -2021188 -1287385 -413737 466606 875725 699346 459120 561570 786665 771944 487649
40555 487649 -27290 -841658 -1666147 -1729697 -658972 841553 1731676 1866263 1946389 2335164
40545 2335164 2545812 2099978 1373367 1118310 1369062 1382784 753385 53195 -4395 355562
40535C55562k7656n44832l65646J64465K11419j8075L67684J172319J064953l18508
40525B061685j493147j106415J95187Q48698N79119L73566O43911O38050k06393
40516B534261j260178j454598n65465N78128R91529M99265j63147k34576J69476
40507A094695L16960m0712l57468k12622P8876J14203P0128K34018L63766R1929
40497A753773l82086n41965k35204L05318P90699Q66794K38573p46140j137086
40488I12676n37065K76593M35765J10528j04123k73342o86478q91070k74354O95754
40478c35116R33750L17999k40898k54347j27082j40471k5935K51339K43454j56949
40468D65744m57537l97027k95825l48528k91148l133K51265L79776N57294O00285
$$ plain form
40535 355562 327906 -216926 -582572 -418107 -206688 -224763 142921 1315240 2380193 2061685
40525 2061685 568538 -537877 -342690 506008 1085127 1458693 2102604 2740654 2534261
40516 2534261 1274083 -180515 -745980 -167852 823677 1322942 1159795 925219 1094695
40507 1094695 1411655 1370943 1013475 800853 879729 993932 1064060 1298078 1661844 1753773
40497 1753773 1371687 829722 594518 899836 1690535 2557329 2795902 2049762 912676
40488 912676 375611 652204 1087969 1198497 1094374 821032 134554 -756516 -1030870 -335116
40478 -335116 598634 916633 675735 421388 294306 153835 127900 379239 622693 465744
40468 465744 8207 -388820 -684645 -1033173 -1324321 -1327454 -1076189 -696413 -139119 461166
40458D61166L8414r31771j362235p88020J52871O83068P75662P13350M78825P7808
40448B99138j31980M8418K83618K49764R0963k2678k64636o73635q18700m00468
40438a340196K36604N97694O29119M61518M3183n41007q29009n31435K5840M05100
40428h42589O38162R21320J111344R48580M81013p1640n60102p71892n13947j12232
40418A228017k66324j006553j396626q08285R8841L50276P9007J27096N90422
40409a004129P38581L08759o7419O9232K84870l466n73533o74900p0888O10619
40399c82274O50971J35490j94354O896J84239k12963o91441l23396O94106J053215
40389I20489K17416o63760l86528N45095P17305j33160r02309p88845j88300J70196
$$ plain form
40458 461166 499580 -432191 -1794426 -2582446 -2429575 -1746507 -970845 -257495 221330 299138
40448 299138 167158 215576 499194 748958 839921 817243 552607 -121028 -939728 -1340196
40438 -1340196 -1103592 -505898 123221 584739 627922 86915 -742094 -1273529 -1247689 -842589
40428 -842589 -204427 716893 1828237 2776817 3257830 3186190 2626088 1854196 1340249 1228017
40418 1228017 961693 -44860 -1441486 -2249771 -2150930 -1800654 -1721647 -1594551 -1004129
40409 -1004129 -265548 43211 -24208 45024 329894 326428 -247105 -922005 -992893 -382274
40399 -382274 268697 404187 209833 216729 400968 188005 -503436 -826832 -132726 920489
40389 920489 1137905 474145 87617 632712 1350017 1216857 314548 -474297 -662597 -492401
40379d92401J49725K0555m3423j9686O275j81173o03994p46922r2423R00746J014918
40368h7803j59765j411810j243162K38451J384856R91633l33991j073457o71961
40359b367009K5223J51566j0976L46379J170931J481590P30823l73530p16252
40350D38745p7856P37576Q50780J01029r31150j417656r12277K41628J122326
40341A53145R99665l6485j161938j474922p02350N30502J198701Q72999J49637
40332E28954j24040J37571L70468K69541N9002l4696j070K15890N94138O96260
40322B712018J51371n35082m60275L05919P21630L24392k04328l45265n19972
40313B150408r96256j106228m11365K81495R6062m62110l49779K92893M71725
$$ plain form
40379 -492401 -342676 -322121 -365544 -385230 -378955 -560128 -1164122 -1911044 -2003467 -1102721 -87803
40368 -87803 -247568 -1659378 -2902540 -2664089 -1279233 -287600 -621591 -1695048 -2367009
40359 -2367009 -2341786 -2190220 -2201196 -1854817 -683886 797704 1528527 1154997 438745
40350 438745 360889 1098465 1949245 2050274 1119124 -298532 -1210809 -969181 153145
40341 153145 1152810 1116325 -45613 -1520535 -2222885 -1692383 -493682 379317 528954
40332 528954 404914 542485 912953 1182494 1241496 1206800 1205730 1421620 2015758 2712018
40322 2712018 2863389 2328307 1868032 2173951 2895581 3219973 3015645 2670380 2150408
40313 2150408 1154152 47924 -363441 -81946 14116 -447994 -797773 -504880 -33155
40304c3155K0653k83186j38774n7167k33867k12852R6792R1566m30014o90375
40294a870379j5353J089259J546219J083715M64311M09962P20605O30148j32235
40285C926252r19661r50089l12731J55694l7249m83459n02942M7020P16272Q93824
40275B532931K64524p82943j263019o38169L37201N27724O0494N2559O57968P00621
40265B449891k95644j075016n28575N41709O65485j43014o73363l77919K06224
40256G69778N38456N95840N32978N24089O60159N67561k78420j446499j664746
40247G99196o41573K92543J44599l23141j25634K77928J39430r560M90250Q39900
40237A883938J22036p64764m52994M49785L53528n39332o74510P6217L80484M375
$$ plain form
40304 -33155 -12502 -295688 -434462 -491629 -725496 -938348 -841556 -749990 -1180004 -1870379
40294 -1870379 -1885732 -796473 749746 1833461 2297772 2707734 3428339 4058487 3926252
40285 3926252 3006591 2056502 1743771 1899465 1862216 1378757 875815 922835 1639107 2532931
40275 2532931 2797455 2014512 751493 113324 450525 978249 1038743 1091302 1749270 2449891
40265 2449891 2154247 1079231 550656 1092365 1757850 1614836 941473 563554 769778
40256 769778 1308234 1904074 2437052 2961141 3621300 4188861 3910441 2463942 799196
40247 799196 157623 450166 594765 271624 145990 423918 563348 553788 1044038 1883938
40237 1883938 2005974 1241210 788216 1238001 1591529 1052197 377687 453904 834388 838763
40227H38763R1501P92976Q38440j78678j055207r39519l48132P2088K43373J7024
40217C72629o20269p92636J80666J228294Q78249k65734n24999j17836n68539
40208b30175j499117r81675Q75971J826638J313553J196815K043272K004378L69850
40199F919510r89962r11012n43066m98521L46314J915214K242044J191807J273226
40190A0945554L142243M239998L744017M409170P147471Q829780Q627720J0933139
40182F2019092J7743204K4489997K9440838L9797949N7971774O7028466M4792535
40175C43283855n626162n2298396o7299591n3857416l4944076k4394473j9098790
40168H5764951j3495961q913856p749862p851910o396870m136081k820956k051165
$$ plain form
40227 838763 930264 1723240 2561680 2383002 1327795 388276 40144 112232 355605 372629
40217 372629 -247640 -1040276 -859610 368684 1246933 981199 456200 338364 -230175
40208 -230175 -1729292 -2710967 -1834996 -8358 1305195 2502010 4545282 6549660 6919510
40199 6919510 5929548 5018536 4475470 3976949 4323263 6238477 8480521 9672328 10945554
40190 10945554 14087797 18327795 22071812 26480982 33628453 42458233 51085953 62019092
40182 62019092 79762296 104252293 133693131 173491080 231462854 298491320 343283855
40175 343283855 337657693 285359297 218059706 164202290 129258214 104863741 85764951
40168 85764951 72268990 63355134 55605272 47753362 41356492 37220411 34399455 32348290
40160C2348290j145293j222547k966637m466211l662262j495425m43214r32304
40152A6014397j319980q72507o00056j056086j284096o36004o7591n60145j402988
40143H214944j330443n74541l47628p51408p53289j13940K17257k09273o74544
40134C677135n63426k9346P30837J523531J555880M22156m84602M12009K059694
40125I303868K156893J171711J674347L565414M151861L644927N498043R791078
40117D0958142J2486329J4098129K1308160L3730671L6623947J7334871j4599423
40110A61940826l5135950l3185300k0054890j0769829p239824l855545N42754
40103E2242242L465156N134947P564307J1416238J7790860K7499363L4262768
$$ plain form
40160 32348290 31202997 29980450 27013813 22547602 18885340 17389915 16946701 16014397
40152 16014397 14694417 13821910 13221854 12165768 10881672 10245668 10178077 9617932 8214944
40143 8214944 6884501 6309960 5962332 5210924 4457635 4343695 4560952 4351679 3677135
40134 3677135 3113709 3084363 3815200 5338731 6894611 7316767 6832165 7244174 9303868
40125 9303868 11460761 12632472 14306819 17872233 22024094 25669021 31167064 40958142
40117 40958142 53444471 67542600 88850760 122581431 159205378 176540249 161940826
40110 161940826 126804876 93619576 73564686 62794857 55555033 51699488 52242242
40103 52242242 55707398 60842345 68406652 79822890 97613750 125113113 159375881
40096A59375881K5932529o6130k7912054l8573192l0716206j8711925j2907359
40089E6421544j1073403q256902n061700l663857l114224k170246j880667k640499
40081A8560046k654121j399597r84131k285350l166539k153310o61225o2623L53824
40072E546974J036846Q13491n80949j386700p18046j6013k94564m96226J19642
40063D024455M93722j0661l51716k6865r0965p56252n54863P91800J334597K28309
40053E081561n89858K03631R10317j20090j470739j087349L46287R13923O04201
40044D791884N19312M60671k66485q86825l62090M48165P8338r51053r90406p4
40034B841437O35722M82029K99462L36216J57062j38334j01313j3239l78001p62029
$$ plain form
40096 159375881 185308410 185242280 157330226 118757034 88040828 69328903 56421544
40089 56421544 45348141 37091239 32029539 28365682 25251458 23081212 21200545 18560046
40081 18560046 15905925 14506328 13522197 11236847 8070308 5916998 5255773 5193150 5546974
40072 5546974 6583820 7397311 6816362 5429662 4711616 4695603 4401039 3904813 4024455
40063 4024455 4518177 4507516 4155800 4128935 4037970 3281718 2726855 3518655 4853252 5081561
40053 5081561 4491703 4695334 5605651 5485561 4014822 2927473 3273760 4187683 4791884
40044 4791884 5311196 5771867 5505382 4618557 4256467 4704632 4782970 3831917 2841511 2841437
40034 2841437 3477159 3959188 4258650 4594866 4751928 4613594 4512281 4499042 4121041 3359012
40024C359012m85918M0215M0939j29254L25835R74909P30319k53761p70537m62548
40014C369211j42587l19069o61851q73675r70560p69362j02572N68906O55284
40005G53725L57248K67417L71842K86137J02208J30656K00689N8855j4007J67367
39995B682137M7004p31166j387918j102981m01071k35083l06288L13488J353434
39986B31556J623696Q80049N480n09418r00163j052749n01679M17894O96108J04899
39976I95673n44351o78368m70482q6815M74577P72823K85626n26646o14667Q7566
39966c05064N62106K96016j44584l06710m59052o85490m83782K40182P18284M08900
39956a59194k07751m19655k29097m5408L2287J75294M19042O05383N22586O1071
$$ plain form
40024 3359012 2873094 2913309 2954248 2824994 3150829 4125738 4856057 4602296 3831759 3369211
40014 3369211 3226624 2907555 2245704 1372029 401469 -367893 -470465 98441 753725
40005 753725 1110973 1378390 1750232 2036369 2138577 2269233 2469922 2528777 2514770 2682137
39995 2682137 2729141 1997975 610057 -492924 -893995 -1129078 -1435366 -1121878 231556
39986 231556 1855252 2735301 2740781 2231363 1331200 278451 -223228 194666 890774 995673
39976 995673 451322 -227046 -697528 -784343 -309766 463057 748683 222037 -392630 -305064
39966 -305064 257042 553058 408474 101764 -357288 -1042778 -1526560 -1286378 -568094 -159194
39956 -159194 -366945 -786600 -1015697 -1061105 -1028818 -853524 -434482 170901 693487 754558
39946G54558n13740o03853m220O37833O08509J13075j34941p977R3156J06033
39936A048433K51121L16098p5031n97924n75574j23489k299l61892n86818l82161
39926a089536n2998K75459P01237Q34564J71224p57708q08645J0420M21139j59728
39916d54572p61020m48686L61699P91064P05398M08965M49l62617l40496o6364
39906a66180j28160m58781j90699Q27926J390794N95889p16484j072055k34681
39897a52431Q51961J374401J097793J12288r98616j238627l25156O54902N28568
39888A905083l99998q91236n19203L3799K19538K08900K10957M9064l50055o29874
39878a63025m49311O4510M81071N04256J93113j29289j93735n5828L6157M692
$$ plain form
39946 754558 240818 -363035 -367255 270578 879087 992162 857221 849244 942400 1048433
39936 1048433 1299554 1615652 1540621 942697 367123 243634 241335 -120557 -707375 -1089536
39926 -1089536 -1142534 -867075 -165838 668726 839950 82242 -726403 -715983 -294844 -454572
39916 -454572 -1215592 -1664278 -1302579 -511515 193883 602848 603297 240680 -99816 -166180
39906 -166180 -294340 -753121 -943820 -115894 1274900 1870789 1154305 82250 -152431
39897 -152431 699530 2073931 3171724 3284012 2285396 1046769 721613 1376515 1905083
39888 1905083 1505085 613849 94646 128445 347983 556883 767840 816904 466849 -163025
39878 -163025 -612336 -547826 -66755 437501 630614 501325 307590 251762 287919 292611
39868B92611l8940p3974j36886p3798K42472N14283L85794J49585L79232Q39918
39858B480297O47890k77672q84203n33274N7018K4246l50326l32039L0163K21677
39848A083777K18887K40134N9382m89202p57614q0064R29410R52922j72634j157225
39838H27773r87023j20631L45095O8215l72059l44009J47361N59710M68222N1317
39828F43971k17001k75252m59464p36797n71358J57864P45436O31549J89470j8204
39818I0214j59945n87434r15340n44463K53655O89924O66294P33780R95607R65977
39808B188269M93894k1945l57637o04498n90561l2404O46742N61610l14773r11354
39798A057343n17916K44262L77741j60932o17019n03565O075M88446O13147K17430
$$ plain form
39868 292611 253671 179697 42811 -30987 211485 725768 1111562 1261147 1640379 2480297
39858 2480297 3128187 2850515 1966312 1433038 1490056 1514302 1163976 831937 862100 1083777
39848 1083777 1302664 1542798 1602180 1112978 355364 275300 1204710 2157632 1984998 827773
39838 827773 -159250 -279881 65214 133429 -238630 -582639 -435278 124432 592654 643971
39828 643971 426970 151718 -307746 -1044543 -1615901 -1458037 -712601 -81052 108418 90214
39818 90214 -69731 -657165 -1572505 -2116968 -1863313 -1173389 -507095 226685 1222292 2188269
39808 2188269 2682163 2660218 2302581 1698083 1107522 1075118 1721860 2283470 1968697 1057343
39798 1057343 539427 783689 1161430 1000498 383479 -120086 -114011 374435 987582 1205012
39788A205012n55977j178043j062301j30505R72146J356698P50385j59794m92925
39779G04696k50128j87128n58109o72475p5607N52031L77950k59131l92187O8071
39769f92017L33744Q2550j65375k8802K50028M01953M42444K91635j92044p16481
39759G635p87352m67489k07143J0666N02257R32380N91614k71856n39743O9614
39749a59417N31811J87698k87105k11318m8907l60646o07670p3576P66084R27146
39739F64100M62149K26412M25633M40198l8276n96855q10017o74314l82252j73400
39729d56622k29201k94708J82752J031894J109016j16864j362158j046154M16117
39720g65928J164652N68887j00236J61769P12463O06849O7604k11743k77609m97058
$$ plain form
39788 1205012 649035 -529008 -1591309 -1721814 -749668 607030 1357415 1197621 704696
39779 704696 454568 267440 -290669 -963144 -1038751 -486720 -108770 -367901 -760088 -692017
39769 -692017 -358273 -275723 -441098 -469900 -219872 182081 624525 916160 724116 7635
39759 7635 -779717 -1247206 -1454349 -1443683 -941426 -9046 582568 310712 -229031 -159417
39749 -159417 372394 560092 272987 61669 12762 -347884 -955554 -1029130 -263046 664100
39739 664100 1126249 1352661 1778294 2218492 2180216 1583361 773344 99030 -283222 -456622
39729 -456622 -685823 -980531 -797779 234115 1343131 1226267 -135891 -1182045 -765928
39720 -765928 398724 967611 867375 1029144 1741607 2348456 2416060 2204317 1926708 1429650
39710A429650o03777j30148N89664P17115M7712q03906j215825j019385l45583
39701a334483M23617P01469K66567k84623j81321M73942Q29332M56042j51180
39692A199362l57677j66051J7959J802r9303j38249o0802Q9665J36120r1314m47740
39681H3772n20011j61666K22084J65474k33115m63396l08131q5055j35966l38042
39671a774052k85616J62098O72711P92070M61454J47546L71724J060074J499591
39662C107600J118131K09399l96569l75201k62702o19376j186960j228205n29497
39653a63380L27766O76786M07235j42748o02783p38473m88081p5258O6637k66152
39643i98451p27214p51792k41350K51520J35847m85596q36793k84028R35660J900277
$$ plain form
39710 1429650 825873 695725 1285389 2002504 2050216 1246310 30485 -988900 -1334483
39701 -1334483 -910866 -209397 57170 -227453 -408774 65168 894500 1350542 1199362
39692 1199362 841685 675634 693593 695395 596092 457843 397041 486706 622826 531512 83772
39681 83772 -436239 -597905 -375821 -210347 -443462 -906858 -1214989 -1300044 -1436010 -1774052
39671 -1774052 -2059668 -1897570 -1224859 -432789 28665 176211 547935 1608009 3107600
39662 3107600 4225731 4435130 4038561 3663360 3400658 2781282 1594322 366117 -163380
39653 -163380 164386 841172 1248407 1105659 502876 -235597 -723678 -798936 -732299 -998451
39643 -998451 -1725665 -2477457 -2718807 -2467287 -2331440 -2817036 -3653829 -3937857 -3002197 -1101920
39633a101920J893399J002986j11174q05422p70940j21930N64745N71506j95019
39624I26231r06302p15807J32176O19953L68667O1232K32083L62741k24917j086944
39614b30887j107758j14254P67256N74721k75169o08001M2779R97730J298780
39605A345197O72144l48357r96890q91695k17920N36436R38451P72559J02382
39596A912307o37623q01789j48711P16768Q99119L04348k27733r7487J93019j85074
39586A927144j055391j348690n64586N15915Q45277L43217k78730n49018n56592
39577g21454m18133l6574N01040P70787N30924J06220k8549J23883J52210j40439
39567H39915m55224m05886m3792J74316m2683l91493k94144L05766P08355K80478
$$ plain form
39633 -1101920 791479 1794465 1683291 877869 106929 -15001 549744 1121250 926231
39624 926231 19929 -695878 -563702 56251 424918 486150 718233 1080974 856057 -230887
39614 -230887 -1338645 -1452899 -685643 -110922 -386091 -994092 -951313 46417 1345197
39605 1345197 2017341 1668984 672094 -219601 -437521 98915 1037366 1809925 1912307
39596 1912307 1274684 472895 324184 1040952 1940071 2244419 2016686 1919199 2112218 1927144
39586 1927144 871753 -476937 -1041523 -525608 319669 662886 384156 -164862 -721454
39577 -721454 -1139587 -1176161 -675121 95666 626590 732810 704261 828144 980354 839915
39567 839915 384691 -21195 -64987 109329 66646 -324847 -618991 -313225 395130 675608
39557F75608o39348j057315n47297K73806O18593M33026J67852O0828N1900J15417
39547A53070K07699O9368m36342q89100p06216M0523O62509P38386N04977K96297
39537F41171Q8947j91272l49596k20300J6539J17373J46673K82836M42552L96105
39527A371028J37389j37083l44872n52277p11661o05427j24645N22790R46524
39518E01766Q82801L93398j78484m70334l89246j49712L43N8184K02283M48487
39508A299486M87620J9457p57414j217259j022974n53757l33165k45581J83157
39499b140430Q26815R78894M82964Q5091K60374M35987J6370n09347l58878J95068
39489B72908L28966J36248L54719P94501M44093o74177j177018l80462N94110
$$ plain form
39557 675608 36260 -1021055 -1568352 -1294546 -675953 -242927 -75075 -14247 37653 153070
39547 153070 360769 430137 -6205 -895305 -1601521 -1560998 -898489 -160103 344874 641171
39537 641171 730118 538846 189250 -31050 -14511 102862 249535 532371 974923 1371028
39527 1371028 1508417 1371334 1026462 474185 -237476 -842903 -967548 -444758 501766
39518 501766 1384567 1777965 1599481 1129147 739901 590189 590532 648716 850999 1299486
39508 1299486 1787106 1806563 1049149 -168110 -1191084 -1744841 -2078006 -2323587 -2140430
39499 -2140430 -1313615 -334721 148243 233334 493708 929695 946065 436718 77840 272908
39489 272908 601874 738122 1092841 1887342 2331435 1657258 480240 99778 693888
39480F93888N45731r6762k59697J8486l2491m35686n81858m47135n37209p79265
39470a911998n28873L15324J096731J337954J122595N62522l02410j025315r99330
39461c32800l69451J6840k14701m91346k41203L02163N80473N06550M05590M73253
39451F35368N90645N08071R0640m57548o55941k93198K04806L14616J66176K53134
39441A356769N20610L97513k33379p83130q43183o85466o26317m93773q2339L56220
39431a116475M61722K43238p8868l41331l23929J72126Q42415R71963L98742r1394
39421A138209J82977P83637P87982J12176m96934o31833o36416p79680p26277
39412b66159j67749N07389O45659K22723j34323j2505K70034J84066k22511l80022
$$ plain form
39480 693888 1239619 1142857 883160 901646 869155 433469 -148389 -595524 -1132733 -1911998
39470 -1911998 -2440871 -2125547 -1028816 309138 1431733 1994255 1691845 666530 -332800
39461 -332800 -702251 -685411 -900112 -1391458 -1632661 -1330498 -750025 -243475 162115 635368
39451 635368 1226013 1734084 1824724 1367176 711235 418037 622843 937459 1103635 1356769
39441 1356769 1877379 2274892 2041513 1258383 415200 -270266 -896583 -1390356 -1472695 -1116475
39431 -1116475 -654753 -411515 -490383 -831714 -1155643 -983517 -141102 830861 1229603 1138209
39421 1138209 1321186 2104823 2892805 3004981 2508047 1876214 1239798 460118 -266159
39412 -266159 -433908 73481 719140 941863 807540 795035 1065069 1249135 1026624 646602
39402F46602j0160M56165M45073j9591m14935m27029k49529j92991k79316k99225
39392c44936r5891K69153N39495M82249J76217k1743P3118K16673J14078j39169
39382A269244k47295j47842M3222L05072N72976N56050J32769k86538k90570j36253
39372A770835k96723n70515l92552J08088K45975k9120n8839K44630J16293o46454
39362D91618j039532l33029O71683P52969J3294m25696o6966N38275P84222N84431
39352A971269N2088o31750j024384p47097p6802K97693J58581m0104J17697N02049
39342E79240P03822N23118J53310J7606L10273O19950L30621m45064q22574l69586
39332A600716J82408j4701o97403j016342q22064n45392j49823P16400J615435
$$ plain form
39402 646602 636442 1092607 1537680 1518089 1103154 676125 426596 233605 -45711 -344936
39392 -344936 -440827 -171674 367821 850070 1026287 1004544 1077662 1294335 1408413 1269244
39382 1269244 1021949 874107 917329 1222401 1795377 2351427 2484196 2197658 1907088 1770835
39372 1770835 1474112 903597 511045 619133 865108 835988 777149 1021779 1138072 491618
39362 491618 -547914 -880943 -209260 543709 557003 131307 64341 602616 1386838 1971269
39352 1971269 2023357 1391607 367223 -379874 -456676 -158983 -402 -40506 77191 579240
39342 579240 1283062 1806180 1959490 1977096 2287369 2907319 3237940 2792876 1970302 1600716
39332 1600716 1783124 1768423 1071020 54678 -767386 -1312778 -1462601 -746201 869234
39323H69234J521761L66520o33044n97791o0140J01595j8026J62239N04633L37022
39313B554003l81746r08008p80806l98047l12594m26032k31545L76754R15047
39304D07026R28446N06558M6697k79833n61234p48536n87428m0041N12048O48313
39294H32016L08488k62027p20804p38792k67629J91027K1429o09719p97585j43878
39284b187474N89000N19113j81616p23239q20018o84504l16687L76886J001175
39275b427364J032500O28342L34956J64934k17052n58529k42709N39789Q26369
39266H1236K75205l67063m42011j95049j04868j57273j51192r3182L2098L35860
39256g86239O68923P37222O21977N27820J09567r91988j978782j536754R0073
$$ plain form
39323 869234 2390995 2757515 2124471 1526680 1466540 1568135 1550109 1712348 2216981 2554003
39313 2554003 2172257 1264249 483443 85396 -227198 -653230 -884775 -508021 407026
39304 407026 1335472 1842030 1888727 1608894 1047660 299124 -288304 -328345 183703 832016
39294 832016 1140504 878477 157673 -581119 -848748 -657721 -636292 -1246011 -2043596 -2187474
39284 -2187474 -1598474 -1079361 -1260977 -1984216 -2804234 -3488738 -3805425 -3428539 -2427364
39275 -2427364 -1394864 -766522 -431566 -266632 -483684 -1042213 -1284922 -745133 81236
39266 81236 356441 -10622 -452633 -647682 -752550 -909823 -1061015 -1154197 -1122099 -786239
39256 -786239 -117316 619906 1241883 1769703 1879270 887282 -1091500 -2628254 -2538181
39247b538181J060066N22671j93976J52212P31355K52776o63990m74114O51268
39238d99913J025732R8932q05411n93308K08547N79695L56569o1546m52304o70212
39228h13219m61831J26523N94523N84342K97332J21601J62791K59601J86519j69793
39218H88389n80274n59302n782M87202L99480N8974Q6304L75883L34671j11604
39208A373941n32342q09487j094945j133754n97309J0848j31021p14528n43185
39199d171782N73040J381985J049534K68367m8692j6628M431K91317Q92153R02169
39189A125894k08322j344025j169126j39735K57181j16080j6995Q80000J315376
39180E84168N24375m58122m04175K68558K95883m66789r70796o16891N745J17257
$$ plain form
39247 -2538181 -1478115 -955444 -1149420 -997208 -265853 -13077 -677067 -1151181 -499913
39238 -499913 525819 624751 -180660 -773968 -565421 14274 370843 309297 -143007 -813219
39228 -813219 -1275050 -1148527 -554004 30338 327670 449271 612062 871663 1058182 888389
39218 888389 308115 -251187 -256969 230233 629713 688687 774991 1150874 1485545 1373941
39208 1373941 841599 32112 -1062833 -2196587 -2793896 -2783048 -2914069 -3628597 -4171782
39199 -4171782 -3598742 -2216757 -1167223 -898856 -947548 -964176 -959745 -668428 223725 1125894
39189 1125894 917572 -426453 -1595579 -1735314 -1478133 -1594213 -1611208 -731208 584168
39180 584168 1108543 650421 246246 514804 810687 343898 -626898 -1243789 -1238044 -1120787
39170a120787k33976m24969j10623M58557P77456N64045k888m27073l52279P2735
39160g99802L61489K47269l1454o4376K15627M78188M23131J22350j04674n0484
39150G97264K09659M16659L18661j40173p00296r33867o70563k38096j05914k98103
39140a344769l53197P9630P71335J140370Q56150J31937n29369p99535p13424
39131g60872m35518J413N33118P57007K37242p23735j101103l58519P15746R37081
39121a98140K38391l92872l33687R1010M49379P65316R87325P14333o5338o02603
39111A653114l23410L25709M95866J0642o57637j081463j037140l83782O10467
39102c87634J147230P33325j01569m94585l70381k40771k00498O9579M59003M54782
$$ plain form
39170 -1120787 -1354763 -1779732 -1890355 -1431798 -654342 -90297 -93185 -520258 -872537 -799802
39160 -799802 -438313 -191044 -222498 -286874 -71247 406941 830072 952422 847748 797264
39150 797264 1006923 1423582 1742243 1602070 901774 -32093 -702656 -940752 -1046666 -1344769
39140 -1344769 -1697966 -1618336 -847001 293369 1149519 1281456 752087 -47448 -760872
39131 -760872 -1196390 -1194977 -661859 95148 332390 -391345 -1492448 -1850967 -1135221 -198140
39121 -198140 40251 -352621 -686308 -595298 -145919 619397 1606722 2321055 2255717 1653114
39111 1653114 1329704 1655413 2151279 2161921 1504284 422821 -614319 -998101 -387634
39102 -387634 759596 1492921 1391352 896767 526386 285615 85117 154696 613699 1068481
39092A068481L0955k89673l49696n43053r19798r00737k06524O13340R56502Q87487
39082C47284P14342M20420m2726l98696m60935m87061o58330o16954n1524O02236
39072f31944O47133J11223l21086k58903M7321K78002M51822O55628P49269N16058
39062B244523n9379p12712j009898o62122Q2898N34010L18939j05241n8463L81215
39052I53770M81043o0465o62953o98138l10213n3145o0558n5836j15j47364l97725
39041a011699j85783O46151J313339R82455k1388n60002k33752J38683j51268
39032I16736o30483m84341R9100K48213k11522n81278m51775j83828r7758J523
39022a375413K20782K49827R51j08386P1275L9715m56399q02411m18452K98332
$$ plain form
39092 1068481 1099436 809763 460067 -82986 -1002784 -1903521 -2110045 -1496705 -540203 347284
39082 347284 1061626 1482046 1439320 1040624 579689 92628 -565702 -1182656 -1234180 -631944
39072 -631944 15189 126412 -194674 -453577 -406256 -128254 323568 979196 1728465 2244523
39062 2244523 2185144 1472432 462534 -199588 -116690 417320 736259 631018 572555 953770
39052 953770 1434813 1374348 711395 13257 -296956 -350101 -410659 -466495 -466610 -613974 -1011699
39041 -1011699 -1197482 -551331 762008 1744463 1723075 1163073 929321 1068004 916736
39032 916736 286253 -198088 -98988 149225 -62297 -643575 -1095350 -1279178 -1376936 -1375413
39022 -1375413 -1154631 -904804 -903853 -1012239 -940964 -901249 -1357648 -2160059 -2578511 -2280179
39012b280179O31710O06692O07811M61877j30275o40034l17474M20479M02737
39003b36656m43715q73878k52794M91686M18398J631J62141O89663O65721l41
38993F21856m82590l32089K1061Q5388r2327k63936l39454k55748N0504L89673
38983e97662M37669K39563J98294M00754L89868q6667m83015j05799Q09601J247543
38973B450149P31040m5367k27708J5309p9651n28837n52074J4552K08074n71012
38963A414475j352590q51793N37683J178578N03460l59287m91176m23960q33296
38954f77906j134933m31296Q68697J512489J109051L48012k16143n69055n91829
38945B17087j17257L35848p488p96937p14336N44572J515195R19785n14370j145251
$$ plain form
39012 -2280179 -1648469 -1041777 -433966 27911 -102364 -742398 -1059872 -639393 -236656
39003 -236656 -680371 -1554249 -1807043 -1315357 -896959 -895328 -733187 -43524 622197 621856
38993 621856 139266 -192823 -171762 -86374 -178701 -442637 -782091 -1037839 -987335 -597662
38983 -597662 -159993 79570 277864 678618 1068486 981819 498804 393005 1202606 2450149
38973 2450149 3181189 3135822 2908114 2923423 2843772 2314935 1762861 1777413 1985487 1414475
38963 1414475 61885 -789908 -252225 926353 1429813 1070526 579350 155390 -677906
38954 -677906 -1812839 -2244135 -1375438 137051 1246102 1594114 1377971 808916 217087
38945 217087 99830 435678 428190 -368747 -1083083 -538511 976684 1896469 1382099 236848
38935B36848o73308j78586k37968k52330K35799O84468N12854J05322J74143O01178
38925A208420O19808n1061q62363j163398p69891J49660J197601J693054J113571
38916C135401j17745q16355m37318J59184r2986q94275j015246j61318N51153
38907C10495K18950o08119q34935l28140J47464R8603k58900n12702m13550J28165
38897b052669Q69506J188158P29501q849k37356J22827N28558P05807P64678N65396
38887C175557j65318j010465j059384k26581M47988K43657k58292j92642K83157
38878A237677M23947J13987j65118k54589l73521m02316O6205Q90531J289341
38869B826144Q04609j20070p18088p03482l63260j60002l58806p94591r46870
$$ plain form
38935 236848 -436460 -615046 -853014 -1105344 -869545 -185077 327777 433099 607242 1208420
38925 1208420 1828228 1777167 914804 -248594 -1018485 -868825 328776 2021830 3135401
38916 3135401 3017656 2201301 1763983 1923167 1830181 935906 -79340 -240658 310495
38907 310495 529445 -78674 -913609 -1241749 -1094285 -995682 -1254582 -1767284 -2180834 -2052669
38897 -2052669 -1183163 4995 734496 725647 488291 611118 1139676 1845483 2610161 3175557
38887 3175557 3010239 1999774 940390 713809 1161797 1405454 1147162 954520 1237677
38878 1237677 1661624 1775611 1610493 1355904 982383 580067 646272 1536803 2826144
38869 2826144 3630753 3510683 2792595 2089113 1725853 1565851 1207045 412454 -534416
38860e34416m86792K44635N88053L88777J18386J26744J75153r6472n69004p97003
38850h41939n80086j17043L15119N84728O09306K73026l83989r47981q39087O0727
38840a867219J061753J230753L89144o78485j112492q01946j67896N01647J111612
38831c33129J407204J093111L15163l81984o53714o22812n29828m26233k71999
38822d04221o6047J82056L92968L44811o9997n36507n88042j97652K33774M80421
38812b28436O62638P47841L92050m46053j150175j105492m75158N8366J81187
38803a363232K03067M56534P81594P45807K32280l46839m78797j52548J23582
38794B01448n35k38591j36179J83721K11834p1393j08214K87281M95431o606p82160
$$ plain form
38860 -534416 -1021208 -776573 -188520 200257 318643 445387 620540 524068 -44936 -841939
38850 -841939 -1422025 -1539068 -1223949 -639221 -29915 243111 -140878 -1088859 -1927946 -1867219
38840 -1867219 -805466 425287 814431 135946 -976546 -1778492 -1946388 -1444741 -333129
38831 -333129 1074075 2167186 2482349 2100365 1446651 823839 294011 -132222 -404221
38822 -404221 -470268 -288212 104756 449567 379570 -156937 -744979 -942631 -708857 -228436
38812 -228436 434202 1182043 1574093 1128040 -22135 -1127627 -1602785 -1544419 -1363232
38803 -1363232 -1160165 -703631 77963 823770 1056050 709211 230414 77866 201448
38794 201448 200913 -37678 -173857 9864 221698 150305 42091 329372 824803 818197 36037
38783C6037r88277m93911P4462K22877K7597k10582k72822k6500M34872O72056
38773e24191L52448j75165k20716K67274N56077J52780m86460n99898j35369K88959
38763e24261K69435M2724P117J42356P7992l74384r17930j053865o24841K3869
38753b931788M56050N78196N48529M32539K20792R0069K69844O05946O37576K48574
38743A156327j28568j69087j18361k55713k89930J54281O89382N19374l35620
38734A222085q86420n08015K03524L45273m4049k58912r7643j1594j80121k01483
38724d17355J26330L73061J68087j74551j59055J06583J03984k94518o60123o02260
38714a429817k01121J50647J25656k54585n41141k19474O28424J234084J030903
$$ plain form
38783 36037 -952240 -1446151 -1371689 -1148812 -1121215 -1331797 -1604619 -1631119 -1196247 -524191
38773 -524191 -171743 -346908 -567624 -300350 255727 408507 -77953 -677851 -813220 -524261
38763 -524261 -254826 -212102 -204985 -62629 15363 -359021 -1276951 -2330816 -2955657 -2931788
38753 -2931788 -2475738 -1897542 -1349013 -916474 -695682 -605613 -335769 270177 907753 1156327
38743 1156327 1027759 858672 740311 484598 194668 348949 1038331 1557705 1222085
38734 1222085 335665 -172350 31174 376447 332398 73486 -24157 -35751 -215872 -417355
38724 -417355 -291025 82036 250123 75572 -83483 23100 127084 -167434 -827557 -1429817
38714 -1429817 -1630938 -1480291 -1354635 -1609220 -2150361 -2369835 -1741411 -507327 523576
38705E23576M24090K52886O36732Q70080M34105m10822j099392j321342j006207
38696f96294k80411L65633L82609q8799k53699K24004O33552K03630p35944j163051
38686a408770o94640P6255M68452L91236J39534o879R6408L69573M79736K07817
38676A18722j52053r6292L70952O87072M68114m0258l53275k87574Q323K93174
38666A016905L63446J59432j36688k66143j99067j01120l0957N5824L4018k76872
38656F18778o69970o51119j44986L11184L12130J18860J43636L01009K89088J71132
38646G99742J55139N4284m10243q93206p08546R7722O27711L29857k70816m03353
38636f21709r7057R7294L6492K1257J07058K3455k20530k30958J34496M93688
$$ plain form
38705 523576 947666 1200552 1837284 2707364 3141469 2730647 1631255 309913 -696294
38696 -696294 -976705 -611072 -228463 -317262 -570961 -346957 286595 490225 -245719 -1408770
38686 -1408770 -2103410 -2027155 -1558703 -1167467 -1027933 -1034812 -938404 -568831 -89095 118722
38676 118722 -33331 -129623 241329 928401 1396515 1356257 1002982 715408 723731 1016905
38666 1016905 1380351 1539783 1403095 1136952 937885 836765 805808 861632 895650 618778
38656 618778 -51192 -702311 -847297 -536113 -223983 -105123 38513 339522 628610 799742
38646 799742 954881 1009165 598922 -294284 -1002830 -905108 -277397 52460 -218356 -621709
38636 -621709 -718766 -621472 -584980 -563723 -456665 -433210 -653740 -884698 -750202 -256514
38626b56514M88684K17168o6856k91305l79296j39354L12127L87178k41654r87983
38616i57805r72715k09805L78170J87746l40550m38469l2536L02296J98078o7059
38606a952649j602M52106Q31354O85381R1245m62155o48348n46250k96033J31124
38596a715827O11409O94469J69726m51929n21039j38067Q9486L3019J07309L70849
38586g50595L43707q3722l20220k4579K80581M1034m27243m31315J04383O79693
38576e88276R37336Q36358L97070k20272o07756n37776l01128k56662l34969l53991
38566a030066m23246n62602l74203K81290P05354K33802o18377p45372k0660O01099
38556a952981N06379O0947k47281m22751m90259k05049L97170P69808N52525O8853
$$ plain form
38626 -256514 232170 449338 382482 91177 -288119 -427473 -115346 271832 30178 -957805
38616 -957805 -1930520 -2140325 -1762155 -1574409 -1914959 -2353428 -2385964 -2083668 -1885590 -1952649
38606 -1952649 -1954251 -1502145 -670791 14590 105835 -356320 -1004668 -1550918 -1846951 -1715827
38596 -1715827 -1104418 -409949 -240223 -692152 -1213191 -1351258 -1261772 -1228753 -1121444 -750595
38586 -750595 -406888 -490610 -810830 -835409 -554828 -513794 -941037 -1372352 -1267969 -588276
38576 -588276 349060 1185418 1582488 1362216 754460 216684 -84444 -341106 -676075 -1030066
38566 -1030066 -1453312 -2015914 -2390117 -2108827 -1403473 -1169671 -1788048 -2533420 -2554080 -1952981
38556 -1952981 -1446602 -1385655 -1632936 -2055687 -2545946 -2750995 -2353825 -1584017 -1031492 -962639
38546i62639j37009R7395N44493Q04226N02374k79498q06419m79475K18467K43845
38536b54240n22703j078184p04084K12791R47353J209265R09121L2502q65635
38527a13814q87190o791O93212M93728k4275m9408K65371L56473K55079K60700
38517A243085K26836n5074l06340l13698m38319q38435q74587j80121L81225o6713
38507a222141q32921n86268N26572J076543N24185j84499k75030q6941r0524j42892
38497a293916j21024k76128n32459l49733K89446O26184L14399K9130L70409R27662
38487a6030J009436O26478J54304l62788r21372j092169n42463L03551P22595
38478a18458N67538K16029p4544k85738l47035j85028P1874K54335L46720L06470
$$ plain form
38546 -962639 -1099648 -1002253 -457760 346466 848840 569342 -237077 -716552 -498085 -254240
38536 -254240 -776943 -1855127 -2559211 -2346420 -1399067 -189802 719319 751821 -113814
38527 -113814 -1001004 -1007795 -314583 179145 154870 105462 370833 727306 982385 1243085
38517 1243085 1469921 1414847 1108507 794809 356490 -481945 -1356532 -1536653 -1155428 -1222141
38507 -1222141 -2055062 -2641330 -2114758 -1038215 -514030 -698529 -973559 -1060500 -1151024 -1293916
38497 -1293916 -1414940 -1691068 -2223527 -2573260 -2283814 -1657630 -1343231 -1314101 -943692 -16030
38487 -16030 993406 1619884 1774188 1411400 490028 -602141 -1144604 -841053 -118458
38478 -118458 449080 665109 590565 304827 -42208 -227236 -155362 98973 445693 752163
38468G52163j2342m92813o50144k25156L96488O62454M82646J24439j95384l37466
38458E04885k03478L2679L971k73020l23533j0358J28273k33814n55750k74869
38448a205014K02844J38524k81898k26522M07044Q23244N88333J85180P7054l960
38438G04829m28452r31694j005663o48914k48247N5932M34357Q80554J047465
38429a39833O60028j07714p61603r18751n75295k5803L80572M07273J8492n38983
38419a601617q26383o01844r3321L20940O03750Q95730R86083N28515j59815k38273
38409a86235M13220Q27469L49078l24306k62784J91719R2809l95428k58659M91937
38399I38820O22139l13279j081339n97952M30095O29922m8377n23444k84610J70730
$$ plain form
38468 752163 739821 247008 -403136 -628292 -231804 430650 913296 1037735 842351 504885
38458 504885 301407 334086 338057 65037 -258496 -268854 -140581 -374395 -930145 -1205014
38448 -1205014 -1002170 -863646 -1145544 -1372066 -965022 -141778 446555 631735 708789 704829
38438 704829 276377 -655317 -1660980 -2309894 -2558141 -2502209 -2067852 -1187298 -139833
38429 -139833 520195 412481 -349122 -1267873 -1843168 -1868971 -1488399 -1081126 -1062634 -1601617
38419 -1601617 -2428000 -3029844 -3123165 -2802225 -2198475 -1302745 -316662 211853 52038 -186235
38409 -186235 226985 1054454 1403532 1079226 816442 1008161 1100970 705542 446883 938820
38399 938820 1560959 1247680 166341 -431611 -1516 628406 580029 56585 -228025 -57295
38389e7295L94401M63189L65493j83449j067043j581940j236820k99807O29173
38380b574098J171033J173563O68414N1690j42426P2144P4510m35681q71641n53062
38370a365554K62426O80245L38749k66842n87988n87244l86436R5499Q10249J260153
38360B53257R69018J47045m98106n94265m27899m13465n67433o42370n19103k57292
38350b550613O8767L55670M11399J69578q5162J5917L96498N38814J35673m80456
38340a023915p29051m36579P5954L97500L03516j97715p69225q00226J7804J125180
38330b036757J534135R94806L04284J98826L92022J81407l51812m39962J57995
38321I34944P51793P04837K36132p2425j06714j61533l63848n59596o03476m46487
$$ plain form
38389 -57295 337106 800295 1165788 982339 -84704 -1666644 -2903464 -3203271 -2574098
38380 -2574098 -1403065 -229502 438912 490602 348176 420320 494830 59149 -812492 -1365554
38370 -1365554 -1103128 -422883 -84134 -350976 -938964 -1526208 -1912644 -1817145 -1006896 253257
38360 253257 1222275 1369320 871214 276949 -150950 -564415 -1131848 -1774218 -2293321 -2550613
38350 -2550613 -2481846 -2126176 -1714777 -1545199 -1630361 -1614444 -1217946 -679132 -543459 -1023915
38340 -1023915 -1752966 -2189545 -2113591 -1716091 -1412575 -1610290 -2379515 -3179741 -3161937 -2036757
38330 -2036757 -502622 492184 796468 995294 1387316 1568723 1216911 776949 934944
38321 934944 1686737 2391574 2627706 2555281 2448567 2287034 1923186 1363590 760114 313627
38311C13627q4339L20224M33877J28356l04266n25257n07383l00649K06160R10575
38301E90925J227080P32364j28129n38860l75047j82015k08574j35450K15165
38292A197459N73320P38757P71283N39701k16083j137285j304192m64752M38132
38283A136340M72473j19400n18587n26854m53752k69460K43428P08007M53420
38274A125615l44555o55947J1055Q88595J003363M25957k7110l586N8106k33335
38264B248158n95564n40357j65297p2860n17319j016946r89599m49032K15167
38255a883649Q14372J245099J095267J08821j008022j098871j00469P35402N45580
38246D53530k8139l131M44321M84489N3097k31114k31188l52927n71126l89934
$$ plain form
38311 313627 229288 549512 983389 1111745 807479 282222 -225161 -525810 -319650 590925
38301 590925 1818005 2550369 2422240 1883380 1508333 1326318 1117744 982294 1197459
38292 1197459 1770779 2509536 3280819 3820520 3604437 2467152 1162960 698208 1136340
38283 1136340 1608813 1489413 970826 443972 -9780 -279240 -35812 672195 1125615
38274 1125615 781060 125113 136168 1024763 2028126 2454083 2426973 2423387 2481493 2248158
38264 2248158 1652594 1112237 946940 874080 356761 -660185 -1649784 -2098816 -1883649
38255 -1883649 -1069277 175822 1271089 1379910 371888 -726983 -827452 -92050 453530
38246 453530 425391 422260 866581 1351070 1404167 1173053 941865 588938 17812 -372122
38236c72122J65304M15214O5088l90728n03181m04977k98826q5383K31401L75079
38226h03131L02742L20544M60031L35392j08482l33420m7772K95625K64892J30957
38216H17378K68051M03965J07327l72457m57148k00804j81192m88410n29371k3235
38206f55896L83256q3262j154446j624501p51701P28656J350805O52583l00937
38197a455443l70654J91934L32320j22529k89095K52140P43274M44118k74056
38188e47991o23239n76205o55550r42497j002361o21542m0618M54104P19561O45270
38178c191068K67961q2264r0543J70754M24736N69727O33293N91185N08468N80559
38168C82808P36095N43641j11291o31214m68236O0062K64090P7722p1772j27874
$$ plain form
38236 -372122 -206818 208396 273484 -117244 -620425 -1025402 -1324228 -1409611 -1178210 -803131
38226 -803131 -500389 -179845 280186 615578 507096 173676 125904 421529 686421 817378
38216 817378 1085429 1489394 1596721 1224264 767116 566312 385120 -103290 -632661 -655896
38206 -655896 -272640 -355902 -1510348 -3134849 -3886550 -3157894 -1807089 -1154506 -1455443
38197 -1455443 -1826097 -1634163 -1301843 -1424372 -1713467 -1461327 -718053 -273935 -547991
38188 -547991 -1171230 -1747435 -2402985 -3345482 -4347843 -4969385 -5010003 -4555899 -3836338 -3191068
38178 -3191068 -2923107 -3005371 -3095914 -2925160 -2500424 -1930697 -1297404 -706219 -197751 382808
38168 382808 1118903 1662544 1551253 920039 451803 511865 775955 853677 781905 654031
38158F54031l99424q07938q95156o03507l50252k41579R7541P32045J106769Q23053
38148A15583K09360j89340k66764k11026q8672J06200K61305K86739K65502K87640
38138G76527L10166K85359K36312J60964Q2453J65014M59866N77977O4051q49155
38128B269534j346964j042706m15249n2783L9763R8842P3827j31656k80717j52986
38118i41095R29j49649l66557j18698N55022R79045P33645J98575R079K52323
38108A152619M59003K70005j44012l74513l08870j86415j56923n2435K44573M56407
38098A359439K63398j40364k64158n9625L4143j39183j72421J59372L72236n8957
38088A353880q27687j095704n35593L47410Q70791P88522K90671k52416m99752
$$ plain form
38158 654031 254607 -553331 -1448487 -2051994 -2402246 -2643825 -2546284 -1814239 -707470 115583
38148 115583 324943 135603 -131161 -342187 -430859 -324659 -63354 223385 488887 776527
38138 776527 1086693 1372052 1608364 1769328 1851781 2016795 2476661 3054638 3118689 2269534
38128 2269534 922570 -120136 -535385 -588168 -548405 -449563 -375736 -507392 -788109 -941095
38118 -941095 -940166 -1089815 -1456372 -1575070 -1020048 -41003 692642 891217 900296 1152619
38108 1152619 1611622 1881627 1737615 1363102 1054232 867817 710894 658459 903032 1359439
38098 1359439 1622837 1482473 1218315 1158690 1192833 1053650 881229 1040601 1412837 1353880
38088 1353880 526193 -569511 -1105104 -757694 113097 901619 1192290 939874 440122
38079D40122l64808j10799p7689l14741n85398o38594l41892K83687R34994J097643
38069C22525N56555k43979o34538m39281P626M11377O78542O29803R4820o01205
38059G82245p60939j90291M43025M40565m9956l36794j12443L17609N72806N34470
38049A640297J96744l85325r14488r81801n55425r0023K7079o8375j0404K37455
38039i04266L94211L51241L31848M85428N81289L13390k09458n27296m13685j82536
38029B20166k55917n54102n65243m1921O19475Q35795M77457j55258q06929j361857
38019a588334j536530r63899K14547J212878J380678Q98270M04629J76316O4890
38010B63445L7962K25342M36251K08477m63126r15506o35334N3615M45462L41066
$$ plain form
38079 440122 75314 -35485 -113174 -427915 -1013313 -1651907 -1993799 -1710112 -775118 322525
38069 322525 879080 635101 563 -438718 -431092 -19715 658827 1288630 1383450 782245
38059 782245 21306 -168985 274040 714605 664649 327855 215412 533021 1105827 1640297
38049 1640297 1837041 1451716 537228 -444573 -999998 -1090021 -1062942 -1131317 -1141721 -904266
38039 -904266 -510055 -158814 173034 658462 1239751 1553141 1343683 816387 402702 220166
38029 220166 -35751 -589853 -1155096 -1197017 -577542 258253 735710 580452 -226477 -1588334
38019 -1588334 -3124864 -4088763 -3874216 -2661338 -1280660 -382390 22239 198555 263445
38010 263445 301407 526749 963000 1171477 708351 -207155 -842489 -788874 -343412 -2346
38000b346J46157K44689N85938Q18779O22282n349o35726p50651l53177j8816
37990F51780j40223m00901k96076J11347L73101L74411L68319M01120K39925j12350
37980A570453l38046l39591l87480n78145n83359j83486L04684M20542J33750
37971A9322k29437m32612m56195l34285j10798J10639K41219K86068K71343J97941
37961d36795J38556K31120M57798N56634L01257j81722m81739l02044K12128N40931
37951A036124K86791l19328n74593j51622M02595L42186k44092n41864j63024
37942G3173L35105K91120j52140l45605o0654K88258K60081r1093l37724j58419
37932A02102L24525O39453M54914j1499k06674R5679N10917N12152M5024m46433
$$ plain form
38000 -2346 143811 388500 974438 1793217 2415499 2410150 1774424 1023773 670596 651780
37990 651780 511557 110656 -185420 -74073 299028 673439 1041758 1442878 1682803 1570453
37980 1570453 1232407 892816 505336 -72809 -656168 -839654 -534970 -114428 19322
37971 19322 -210115 -642727 -1098922 -1433207 -1544005 -1433366 -1192147 -906079 -634736 -436795
37961 -436795 -298239 -67119 390679 947313 1248570 1066848 585109 283065 495193 1036124
37951 1036124 1322915 1003587 428994 277372 679967 1022153 778061 236197 73173
37942 73173 408278 699398 547258 201653 140999 429257 689338 598245 260521 102102
37932 102102 426627 1066080 1520994 1509495 1302821 1398500 1909417 2421569 2466593 2020160
37922B020160n43519l05751j69809l79312o03248l47751K57703M98516R6230l10021
37912B13198j43189J59189j09058o20758m42857L71721P38037K48302j98278Q5958
37902C02265M79909J69981n02356o56792k04710K89767N86937P70906O81211K05829
37892B122947j58151J13814O34377N53310j95980q56308r32227n89756j04945
37883E87081L34270L88339q8037n30886k84694L36662M53005K3742j30583K12742
37873A301641K78477l30754q83006o53717N9658O32682J015760J277178J004841
37864C702760J8405q70680p47604N1309L53393k05399p76870n94798M9544L55927
37854A335987L3075n17367p59000n45326j92843r5608k24683j33779L98462R33527
$$ plain form
37922 2020160 1476641 1170890 1001081 621769 18521 -329230 -71527 426989 523219 213198
37912 213198 70009 229198 120140 -500618 -943475 -571754 166283 414585 216307 302265
37902 302265 782174 952155 449799 -206993 -411703 -121936 465001 1235907 1917118 2122947
37892 2122947 1964796 2078610 2712987 3266297 3070317 2214009 1281782 692026 587081
37883 587081 921351 1309690 1221653 690767 406073 742735 1195740 1219482 1088899 1301641
37873 1301641 1580118 1249364 366358 -287359 -227701 404981 1420741 2697919 3702760
37864 3702760 3721165 2850485 2102881 2154190 2507583 2302184 1525314 930516 980060 1335987
37854 1335987 1369062 851695 92695 -452631 -645474 -741082 -965765 -1099544 -701082 232445
37844B32445Q76830L00509r6711J30169O46265P99248L85555j99875m73877l74546
37834B226012k33059k98987m12954k56787J46343L98493K36764j34020l30353
37825A341452k34534r939J70286K30865J41540m5122j48952l8152J40807O6117
37815A614368l52795p71933p53793l15767L0390p1441k84663r478O81080R85582
37805G51550M46017l65601n99981k06570K10755L01255J50851k03185p36352j005190
37795a256451n12816M08172P94823L20398l01202l98707j58289n2468j16285j98740
37785a471565l48422n09392l75920O730O4445l78785n92907j684Q01162Q83041
37775a923297L87737K18575N64443P14295L32326m639K21301O80088P20451K09784
$$ plain form
37844 232445 1109275 1409784 1313073 1443242 2089507 2888755 3274310 3074435 2600558 2226012
37834 2226012 1992953 1693966 1281012 1024225 1170568 1569061 1805825 1671805 1341452
37825 1341452 1106918 1096979 1267265 1498130 1639670 1594548 1445596 1407444 1548251 1614368
37815 1614368 1261573 489640 -264153 -579920 -549530 -620971 -905634 -915112 -234032 751550
37805 751550 1197567 831966 231985 25415 236170 537425 688276 485091 -251261 -1256451
37795 -1256451 -1769267 -1361095 -566272 -245874 -547076 -945783 -1104072 -1156540 -1272825 -1471565
37785 -1471565 -1819987 -2329379 -2705299 -2698569 -2634124 -3012909 -3605816 -3607500 -2806338 -1923297
37775 -1923297 -1535560 -1316985 -752542 -38247 294079 289440 510741 1190829 1911280 2121064
37765B121064m54365q55319q55835n86210k61055O2123M37854O58183K92355n63217
37755d422j008505m12760N77575Q65747M86711M02520P80618O34106m82623j519435
37745C19532j374271m58441N2127n7725n7509K92541L77767j18377n98029m40737
37735b063122J05875L58942J28141k11925l15782j10916L89927J052533J410531
37726G44204R82477o559o28842l20783L56413M65741k5591l22825r6282O1212
37716A209165k93490o69766m63718J8896P2323k55509l16882J0077J71085q1425
37706e99244l30107k68062j43883k01553k81506k42299k25103k26915L2397M98554
37696a987721O03144J04074m21161m11446j68566k77224n75837m10810K95041
$$ plain form
37765 2121064 1666699 811380 -44455 -630665 -891720 -829597 -391743 266440 558795 -4422
37755 -4422 -1012927 -1425687 -848112 17635 504346 906866 1687484 2321590 1838967 319532
37745 319532 -1054739 -1513180 -1461053 -1518778 -1576287 -1283746 -905979 -1024356 -1622385 -2063122
37735 -2063122 -1957247 -1598305 -1470164 -1682089 -1997871 -2108787 -1718860 -666327 744204
37726 744204 1726681 1720122 1091280 770497 1126910 1592651 1567060 1244235 1147953 1209165
37716 1209165 915675 245909 -217809 -198913 -126590 -382099 -698981 -688904 -517819 -599244
37706 -599244 -929351 -1197413 -1341296 -1542849 -1824355 -2066654 -2291757 -2518672 -2486275 -1987721
37696 -1987721 -1384577 -1280503 -1701664 -2113110 -2281676 -2558900 -3134737 -3545547 -3250506
37687c250506R41330J170084J220410J272018J043008L19604n16490q22233l96081
37678I81144L42342P71589N62722j33116q50611j146012q36036o3275P12118R04376
37668A245241L34657m01015n05067l2211J36080l87732q38245m87045J27177J9400
37658g88760n97173n83949K85192R39548P24053L43821N18549P36728K52486m77008
37648A353487m82564O4385J13479n12638q60675m61510l79K5175J75682Q78366
37638B92808J335092O55873n47268q88112k51593J19743l56731p31859j38413
37629e10460P71777Q19899L4335n65136n50895m41119n12140k71642N20756J101810
37619C97185O31894n30461j169356p31010R4665M03198J57103o7412m2682j01622
$$ plain form
37687 -3250506 -2309176 -1139092 81318 1353336 2396344 2715948 2199458 1377225 981144
37678 981144 1323486 2095075 2657797 2524681 1674070 528058 -307978 -371253 340865 1245241
37668 1245241 1579898 1178883 673816 641605 777685 389953 -448292 -935337 -808160 -788760
37658 -788760 -1385933 -1969882 -1684690 -745142 -21089 322732 841281 1578009 1830495 1353487
37648 1353487 870923 935308 1048787 536149 -324526 -786036 -786415 -761240 -585558 292808
37638 292808 1627900 2283773 1736505 848393 596800 716543 359812 -372047 -510460
37629 -510460 261317 1081216 1115551 550415 -480 -441599 -953739 -1225381 -704625 397185
37619 397185 1029079 498618 -670738 -1401748 -1307083 -903885 -746782 -814194 -856876 -958498
37609i58498m46462p17627m70406J77211O54410O12914K68898Q5892K85127O65589
37599A57048P74370K88716o14760j306339j295526p48498k35831m5717k0712j032
37589c048281j7729P339K91099P19729P84317K98691j95686j42685K14825K11227
37579h77154k44193n58027k95358L15628P60683P81237N02083K78211M04152P61842
37569A829104Q52616M08246k09098n09790n28073n51415m74996l8839M51083L76878
37559A605716j88343m69609j44696K05472P4459k34644k61678j65596l22510o09026
37549e10455o34946l66281k6803L37976P30345Q91390O02777J18652j27215r5593
37539I19847p0324j94700l98656n63569m68188J01843Q47452R90901L04207l57376
$$ plain form
37609 -958498 -1404960 -2122587 -2592993 -2415782 -1761372 -1148458 -879560 -793668 -508541 157048
37599 157048 931418 1220134 605374 -700965 -1996491 -2744989 -2980820 -3026537 -3047249 -3048281
37589 -3048281 -3066010 -3058671 -2767572 -2047843 -1263526 -964835 -1160521 -1303206 -1088381 -877154
37579 -877154 -1121347 -1679374 -1974732 -1659104 -898421 -117184 384899 663110 1067262 1829104
37569 1829104 2681720 3089966 2880868 2371078 1843005 1291590 816594 777755 1228838 1605716
37559 1605716 1417373 947764 803068 1008540 1082999 848355 586677 421081 98571 -510455
37549 -510455 -1145401 -1511682 -1538485 -1200509 -470164 421226 1024003 1142655 1015440 919847
37539 919847 849523 654823 256167 -307402 -775590 -673747 173705 1164606 1468813 1111437
37529A111437k04087K52165r767q01994r06431J5221Q20111N28588m07769r92149
37519e94675j002774p90755m52692L2024L22439J63123N121M25152J114976J199302
37509D21241N00880k31276m16108k86500k61064k83571j16101J59893L06699L07258
37499A01351K72068K02493J14391J67662L87485M70164J90475j79551k35592r1573
37489A399373k06326n77674o37684j45167K97921K9878o67110q64897k28607N49040
37479a051253O93447L01051L0596J20716J72743j04407l78921j79223L47964N30919
37469D83632M6552n93726o23270M9094P18377P00237Q1191m36446l20054K87655
37459C93242Q00653P99245L75605n2810j83524m5461J63859L10507L20230Q8566
$$ plain form
37529 1111437 907350 1159515 1149748 347754 -558677 -543456 276655 805243 397474 -594675
37519 -594675 -1597449 -2388204 -2840896 -2808872 -2486433 -2323310 -2318189 -1893037 -778061 421241
37509 421241 922121 690845 274737 -11763 -272827 -556398 -672499 -512606 -205907 101351
37499 101351 373419 575912 690303 857965 1245450 1715614 1906089 1726538 1490946 1399373
37489 1399373 1193047 615373 -22311 -167478 130443 160321 -506789 -1371686 -1600293 -1051253
37479 -1051253 -357806 -56755 -26159 94557 267300 162893 -216028 -395251 -47287 483632
37469 483632 530184 -63542 -686812 -637718 80659 780896 862087 425641 105587 393242
37459 393242 1193895 1993140 2368745 2315935 2132411 2086950 2250809 2561316 2881546 2970112
37449B970112l99084q94013j053504q22764m58297j39026K04565N82202P38519
37440G28710M71851j6900l23074k93639j14113k9000j13950k42009j95460O6708
37430f0876K42725L6560l16687k84014R4033J12866n03450j010575o86576O4295
37420b311699L85003L19487N65934J093762J058820J91074p04694r21904o95368
37411a019585n09242l12531J06149N49966O92332N01802Q0436m56321p07876j98409
37401a273279Q19067J382176J020829L34101j1040j58533m43454o31760m69447
37392E68660l57908o84721r83076n95315K07169N96585L92554J08421M4041Q9118
37382f14472J98612L26859J42501m29616o81019j9718Q48965O64431n38987j374800
$$ plain form
37449 2970112 2571028 1677015 623511 -199253 -657550 -796576 -592011 -9809 728710
37440 728710 1200561 1183661 860587 566948 452835 423835 309885 67876 -127584 -60876
37430 -60876 181849 218409 -98278 -382292 -288259 -175393 -678843 -1689418 -2375994 -2311699
37420 -2311699 -1926696 -1607209 -1041275 52487 1111307 1302381 597687 -324217 -1019585
37411 -1019585 -1528827 -1841358 -1735209 -1185243 -492911 8891 89327 -366994 -1074870 -1273279
37401 -1273279 -454212 927964 1948793 2282894 2271854 2113321 1669867 1038107 568660
37392 568660 210752 -473969 -1457045 -2052360 -1845191 -1248606 -856052 -747631 -703590 -614472
37382 -614472 -415860 -89001 53500 -376116 -1057135 -1076853 -227888 436543 -102444 -1477244
37372a477244j002456q0333M26961M61519M80995O06440O53025N25829K24516
37363H19252j84913m25099k29650J92244L35771P8652k68872n31228p24827o31271
37353a569941o835P87535J100311R61185R48574J039141N28506o57476j510276
37344A620724j241465k78580M76978O99091N35546J50138j78474j20974J23447
37335A786431p7179p54043j097395o52112K904K51854L24107N79953O99927L28525
$$ plain form
37372 -1477244 -2479700 -2560033 -2133072 -1671553 -1190558 -584118 68907 594736 819252
37363 819252 634339 209240 -20410 171834 507605 586257 317385 -213843 -938670 -1569941
37353 -1569941 -1576776 -789241 311070 1272255 2220829 3259970 3788476 3131000 1620724
37344 1620724 379259 100679 577657 1276748 1812294 1962432 1783958 1662984 1786431
37335 1786431 1709252 955209 -142186 -794298 -791394 -539540 -215433 364520 1064447 1392972
$$ [...]
##END NTUPLES=NMR SPECTRUM
##END=
