##TITLE=31P Pdec_LR-785-R3-C2-1 
 CDCl3, 32 sc
 17.2.2025
##JCAMPDX= 6.0         $$ Bruker NMR JCAMP-DX V2.0
##DATA TYPE= NMR SPECTRUM
##DATA CLASS= NTUPLES
##ORIGIN= UXNMR, Bruker Analytische Messtechnik GmbH
##OWNER= root
$$ XWIN-NMR		Version 3.5
$$ Wed Feb 19 15:29:09 2025 Russian Standard Time (UT+4h)  new_Human@DPX200
##.OBSERVE FREQUENCY= 81.013821
##.OBSERVE NUCLEUS= ^31P
##.ACQUISITION MODE= SIMULTANEOUS
##.ACQUISITION SCHEME= undefined
##.AVERAGES= 32
##.DIGITISER RES= 17
##SPECTROMETER/DATA SYSTEM= spect
##.PULSE SEQUENCE= zgpg30
##.SOLVENT NAME= CDCl3
##.SHIFT REFERENCE= (INTERNAL, CDCl3, 0, 198.062)
##AUDIT TRAIL= $$ (NUMBER, WHEN, WHO, WHERE, WHAT)
$$ ##TITLE= Audit trail, XWIN-NMR		Version 3.5
$$ ##JCAMPDX= 5.01
$$ ##ORIGIN= Bruker BioSpin GmbH
$$ ##OWNER= new_Human
$$ C:/Bruker/XWIN-NMR/data/yarkov/nmr/P31/2/pdata/1/auditp.txt
$$ ##AUDIT TRAIL=  $$ (NUMBER, WHEN, WHO, WHERE, WHAT)
(   1,<2025-02-19 15:24:54.18 +0400>,<new_Human>,<DPX200>,
      <created by zg, POWCHK disabled, PULCHK disabled
       configuration hash MD5:
       00 E9 B6 7A A2 85 ED C7 34 08 36 98 17 FE 4E 26
       data hash MD5: 32K
       D1 59 BE 5D DE 61 F7 AF D9 75 23 DE C6 D4 14 35>)
(   2,<2025-02-19 15:25:11.03 +0400>,<new_Human>,<DPX200>,
      <Start of raw data processing
       efp BC_mod = 2 LB = 1.5 FT_mod = 6 PKNL = 1 PHC0 = 1752.869 PHC1 = 150.6954 SI = 64K 
       data hash MD5: 64K
       85 6D 62 AC 43 F3 57 73 A9 DA 13 48 63 E5 5B 86>)
(   3,<2025-02-19 15:27:50.43 +0400>,<new_Human>,<DPX200>,
      <pk PHC0 = -41.15119 PHC1 = -3.2 
       data hash MD5: 64K
       ED 01 78 21 53 76 BF 42 A7 79 89 41 50 77 9B 1D>)
$$ ##END=
$$ 
$$ hash MD5
$$ A9 D4 91 EF 5C 2E 30 DD 4E 76 25 16 AC E5 8E 5C
##$RELAX= 
##$RELAX= 
##$RELAX= 
##$RELAX= 
##$RELAX= 
##$RELAX= 
##$RELAX= 
##$RELAX= 
$$ Bruker specific parameters
$$ --------------------------
##$DU= <C:/Bruker/XWIN-NMR>
##$EXPNO= 2
##$NAME= <P31>
##$PROCNO= 1
##$TYPE= <nmr>
##$USER= <yarkov>
##$AMP= (0..31)
100 100 100 100 100 100 100 100 100 100 100 100 100 100 100 100 100 100 
100 100 100 100 100 100 100 100 100 100 100 100 100 100 
##$AQSEQ= 0
##$AQ_mod= 1
##$AUNM= <au_zg>
##$AUTOPOS= <>
##$BF1= 81.014009
##$BF2= 200.13
##$BF3= 200.13
##$BF4= 200.13
##$BF5= 200.13
##$BF6= 200.13
##$BF7= 200.13
##$BF8= 200.13
##$BYTORDA= 1
##$CFDGTYP= 0
##$CFRGTYP= 5
##$CHEMSTR= <none>
##$CNST= (0..31)
1 1 145 1 1 1 1 1 1 1 1 1 1 1 1 1 1 1 1 1 1 1 1 1 1 1 1 1 1 1 1 1 
##$CPDPRG= <waltz16>
##$CPDPRG1= <>
##$CPDPRG2= <waltz16>
##$CPDPRG3= <>
##$CPDPRG4= <mlev>
##$CPDPRG5= <mlev>
##$CPDPRG6= <mlev>
##$CPDPRG7= <mlev>
##$CPDPRG8= <mlev>
##$CPDPRGB= <>
##$CPDPRGT= <>
##$D= (0..31)
0 1 0 0 0 0 0 0 0 0.06 0 0.03 2e-05 3e-06 0 0 0.0002 0 0 0 0 0 0 0 0 0 
0 0 0 0 0 0 
##$DATE= 1739964293
##$DBL= (0..7)
120 120 120 11 120 120 24 19 
##$DBP= (0..7)
150 150 150 150 150 150 150 150 
##$DBP07= 0
##$DBPNAM0= <>
##$DBPNAM1= <>
##$DBPNAM2= <>
##$DBPNAM3= <>
##$DBPNAM4= <>
##$DBPNAM5= <>
##$DBPNAM6= <>
##$DBPNAM7= <>
$$ [...]
##$SUBNAM2= <"">
##$SUBNAM3= <"">
##$SUBNAM4= <"">
##$SUBNAM5= <"">
##$SUBNAM6= <"">
##$SUBNAM7= <"">
##$SUBNAM8= <"">
##$SUBNAM9= <"">
##$SW= 400.765351723535
##$SWIBOX= (0..15)
0 1 3 0 0 0 0 0 0 0 0 0 0 0 0 0 
##$SW_h= 32467.5324675325
##$TD= 32768
##$TD0= 1
##$TE= 0
##$TE2= 300
##$TE3= 300
##$TEG= 300
##$TL= (0..7)
0 120 53 12 22 120 120 120 
##$TP= (0..7)
150 150 150 150 150 150 150 150 
##$TP07= 0
##$TPNAME0= <>
##$TPNAME1= <>
##$TPNAME2= <>
##$TPNAME3= <>
##$TPNAME4= <>
##$TPNAME5= <>
##$TPNAME6= <>
##$TPNAME7= <>
##$TPOAL= (0..7)
0.5 0.5 0.5 0.5 0.5 0.5 0.5 0.5 
##$TPOFFS= (0..7)
0 0 0 0 0 0 0 0 
##$TUNHIN= 0
##$TUNHOUT= 0
##$TUNXOUT= 0
##$USERA1= <user>
##$USERA2= <user>
##$USERA3= <user>
##$USERA4= <user>
##$USERA5= <user>
##$V9= 5
##$VALIST= <valist>
##$VCLIST= <CCCCCCCCCCCCCCC>
##$VD= 0
##$VDLIST= <DDDDDDDDDDDDDDD>
##$VPLIST= <PPPPPPPPPPPPPPP>
##$VTLIST= <TTTTTTTTTTTTTTT>
##$WBST= 1024
##$WBSW= 4
##$XGAIN= (0..3)
0 0 0 0 
##$XL= 0
##$YL= 0
##$YMAX_a= 9662
##$YMIN_a= -4175
##$ZGOPTNS= <>
##$ZL1= 120
##$ZL2= 120
##$ZL3= 120
##$ZL4= 120
##$ABSF1= 0
##$ABSF2= 0
##$ABSG= 0
##$ABSL= 0
##$ALPHA= 0
##$AQORDER= 0
##$ASSFAC= 0
##$ASSFACI= 0
##$ASSFACX= 0
##$ASSWID= 0
##$AUNMP= <proc_1d>
##$AZFE= 0.1
##$AZFW= 0.5
##$BCFW= 0
##$BC_mod= 2
##$BYTORDP= 0
##$COROFFS= 0
##$CY= -3
##$DATMOD= 1
##$DC= 0
##$DFILT= <>
##$DTYPP= 0
##$F1P= 0
##$F2P= 0
##$FCOR= 1
##$FTSIZE= 65536
##$FT_mod= 6
##$GAMMA= 0
##$GB= 0
##$INTBC= 1
##$INTSCL= 9.790993e-09
##$ISEN= 30
##$LB= 1.5
##$LEV0= 0
##$LPBIN= 0
##$MAXI= 10000
##$MC2= 0
##$MEAN= 0
##$ME_mod= 0
##$MI= 50
##$NCOEF= 0
##$NC_proc= -9
##$NLEV= 6
##$NOISF1= 182.463
##$NOISF2= 159.3651
##$NSP= 0
##$NTH_PI= 0
##$NZP= 0
##$OFFSET= 198.0616
##$PC= 4
##$PHC0= 1711.718
##$PHC1= 147.4954
##$PH_mod= 1
##$PKNL= yes
##$PPARMOD= 0
##$PSCAL= 0
##$PSIGN= 0
##$REVERSE= no
##$SF= 81.0140089999434
##$SI= 65536
##$SIGF1= 159.3651
##$SIGF2= -187.1042
##$SINO= 113.3802
##$SIOLD= 16384
##$SREGLST= <1H.CDCl3>
##$SSB= 0
##$STSI= 65536
##$STSR= 0
##$SW_p= 32467.5324675325
##$SYMM= 0
##$S_DEV= 0
##$TDeff= 32768
##$TDoff= 0
##$TI= <>
##$TILT= no
##$TM1= 0
##$TM2= 0
##$TOPLEV= 0
##$USERP1= <user>
##$USERP2= <user>
##$USERP3= <user>
##$USERP4= <user>
##$USERP5= <user>
##$WDW= 1
##$XDIM= 65536
##$YMAX_p= 118185228
##$YMIN_p= -347289589
$$ End of Bruker specific parameters
$$ ---------------------------------
##NTUPLES= NMR SPECTRUM
##VAR_NAME=  FREQUENCY,     SPECTRUM/REAL,   SPECTRUM/IMAG
##SYMBOL=    X,             R,               I
##VAR_TYPE=  INDEPENDENT,   DEPENDENT,       DEPENDENT
##VAR_FORM=  AFFN,          ASDF,            ASDF
##VAR_DIM=   65536,         65536,           65536
##UNITS=     HZ,            ARBITRARY UNITS, ARBITRARY UNITS
##FACTOR=    0.49542278885378, 1,            1
##FIRST=     16045.7642231865, 0,            0
##LAST=      -16421.768244346, 0,            0
##MIN=       -16421.768244346, -347289589,   0
##MAX=       16045.7642231865, 118185228,    0
$$ Real data points
##PAGE= N=1
##DATA TABLE= (X++(R..R)), XYDATA
$$ [...]
$$ plain form
7438 15321226 13367187 9836459 6083011 1881457 -3574272 -9295968 -12043270 -9512244
7430 -9512244 -3920325 -490302 -1123635 -1295893 4290229 13729708 18820314 14717170 5728724
7421 5728724 -389679 -1382364 -741108 -774081 177642 3099899 5069190 3288241 -170051
7412 -170051 -1021246 793824 755907 -3765464 -9779722 -12984881 -13379986 -13836248 -14242056
7403 -14242056 -10781264 -2364794 5006149 3612719 -6364805 -15492117 -14979536 -6379598
7395 -6379598 742912 140088 -4871229 -7245299 -5566625 -4882950 -9145706 -15930641 -19618325
7386 -19618325 -17746685 -12644609 -7956731 -5308266 -4052711 -2790795 -871877 784048
7378 784048 301363 -3022342 -7266639 -9237645 -7144585 -1487139 5810379 11749174 12644624
$$ packed form
7438A5321226j954039l530728l753448m201554n455729n721696k747302K531026
7430i512244N591919L430023o33333j72258N586122R439479N090606m103144q988446
7421E728724o118403r92685O41256l2973R51723K922257J969291j780949l458292
7412a70051q51195J815070l7917m521371o014258l205159l95105m56262m05808
7403a4242056L460792Q416470P370943j393430r977524r127312N12581Q599938
7395f379598P122510o02824n011317k374070J678674O83675m262756o784935l687684
7386a9618325J871640N102076M687878K648465J255555J261916J918918J655925
7378G84048m82685l323705m244297j971006K093060N657446P297518N938795Q95450
$$ plain form
7369 12644624 6975790 -1388958 -5327562 -1683194 5144758 8512822 6906131 3946503
7361 3946503 2701295 3209494 4970020 7993735 10561240 9454049 4288229 -1058656
7353 -1058656 -3424159 -4344164 -6566601 -8878192 -7913881 -3888880 -700857 -437922 -1318758
7344 -1318758 -1540585 -1615874 -1563602 909317 6964893 13457534 15782724 12899139 7594031
7335 7594031 2710221 -965060 -3735790 -5868226 -7337474 -7473163 -5226472 -827380
7327 -827380 3555756 6059884 7201563 8255540 8508927 6105589 1090646 -4429562 -8856420
7318 -8856420 -11826663 -12836140 -11694303 -10288668 -10918444 -12253388 -10128847 -3868168
7310 -3868168 1214845 121582 -5240927 -8644688 -7221148 -3595417 -1380875 -1784526
$$ packed form
7369A2644624n668834q364748l938604L644368O827952L368064j606691k959628
7361C946503j245208N08199J760526L023715K567505j107191n165820n346885
7353a058656k365503r20005k222437k311591R64311M025001L188023K62935q80836
7344a318758k21827p5289N2272K472919O055576O492641K325190k883585n305108
7335G594031m883810l675281k770730k132436j469248j35689K246691M399092
7327h27380M383136K504128J141679J053977K53387k403338n014943n520208m426858
7318h856420k970243j009477J141837J405635o29776j334944K124541O260679
7310c868168N083013j093263n362509l403761J423540L625731K214542m03651
$$ plain form
7302 -1784526 -4405458 -8143141 -10770269 -10402310 -8267408 -7597411 -8967810 -9471005 -7796164
7293 -7796164 -7001667 -9633015 -12644411 -10988011 -5121426 -796884 -1106970 -2715531 -1538394
7284 -1538394 1380913 2626646 2691661 5507847 11953921 17448115 17442255 13073246 9455080
7275 9455080 9467735 11090599 10622243 6982816 2467768 258660 1760564 5761305 9425305
7266 9425305 10210618 7605992 3600655 1278892 2220635 4864013 5793532 3098396 -1805426
7257 -1805426 -6059545 -8468473 -9839291 -10744215 -10509436 -8673552 -5908685 -2743294 1228596
7248 1228596 5726062 8619425 8036367 4973181 2209289 1055639 800710 963269 1939485
7239 1939485 3095150 2400065 -755963 -3715221 -3018561 1635585 6779987 8441672 5763376
$$ packed form
7302a784526k620932l737683k627128L67959K134902O69997j370399n03195J674841
7293g796164P94497k631348l011396J656400N866585M324542l10086j608561J177137
7284a538394K919307J245733O5015K816186O446074N494194n860m369009l618166
7275I455080J2655J622864m68356l639427m515048k209108J501904M000741L664000
7266I425305P85313k604626m005337k321763R41743K643378R29519k695136m903822
7257a805426m254119k408928j370818r04924K34779J835884K764867L165391L971890
7248A228596M497466K893363n83058l063186k763892j153650k54929J62559R76216
7239A939485J155665o95085l156028k959258O96660M654146N144402J661685k678296
$$ plain form
7230 5763376 1683394 70972 1860028 4350563 4822028 3867212 3843852 5176812 6562297
7221 6562297 8069485 10711367 12930595 11709324 8508773 9450415 16371037 21788574
7213 21788574 17629066 6270276 -2678928 -5028533 -5131880 -6570332 -6827311 -3667397
7205 -3667397 -677528 -2092039 -6147901 -8129783 -7200950 -5730502 -4056121 -932655
7197 -932655 1799731 188203 -5401964 -8826954 -4764710 5517616 15806409 20312937
7189 20312937 17166140 9206878 2321783 941509 4084855 7045532 6915419 4487388
7181 4487388 1159286 -2593167 -4863647 -2278790 5234379 12449452 14554306 12891135
7173 12891135 12028617 12897271 12539162 9807569 7158254 6211909 5257002 2831070 895059
$$ packed form
7230E763376m079982j612422J789056K490535M71465r54816k3360J332960J385485
7221F562297J507188K641882K219228j221271l200551R41642O920622N417537
7213B1788574m159508j1358790q949204k349605j03347j438452k56979L159914
7205c667397K989869j414511m055862j981882R28833J470448J674381L123466
7197i32655K732386j611528n590167l424990M062244J0282326J0288793M506528
7189B0312937l146797p959262o885095j380274L143346K960677j30113k428031
7181D487388l328102l752453k270480K584857P513169P215073K104854j663171
7173A2891135q62518Q68654l58109k731593k649315r46345r54907k425932j936011
$$ plain form
7164 895059 1996418 4971153 6122596 4182889 1763723 1427970 2164465 1232457 -1133404
7155 -1133404 -823226 5089439 13240176 16131349 10353982 1144985 -2945191 771020
7147 771020 6974028 8980376 5635918 1435458 1528180 7094886 14222638 16880085 12471985
7138 12471985 5059403 1694640 4966512 10619119 13018949 10877282 6380356 1047492
7130 1047492 -4942756 -10509276 -13643632 -13776764 -12263933 -10338151 -8119049 -5785574
7122 -5785574 -4290807 -4514030 -6488364 -9296073 -10915579 -8906426 -2825347 4279477
7114 4279477 8276784 7783202 4499064 526803 -2797316 -4167503 -3112058 -1603284
7106 -1603284 -2156132 -3812571 -2796063 1859570 6167017 6318030 3523557 1759206 2763671
$$ packed form
7164H95059J101359K974735J151443j939707k419166l35753P36495r32008k365861
7155a133404L10178N912665Q150737K891173n777367r208997m090176L716211
7147G71020O203008K006348l344458m200460R2722N566706P127752K657447m408100
7138A2471985p412582l364763L271872N652607K399830k141667m496926n332864
7130A047492n990248n566520l134356j33132J512831J925782K219102K333475
7122e785574J494767k23223j974334k807709j619506K009153O081079P104824
7114D279477L997307m93582l284138l972261l324119j370187J055445J508774
7106a603284n52848j656439J016508M655633M307447J51013k794473j764351J004465
$$ plain form
7097 2763671 5379976 7922119 8838692 6845040 3135023 1896430 5479686 10227080
7089 10227080 10640979 6998022 4742665 6082885 6625969 2172748 -4883756 -8901251
7081 -8901251 -8302537 -6272636 -5455060 -5353883 -4963087 -4861170 -5410862 -4931880 -1671901
7072 -1671901 3075215 5734571 4691580 2248840 1326837 1516776 429546 -1582680 -979713
7063 -979713 3644140 8448168 8811582 5104736 1312219 -802821 -2887839 -5798637 -7735487
7054 -7735487 -7310348 -5630745 -4259923 -3380879 -2880511 -2996046 -3000153 -1638441 126420
7045 126420 -544186 -3920785 -6409408 -5574087 -3621087 -3398962 -3770514 -2454741 -1230436
7036 -1230436 -3854404 -9597842 -13245306 -11945586 -8439360 -6706957 -7638218 -10023942
$$ packed form
7097B763671K616305K542143R16573j993652l710017j238593L583256M747394
7089A0227080M13899l642957k255357J340220N43084m453221p056504m017495
7081h901251N98714K029901Q17576J01177L90796J01917n49692M78982L259979
7072a671901M747116K659356j042991k442740r22003J89939j087230k012226O02967
7063i79713M623853M804028L63414l706846l792517k115040k085018k910798j936850
7054g735487M25139J679603J370822Q79044N00368j15535m107J361712J764861
7045A26420o70606l376599k488623Q35321J953000K22125l71552J315773J224305
7036a230436k623968n743438l647464J299720L506226J732403r31261k385724
$$ plain form
7028 -10023942 -12712871 -14201351 -12753321 -8930196 -6038121 -6191571 -7703766 -8306026
7020 -8306026 -9041055 -12144723 -16206118 -16887220 -12785028 -7494934 -4454978 -2277312 2324775
7011 2324775 8509706 11672092 10204030 8611791 11723311 17922044 21307737 19800402
7003 19800402 17414314 17634486 17983542 13685380 4741425 -3514165 -6225701 -3101340
6995 -3101340 2830943 8195853 10825188 10423210 8635949 7570783 7755889 7935929 6680977
6986 6680977 3732199 314562 -1359877 100673 3142129 4277855 2476489 1021774
6978 1021774 3239145 7962207 11617550 13296744 14633112 15733861 15069588 13200324
6970 13200324 12569159 12946701 11071332 6319312 3155949 5768169 12931628 20088108
$$ packed form
7028a0023942k688929j488480J448030L823125K892075j53450j512195o02260
7020h306026p35029l103668m061395o81102M102192N290094L039956K177666M602087
7011B324775O184931L162386j468062j592239L111520O198733L385693j507335
7003A9800402k386088K20172L49056m298162q943955q255590k711536L124361
6995c101340N932283N364910K629335m01978j787261j065166J85106J80040j254952
6986F680977k948778l417637j674439J460550L041456J135726j801366j454715
6978A021774K217371M723062L655343J679194J336368J100749o64273j869264
6970A3200324o31165L77542j875369m752020l163363K612220P163459P156480
$$ plain form
6962 20088108 23893155 22916944 17024913 8949896 3905496 4160940 5591466 2900544
6954 2900544 -2966818 -6022600 -3145553 2643565 6837648 8157209 7810106 6655922
6946 6655922 4636679 1837174 -884703 -1902780 469249 6369728 13487652 18505958
6938 18505958 19337196 15683028 8644219 1143136 -2333986 1206601 9897081 17893721
6930 17893721 20265043 16868478 11781877 9351023 10266905 11129591 8532941 3575507
6922 3575507 802100 2341205 5321562 6253314 5527812 5527108 6475666 6935921 6794642 6710519
6912 6710519 5772585 2922900 -85718 -515323 937990 928553 -1322601 -2967962 -2096805
6903 -2096805 -77681 1446830 2828994 4605416 6206882 7625744 9704069 11542670
$$ packed form
6962B0088108L805047r76211n892031q075017n044400K55444J430526k690922
6954B900544n867362l055782K877047N789118M194083J319561l47103j154184
6946F655922k019243k799505k721877j018077K372029N900479P117924N018306
6938A8505958Q31238l654168p038809p501083l477122L540587Q690480P996640
6930A7893721K371322l396565n086601k430854R15882Q62686k596650m957434
6922C575507k773407J539105K980357R31752p25502p04R48558M60255j41279q4123
6912F710519r37934k849685l008618m29605J453313r437k251154j645361Q71157
6903b096805K019124J524511J382164J776422J601466J418862K078325J838601
$$ plain form
6895 11542670 10401897 5873771 1640458 983093 2464697 2147233 -1434824 -6443274
6887 -6443274 -10471875 -12044424 -10358038 -5688041 4691 4158139 5443124 4269396
6879 4269396 2091981 465030 -37213 -115394 -196218 822723 3614790 5856229 4334046
6870 4334046 -219041 -3367433 -2796973 -868860 -250385 -343379 52029 -148688 -1772399
6861 -1772399 -2839032 -1939665 -1818555 -5522066 -10361398 -10191069 -3779109 3038035 4645824
6852 4645824 2019375 22197 307205 -761452 -7084796 -17036785 -23929621 -22858540
6844 -22858540 -16260474 -11154526 -11323792 -14483780 -17020422 -18058674 -17606291 -14388190
6836 -14388190 -8327353 -2480130 493961 1551026 2233699 1443722 -868422 124689 8432307
$$ packed form
6895A1542670j140773m528126m233313o57365J481604l17464l582057n008450
6887f443274m028601j572549J686386M669997N692732M153448J284985j173728
6879D269396k177415j626951n02243p8181q0824J018941K792067K241439j522183
6870D334046m553087l148392N70460J928113O18475r2994L95408k00717j623711
6861a772399j066633Q99367J21110l703511m839332J70329O411960O817144J607789
6852D645824k626449j997178K85008j068657o323344r951989o892836J071081
6844b2858540O598066N105948j69266l159988k536642j038252M52383L218101
6836a4388190O060837N847223K974091J057065O82673p89977k312144R93111Q307618
$$ plain form
6827 8432307 19037773 21813769 14421915 5792981 5087972 11948798 19737124 23780087
6819 23780087 23240680 18647617 11902469 7007624 6963451 10131563 11970362 10173247 6504639
6810 6504639 3916157 3259050 2843338 486647 -4040852 -8576531 -10824515 -10498819 -8453369
6801 -8453369 -4759064 607660 6044315 9699956 12139091 14965773 17042214 15343022
6793 15343022 10109329 5826353 5705248 7947597 9056232 8457946 8086026 9216676 11331901
6784 11331901 12903658 12473884 10156528 8039010 7395517 6351814 3196232 810676
6776 810676 3115401 7439194 6532262 -469871 -5644507 -3760223 448623 967930 -28909
6767 -28909 2090947 4686049 2248043 -2758796 -2660589 2763347 5278792 793154 -5159750
$$ packed form
6827H432307J0605466K775996p391854q628934p05009O860826P788326M042963
6819B3780087n39407m593063o745148m894845m4173L168112J838799j797115l668608
6810F504639k588482o57107m15712k356691m527499m535679k247984L25696K045450
6801h453369L694305N366724N436655L655641K439135K826682K076441j699192
6793A5343022n233693m282976j21105K242349J108635n98286l71920J130650K115225
6784A1331901J571757m29774k317356k117518o43493j043703l155582k385556
6776H10676K304725M323793r06932p002133n174636J884284M208846N19307r96839
6767b8909K119856K595102k438006n006839R8207N423936K515445m485638n952904
$$ plain form
6758 -5159750 -6866338 -6173932 -7153404 -8765143 -7323723 -2625985 2233710 4740494 3985820
6749 3985820 328407 -3556304 -3677274 802777 5847702 6975751 3701131 -1283043
6741 -1283043 -4892375 -4886046 -1528060 829331 -2548592 -9755223 -12726800 -7160670 1709894
6732 1709894 6143902 5083916 2762575 1560563 944639 1336983 4066719 8135228 10939634
6723 10939634 11682023 10804744 7194412 -69549 -7733679 -10366323 -6901512 -1904012
6715 -1904012 243351 -482751 -1783025 -2209348 -1261222 1328651 5102633 8817989 11257676
6706 11257676 11412237 8883515 5651408 5853235 11073145 16982230 17861889 13698538 9339156
6697 9339156 7322773 5770413 3372074 1720568 1473657 566401 -1740600 -2678979 -60893
$$ packed form
6758e159750j706588O92406r79472j611739J441420M697738M859695K506784p54674
6749C985820l657413l884711j20970M480051N044925J128049l274620m984174
6741a283043l609332O329L357986K357391l377923p206631k971577N566130Q870564
6732A709894M434008j059986k321341j202012o15924L92344K729736M068509K804406
6723A0939634P42389q77279l610332p263961p664130k632644L464811M997500
6715a904012K147363p26102j300274m26323R48126K589873L773982L715356K439687
6706A1257676J54561k528722l232107K01827N219910N909085Q79659m163351m359382
6697I339156k016383j552360k398339j651506k46911r07256k307001r38379K618086
$$ plain form
6688 -60893 4463755 8148474 10153025 10125572 7358890 3647155 3293066 7278739 10916640
6679 10916640 10775991 10406935 14652957 21236639 23522263 19920616 14766465 10589917
6671 10589917 5649454 -129624 -2637056 690403 7034257 12569331 16920979 20560716
6663 20560716 21239055 16754504 9394552 4167094 3338842 5152168 7047930 7602516 5792220
6654 5792220 1189272 -4294857 -6700098 -3542076 3096037 7691385 6112627 -265727
6646 -265727 -5592575 -5324176 -594838 4080238 6645577 8984460 12657162 15907343 16289919
6637 16289919 14267099 12259703 11239377 10033766 7417751 3519537 -358336 -2246723
6629 -2246723 -519835 4393495 9741386 12854660 13405295 12648725 11325945 9342696 6819034
$$ packed form
6688f0893M524648L684719K004551k7453k766682l711735l54089L985673L637901
6679A0916640j40649l69056M246022O583682K285624l601647n154151m176548
6671A0589917m940463n779078k507432L327459O343854N535074M351648L639737
6663B0560716O78339m484551p359952n227458q28252J813326J895762N54586j810296
6654E792220m602948n484129k405241L158022O638113M595348j578758o378354
6646b65727n326848K68399M729338M675076K565339K338883L672702L250181L82576
6637A6289919k022820k007396j020326j205611k616015l898214l877873j888387
6629b246723J726888M913330N347891L113274N50635p56570j322780j983249k523662
$$ plain form
6620 6819034 4382961 2796197 2756301 4132718 4898901 2352760 -3450962 -8878886 -10681463
6611 -10681463 -9398647 -7342335 -4955624 -1565707 1587203 2229306 830275 703137
6603 703137 3704465 7774849 9302195 6511568 475825 -5584510 -7938978 -5101968
6595 -5101968 521104 4851117 5981794 4824593 2785590 750845 -197991 513716 1545608
6586 1545608 1164074 126195 690223 2802521 3934739 2847228 614187 -2291581 -6387605
6577 -6387605 -9845552 -8833544 -3286862 1284840 682756 -2219772 -1992106 1358799 2794472
6568 2794472 -520901 -6111061 -10085804 -11051702 -9870031 -7970885 -6537762 -5937769 -5679150
6559 -5679150 -5499825 -5635389 -5305042 -2788873 1396449 3573777 1788557 -275910 2169038
$$ packed form
6620F819034k436073j586764l9896J376417P66183k546141n803722n427924j802577
6611a0681463J282816K056312K386711L389917L152910O42103j399031j27138
6603G03137L001328M070384J527346k790627o035743o060335k354468K837010
6595e101968N623072M330013J130677j157201k039003k034745r48836P11707J031892
6586A545608l81534j037879N64028K112298J132218j087511k233041k905768m096024
6577f387605l457947J012008N546682M571702o02084k902528K27666L350905J435673
6568B794472l315373n590160l974743r65898J181671J899146J433123N99993K58619
6559e679150J79325j35564L30347K516169M185322K177328j785220k064467K444948
$$ plain form
6550 2169038 7636199 9591106 5136002 -1440906 -4713884 -4136549 -2318073 -363352
6542 -363352 2404145 5700837 7833461 7648348 5402701 1949168 -1772717 -4511021 -5033349
6533 -5033349 -3336525 -1407135 -2051637 -6087145 -10805893 -12443619 -10474271 -8049608
6525 -8049608 -7677645 -8352426 -8068136 -7064342 -6683685 -6781472 -6423150 -5560006 -3861382
6516 -3861382 133081 5954112 9435993 7633461 3752630 2981997 4850502 4687547 1879714
6507 1879714 953402 3960277 7405107 8158652 7209924 5721098 2546014 -1816152 -3675252
6498 -3675252 -1602626 870219 929730 391310 773316 -514020 -4676398 -6985688 -3359303
6489 -3359303 2155506 2566157 -2072568 -6001349 -6920851 -7208505 -7289652 -4803305 -492736
$$ packed form
6550B169038N467161J954907m455104o576908l272978N77335J818476J954721
6542c63352K767497L296692K132624j85113k245647l453533l721885k738304n22328
6533e033349J696824J929390o44502m035508m718748j637726J969348K424663
6525h049608L71963o74781K84290J003794L80657r7787L58322Q63144J698624
6516c861382L994463N821031L481881j802532l880831p70633J868505j62955k807833
6507A879714r26312L006875L444830P53545r48728j488826l175084m362166j859100
6498c675252K072626K472845N9511n38420L82006j287336m162378k309290L626385
6489c359303N514809M10651m638725l928781r19502k87654q1147K486347M310569
$$ plain form
6480 -492736 1563231 563476 73308 1373542 1335998 -1475974 -4038817 -4364715 -4663733
6471 -4663733 -6357866 -6674043 -3428297 908871 3388192 5152630 8108892 10332149
6463 10332149 9084595 6012676 4923867 5914014 5896725 4006974 2382996 1891330 967892
6454 967892 -878729 -1816271 -884876 341483 583007 1174286 3901623 7745158 9405453
6445 9405453 6958152 2154656 -1237424 -1383614 -343388 -1436276 -4882882 -7520263
6437 -7520263 -7259600 -5904350 -6124213 -7345209 -6888642 -4143285 -1007985 1401749 3690469
6428 3690469 5547461 5047472 1842168 -1289052 -1938134 -1470576 -2814224 -5918359 -7762017
6419 -7762017 -6536315 -3544942 -771892 1214543 2237975 1594028 -389530 -1548434
$$ packed form
6480d92736K055967r99755m90168J300234l7544k811972k562843l25898k99018
6471d663733j694133l16177L245746M337168K479321J764438K956262K223257
6463A0332149j247554l071919j088809R90147j7289j889751j623978m91666r23438
6454I67892j846621r37542R31395J226359K41524N91279K727337L843535J660295
6445I405453k447301m803496l392080j46190J040226j092888l446606k637381
6437g520263K60663J355250k19863j220996M56567K745357L135300K409734K288720
6428C690469J856992m99989l205304l131220o49082M67558j343648l104135j843658
6419g762017J225702K991373K773050J986435J023432o43947j983558j158904
$$ plain form
6411 -1548434 -406754 1799418 3507003 5760606 9955222 13624368 12340689 6378855
6403 6378855 1749649 2885304 7427380 10459808 10883684 10478825 9123982 5099889 -759731
6394 -759731 -5022297 -5837275 -4417078 -2612228 -1611137 -2419211 -4587840 -5007313 -1406558
6385 -1406558 3268544 3860037 462293 -1444666 946969 4240958 4951299 4314982 4233980
6376 4233980 2983946 -876395 -3745190 -1099997 5352477 9232952 7447662 2612851
6368 2612851 -2058210 -6282190 -10479725 -13238033 -12446893 -7531399 -106069 6562842
6360 6562842 9209020 7164016 2916793 -1021853 -4582415 -7848718 -8238552 -3294108
6352 -3294108 4339792 8309134 5635720 -206787 -3980786 -3912453 -1205662 3069469 8264930
$$ packed form
6411a548434J141680K206172J707585K253603M194616L669146j283679n961834
6403F378855m629206J135655M542076L032428M23876m04859j354843m024093n859620
6394g59731m262566q14978J420197J804850J001091q08074k168629m19473L600755
6385a406558M675102N91493l397744j906959K391635L293989P10341o36317q1002
6376D233980j250034l860341k868795K645193O452474L880475j785290m834811
6368B612851m671061m223980m197535k758308P91140M915494P425330O668911
6360F562842K646178k045004m247223l938646l560562l266303l89834M944444
6352c294108P633900L969342k673414n842507l773999O8333K706791M275131N195461
$$ plain form
6343 8264930 12362968 12331652 7200880 68982 -4132908 -3531131 -1336007 -1831798 -4932264
6334 -4932264 -6834923 -5995925 -5293810 -6986337 -8855109 -8046656 -6105757 -6766214 -10436615
6325 -10436615 -14154189 -15488748 -13270825 -6505243 3057344 8885430 5742220 -2339182
6317 -2339182 -5626998 -1010989 4548902 4240171 -491442 -4566443 -6634597 -7811787
6309 -7811787 -7321206 -4388320 -1931673 -3396837 -7007048 -7439818 -2969015 2529588 4815028
6300 4815028 3754323 2257329 2815690 5429067 7746027 7507991 5649007 5792052 9452110
6291 9452110 13352087 13399133 9921952 6837311 6910500 10027490 14556745 17519706 14911289
6282 14911289 5870965 -3696360 -5767691 521869 7588290 8708115 5499396 4136900
$$ packed form
6343H264930M098038l1316n130772p131898m201890O01777K195124m95791l100466
6334d932264j902659Q38998P02115j692527j868772Q08453J940899o60457l670401
6325a0436615l717574j334559K217923O765582R562587N828086l143210q081402
6317b339182l287816M616009N559891l08731m731613m075001k068154j177190
6309g811787M90581K932886K456647j465164l610211m32770M470803N498603K285440
6300D815028j060705j496994N58361K613377K316960k38036j858984J43045L660058
6291I452110L899977M7046l477181l084641P3189L116990M529255K962961k608417
6282A4911289r040324r567325k071331O289560P066421J119825l208719j362496
$$ plain form
6274 4136900 6802634 9820624 9024645 4206942 -1663737 -5678182 -7061955 -7138703 -7623140
6265 -7623140 -8707350 -9212270 -8844284 -9144057 -11107725 -12853355 -11431983 -6651310 -1139428
6256 -1139428 3597367 8848316 15184511 19546923 18644600 14402097 12769908 16476453
6248 16476453 21716155 23341217 20846297 17315408 14858427 13957904 15435945 19157635
6240 19157635 21401351 17733282 9313249 2770465 2411319 5672902 7998948 9039641
6232 9039641 11278753 14880732 17330700 17315584 16063357 14880536 13422539 10582042 5837196
6223 5837196 -163105 -5539385 -8317922 -8477457 -8071038 -8515154 -8799862 -7242748 -3765962
6214 -3765962 536094 4691246 7674372 8595312 8379984 9592798 13130827 16755404 18207731
$$ packed form
6274D136900K665734L017990p95979m817703n870679m014445j383773p6748m84437
6265g623140j084210n04920L67986k99773j963668j745630J421372M780673N511882
6256a139428M736795N250949O336195M362412r02323m242503j632189L706545
6248A6476453N239702J625062k494920l530889k456981r00523J478041L721690
6240A9157635K243716l668069q420033o542784l59146L261583K326046J040693
6232I039641K239112L601979K449968j5116j252227j182821j457997k840497m744846
6223E837196o000301n376280k778537j59535M06419m44116k84708J557114L476786
6214c765962M302056M155152K983126R20940k15328J212814L538029L624577J452327
$$ plain form
6205 18207731 17630609 15440095 10788067 4695695 1655161 4391716 9378515 11647462
6197 11647462 11938761 14274943 18107029 18643612 14634525 10017580 7212056 4454888
6189 4454888 1181351 361682 2940781 4958862 3438743 954982 960268 2451711 3190321
6180 3190321 4796030 9913482 16421917 19144015 16464297 11527088 7595632 5586784
6172 5586784 5480611 6663277 6951999 4294691 -362635 -4191753 -6166023 -7276966 -7620456
6163 -7620456 -6150010 -3305314 -987545 531609 2951383 6348454 7751933 4748127
6155 4748127 -1223235 -6575625 -9310627 -9731044 -8456247 -5424933 -912229 3612007
6147 3612007 6359879 6815272 5914746 4446147 1984963 -1741816 -5166255 -6265889 -5489686
$$ packed form
6205A8207731n77122k190514m652028o092372l040534K736555M986799K268947
6197A1647462K91299K336182L832086N36583m009087m616945k805524k757168
6189D454888l273537q19669K579099K018081j520119k483761N286J491443P38610
6180C190321J605709N117452O508435K722098k679718m937209l931456k008848
6172E586784j06173J182666K88722k657308m657326l829118j974270j110943l43490
6163g620456J470446K844696K317769J519154K419774L397071J403479l003806
6155D748127n971362n352390k735002m20417J274797L031314M512704M524236
6147C612007K747872M55393r00526j468599k461184l726779l424439j099634P76203
$$ plain form
6138 -5489686 -5183293 -5765717 -5018947 -2136401 499791 1551258 3678476 8996127 14002379
6129 14002379 13454246 8244904 4759135 6263161 9514782 11074034 12472049 16392597
6121 16392597 20999684 21663938 16969422 10073660 4595123 1404629 -561676 -2038649
6113 -2038649 -2443268 -559163 3690363 7999362 9130927 6321176 2448750 987778
6105 987778 2449325 4643999 5760508 6046108 6610630 7481903 7156239 4073723 -1133350
6096 -1133350 -4959185 -3674289 2486114 8335358 8124223 1356580 -6170625 -7621402
6088 -7621402 -1580777 6893145 11738158 11740088 10093773 9015922 7338094 4194306 2119153
6079 2119153 3663106 6694694 6795228 3944733 2882938 5875795 8816868 6845621
$$ packed form
6138e489686L06393n82424P46770K882546K636192J051467K127218N317651N006252
6129A4002379n48133n209342l485769J504026L251621J559252J398015L920548
6121A6392597M607087O64254m694516o895762n478537l190494j966305j476973
6113b038649m04619J884105M249526M308999J131565k809751l872426j460972
6105I87778J461547K194674J116509K85600N64522Q71273l25664l082516n207073
6096a133350l825835J284896O160403N849244k11135o767643p527205j450777
6088g621402O040625Q473922M845013J930j646315j077851j677828l143788k075153
6079B119153J543953L031588J00534k850495j061795K992857K941073j971247
$$ plain form
6071 6845621 1301124 -1808802 886377 6809718 11008128 11134963 8895151 7771709
6063 7771709 9388254 11707422 11411930 8251353 5531187 5467950 5930808 3622926 -925107
6054 -925107 -3975595 -3525681 -1045372 1711260 4884594 8407446 9908930 6756976 -552700
6045 -552700 -8675331 -14839815 -18617718 -20412801 -20126235 -18446453 -17936285 -20487054 -23835363
6036 -23835363 -23173248 -17334886 -11148030 -9543945 -10947583 -9364096 -2382619 5954225
6028 5954225 10537049 10663765 9298798 9267829 11380882 14462436 16080427 14686044 11711557
6019 11711557 9967097 9674123 8278742 4580406 278135 -3371620 -7262693 -11486694
6011 -11486694 -14051938 -14352675 -14297583 -13710183 -8918716 360117 6994347 4795267 -1991456
$$ packed form
6071F845621n544497l109926K695179N923341M198410J26835k239812j123442
6063G771709J616545K319168k95492l160577k720166o3237M62858k307882m548033
6054i25107l050488M49914K480309K756632L173334L522852J501484l151954p309676
6045e52700q122631o164484l777903j795083K86566J679782N10168k550769l348309
6036b3835363O62115N838362O186856J604085j403638J583487O981477Q336844
6028E954225M582824J26716j364967l0969K113053L081554J617991j394383k974487
6019A1711557j744460k92974j395381l698336m302271l649755l891073m224001
6011a1486694k565244l00737N5092N87400M791467R278833O634230k199080o786723
$$ plain form
6002 -1991456 -3745921 1656210 7511558 9018348 8215187 7454880 5205154 1124494 -855063
5993 -855063 1407210 3692925 1352533 -3395730 -4420846 61860 5919464 8518455
5985 8518455 6736764 2612297 -579874 -766348 746491 754689 -1174237 -1864338 168499
5976 168499 1701373 -207763 -2991412 -1870949 3472823 9010872 11698897 11292280 8198559
5967 8198559 3326990 -647911 -1667555 -1801919 -4899888 -10544779 -13626933 -10604727
5959 -10604727 -3612717 2151941 2938893 -1635495 -8592226 -13222915 -13048775 -10424898
5951 -10424898 -9320356 -10139052 -10411772 -9789043 -10377192 -11835546 -10433167 -4627605 1868322
5942 1868322 4541332 2777623 -1560916 -7074791 -11927140 -12921369 -8817092 -2954999
$$ packed form
6002a991456j754465N402131N855348J506790q03161p60307k249726m080660j979557
5993h55063K262273K285715k340392m748263j025116M482706N857604K598991
5985H518455j781691m124467l192171j86474J512839Q198j928926o90101K032837
5976A68499J532874j909136k783649J120463N343772N538049K688025m06617l093721
5967H198559m871569l974901j019644j34364l097969n644891l082154L022206
5959a0604727O992010N764658P86952m574388o956731m630689J74140K623877
5951a0424898J104542q18696k72720O22729n88149j458354J402379N805562O495927
5942A868322K673010j763709m338539n513875m852349r94229M104277N862093
$$ plain form
5934 -2954999 404342 1248150 2628715 5309120 6624727 4691959 1258057 -307153
5926 -307153 1586054 5750067 9610896 11322987 11015116 9891087 8114407 4612665 -534561
5917 -534561 -4848699 -5710781 -2981571 1514533 5963895 8877387 8698130 4904400 -858941
5908 -858941 -5989098 -9001836 -9785751 -8701870 -6357056 -3444687 -136726 3212553 4439193
5899 4439193 1119917 -4765267 -6597163 -669557 7958172 10964730 7100582 2900325
5891 2900325 3364125 6606551 8889223 10289801 12425890 13941293 12222942 8123908
5883 8123908 5387465 5722554 7351009 8475730 9413324 10481316 10124198 6867600 2050470
5874 2050470 -1035940 -625421 1851582 3551118 2927036 556037 -2042268 -3906203 -5144959
$$ packed form
5934b954999L359341Q43808J380565K680405J315607j932768l433902j565210
5926c07153J893207M164013L860829J712091l07871j124029j776680l501742n147226
5917e34561m314138q62082K729210M496104M449362K913492j79257l793730n763341
5908h58941n130157l012738p83915J083881K344814K912369L307961L349279J226640
5899D439193l319276n885184j831896N927606Q627729L006558l864148m200257
5891B900325M63800L242426K282672J400578K136089J515403j718351m099034
5883H123908k736443L35089J628455J124721R37594J067992l57118l256598m817130
5874B050470l086410M10519K477003J699536o24082k370999k598305j863935j238756
$$ plain form
5865 -5144959 -6268779 -7003921 -5927595 -1939079 3630688 7350720 7261795 5589272 6324183
5856 6324183 10061713 12988864 11651742 7097729 3173318 2091088 3044062 3979091 3080001
5847 3080001 -487251 -5326414 -7954341 -6318412 -2928276 -2374868 -5664929 -9028240
5839 -9028240 -8548366 -3932037 2596251 8692861 12215884 11552898 7498409 3337749 1314559
5830 1314559 142403 -2354508 -5406135 -6363127 -4908485 -3515093 -3336062 -2226831 1582153
5821 1582153 5657112 5707717 1446346 -2370748 -1710119 1889336 4088152 3994469 4772447
5812 4772447 8128928 11517560 12333185 12083481 13760530 16884973 18204240 16354625 12827319
5803 12827319 8859086 4480965 508023 -1735822 -2939602 -4929981 -7016786 -6788849
$$ packed form
5865e144959j123820p35142J076326L988516N569767L720032q8925j672523P34911
5856F324183L737530K927151j337122m554013l924411j082230R52974R35029q99090
5847C080001l567252m839163k627927J635929L390136N53408l290061l363311
5839i028240M79874M616329O528288O096610L523023o62986m054489m160660k023190
5830A314559j172156k496911l051627r56992J454642J393392J79031J109231L808984
5821A582153M074959N0605m261371l817094O60629L599455K198816r3683P77978
5812D772447L356481L388632Q15625k49704J677049L124443J319267j849615l527306
5803A2827319l968233m378121l972942k243845j203780j990379k086805K27937
$$ plain form
5795 -6788849 -5133886 -6131654 -10267846 -12336490 -9165583 -5208180 -5979333 -9096761 -7314100
5786 -7314100 1073857 10330333 15424839 16855673 16751124 15255946 12751050 11550227
5778 11550227 12600064 13194796 10657767 6590513 5202589 8404430 14001425 17772721
5770 17772721 16438130 9935522 1779927 -3957257 -6514033 -7910386 -8835745 -8014463
5762 -8014463 -6298809 -7484172 -12530612 -16250477 -13457994 -6340426 -1721747 -2216815
5754 -2216815 -4207935 -4062433 -2052610 225727 2042459 1910776 -2189806 -8809594 -12636042
5745 -12636042 -10837724 -7044179 -5873490 -5885419 -2044793 5986858 12505527 13171404 9970594
5736 9970594 7399515 6773796 6439092 5493643 4748346 4830491 5355941 5737215 5470441 3967705
$$ packed form
5795f788849J654963r97768m136192k068644L170907L957403p71153l117428J782661
5786g314100Q387957R256476N094506J430834j04549j495178k504896j200823
5778A1550227J049837N94732k537029m067254j387924L201841N596995L771296
5770A7772721j334591o502608q155595n737184k556776j396353r25359Q21282
5762h014463J715654j185363n046440l719865K792483P117568M618679m95068
5754b216815j991120J45502K009823K278337J816732j31683m100582o619788l826448
5745a2636042J798318L793545J170689j1929L840626Q031651O518669O65877l200810
5736I970594k571079o25719l34704r45449p45297Q2145N25450L81274k66774j502736
$$ plain form
5726 3967705 1320730 -1088735 -1911662 -1529519 -1347549 -1696367 -1734173 -1368856 -1845124
5717 -1845124 -3992352 -6978339 -9328258 -10293520 -9657434 -7060612 -2470973 2947148 7196563
5708 7196563 8857337 7992336 5747993 3190871 520262 -2504530 -5390970 -6708557
5700 -6708557 -5562728 -2896884 -666232 16188 -673016 -2007643 -2736662 -1036165 3477797
5691 3477797 7432476 5793652 -2047610 -9677224 -9287216 198004 11975888 18270682
5683 18270682 17144650 12375192 8135595 5156599 1962672 -1487366 -2847301 -396409
5675 -396409 4148022 7107958 6763304 4440849 1850894 -837754 -3665419 -5414149 -4906733
5666 -4906733 -2798343 -680948 1097870 3582837 7450344 11901594 15088927 15334550
$$ packed form
5726C967705k646975k409465q22927L82143J81970l48818l7806L65317m76268
5717a845124k147228k985987k349919r65262O36086K596822M589639N418121M249415
5708G196563J660774q65001k244343k557122k670609l024792k886440j317587
5700f708557J145829K665844K230652O82420o89204j334627p29019J700497M513962
5691C477797L954679j638824p841262p629614L90008R485220J1777884O294794
5683A8270682j126032m769458m239597k978996l193927l450038j359935K450892
5675c96409M544431K959936l44654k322455k589955k688648k827665j748730N07416
5666d906733K108390K117395J778818K484967L867507M451250L187333K45623
$$ plain form
5658 15334550 12664259 9512658 8812737 10732149 12500841 12209327 11180338 11320050 11869624
5649 11869624 10834295 8348187 6191311 4743835 3022536 1471980 2045197 5106763
5641 5106763 8521447 10505551 11540153 12754770 14016192 14401363 13436871 11484522 9868118
5632 9868118 10306365 12616542 13407950 9453556 2472602 -2186242 -2322310 -1395702 -2861665
5623 -2861665 -5054225 -4333787 -1036743 1159988 860987 573356 2562959 5879127 8303927
5614 8303927 9183618 9314414 9571979 10721478 13358838 16829151 19044110 18631747 16712796
5605 16712796 15148463 13322131 8595242 750236 -5774935 -6096987 -836992 4161769
5597 4161769 4313428 669149 -2685305 -3481151 -2134294 371888 3231434 5271130 5691659
$$ packed form
5658A5334550k670291l151601o99921J919412J768692k91514j028989J39712N49574
5649A1869624j035329k486108k156876j447476j721299j550556N73217L061566
5641E106763L414684J984104J034602J214617J261422L85171r64492j952349j616404
5632I868118M38247K310177P91408l954394o980954m658844j36068R26608j465963
5623b861665k192560P20438L297044K196731k99001k87631J989603L316168K424800
5614H303927Q79691J30796K57565J149499K637360L470313K214959m12363j918951
5605A6712796j564333j826332m726889p845006o525171l22052N259995M998761
5597D161769J51659l644279l354454p95846J346857K506182K859546K039696M20529
$$ plain form
5588 5691659 5053615 4145514 2675562 705191 259307 3107979 7492844 9522327 7627770
5579 7627770 3428518 -1284050 -5685712 -8491905 -8794820 -8597744 -11028086 -15222521 -16453291
5570 -16453291 -12591434 -7091280 -4015653 -3442743 -3591287 -3872738 -3326620 363718 6810739
5561 6810739 10795529 8199817 2056590 -1234778 -161749 1376126 566526 -1480788
5553 -1480788 -2923103 -3218588 -1820592 1659227 5490546 6873532 5301540 2525960
5545 2525960 -515797 -3988534 -6829576 -7420595 -6571296 -6521657 -6845368 -4873006 -577372
5536 -577372 2775592 3729703 4443363 5914204 5408912 1108385 -4052507 -6121599 -5109379
5527 -5109379 -3412144 -1760024 -27455 -9623 -3441397 -8083290 -9392289 -6035989 -829086
$$ packed form
5588E691659o38044r08101j469952j970371m45884K848672M384865K029483j894557
5579G627770m199252m712568m401662k806193l02915J97076k430342m194435j230770
5570a6453291L861857N500154L075627N72910j48544k81451N46118L690338O447021
5561F810739L984790k595712o143227l291368J073029J537875q09600k047314
5553a480788j442315k95485J397996L479819L831319J382986j571992k775580
5545B525960l041757l472737k841042n91019Q49299M9639l23711J972362M295634
5536e77372L352964R54111P13660J470841n05292m300527n160892k069092J012220
5527e109379J697235J652120J732569J7832l431774m641893j308999L356300N206903
$$ plain form
5518 -829086 3703734 7665787 11407316 13994827 15348951 17371912 21035436 23948694
5510 23948694 22846814 17752573 11949725 8178027 6455920 5673554 5620398 6546504 7843180
5501 7843180 8535202 8793216 9698882 11371987 12542227 12517001 12395572 13207142 13634015
5492 13634015 11197851 5813853 839405 -120984 3050548 6815206 7219886 3251897
5484 3251897 -2448327 -5809147 -4547161 202862 4887517 5978745 2159695 -4649742
5476 -4649742 -10126464 -10446890 -5209398 2715691 10136430 15450852 17891404 16920417 13416753
5467 13416753 9882873 8085110 7562914 7398979 7756142 8272831 7034116 3520514 905906
5458 905906 2413490 6340892 7875449 5511257 2545757 2044802 3297562 3973977 3328590
$$ packed form
5518h29086M532820L962053L741529K587511J354124K022961L663524K913258
5510B3948694j101880n094241n802848l771698j722107p82366n3156R26106J296676
5501G843180O92022K58014R05666J673105J170240k5226j21429Q11570M26873
5492A3634015k436164n383998m974448r60389L171532L764658M04680l967989
5484C251897n700224l360820J261986M750023M684655J091228l819050o809437
5476d649742n476722l20426N237492P925089P420739N314422K440552r70987l503664
5467A3416753l533880j797763n22196j63935L57163N16689j238715l513602k614608
5458I05906J507584L927402J534557k364192k965500n00955J252760O76415o45387
$$ plain form
5449 3328590 2309349 2204313 3743039 6272795 8052953 8722207 10284926 13353036 14056433
5440 14056433 8573545 -45232 -4256008 -1581457 2926613 4757999 5282079 6767913
5432 6767913 7266868 4557237 1527728 2908428 8547558 13956675 16223084 15795710 13470553
5423 13470553 9288043 4344765 873589 179810 1957571 5033393 7492518 7491238 5721228
5414 5721228 5419456 7742491 8941624 5033781 -2174973 -7155351 -7936821 -7615210 -8513441
5405 -8513441 -8636826 -5525432 -1061883 -110306 -4905006 -12095755 -15728540 -13197050 -8037592
5396 -8037592 -6094715 -8952964 -12492838 -12228622 -8277005 -4274929 -3353121 -6333237 -11841250
5387 -11841250 -16662515 -17901266 -16319502 -15477967 -16206276 -14912285 -9633069 -4383830
$$ packed form
5449C328590j019241j05036J538726K529756J780158O69254J562719L068110P03397
5440A4056433n482888q618777m210776K674551M508070J831386N24080J485834
5432F767913M98955k709631l029509J380700N639130N409117K266409m27374k325157
5423A3470553m182510m943278l471176o93779J777761L075822K459125j280j770010
5414E721228l01772K323035J199133l907843p208754m980378p81470L21611q98231
5405h513441j23385L111394M463549R51577m794700p190749l632785K531490N159458
5396h037592J942877k858249l539874K64216L951617M002076R21808k980116n508013
5387a1841250m821265j238751J581764Q41535p28309J293991N279216N249239
$$ plain form
5379 -4383830 -3886673 -6768439 -8371280 -8165951 -9292343 -11876246 -12198814 -8712513 -4210835
5370 -4210835 -1412272 -516889 -1623955 -5194157 -9091351 -9451035 -6132124 -3540400 -4246046
5361 -4246046 -5341051 -3214662 1379192 5473840 8142617 9728744 9206446 5677911
5353 5677911 1368094 66290 2542222 5388707 4618191 -561189 -7396403 -12250522
5345 -12250522 -13620120 -12728521 -11225021 -9076436 -5404096 -335637 5286872 10963196
5337 10963196 15662156 17271141 15307601 12945510 13324529 14750351 13044862 8085809
5329 8085809 4004162 2878061 2600742 1827717 2655829 6662017 11982045 16173388 18724544
5320 18724544 19225844 16705060 12637078 10848217 12138895 12688485 10340389 8523077
$$ packed form
5379d383830M97157k881766j602841K05329j126392k583903l22568L486301M501678
5370d210835K798563Q95383j107066l570202l897194l59684L318911K591724p05646
5361d246046j095005K126389M593854M094648K668777J586127n22298l528535
5353E677911m309817j301804K475932K846485p70516n179380o835214m854119
5345a2250522j369598Q91599J503500K148585L672340N068459N622509N676324
5337A0963196M698960J608985j963540k362091L79019J425822j705489m959053
5329H085809m081647j126101k77319p73025Q28112M006188N320028M191343K551156
5320A8724544N01300k520784m067982j788861J290678N49590k348096j817312
$$ plain form
5312 8523077 10584511 14013878 14574688 13105886 13261558 14557107 13018173 8105473 4030138
5303 4030138 3572542 4430653 2770225 -2279054 -8468185 -12720971 -13113919 -10251660 -6964076
5294 -6964076 -5494820 -5305761 -4682132 -3462578 -2585790 -1959807 -674207 1423681 4074672
5285 4074672 7625710 11890861 14871175 14511549 11142323 6758160 2887258 545658
5277 545658 725950 2997562 5085068 5864955 7154082 10230762 12461021 10451522 5178378
5268 5178378 669345 -1470096 -2827525 -4080207 -3611464 -355279 4736844 10014085
5260 10014085 13548295 13020361 8211453 3020971 1662202 3125169 2832509 -400431
5252 -400431 -2852432 -1611231 2050445 5711314 8380237 8947928 5943995 680045 -2645416
$$ packed form
5312H523077K061434L429367N60810j468802J55672J295549j538934m912700m075335
5303D030138m57596Q58111j660428n049279o189131m252786l92948K862259L287584
5294f964076J469256J89059O23629J219554Q76788O25983J285600K097888K650991
5285D074672L551038M265151K980314l59626l369226m384163l870902k341600
5277E45658J80292K271612K087506P79887J289127L076680K230259k009499n273144
5268E178378m509033k139441j357429j252682M68743L256185N092123N277241
5260A0014085L534210n27934m808908n190482j358769J462967k92660l232940
5252d00431k452001J241201L661676L660869K668923N67691l003933n263950l325461
$$ plain form
5243 -2645416 -1974853 289811 1689124 3204411 6027579 7999247 6622475 3526512
5235 3526512 2369891 3413569 3569992 1564806 -48429 1287612 4455669 5971427
5227 5971427 4046634 546741 -911187 1391859 5489963 7632781 5806004 1152004
5219 1152004 -3545965 -6032408 -5790482 -4263118 -3622471 -4372791 -4838781 -4156083 -4306576
5210 -4306576 -6737255 -8136008 -3367204 7013856 15843121 17307759 12818780 7515514
5202 7515514 4123582 2465804 2060325 2023423 284256 -3928204 -7942309 -8743689 -7179989
5193 -7179989 -6264028 -6199661 -4418375 -556257 1866615 -127571 -4959298 -8030750 -6078216
5184 -6078216 362509 7346301 10030975 6563618 329328 -2978451 -1263429 2244730
$$ packed form
5243b645416O70563K264664J399313J515287K823168J971668j376772l095963
5235C526512j156621J043678J56423k005186j613235J336041L168057J515758
5227E971427j924793l499893j457928K303046M098104K142818j826777m654000
5219A152004m697969k486443K41926J527364O40647p50320m65990O82698j50493
5210d306576k430679j398753M768804J0381060Q829265J464638m488979n303266
5202G515514l391932j657778m05479l6902j739167m212460m014105q01380J563700
5193g179989R15961O4367J781286L862118K422872j994186m831727l071452J952534
5184f078216O440725O983792K684674l467357o234290l307779J715022L508159
$$ plain form
5176 2244730 3676253 3000829 2436901 2377440 1638426 906833 2587692 6567960 9184406
5167 9184406 8132569 5918215 6023256 7731911 7989806 6880818 7098106 8462213 7794601
5158 7794601 5074319 4549356 7314870 7812708 1880159 -5731598 -7217184 -2449735 1934328
5149 1934328 2601171 2381654 3258077 2857133 -525815 -4614784 -6903693 -7519102 -6697696
5140 -6697696 -3731720 -350959 -788026 -5932579 -11216064 -12750501 -11807733 -10839006 -9327245
5131 -9327245 -6631545 -4587224 -3524346 18469 7118068 12153948 10164179 4974330
5123 4974330 3656658 5670788 4734650 -161408 -3601006 -3602650 -4560263 -8556020 -11253596
5114 -11253596 -9761447 -8076344 -10231326 -13244252 -12029786 -7432624 -3938459 -2127222
$$ packed form
5176B244730J431523o75424n63928n9461p39014p31593J680859L980268K616446
5167I184406j051837k214354J05041J708655K57895j108988K17288J364107o67612
5158G794601k720282n24963K765514M97838n932549p611757j485586M767449M384063
5149A934328O66843k19517Q76423m00944l382948m088969k288909o15409Q21406
5140f697696K965976L380761m37067n144553n283485j534437R42768R68727J511761
5131i327245K695700K044321J062878L542815P099599N035880j989769n189849
5123D974330j317672K014130r36138m896058l439598j644r57613l995757k697576
5114a1253596J492149J685103k154982l012926J214466M597162L494165J811237
$$ plain form
5106 -2127222 924294 5166883 7205746 6496913 6811362 10014690 12334623 9298408 2077183
5097 2077183 -3651820 -4324062 -1974112 -1034450 -3020279 -5342654 -5171071 -3219299 -2523903
5088 -2523903 -4094557 -5852058 -6292721 -6762998 -8443988 -9305384 -7011667 -3678150 -4072273
5079 -4072273 -8856908 -13254483 -13837948 -13238206 -15356995 -18610989 -18126143 -13640215 -10399609
5070 -10399609 -11129708 -11640522 -7516616 -1865711 -1685065 -7614409 -12310049 -9941548 -2894089
5061 -2894089 3235881 7359905 11626971 14992137 13482928 7116854 1803620 2295241
5053 2295241 6489695 9199433 8985434 8104492 7405143 5172812 933295 -3120378 -5388480
5044 -5388480 -6628945 -7157209 -5137218 78060 5159817 6387956 4758885 4283008 5706430
$$ packed form
5106b127222L051516M242589K038863p08833L14449L203328K319933l036215p221225
5097B077183n729003o72242K349950R39662j985829k322375J71583J951772O95396
5088b523903j570654j757501m40663m70277j680990q61396K293717L333517l94123
5079d072273m784635m397575n83465N99742k118789l253994M84846M485928L240606
5070a0399609p30099n10814M123906N650905J80646n929344m695640K368501P047459
5061b894089O129970M124024M267066L365166j509209o366074n313234M91621
5053B295241M194454K709738k13999q80942o99349k232331m239517m053673k268102
5044e388480j240465n28264K019991N215278N081757J228139j629071m75877J423422
$$ plain form
5035 5706430 5361036 642893 -6597877 -13036074 -17086435 -17842076 -14318231 -8297350 -4894500
5026 -4894500 -6726654 -9551690 -7618398 -1984677 945746 -1167762 -3436911 -1119258
5018 -1119258 4089572 7423962 7482730 6448154 6062032 6461713 7891849 10524688 12538981
5009 12538981 10867738 4891894 -1964009 -5638287 -6081034 -7126290 -11043565 -14507378
5001 -14507378 -12203709 -4451731 1598229 -51623 -7352768 -13416588 -14427838 -11595476
4993 -11595476 -7393807 -3796739 -3001909 -5534830 -7896630 -6133988 -1609783 815988
4985 815988 -24008 -1018827 -1261503 -3331605 -7142464 -8753994 -7603279 -8792133 -14705592
4976 -14705592 -19943126 -18884147 -13381062 -8289907 -4143718 186556 1864821 -2072881
$$ packed form
5035E706430l45394m718143p240770o438197m050361p55641L523845O020881L402850
5026d894500j832154k825036J933292N633721K930423k113508k269149K317653
5018a119258N208830L334390N8768j034576l86122L99681J430136K632839K014293
5009A2538981j671243n975844o855903l674278m42747j045256l917275l463813
5001a4507378K303669P751978O049960j649852p301145o063820j011250K832362
4993a1595476M201669L597068P94830k532921k361800J762642M524205K425771
4985H15988q39996r94819k42676k070102l810859j611530J150715j188854n913459
4976a4705592n237534J058979N503085N091155M146189M330274J678265l937702
$$ plain form
4968 -2072881 -7926719 -9199995 -5917091 -3863100 -5398298 -7254017 -7437951 -8179164 -10695510
4959 -10695510 -12172524 -10130023 -6277825 -4031826 -4459258 -5996960 -6615764 -5525902
4951 -5525902 -3573377 -1807319 487553 4595178 8829081 9395769 6141943 3374067
4943 3374067 2631391 -368250 -7593521 -12725961 -9301663 -729695 4631294 5078933 4782258
4934 4782258 4258538 488072 -4555220 -4694569 203447 2929266 -367120 -5325081 -7064774
4925 -7064774 -5960434 -3659625 137058 4302788 5429856 2994177 526637 -176891
4917 -176891 -969255 -2028386 -270978 4793390 8806302 8406324 4968296 1161681 -1746737
4908 -1746737 -2554178 -1126081 -919060 -4844220 -8868074 -6538997 128856 2090981 -3693772
$$ packed form
4968b072881n853838j273276L282904K053991j535198j855719j83934p41213k516346
4959a0695510j477014K042501L852198K245999m27432j537702o18804J089862
4951e525902J952525J766058K294872M107625M233903N66688l253826k767876
4943C374067p42676k999641p225271n132440L424298Q571968N360989M47639k96675
4934D782258n23720l770466n043292j39349M898016K725819l296386m957961j739693
4925g064774J104340K300809L796683M165730J127068k435679k467540p03528
4917a76891p92364j059131J757408N064368M012912l99978l438028l806615k908418
4908a746737q07441J428097K07021l925160m023854K329077O667853J962125n784753
$$ plain form
4899 -3693772 -10724149 -13438630 -12804304 -10389144 -6120262 -3569424 -7701271 -15178832
4891 -15178832 -16762227 -11271477 -6594312 -5573488 -3625156 -2013485 -8094873 -18901184
4883 -18901184 -21651011 -15777601 -15429661 -23470882 -25594586 -20181730 -27022009 -50403699
4875 -50403699 -65437016 -68685585 -108575141 -217542288 -333254599 -347289589 -237231291
4868 -237231291 -97975872 -25919050 -19525907 -19620680 -2512382 10240711 7435436 4599548
4860 4599548 10133700 13290981 9380650 8902164 16309293 21712550 19526798 17429161
4852 17429161 20843060 23546722 19825632 13548384 9318035 5114310 -602304 -3408598
4844 -3408598 -212982 5047025 8028046 10385860 14882737 18973517 18059319 12227466
$$ packed form
4899c693772p030377k714481O34326K415160M268882K550838m131847p477561
4891a5178832j583395N490750M677165J020824J948332J611671o081388j0806311
4883a8901184k749827N873410L47940q041221k123704N412856o840279k3381690
4875e0403699j5033317l248569l9889556j08967147j15712311j4034990J10058298
4868b37231291J39255419P2056822O393143r4773J7108298J2753093k805275k835888
4860D599548N534152L157281l910331m78486P407129N403257k185752k097637
4852A7429161L413899K703662l721090o277248m230349m203725n716614k806294
4844c408598L195616N260007K981021K357814M496877M090780r14198n831853
$$ plain form
4836 12227466 6048191 3198585 3404195 3625759 1330031 -2703621 -5143723 -4311665 -2082706
4827 -2082706 -791262 -1117349 -4396936 -12591865 -22816856 -26634923 -19790418 -9024919
4819 -9024919 -3983338 -5671070 -8381152 -9389309 -9988379 -9746502 -7195737 -4680784 -5540705
4810 -5540705 -7740117 -7025924 -4774545 -5248067 -6560365 -3059427 3593903 5087073 -311233
4801 -311233 -4149954 -397162 6410074 9567163 9736958 11328547 14851253 17724065 18783088
4792 18783088 18084837 15525698 12517901 11546274 11829697 9565302 4695529 2491716 5355805
4783 5355805 8151525 5851089 1319802 555514 3724824 6234614 6279888 6085997 7015349
4774 7015349 8168246 9181784 10303578 9979027 6080991 -248585 -5039900 -6175788
$$ packed form
4836A2227466o179275k849606K05610K21564k295728m033652k440102Q32058K228959
4827b082706J291444l26087l279587q194929j0224991l818067O844505J0765499
4819i024919N041581j687732k710082j008157n99070K41877K550765K514953q59921
4810e540705k199412P14193K251379m73522j312298L500938O653330J493170n398306
4801c11233l838721L752792O807236L157089J69795J591589L522706K872812J059023
4792A8783088o98251k559139l007797r71627K83423k264395m869773k203813K864089
4783E355805K795720k300436m531287p64288L169310K509790M5274j93891R29352
4774G015349J152897J013538J121794l24551l898036o329576m791315j135888
$$ plain form
4766 -6175788 -5068364 -3108603 1061033 8920280 17573031 20060886 11968517 -2361338
4758 -2361338 -12549311 -12760246 -7575080 -4900941 -5562522 -4449929 -353007 1842316
4750 1842316 -349273 -2742826 -1544908 747948 366404 -1322452 -1038106 157567 -1155074
4741 -1155074 -4476710 -5689792 -2715826 2637553 7519298 9754470 8020601 3411900
4733 3411900 -155654 200805 3121252 5844078 8351665 11783427 14607401 14068981 10608632
4724 10608632 7619908 7207230 8426115 8692983 5048375 -3754378 -13616360 -16134949
4716 -16134949 -7350806 6227874 14349997 14091893 9959888 5160518 -1030278 -7625645
4708 -7625645 -10366699 -7811184 -4138877 -3582025 -5523765 -6753003 -5437259 -1667585
$$ packed form
4766f175788J107424J959761M169636P859247Q652751K487855q092369j4329855
4758b361338j0187973k10935N185166K674139o61581J112593M096922K195323
4750A842316k191589k393553J197918K292856l81544j688856K84346J195673j312641
4741a155074l321636j213082K973966N353379M881745K235172j733869m608701
4733C411900l567554L56459K920447K722826K507587L431762K823974n38420l460349
4724A0608632k988724m12678J218885K66868l644608q802753r861982k518589
4716a6134949Q784143J3578680Q122123k58104m132005m799370o190796o595367
4708g625645k741054K555515L672307N56852j941740j229238J315744L769674
$$ plain form
4700 -1667585 2860437 4926759 2786342 -582687 -971221 497230 -545894 -2819431
4692 -2819431 377168 9478706 14538657 8038540 -3976932 -9998924 -7820686 -3920830
4684 -3920830 -1438295 2445071 7731066 8987011 3878240 -2275924 -3768728 -1540320
4676 -1540320 224031 473876 676690 782766 -415141 -2370696 -3116380 -1611221 2034223
4667 2034223 7239042 12109839 13705347 11399689 8554229 8547364 10497235 11445587 11387337
4658 11387337 12721428 15204046 15319671 11640570 7487416 6263340 6592611 4801525
4650 4801525 881978 -1183605 715652 3348905 2145953 -2786398 -6770658 -6496760
4642 -6496760 -3793879 -2539557 -3431101 -3815230 -2170758 -323870 -320605 -952741 824136
$$ packed form
4700a667585M528022K066322k140417l369029l88534J468451j043124k273537
4692b819431L196599R101538N059951o500117j2015472o021992K178238L899856
4684c920830K482535L883366N285995J255945n108771o154164j492804K228408
4676a540320J764351K49845K02814J06076j197907j955555p45684J505159L645444
4667B034223N204819M870797J595508k305658k845460o865J949871R48352n8250
4658A1387337J334091K482618J15625l679101m153154j224076L29271j791086
4650D801525l919547k065583J899257K633253j202952m932351l984260K73898
4642f496760K702881J254322q91544l84129J644472J846888L265o32136J776877
$$ plain form
4633 824136 5751669 11273561 14653142 15618924 15369175 14051236 10516886 4726408 -657282
4624 -657282 -2415410 -699283 675561 -973555 -3479662 -3009755 163956 2458335 3444876
4615 3444876 7081902 14627939 20633597 19722316 14265348 10829107 11225474 12222249 12624164
4606 12624164 14376835 16381189 13732311 5494363 -2102478 -3533771 -897740 468002
4598 468002 -419855 -953157 -293178 516055 1970588 5359243 9531429 12073899 13038709
4589 13038709 14232325 15444959 14625280 11476499 7933948 5230505 3020106 1088538
4581 1088538 -416298 -1933963 -3455329 -3450754 -1198281 1089722 1226329 617422 1495912
4572 1495912 2173446 -622916 -5613072 -7976656 -6313305 -3667732 -1318531 3132498
$$ packed form
4633H24136M927533N521892L379581R65782k49749j317939l534350n790478n383690
4624f57282j758128J716127J374844j649116k506107M69907L173711K294379R86541
4615C444876L637026P546037O005658r11281n456968l436241L96367R96775M01915
4606A2624164J752671K004354k648878q237948p596841j431293K636031J365742
4598D68002q87857n33302O59979Q09233J454533L388655M172186K542470R64810
4589A3038709J193616J212634q19679l148781l542551k703443k210399j931568
4581A088538j504836j517665j521366M575K252473K288003J36607o08907Q78490
4572A495912O77534k796362m990156k363584J663351K645573K349201M451029
$$ plain form
4564 3132498 10183119 16088923 18215953 18150330 17093857 12742607 4008008 -5044954 -9713837
4555 -9713837 -10180672 -9083798 -6406065 -735242 6285765 10611329 10092058 5694624 -37245
4546 -37245 -3433512 -889298 7022166 14052606 14184380 8270435 2297335 316111 1836045
4537 1836045 4891193 8329946 11330809 13199088 13606996 11759614 6715141 108869
4529 108869 -3703259 -2684673 36391 1321308 3289172 9253368 16715487 19729790
4521 19729790 17131585 12905289 8847397 2980309 -3996375 -7109918 -4592367 -1622682
4513 -1622682 -3084179 -6798921 -7829403 -6019588 -4842899 -5183960 -4940565 -3601640 -2790918
4504 -2790918 -2527865 -1042542 1141236 709050 -3297390 -6821578 -5690212 -1405623 669366
$$ packed form
4564C132498P050621N905804K127030o5623j056473m351250q734599r052962m668883
4555i713837m66835J096874K677733N670823P021007M325564n19271m397434n731869
4546c7245l396267K544214P911464P030440J31774n913945n973100j981224J519934
4537A836045L055148L438753L000863J868279M07908j847382n044473o606272
4529A08869l812128J018586K721064J284917J967864N964196P462119L014303
4521A9729790k598205m226296m057892n867088o976684l113543K517551K969685
4513a622682j461497l714742j030482J809815J176689l41061K43395J338925Q10722
4504b790918K63053J485323K183778m32186m006440l524188J131366M284589K074989
$$ plain form
4495 669366 -1617020 -4542701 -3495730 1502185 6650817 9170583 9111673 7211577 3767508
4486 3767508 80079 -1662931 -1304166 -1321693 -2829484 -3131975 352740 5549976 8154212
4477 8154212 7488748 6654411 7370316 8219532 8256226 8761531 10244100 10756474 8905056
4468 8905056 6212839 4785528 4545075 4392763 4309742 4518852 4134672 2639825 1530389
4459 1530389 2409786 4153290 4038645 1563866 -648346 -102403 2672628 5005623 5076509
4450 5076509 3404062 1644051 549083 -535991 -2426409 -5025614 -7598932 -9277352
4442 -9277352 -8947491 -5801392 -870387 3180467 5085622 6571552 9093291 10239857
4434 10239857 6265958 -2013775 -8844929 -9766808 -5865752 -1088460 2215129 3857237
$$ packed form
4495F69366k286386k925681J046971M997915N148632K519766n8910j900096l444069
4486C767508l687429j743010L58765j7527j507791l02491L484715N197236K604236
4477H154212o65464q34337P15905Q49216L6694N05305J482569N12374j851418
4468H905056k692217j427311k40453j52312q3021K09110l84180j494847j109436
4459A530389Q79397J743504j14645k474779k212212N45943K775031K332995P0886
4450E076509j672447j760011j094968j085074j890418k599205k573318j678420
4442i277352L29861L146099M931005M050854J905155J485930K521739J146566
4434A0239857l973899q279733o831154r21879L901056M777292L303589J642108
$$ plain form
4426 3857237 4246263 4134028 4495049 5057132 4133578 1347305 -724812 583264 4258583
4417 4258583 6524316 5396512 2823503 1958828 3427245 5158042 5564141 5647156 6974387
4408 6974387 8361179 6849880 2641037 389532 3281974 7842625 8069581 3839049
4400 3839049 1265944 4303330 9622031 11192695 7125073 420061 -4773927 -6079753
4392 -6079753 -3839289 -499841 1999978 4301031 7393761 9222109 7102023 3432390
4384 3432390 4160236 9991418 14092518 11638297 7158898 7887956 13116197 15537851 11548532
4375 11548532 4960675 812718 166112 1667127 4336500 7315965 9309384 9593661
4367 9593661 8418156 6308810 4156487 3299206 3811489 3546894 890702 -2480329 -3996511
$$ packed form
4426C857237L89026j12235L61021N62083r23554k786273k072117J308076L675319
4417D258583K265733j127804k573009q64675J468417J730797M06099Q3015J327231
4408F974387J386792j511299m208843k251505K892442M560651K26956m230532
4400C839049k573105L037386N318701J570664m067622o705012n193988j305826
4392f079753K240464L339448K499819K301053L092730J828348k120086l669633
4384C432390P27846N831182M101100k454221m479399P29058N228241K421654l989319
4375A1548532o587857m147957o46606J501015K669373K979465J993419K84277
4367I593661j175505k109346k152323q57281N12283k64595k656192l371031j516182
$$ plain form
4358 -3996511 -4425624 -6655116 -10552837 -12397582 -10170890 -6603315 -5579178 -7368379
4350 -7368379 -8813206 -7340793 -4004199 -2857020 -6963543 -14282353 -18444187 -15175439
4342 -15175439 -7280910 -1515348 -1150240 -3646860 -5127126 -4587929 -3402105 -2900892 -3390701
4333 -3390701 -4338520 -4951321 -5163417 -5824750 -7304833 -8721612 -9270515 -8833382 -6212516
4324 -6212516 825948 11378505 19629431 20811522 17351776 15029248 14207651 9914072
4316 9914072 771550 -7394200 -8640237 -3518561 3385304 8906440 11966970 12027451 9932173
4307 9932173 8506313 9918879 13508252 17250096 19440607 18079151 11621417 2385403
4299 2385403 -3519712 -2436113 2458561 5398231 4810869 3241323 2360488 1560450 815642
$$ packed form
4358c996511m29113k229492l897721j844745K226692L567575J024137j789201
4350g368379j444827J472413L336594J147179m106523p318810m161834L268748
4342a5175439P894529N765562L65108k496620j480266N39197J185824N01213m89809
4333c390701r47819o12801k12096o61333j480083j416779n48903M37133K620866
4324f212516P038464J0552557Q250926J182091l459746k322528q21597m293579
4316I914072r142522q165750j246037N121676O903865N521136L060530O0481k095278
4307I932173j425860J412566L589373L741844K190511j361456o457734r236014
4299B385403n905115J083599M894674K939670n87362j569546q80835q00038p44808
$$ plain form
4290 815642 1384286 2979737 2776836 -1400430 -7893473 -12035593 -10089117 -2639317 5588668
4281 5588668 9739286 8910953 5794439 2870816 895043 1081051 5580851 13820212 20713400
4272 20713400 21396908 16733021 11670196 8888116 6626990 2643527 -2230191 -5289335
4264 -5289335 -5214334 -3300034 -2073423 -3000371 -5233194 -6695127 -6443347 -5296113 -4073371
4255 -4073371 -2539341 -585323 1178227 2977383 6155223 10247470 11584225 7354592
4247 7354592 102216 -4490215 -3920038 -421300 3522836 7954701 12634628 14466090
4239 14466090 10565202 3008861 -2122641 -1163155 3134292 5135122 3072425 561883
4231 561883 1173605 3594633 4021808 1949823 567338 1497790 2548956 1934629 1538686
$$ packed form
4290H15642N68644J595451k02901m177266o493043m142120J946476P449800Q227985
4281E588668M150618q28333l116514k923623j975773J86008M499800Q239361O893188
4272B0713400O83508m663887n062825k782080k261126l983463m873718l059144
4264e289335P5001J914300J226611r26948k232823j461933K51780J147234J222742
4255d073371J534030J954018J763550J799156L177840M092247J336755m229633
4247G354592p252376m592431N70177L498738L944136M431865M679927J831462
4239A4466090l900888p556341n131502R59486M297447K000830k062697k510542
4231E61883O11722K421028M27175k071985j382485R30452J051166o14327l95943
$$ plain form
4222 1538686 3573874 6455660 7043223 5332286 3695212 2651924 1008309 -321878
4214 -321878 1440978 6380827 11134382 13718106 15737588 18321871 19326345 17098995
4206 17098995 14148317 13717427 14603652 13067590 8891065 5649818 5041003 4932574 4040660
4197 4040660 4581506 7770238 9740699 5657962 -3385758 -11146425 -13715516 -13060562 -12629586
4188 -12629586 -12485105 -10385584 -5756777 -888125 1024645 -1489518 -6267151 -8292387
4180 -8292387 -4687735 823248 1670352 -2311446 -3551616 2570197 9907208 9272657 1182271
4171 1182271 -5087579 -4103085 250976 2302538 1518402 -85377 -2212580 -4729103 -5412829
4162 -5412829 -2536046 2364433 6464504 8637373 9248327 9094893 9376984 10447000 10492944
$$ packed form
4222A538686K035188K881786N87563j710937j637074j043288j643615j330187
4214c21878J762856M939849M753555K583724K019482K584283J004474k227350
4206A7098995k950678m30890Q86225j536062m176525l241247o08815j08429q91914
4197D040660N40846L188732J970461m082737r043720p760667k569091O54954M30976
4188a2629586J44481K099521M628807M868652J912770k514163m777633k025236
4180h292387L604652N510983Q47104l981798j240170O121813P337011o34551q090386
4171A182271o269850R84494M354061K051562p84136j603779k127203k516523o83726
4162e412829K876783M900479M100071K172869O10954j53434K82091J070016M5944
$$ plain form
4153 10492944 8385407 7091004 9668393 12500359 8998908 613740 -3675889 -994651
4145 -994651 1106948 -1992846 -3905473 673741 4989312 895732 -7088611 -9497479
4137 -9497479 -7410615 -7972874 -10158472 -9345273 -10761705 -19540241 -19326883 15109446 76408031
4128 76408031 118185228 105921650 58980277 24235073 19380830 22982370 14133476 -1922224
4120 -1922224 -10500165 -9396061 -4775711 1428045 9304367 14082557 11342762 5202233
4112 5202233 3719765 8249848 12984694 13400099 10285593 6246282 2295155 -1835539
4104 -1835539 -6339640 -10439284 -12003443 -9139016 -2996590 2572211 5132832 5787117
4096 5787117 6382753 6832496 6575726 6524197 7637355 9138679 9953133 10621098 12096471
$$ packed form
4153A0492944k107537j294403K577389K831966l501451q385168m289629K681238
4145i94651K101599l099794j912627M579214M315571m093580p984343k408868
4137i497479K086864n62259k185598Q13199j416432q778536K13358L4436329O1298585
4128G6408031M1777197j2263578m6941373l4745204m854243L601540q848894j6055700
4120a922224q577941J104104M620350O203756P876322M778190k739795o140529
4112E202233j482468M530083M734846M15405l114506m039311l951127m130694
4104a835539m504101m099644j564159K864427O142426N568801K560621O54285
4096E787117N95636M49743k56770n1529J113158J501324Q14454O67965J475373
$$ plain form
4087 12096471 13700380 13753195 11389463 6751093 579882 -5422730 -9338923 -11328499
4079 -11328499 -13632987 -16987764 -18747333 -16293067 -10785586 -5650660 -2678386 -1487399
4071 -1487399 -1329901 -1123465 892659 4741773 7025204 4873471 1050997 1524864 7572205
4062 7572205 13755137 14770736 11075777 6188646 1749285 -1999129 -3404657 -956727
4054 -956727 3023813 3631189 -1063132 -7773116 -11803025 -11421051 -8108624 -4313856 -1985082
4045 -1985082 -2107018 -4316275 -7030107 -8471555 -7739165 -5253616 -2586245 -1341988 -1417540
4036 -1417540 -922086 1060718 2370455 364467 -3642505 -5187145 -2817691 -846685
4028 -846685 -3827533 -10036975 -13213657 -10099932 -3464602 2454191 6543509 9522619
$$ packed form
4087A2096471J603909N2815k363732m638370o171211o002612l916193j989576
4079a1328499k304488l354777j759569K454266N507481N134926K972274J190987
4071a487399J57498K06436K016124L849114K283431k151733l822474M73867O047341
4062G572205O182932J015599l694959m887131m439361l748414j405528K447930
4054i56727L980540O07376m694321o709984m029909L81974L312427L794768K328774
4045a985082j21936k209257k713832j441448P32390K485549K667371J244257p5552
4036a417540M95454J982804J309737k005988m006972j544640K369454J971006
4028h46685k980848o209442l176682L113725O635330N918793M089318K979110
$$ plain form
4020 9522619 10608821 8413560 4628221 3871369 8499177 15124705 18046989 15378408
4012 15378408 9807685 3710176 -3473424 -11765192 -17639775 -17708759 -13877403 -11073869
4004 -11073869 -10220003 -7408364 -639247 6744542 11089523 13155859 15199804 16513017
3996 16513017 15179203 11963394 9015519 6368568 2929820 -596072 -2932621 -4724626
3988 -4724626 -6525699 -6341872 -3245020 -1307128 -4540445 -9147106 -7132984 2093847
3980 2093847 10084358 10707317 7021249 4516502 3634818 2784001 3477561 7385413 11699493
3971 11699493 12308153 9463209 6475639 4971820 4974650 7244763 11619691 15085247 15350896
3962 15350896 14413118 14822891 14729968 11168677 6331517 5312525 8431278 10828970 9516982
$$ packed form
4020I522619J086202k195261l785339p56852M627808O625528K922284k668581
4012A5378408n570723o097509p183600q291768n874583o8984L831356K803534
4004a1073869Q53866K811639O769117P383789M344981K066336K043945J313213
3996A6513017j333814l215809k947875k646951l438748l525892k336549j792005
3988d724626j801073J83827L096852J937892l233317m606661K014122R226831
3980B093847P990511O22959l686068k504747q81684q50817O93560L907852M314080
3971A1699493O08660k844944k987570j503819K830K270113M374928L465556K65649
3962A5350896r37778M09773r2923l561291m837160j018992L118753K397692j311988
$$ plain form
3953 9516982 6251371 3500806 2102474 2978326 6477691 9564806 8387278 4474810
3945 4474810 3641493 7493913 10860358 9482245 5479968 2727850 1548083 1385391 4316711
3936 4316711 11176876 17202953 16679368 10506499 4691407 2318686 1488509 736688 1474276
3927 1474276 3822684 4364120 677220 -4590148 -6942115 -5668417 -3581887 -2233944
3919 -2233944 -531805 1776709 2411110 -34432 -3219294 -3977191 -2840505 -2859552 -4353488
3910 -4353488 -4107539 -661076 2725364 2601614 709391 1838413 6784816 10003909 5253017
3901 5253017 -7035348 -18482284 -19666330 -9585103 2335821 5941609 1689547 -1144120
3893 -1144120 2277517 6171342 3681938 -2903757 -6440359 -5221888 -2780325 -282194
$$ packed form
3953I516982l265611k750565j398332Q75852L499365L087115j177528l912468
3945D474810q33317L852420L366445j378113m002277k752118j179767j62692K931320
3936D316711O860165O026077n23585o172869n815092k372721q30177p51821P37588
3927A474276K348408N41436l686900n267368k351967J273698K086530J347943
3919b233944J702139K308514O34401k445542l184862p57897J136686j9047j493936
3910d353488K45949L446463L386440j23750j892223J129022M946403L219093m750892
3901E253017j2288365j1446936j184046J0081227J1920924L605788m252062k833667
3893a144120L421637L893825k489404o585695l536602J218471K441563K498131
$$ plain form
3885 -282194 3753393 7423343 6483526 1732559 -1340056 -1132148 -1553547 -3658982 -2566896
3876 -2566896 4364821 12296994 15412684 13743143 10253313 6023195 1899463 216625
3868 216625 891267 113582 -3086393 -3456881 2690573 10633341 13560621 12018762 11070945
3859 11070945 11079401 8077872 1812532 -3137755 -4089072 -2640831 -327108 3148222 7079897
3850 7079897 9693379 11315483 13549305 15046635 12308279 5436640 -828976 -3170341
3842 -3170341 -3750142 -6701623 -12475339 -16894221 -15327003 -8092535 -1741874 -2759760
3834 -2759760 -9291198 -12801895 -9782591 -6704979 -9351473 -12862456 -9377501 -1324394
3826 -1324394 1953682 -1109321 -2806909 254762 1873719 -2649698 -8670813 -9741937
$$ packed form
3885b82194M035587L669950r39817m750967l072615K07908m21399k105435J092086
3876b566896O931717P932173L115690j669541l489830m230118m123732j682838
3868B16625O74642p77685l199975l70488O147454P942768K927280j541859r47817
3859A1070945Q456l001529o265340m950287r51317J448241K313723L475330L931675
3850G079897K613482J622104K233822J497330k738356o871639o265616k341365
3842c170341n79801k951481n773716m418882J567218P234468O350661j017886
3834b759760o531438l510697L019304L077612k646494l510983L484955Q053107
3826a324394L278076l063003j697588L061671J618957m523417o021115j071124
$$ plain form
3818 -9741937 -6253321 -2100502 1549904 4638485 5296858 3150969 1595537 2824620
3810 2824620 4302411 3495769 1849422 584409 -2630686 -8523279 -12567582 -11722422 -10475303
3801 -10475303 -14122331 -19539600 -19311699 -12764540 -6277568 -3924368 -4082339 -4663716 -5575405
3792 -5575405 -5763610 -3310151 730240 3070491 3261332 3900662 5627039 6250818 5274850
3783 5274850 4923826 5848486 5790233 3486864 388526 -2136120 -3743398 -2971152 1639113
3774 1639113 7461075 9224674 6057779 3036355 3965052 6622849 7329537 6198181 4881781
3765 4881781 2625346 -1705270 -6009102 -7036325 -4772656 -1819682 408644 2207317
3757 2207317 3438976 3643320 3661181 4659589 5786915 4832863 1097004 -3948879 -8493129
$$ packed form
3818i741937L488616M152819L650406L088581O58373k145889j555432J229083
3810B824620J477791q06642j646347j265013l215095n892593m044303Q45160J247119
3801a0475303l647028n417269K27901O547159O486972K353200j57971n81377r11689
3792e575405j88205K453459M040391K340251J90841O39330J726377O23779r75968
3783E274850l51024R24660n8253k303369l098338k524646j607278P72246M610265
3774A639113N821962J763599l166895l021424R28697K657797P06688j131356j316400
3765D881781k256435m330616m303832j027223K263669K952974K228326J798673
3757B207317J231659K04344J7861R98408J127326r54052l735859n045883m544250
$$ plain form
3748 -8493129 -11452480 -12279588 -11311863 -9969267 -9174971 -7963487 -5093062 -1620215 -137488
3739 -137488 -1369027 -3096810 -3005894 -1461232 -621941 -1287388 -1576177 734042 4854890
3730 4854890 7158846 5539843 2479766 1861255 3298364 2474773 -2290132 -7024780 -7759943
3721 -7759943 -6540456 -8378964 -13497669 -16523798 -13777471 -7925354 -3861091 -2573526
3713 -2573526 -1471743 708642 2256694 1863498 1115100 2025756 3374251 1820301 -2992336
3704 -2992336 -6536570 -4373570 1867249 5630582 2788418 -3874037 -8056930 -6212612
3696 -6212612 331074 7650718 12006116 11667195 8175303 5606304 6934068 10961707
3688 10961707 13875611 13648871 11821528 11151131 12664950 14932239 15298512 12272216 7878393
$$ packed form
3748h493129k959351q27108R67725J342596P94296J211484K870425L472847J482727
3739a37488j231539j727783R0916J544662Q39291o65447k88789K310219M120848
3730D854890K303956j619003l060077o18511J437109q23591m764905m734648p35163
3721g759943J219487j838508n118705l026129K746327N852117M064263J287565
3713b573526J101783K180385J548052l93196p48398R10656J348495j553950m812637
3704b992336l544234K163000O240819L763333k842164o662455m182893J844318
3696f212612O543686P319644M355398l38921l491892k568999J327764M027639
3688A0961707K913904k26740j827343o70397J513819K267289L66273l026296m393823
$$ plain form
3679 7878393 6943840 12123413 19890430 23721279 21483144 17182195 14723380 13000366
3671 13000366 9221877 4406100 2084873 2713090 3044857 1149189 -1302859 -2565837
3663 -2565837 -3465075 -4829941 -4941238 -1975827 2758199 6527319 8735204 10064241 9309419
3654 9309419 4800343 -994659 -2332498 2554522 8077192 7707301 1922869 -2850184
3646 -2850184 -2092393 2604803 6676152 7368786 5075568 1900402 -165223 -450237 547520
3637 547520 2549607 5807248 9278011 10105475 7112975 3890821 5444642 11551280 16327614
3628 16327614 15426026 10988664 7631541 5817312 2261221 -3794015 -8014201 -6193589
3620 -6193589 -499531 1772979 -3594806 -12065720 -14778064 -8811005 -785386 1337821
$$ packed form
3679G878393r34553N179573P767017L830849k238135m300949k458815j723014
3671A3000366l778489m815777k321227O28217L31767j895668k452048j262978
3663b565837q99238j364866j11297K965411M734026L769120K207885J329037p54822
3654I309419m509076n795002j337839M887020N522670l69891n784432m773053
3646b850184P57791M697196M071349O92634k293218l175166k065625k85014R97757
3637E47520K002087L257641L470763Q27464k992500l222154J553821O106638M776334
3628A6327614r01588m437362l357123j814229l556091o055236m220186J820612
3620f193589N694058K272510n367785q470914k712344N967059Q025619K123207
$$ plain form
3612 1337821 -1993184 -3369200 1413554 8577966 12332625 11704615 9410504 7140269
3604 7140269 5040726 3912239 4597711 5979315 6384082 6594021 8921115 13334325 16795272
3595 16795272 16751984 13504273 8935985 4722155 2227810 2510644 5438029 9433004 12483001
3586 12483001 13175503 11291991 8190365 5991938 5388592 4967667 3775631 3304419 5008248
3577 5008248 6913171 5482822 759534 -3114457 -3074125 -392226 2071731 3529476 4811528
3568 4811528 6138719 6994761 7115716 6424428 4974325 3744369 4112961 5567613 5487900
3559 5487900 2604419 -695964 -1232569 807550 2422721 1903649 491520 63946 931724
3550 931724 2327244 3730299 4943850 5542114 5070077 3909788 3592052 5589680 9307088
$$ packed form
3612A337821l331005j376016M782754P164412L754659o28010k294111k270235
3604G140269k099543j128487O85472J381604M04767K09939K327094M413210L460947
3595A6795272m3288l247711m568288m213830k494345K82834K927385L994975L049997
3586A2483001O92502j883512l101626k198427o03346m20925j192036m71212J703829
3577E008248J904923j430349m723288l873991M0332K681899K463957J457745J282052
3568D811528J327191Q56042J20955o91288j450103j229956L68592J454652p9713
3559E487900k883481l300383n36605K040119J615171n19072j412129m27574Q67778
3550I31724J395520J403055J213551N98264m72037j160289l17736J997628L717408
$$ plain form
3541 9307088 11840235 10851412 7444648 4739549 3651638 2150356 -673757 -2242968
3533 -2242968 13400 4595620 7607719 7315697 4820482 1388083 -1983313 -2959843 545587
3524 545587 6346407 8717938 5068864 -326949 -1547998 1468218 3302943 621190
3516 621190 -3285795 -2693488 3279592 9409837 10499282 7363531 5414383 7633327 10767730
3507 10767730 9546589 3363034 -3088237 -5345454 -3273259 556750 4308455 7374727
3499 7374727 8907697 7766518 3928287 -898289 -4153831 -4015457 -984543 1873689
3491 1873689 1500823 -1652226 -3881926 -2899389 -925214 -1712805 -5622262 -9548886 -11068496
3482 -11068496 -10509855 -9082041 -7232423 -5411617 -4502901 -4477542 -4017558 -2452401 -954081
$$ packed form
3541I307088K533147r88823l406764k705099j087911j501282k824113j569211
3533b242968K256368M582220L012099k92022k495215l432399l371396r76530L505430
3524E45587N800820K371531l649074n395813j221049L016216J834725k681753
3516F21190l906985N92307N973080O130245J089445l135751j949148K218944L134403
3507A0767730j221141o183555o451271k257217K072195L830009L751705L066272
3499G374727J532970j141179l838231m826576l255542J38374L030914K858232
3491A873689l72866l153049k229700R82537J974175p87591l909457l926624j519610
3482a1068496N58641J427814J849618J820806R08716K5359M59984J565157J498320
$$ plain form
3473 -954081 -931843 -2260752 -3894457 -5138315 -5455249 -4216896 -1772640 318427 1262212
3464 1262212 1959281 2533556 550139 -5768083 -13405757 -16683834 -13768457 -8406063 -4635800
3455 -4635800 -2552806 -537621 1007795 353237 -2781866 -7130528 -11203331 -12970108
3447 -12970108 -10078974 -3121024 2635666 2214392 -2551518 -4834041 -1783723 1517129
3439 1517129 -1310211 -9792377 -17197235 -17806937 -11717377 -3498420 1909458 2338136 -830079
3430 -830079 -4518601 -6820808 -7634338 -6683805 -2759455 4023838 10896276 15190454 17419551
3421 17419551 19763093 22306803 22937700 20721243 17403702 15566112 17000766 22578860
3413 22578860 31287909 39013927 40886134 36311428 30020942 26706339 25984152 24143796
$$ packed form
3473i54081K2238j328909j633705j243858l16934J238353K444256K091067R43785
3464A262212O97069N74275j983417o318222p637674l278077K915377N362394L770263
3455d635800K082994K015185J545416o54558l135103m348662m072803j766777
3447a2970108K891134O957950N756690m21274m765910k282523L050318L300852
3439A517129k827340q482166p404858o09702O089560Q218957N407878M28678l168215
3430h30079l688522k302207q13530R50533L924350O783293O872438M294178K229097
3421A7419551K343542K543710O30897k216457l317541j837590J434654N578094
3413B2578860Q709049P726018J872207m574706o290486l314603p22187j840356
$$ plain form
3405 24143796 19606437 14631234 12004146 11877154 12304905 11908910 11477425 13027394 17143201
3396 17143201 21390812 22350644 19600313 16417749 15564851 15595810 12895351 6529960 -790938
3387 -790938 -6119291 -8522812 -7970894 -4444007 788178 4888586 6057777 5440740 5185874
3378 5185874 5541496 5299941 4441257 4699303 7525705 12574925 18008992 21306383 20334503
3369 20334503 15303458 9664801 7318429 8384306 9158490 6788095 2468304 -680633
3361 -680633 -1084994 1182995 5823327 11557075 15189742 14224677 10246587 7294555 6841124
3352 6841124 6815067 5672326 4326281 3106837 224476 -4492918 -7250645 -4911699 24402
3343 24402 2709921 2807105 3751560 5711446 4514445 -925024 -4999226 -2626017 3259302
$$ packed form
3405B4143796m537359m975203k627088j26992M27751l95995m31485J549969M115807
3396A7143201M247611R59832k750331l182564q52898L0959k700459o365391p320898
3387g90938n328353k403521N51918L526887N232185M100408J169191o17037k54866
3378E185874L55622k41555q58684K58046K826402N049220N434067L297391r71880
3369B0334503n031045n638657k346372J065877P74184k370395m319791l148937
3361f80633m04361K267989M640332N733748L632667r65065l978090k952032m53431
3352F841124k6057j142741j346045j219444k882361m717394k757727K338946M936101
3343B4402K685519R7184R44455J959886j197001n439469m074202K373209N885319
$$ plain form
3334 3259302 5550585 2363982 -1777533 -3363234 -3883206 -5603728 -7473917 -7463092 -6096912
3325 -6096912 -4859615 -2883642 1541075 6663704 7697210 2616561 -4533533 -7738241
3317 -7738241 -5447564 -1470654 -14490 -1525685 -3668732 -4729630 -4773922 -4297851 -3411953
3308 -3411953 -2471548 -2141100 -2268024 -1746190 -254874 743196 -281898 -2796449 -4767655
3299 -4767655 -4903983 -3391201 -997835 1251654 2019285 1054702 600891 3286232 7937305
3290 7937305 9600748 5266930 -1942451 -6134101 -5134135 -1651939 1163918 2719238
3282 2719238 3479546 3184037 1730225 -14405 -1629583 -3970338 -7272819 -9821104 -10180430
3273 -10180430 -9607050 -10142437 -11027802 -9494044 -5138466 -1011170 354056 -357286 -1751294
$$ packed form
3334C259302K291283l186603m141515j585701n19972j720522j870189J0825J366180
3325f096912J237297J975973M424717N122629J033506n080649p150094l204708
3317g738241K290677L976910J456164j511195k143047j060898m4292M76071Q85898
3308c411953R40405L30448j26924N21834J491316R98070j025094k514551j971206
3299d767655j36328J512782K393366K249489P67631r64583m53811K685341M651073
3290G937305J663443m333818p209381m191650R99966L482196K815857J555320
3282B719238P60308k95509j453812j744630j615178k340755l302481k548285l59326
3273a0180430N73380n35387q85365J533758M355578M127296J365226p11342j394008
$$ plain form
3264 -1751294 -4595145 -9749664 -14518610 -14087998 -7129665 1891186 6842042 5436708
3256 5436708 308818 -4369687 -6676430 -7808612 -9647236 -11722729 -11435650 -7835237
3248 -7835237 -3898771 -3347365 -5960135 -8347608 -9124501 -10318670 -12764907 -13256073 -8690456
3239 -8690456 -990079 5020830 7600613 9142606 11725311 14446696 15461495 14271915
3231 14271915 11428958 7972497 5695549 5965946 7612252 7876331 6079284 4204194
3223 4204194 3118321 976271 -2961662 -5665363 -4184535 -93871 3120424 5535550
3215 5535550 9651584 14340191 14603564 8792721 2263896 1216281 5216506 8504524
3207 8504524 7253687 2932306 -783795 -1965121 -1238675 -439347 -869495 -2075958 -2469828
$$ packed form
3264a751294k843851n154519m768946M30612O958333R020851M950856j405334
3256E436708n127890m678505k306743j132182j838624k075493K87079L600413
3248g835237L936466N51406k612770k387473p76893j194169k446237m91166M565617
3239h690456P700377O010909K579783J541993K582705K721385J014799j189580
3231A4271915k842957l456461k276948K70397J646306K64079j797047j875090
3223D204194j085873k142050l937933k703701J480828M090664L214295K415126
3215E535550M116034M688607K63373n810843o528825j047615M000225L288018
3207H504524j250837m321381l716101j181326P26446P99328m30148j206463l93870
$$ plain form
3198 -2469828 -1635110 -1078419 -1699876 -1798121 557120 4000062 5014850 2470373 -1231870
3189 -1231870 -3877735 -6178282 -9908503 -14906982 -18943025 -19627204 -16047906 -9679190
3181 -9679190 -3941225 -1482861 -1631270 -2003199 -2511534 -5317146 -10320586 -13771509 -13001164
3172 -13001164 -9732454 -6390771 -1845129 5828041 14271737 18596420 17631066 14829592
3164 14829592 13071826 12031728 10984532 10729951 11672611 12738272 13141317 12833987 10827125
3155 10827125 6193730 1522923 1715961 7503806 13393054 14330269 11475266 8842915
3147 8842915 7287305 5307240 3388593 3321578 4414111 4426152 3786169 5106897 8482310
3138 8482310 10775391 10070012 7757264 5594722 3608261 1734071 775160 626544 94503
$$ packed form
3198b469828Q34718N56691o21457r8245K355241L442942J014788k544477l702243
3189a231870k645865k300547l730221m998479m036043o84179L579298O368716
3181i679190N737965K458364j48409l71929n08335k805612n003440l450923P70345
3172a3001164L268710L341683M545642P673170Q443696M324683r65354k801474
3164A4829592j757766j040098j047196k54581R42660J065661M03045l07330k006862
3155A0827125m633395m670807J93038N787845N889248R37215k855003k632351
3147H842915j555610j980065j918647o7015J092533J2041o39983J320728L375413
3138H482310K293081p05379k312748k162542j986461j874190r58911j48616n32041
$$ plain form
3129 94503 -182068 2981122 11218170 21353496 27974336 28365436 23861528 17594145 12298673
3120 12298673 9377134 8370579 7168695 3554608 -2943566 -10357565 -15339735 -15846973
3112 -15846973 -13522331 -12257172 -13121658 -12280659 -6256379 2192751 6982442 6930678 6797780
3103 6797780 9424653 11401547 8852208 3645927 475351 455975 1286835 1941165 3312398
3094 3312398 4916488 4527818 1418537 -2489789 -4945492 -5011506 -2630135 1406702 4977280
3085 4977280 5912136 4114525 1432261 -217269 417615 4063285 10004945 15591818 18450880
3076 18450880 18865757 18485396 17485832 15043591 11998181 10541457 11143688 11960960 11660484
3067 11660484 10992964 11195325 12447651 14119490 14959819 13098881 7943068 2429537 1152937
$$ packed form
3129I4503k76571L163190Q237048J0135326O620840L91100m503908o267383n295472
3120A2298673k921539j006555j201884l614087o498174p413999m982170n07238
3112a5846973K324642J265159q64486Q40999O024280Q449130M789691n1764j32898
3103F797780K626873J976894k549339n206281l170576j9376Q30860O54330J371233
3094C312398J604090l88670l109281l908326k455703o6014K381371M036837L570578
3085D977280R34856j797611k682264j649530O34884L645670N941660N586873K859062
3076A8450880M14877l80361r99564k442241l045410j456724O02231Q17272l00476
3067A1660484o67520K02361J252326J671839Q40329j860938n155813n513531j276600
$$ plain form
3058 1152937 5133490 10059738 10922299 7193851 2257858 -1273002 -4049080 -7747028
3050 -7747028 -11550732 -12126361 -7646083 -916084 3276653 3919284 4442086 6694137 7323783
3041 7323783 2922671 -3634534 -6086725 -3137059 264863 124248 -2138301 -3383325
3033 -3383325 -3138811 -2401784 -994666 1498656 3893935 4508029 3200128 1279384 324565
3024 324565 1489031 4687492 8344392 11330138 14552500 18475707 20152337 16410567
3016 16410567 9645255 5815971 5911904 4399968 -1954698 -8817696 -10948489 -9515988
3008 -9515988 -8695182 -8845597 -7775660 -5778459 -4487753 -3026393 -130838 1939300 633573
2999 633573 -1568323 -450829 2767962 3361727 1208976 622880 2289615 2275127 34769
$$ packed form
3058A152937L980553M926248Q62561l728448m935993l530860k776078l697948
3050g747028l803704n75629M480278O729999M192737O42631N22802K252051O29646
3041G323783m401112o557205k452191K949666L401922j40615k262549j245024
3033c383325K44514P37027J407118K493322K395279O14094j307901j920744r54819
3024C24565J164466L198461L656900K985746L222362L923207J676630l741770
3016A6410567o765312l829284R5933j511936o354666o862998k130793J432501
3008i515988Q20806j50415J069937J997201J290706J461360K895555K070138j305727
2999F33573k201896J117494L218791N93765k152751n86096J666735j4488k240358
$$ plain form
2990 34769 265670 4301852 6421247 2583737 -2984602 -4615679 -3582911 -4206983 -5730390
2981 -5730390 -4484529 -1543942 -1479349 -4441285 -5797498 -3769021 -1554120 -998244 20784
2972 20784 1873371 406099 -6440697 -13423112 -13953880 -8739769 -3970820 -2571263 -2144519
2963 -2144519 -1094955 -1435332 -4057486 -5822962 -4251382 -1812509 -2164587 -4555864 -5782870
2954 -5782870 -5869777 -7119524 -8215356 -4686613 3518679 9902253 9532714 5347170 3120737
2945 3120737 3650951 4066377 4120516 6024909 9226966 10485034 9186209 8073111 8198815
2936 8198815 7490326 5284481 4019876 4740203 4784668 2144154 -1247427 -2974789 -3762772
2927 -3762772 -4840813 -4584876 -1411869 1835538 298987 -6510487 -13654975 -16000407
$$ packed form
2990C4769K30901M036182K119395l837510n568339j631077J032768o24072j523407
2981e730390J245861K940587O4593k961936j356213K028477K214901N55876J019028
2972B0784J852587j467272o846796o982415n30768N214111M768949J399557M26744
2963b144519J049564l40377k622154j765476J571580K438873l52078k391277j227006
2954e782870q6907j249747j095832L528743Q205292O383574l69539m185544k226433
2945C120737N30214M15426N4139J904393L202057J258068j298825j113098J25704
2936H198815p08489k205845j264605P20327M4465k640514l391581j727362p87983
2927c762772j078041K55937L173007L247407j536551o809474p144488k345432
$$ plain form
2919 -16000407 -12368518 -4962578 2904699 8382534 10461868 10542390 10767507 11643039 11721412
2910 11721412 9140516 3095314 -5141977 -12017289 -13943161 -10912674 -6675127 -4289676
2902 -4289676 -2981848 -541592 3155250 6924623 10737783 14872859 17802917 17555242
2894 17555242 14578049 11101142 8381043 6632556 6578680 8456202 10363359 10539980 10748539
2885 10748539 14211250 20322006 24794713 25536493 24994113 25506591 25468518 22131609 16072974
2876 16072974 10741952 8698891 9769796 11945864 12900725 11412941 8289854 5469223
2868 5469223 3931400 3165769 2473337 1524975 -130415 -2381655 -3497698 -1898109 882511
2859 882511 1558294 18490 -43343 3165746 6226289 5454971 2763406 3041246 6814712
$$ packed form
2919a6000407L631889P405940P867277N477835K079334Q0522K25117Q75532P8373
2910A1721412k580896o045202q237291o875312j925872L030487M237547K385451
2902d289676J307828K440256L696842L769373L813160M135076K930058k47675
2894A7555242k977193l476907k720099j748487n3876J877522J907157J76621K08559
2885A0748539L462711O110756M472707P41780n42380N12478l8073l336909o058635
2876A6072974n331022k043061J070905K176068R54861j487784l123087k820631
2868E469223j537823p65631o92432r48362j655390k251240j116043J599589K780620
2859H82511O75783j539804o1833L209089L060543p71318k691565K77840L773466
$$ plain form
2850 6814712 9431365 8079300 6186544 8733999 15050487 18952381 16068326 8967680
2842 8967680 3820841 3139274 3855682 2632805 582713 947485 3822019 6026207 5776315
2833 5776315 4497449 3514308 1921380 -755815 -2268840 -326641 3907018 7335369
2825 7335369 9085507 10737702 12598036 12272124 8111682 2639158 750192 4281048
2817 4281048 9395855 10335900 5608851 -593683 -3356324 -2007983 697008 2605897
2809 2605897 3376468 2937078 1523045 825733 2187637 3596612 1604875 -3175865 -5797229
2800 -5797229 -3443762 1011070 3659962 4547217 5433166 5443331 2487275 -2531804 -6278120
2791 -6278120 -7121358 -6180151 -4894676 -3779916 -2901965 -1653666 1020851 4401657 5457024
$$ packed form
2850F814712K616653j352065j892756K547455O316488L901894k884055p100646
2842H967680n146839o81567P16408j222877k050092L64772K874534K204188k49892
2833E776315j278866r83141j592928k677195j513025J942199M233659L428351
2825G335369J750138J652195J860334l25912m160442n472524j888966L530856
2817D281048N114807R40045m727049o202534k762641J348341K704991J908889
2809B605897P70571m39390j414033o97312J361904J408975j991737m780740k621364
2800e797229K353467M454832K648892Q87255Q85949J0165k956056n019079l746316
2791f278120q43238R41207J285475J114760Q77951J248299K674517L380806J055367
$$ plain form
2782 5457024 2721757 -942098 -2162833 -1995385 -3744321 -7224083 -9108528 -8332222 -7031885
2773 -7031885 -6156795 -4323424 -1663687 -795707 -2725491 -5300719 -7038164 -8973460 -11084232
2764 -11084232 -10477367 -5615822 529103 4245052 5713039 7204693 8644457 7954208
2756 7954208 4620332 207467 -3964078 -7398140 -9364761 -9406360 -8410006 -7271466 -5073627
2747 -5073627 -690628 4140287 5752037 3136128 -208717 -86201 3696301 7463456
2739 7463456 8114936 6342032 4937380 4666199 3283911 -962849 -6462760 -10224169 -11435657
2730 -11435657 -11092050 -9168408 -4935291 269164 3667598 4841512 6016906 8000675
2722 8000675 8957970 8173610 7589785 7916537 6576278 1937831 -3259226 -5364686 -4246645
$$ packed form
2782E457024k735267l663855j220735J67448j748936l479762j884445P76306J300337
2773g031885Q75090J833371K659737Q67980j929784k575228j737445j935296k110772
2764a1084232O06865M861545O144925L715949J467987J491654J439764o90249
2756G954208l333876m412865m171545l434062j966621m1599R96354J138540K197839
2747e073627M382999M830915J611750k615909l344845J22516L782502L767155
2739G463456O51480j772904j404652k71181j382288m246760n499911l761409j211488
2730a1435657L43607J923642M233117N204455L398434J173914J175394J983769
2722H000675R57295p84360n83825L26752j340259m638447n197057k105460J118041
$$ plain form
2713 -4246645 -1761378 1467512 4750007 5558388 2760989 -581644 -1490073 -1949826 -5097621
2704 -5097621 -8497511 -6695805 230205 6279575 8069079 8506184 10798897 13724561
2696 13724561 14805341 14058346 12368394 9525016 5964831 3533354 2759164 2171303 1600430
2687 1600430 2762650 5053337 4711044 565190 -3163181 -2875541 -1076369 -2312623 -6367157
2678 -6367157 -9159324 -8207465 -3751880 3171585 9867585 11458270 5945082 -1459753
2670 -1459753 -3674648 -655773 1578133 144793 -1817799 -1959441 -2807247 -6664142 -10725770
2661 -10725770 -10564119 -5947362 -410401 3204338 4436043 3858324 2328011 992335
2653 992335 547218 809894 1529510 2617392 3182805 1909120 -743016 -2150693 -429614
$$ packed form
2713d246645K485267L228890L282495Q08381k797399l342633r08429m59753l147795
2704e097621l399890J801706O926010O049370J789504M37105K292713K925664
2696A3724561J080780p46995j689952k843378l560185k431477p74190n87861n70873
2687A600430J162220K290687l42293m145854l728371K87640J799172j236254m054534
2678f367157k792167R51859M455585O923465O696000J590685n513188p404835
2670a459753k214895L018875K233906j433340j962592j41642q47806l856895m061628
2661a0725770J61651M616757N536961L614739J231705n77719j530313j335676
2653I92335m45117K62676P19616J087882N65413j273685k652136j407677J721079
$$ plain form
2644 -429614 3320492 6421413 7165920 5454085 2368946 -95865 -353749 769752 645375
2635 645375 -1677248 -3931294 -3438791 -70633 4406960 8286449 10125335 8741862 4604330
2626 4604330 63773 -3048227 -4863944 -5679073 -4714250 -2196611 -509491 -909659 -806200
2617 -806200 2902662 8905242 12728507 12184147 8801452 4516768 149002 -2926460 -2997599
2608 -2997599 -718843 1231071 2109834 3959777 7261075 8651904 5296798 -489146
2600 -489146 -3767448 -3315347 -2902689 -6043550 -11284169 -13574312 -9728731 -1976692 3987437
2591 3987437 4414486 603214 -3626014 -6591278 -9476643 -12853303 -14678121 -12728393
2583 -12728393 -7647701 -2375957 750922 1489601 859533 -395847 -2570271 -6108340
$$ packed form
2644d29614L750106L100921P44507j711835l085139k464811k57884J123501j24377
2635F45375k322623k254046M92503L368158M477593L879489J838886j383473m137532
2626D604330m540557l112000j815717q15129R64823K517639J687120m00168J03459
2617h06200L708862O002580L823265n44360l382695m284684m367766l075462p1139
2608b997599K278756J949914Q78763J849943L301298J390829l355106n785944
2600d89146l278302M52101M12658l140861n240619k290143L845581P752039N964129
2591C987437M27049l811272m229228k965264k885365l376660j824818J949728
2583a2728393N080692N271744L126879P38679o30068j255380k174424l538069
$$ plain form
2575 -6108340 -9607049 -9747895 -5089322 530030 1153027 -3950512 -8714926 -7509972 -1487043
2566 -1487043 4298129 7538443 9130967 8648595 3915017 -4146875 -9955777 -8966489 -3281073
2557 -3281073 605242 -800254 -4478441 -4982179 -817314 4258303 6021165 4425236
2549 4425236 2469544 1629255 699810 -901008 -1530285 -310974 700373 -657701 -3557382
2540 -3557382 -6082932 -8266035 -10451181 -10539994 -6701682 -1764963 -427996 -2023961 -725129
2531 -725129 5815259 12498290 13813593 11001865 8960737 8972231 8422856 6052484 3517176
2522 3517176 2221424 1930912 2593897 4736124 7639504 9370958 9095444 7632288 5646145
2513 5646145 3270319 1755602 3236844 7834268 12592720 14468945 13393331 11566132
$$ packed form
2575f108340l498709j40846M658573N619352O22997n103539m764414J204954O022929
2566a487043N785172L240314J592524m82372m733578q061892n808902R89288N685416
2557c281073L886315j405496l678187n03738M164865N075617J762862j595929
2549D425236j955692q40289r29445j600818o29277J219311J011347j358074k899681
2540c557382k525550k183103k185146q8813L838312M936719J336967j595965J298832
2531g25129O540388O683031J315303k811728k041128J1494n49375k370372k535308
2522C517176j295752k90512O62985K142227K903380J731454k75514j463156j986143
2513E646145k375826j514717J481242M597424M758452J876225j075614j827199
$$ plain form
2505 11566132 10684826 10677617 10305796 8120261 3520198 -2138848 -5928196 -5933385 -3504363
2496 -3504363 -2071137 -3444336 -5996394 -7005844 -6072869 -5037371 -4750804 -3788315 -1343068
2487 -1343068 372257 -1145592 -4404139 -5163033 -2171872 1090127 1219100 -1310872 -4366959
2478 -4366959 -7017575 -7898501 -3969760 5084302 13075787 12639593 4243114 -4079426 -6315861
2469 -6315861 -4060014 -1966312 -1785231 -2660907 -3767155 -4206863 -3057106 -1915838 -4704695
2460 -4704695 -11989994 -17810813 -15807415 -7266155 439283 2679468 1264292 -442053
2452 -442053 -2058624 -4551059 -7274026 -8896354 -9522127 -9912466 -9716105 -8308547 -6765581
2443 -6765581 -7200826 -10010144 -13031015 -13896826 -12492989 -10564061 -9358286 -8449898 -6940907
$$ packed form
2505A1566132q81306p209l71821k185535m600063n659046l789348n189K429022
2496c504363J433226j373199k552058j009450R32975J035498K86567R62489K445247
2487a343068J715325j517849l258547p58894K991161L261999J28973k529972l056087
2478d366959k650616q80926L928741R054062P991485m36194q396479q322540k236435
2469f315861K255847K093702J81081q75676j106248m39708J149757J141268k788857
2460d704695p285299n820819K003398Q541260P705438K240185j415176j706345
2452d42053j616571k492435k722967j622328o25773l90339J96361J407558J542966
2443f765581m35245k809318l020871q65811J403837J928928J205775R08388J508991
$$ plain form
2434 -6940907 -4885354 -2694962 181647 4370235 8268643 8676008 5014155 1290277
2426 1290277 1719907 5200872 6559121 3238731 -1705315 -3942801 -2894629 -1047257
2418 -1047257 -63191 454911 1253835 2456495 4102253 6097524 7504650 7026024 4359857
2409 4359857 313560 -4162893 -8007915 -9529663 -7610854 -3731027 -997601 -272407
2401 -272407 1095619 5299829 10372680 12604114 11730479 10945534 11723055 11755670 9448441
2392 9448441 7697284 10350493 16195384 19613049 17355324 12067057 8162134 6238537
2384 6238537 3218806 -2836257 -9546484 -12055264 -7805776 378353 6240053 5873802
2376 5873802 1495584 -1385647 -274018 2178468 2253986 -505892 -3778526 -5596562 -5797533
$$ packed form
2434f940907K055553K190392K876609M188588L898408M07365l661853l723878
2426A290277M29630L480965J358249l320390m944046k237486J048172J847372
2418a047257R84066N18102P98924J202660J645758J995271J407126m78626k666167
2409D359857m046297m476453l845022j521748J918809L879827K733426P25194
2401b72407J368026M204210N072851K231434q73635p84945P77521L2615k307229
2392I448441j751157K653209N844891L417665k257725n288267l904923j923597
2384F238537l019731o055063o710227k508780M249488Q184129N861700l66251
2376E873802m378218k881231J111629K452486P5518k759878l272634j818036k00971
$$ plain form
2367 -5797533 -5447122 -5883639 -7434179 -8357045 -6331133 -1805789 1865621 2975943 4148268
2358 4148268 8148912 12609516 12203603 5807623 -1579706 -4576020 -2520595 1783652
2350 1783652 5722039 7795922 7123063 4257848 1622858 1354102 2994204 4381153 4380878
2341 4380878 3747101 3621060 4128841 4463517 3929022 3053619 3667541 7082100 11900257
2332 11900257 14712103 13748559 10884419 8945423 8006615 6179118 3767820 4242186 9738439
2323 9738439 17021041 19990937 16221983 9447341 5125054 4962350 6698872 7848803
2315 7848803 7840518 7096847 6064548 5308552 4900103 3584969 315969 -3358406 -4761755
2306 -4761755 -4333356 -5526511 -9337901 -12105755 -10815102 -7497848 -5505029 -4384454
$$ packed form
2367e797533L50411m36517j550540r22866K025912M525344L671410J110322J172325
2358D148268M000644M460604m05913o395980p387329k996314K055425M304247
2350A783652L938387K073883o72859k865215k634990k68756J640102J386949k75
2341D380878o33777j26041N07781L34676n34495q75403O13922L414559M818157
2332A1900257K811846r63544k864140j938996r38808j827497k411298M74366N496253
2323I738439P282602K969896l768954o774642m322287j62704J736522J149931
2315G848803q285p43671j032299p55996m08449j315134l269000l674375j403349
2306d761755M28399j193155l811390k767854J290653L317254J992819J120575
$$ plain form
2298 -4384454 -2176127 -23301 314021 1391397 6619633 12815233 12768097 5846326 -443008
$$ packed form
2298d384454K208327K152826L37322J077376N228236O195600m7136o921771o289334
$$ [...]
##END NTUPLES=NMR SPECTRUM
##END=
