##TITLE=31P Pdec_DE-81rm2h3o 
 64 sc
 19.2.2025
##JCAMPDX= 6.0         $$ Bruker NMR JCAMP-DX V2.0
##DATA TYPE= NMR SPECTRUM
##DATA CLASS= NTUPLES
##ORIGIN= UXNMR, Bruker Analytische Messtechnik GmbH
##OWNER= root
$$ XWIN-NMR		Version 3.5
$$ Thu Feb 20 15:52:03 2025 Russian Standard Time (UT+4h)  new_Human@DPX200
##.OBSERVE FREQUENCY= 81.013821
##.OBSERVE NUCLEUS= ^31P
##.ACQUISITION MODE= SIMULTANEOUS
##.ACQUISITION SCHEME= undefined
##.AVERAGES= 64
##.DIGITISER RES= 17
##SPECTROMETER/DATA SYSTEM= spect
##.PULSE SEQUENCE= zgpg30
##.SOLVENT NAME= CDCl3
##.SHIFT REFERENCE= (INTERNAL, CDCl3, 0, 198.062)
##AUDIT TRAIL= $$ (NUMBER, WHEN, WHO, WHERE, WHAT)
$$ ##TITLE= Audit trail, XWIN-NMR		Version 3.5
$$ ##JCAMPDX= 5.01
$$ ##ORIGIN= Bruker BioSpin GmbH
$$ ##OWNER= new_Human
$$ C:/Bruker/XWIN-NMR/data/yarkov/nmr/P31/2/pdata/1/auditp.txt
$$ ##AUDIT TRAIL=  $$ (NUMBER, WHEN, WHO, WHERE, WHAT)
(   1,<2025-02-20 15:48:47.20 +0400>,<new_Human>,<DPX200>,
      <created by zg, POWCHK disabled, PULCHK disabled
       configuration hash MD5:
       00 E9 B6 7A A2 85 ED C7 34 08 36 98 17 FE 4E 26
       data hash MD5: 32K
       72 2C 74 E1 AD F9 93 F7 33 CF 2E E6 3D 30 FC 38>)
(   2,<2025-02-20 15:48:57.75 +0400>,<new_Human>,<DPX200>,
      <Start of raw data processing
       efp BC_mod = 2 LB = 1.5 FT_mod = 6 PKNL = 1 PHC0 = 1711.718 PHC1 = 147.4954 SI = 64K 
       data hash MD5: 64K
       15 FC 1D A1 17 EA 64 92 BC A0 48 E1 0D 10 8E AD>)
(   3,<2025-02-20 15:49:52.82 +0400>,<new_Human>,<DPX200>,
      <pk PHC0 = 61.15589 PHC1 = -106 
       data hash MD5: 64K
       00 DD 46 6E 64 97 5D 81 D4 7A 94 7C FE 21 B5 78>)
(   4,<2025-02-20 15:50:31.28 +0400>,<new_Human>,<DPX200>,
      <abs ABSG = 5 
       data hash MD5: 64K
       4F 65 B9 50 8C A7 23 FE E1 73 65 0D 0F 70 C4 D7>)
$$ ##END=
$$ 
$$ hash MD5
$$ B7 E8 8D 1A D2 5C 3A 11 94 C3 96 FB 48 E1 43 EE
##$RELAX= 
##$RELAX= 
##$RELAX= 
##$RELAX= 
##$RELAX= 
##$RELAX= 
##$RELAX= 
##$RELAX= 
$$ Bruker specific parameters
$$ --------------------------
##$DU= <C:/Bruker/XWIN-NMR>
##$EXPNO= 2
##$NAME= <P31>
##$PROCNO= 1
##$TYPE= <nmr>
##$USER= <yarkov>
##$AMP= (0..31)
100 100 100 100 100 100 100 100 100 100 100 100 100 100 100 100 100 100 
100 100 100 100 100 100 100 100 100 100 100 100 100 100 
##$AQSEQ= 0
##$AQ_mod= 1
##$AUNM= <au_zg>
##$AUTOPOS= <>
##$BF1= 81.014009
##$BF2= 200.13
##$BF3= 200.13
##$BF4= 200.13
##$BF5= 200.13
##$BF6= 200.13
##$BF7= 200.13
##$BF8= 200.13
##$BYTORDA= 1
##$CFDGTYP= 0
##$CFRGTYP= 5
##$CHEMSTR= <none>
##$CNST= (0..31)
1 1 145 1 1 1 1 1 1 1 1 1 1 1 1 1 1 1 1 1 1 1 1 1 1 1 1 1 1 1 1 1 
##$CPDPRG= <waltz16>
##$CPDPRG1= <>
##$CPDPRG2= <waltz16>
##$CPDPRG3= <>
##$CPDPRG4= <mlev>
##$CPDPRG5= <mlev>
##$CPDPRG6= <mlev>
##$CPDPRG7= <mlev>
##$CPDPRG8= <mlev>
##$CPDPRGB= <>
##$CPDPRGT= <>
##$D= (0..31)
0 1 0 0 0 0 0 0 0 0.06 0 0.03 2e-05 3e-06 0 0 0.0002 0 0 0 0 0 0 0 0 0 
0 0 0 0 0 0 
##$DATE= 1740052126
##$DBL= (0..7)
120 120 120 11 120 120 24 19 
##$DBP= (0..7)
$$ [...]
##$SUBNAM3= <"">
##$SUBNAM4= <"">
##$SUBNAM5= <"">
##$SUBNAM6= <"">
##$SUBNAM7= <"">
##$SUBNAM8= <"">
##$SUBNAM9= <"">
##$SW= 400.765351723535
##$SWIBOX= (0..15)
0 1 3 0 0 0 0 0 0 0 0 0 0 0 0 0 
##$SW_h= 32467.5324675325
##$TD= 32768
##$TD0= 1
##$TE= 0
##$TE2= 300
##$TE3= 300
##$TEG= 300
##$TL= (0..7)
0 120 53 12 22 120 120 120 
##$TP= (0..7)
150 150 150 150 150 150 150 150 
##$TP07= 0
##$TPNAME0= <>
##$TPNAME1= <>
##$TPNAME2= <>
##$TPNAME3= <>
##$TPNAME4= <>
##$TPNAME5= <>
##$TPNAME6= <>
##$TPNAME7= <>
##$TPOAL= (0..7)
0.5 0.5 0.5 0.5 0.5 0.5 0.5 0.5 
##$TPOFFS= (0..7)
0 0 0 0 0 0 0 0 
##$TUNHIN= 0
##$TUNHOUT= 0
##$TUNXOUT= 0
##$USERA1= <user>
##$USERA2= <user>
##$USERA3= <user>
##$USERA4= <user>
##$USERA5= <user>
##$V9= 5
##$VALIST= <valist>
##$VCLIST= <CCCCCCCCCCCCCCC>
##$VD= 0
##$VDLIST= <DDDDDDDDDDDDDDD>
##$VPLIST= <PPPPPPPPPPPPPPP>
##$VTLIST= <TTTTTTTTTTTTTTT>
##$WBST= 1024
##$WBSW= 4
##$XGAIN= (0..3)
0 0 0 0 
##$XL= 0
##$YL= 0
##$YMAX_a= 42361
##$YMIN_a= -76941
##$ZGOPTNS= <>
##$ZL1= 120
##$ZL2= 120
##$ZL3= 120
##$ZL4= 120
##$ABSF1= 198.0616
##$ABSF2= -202.7028
##$ABSG= 5
##$ABSL= 3
##$ALPHA= 0
##$AQORDER= 0
##$ASSFAC= 0
##$ASSFACI= 0
##$ASSFACX= 0
##$ASSWID= 0
##$AUNMP= <proc_1d>
##$AZFE= 0.1
##$AZFW= 0.5
##$BCFW= 0
##$BC_mod= 2
##$BYTORDP= 0
##$COROFFS= 0
##$CY= -3
##$DATMOD= 1
##$DC= 0
##$DFILT= <>
##$DTYPP= 0
##$F1P= 0
##$F2P= 0
##$FCOR= 1
##$FTSIZE= 65536
##$FT_mod= 6
##$GAMMA= 0
##$GB= 0
##$INTBC= 1
##$INTSCL= 9.790993e-09
##$ISEN= 30
##$LB= 1.5
##$LEV0= 0
##$LPBIN= 0
##$MAXI= 10000
##$MC2= 0
##$MEAN= 0
##$ME_mod= 0
##$MI= 50
##$NCOEF= 0
##$NC_proc= -5
##$NLEV= 6
##$NOISF1= 182.463
##$NOISF2= 159.3651
##$NSP= 0
##$NTH_PI= 0
##$NZP= 0
##$OFFSET= 198.0616
##$PC= 4
##$PHC0= 1772.874
##$PHC1= 41.49541
##$PH_mod= 1
##$PKNL= yes
##$PPARMOD= 0
##$PSCAL= 0
##$PSIGN= 0
##$REVERSE= no
##$SF= 81.0140089999434
##$SI= 65536
##$SIGF1= 159.3651
##$SIGF2= -187.1042
##$SINO= 113.3802
##$SIOLD= 16384
##$SREGLST= <1H.CDCl3>
##$SSB= 0
##$STSI= 65536
##$STSR= 0
##$SW_p= 32467.5324675325
##$SYMM= 0
##$S_DEV= 0
##$TDeff= 32768
##$TDoff= 0
##$TI= <>
##$TILT= no
##$TM1= 0
##$TM2= 0
##$TOPLEV= 0
##$USERP1= <user>
##$USERP2= <user>
##$USERP3= <user>
##$USERP4= <user>
##$USERP5= <user>
##$WDW= 1
##$XDIM= 65536
##$YMAX_p= 292920895
##$YMIN_p= -13349339
$$ End of Bruker specific parameters
$$ ---------------------------------
##NTUPLES= NMR SPECTRUM
##VAR_NAME=  FREQUENCY,     SPECTRUM/REAL,   SPECTRUM/IMAG
##SYMBOL=    X,             R,               I
##VAR_TYPE=  INDEPENDENT,   DEPENDENT,       DEPENDENT
##VAR_FORM=  AFFN,          ASDF,            ASDF
##VAR_DIM=   65536,         65536,           65536
##UNITS=     HZ,            ARBITRARY UNITS, ARBITRARY UNITS
##FACTOR=    0.49542278885378, 1,            1
##FIRST=     16045.7642231865, 0,            0
##LAST=      -16421.768244346, 0,            0
##MIN=       -16421.768244346, -13349339,    0
##MAX=       16045.7642231865, 292920895,    0
$$ Real data points
##PAGE= N=1
##DATA TABLE= (X++(R..R)), XYDATA
$$ [...]
49322 -301467 -104408 -94693 -208844 -315160 -410687 -559971 -620977 -297511 391890 942994
49312 942994 885924 305966 -344283 -737667 -738682 -243634 637242 1375783 1456090 1002986
49302 1002986 594344 461288 312206 -18358 -274300 -316434 -433473 -765159 -859639 -307379
49292 -307379 462531 586220 -117515 -945111 -1247263 -1098397 -905494 -780943 -573837 -256627
49282 -256627 16196 131849 101084 -22744 -174274 -287213 -369801 -494675 -640202 -654616
49272 -654616 -486420 -341986 -467048 -833710 -1180705 -1313932 -1226170 -963922 -563343 -155713
49262 -155713 25787 -142205 -513908 -805498 -859451 -731746 -553375 -381719 -206914 -50734
49252 -50734 8296 -73699 -235311 -380789 -497441 -630546 -744611 -708674 -466811 -138852
49242 -138852 120601 293672 446280 576804 636090 641520 613402 420177 -107513 -839887
49232 -839887 -1319080 -1235077 -830540 -644242 -872472 -1158414 -1057196 -568058 -108213 -38538
49222 -38538 -331120 -689338 -880824 -893626 -830922 -759929 -691349 -634582 -603543 -585690 -556846
49211 -556846 -516838 -470973 -402330 -312200 -240939 -163677 72341 545612 1015487 1103062 787265
49200 787265 485689 485205 524952 211998 -331361 -617984 -537294 -506160 -766415 -946255 -597856
49189 -597856 123822 670603 815179 785732 771109 694261 532679 495452 692446 872930
49179 872930 718744 263125 -174528 -375297 -357976 -201698 57197 342923 533944 597149
49169 597149 600613 532212 238221 -333076 -907670 -1084372 -793735 -427221 -416007 -760032
49159 -760032 -1088786 -1132373 -963245 -759823 -540497 -272988 -100154 -233679 -648112 -1073117
49149 -1073117 -1315902 -1432184 -1539632 -1622215 -1595554 -1436721 -1167446 -818915 -484518 -287713
49139 -287713 -220823 -150001 -69322 -181362 -574157 -974920 -1034168 -749774 -396529 -134079
49129 -134079 66624 189201 171950 128357 247487 432598 366790 34984 -156556 50042
49119 50042 393938 522081 484620 504434 516189 319008 14335 -126989 -148006 -335055
49109 -335055 -684454 -862628 -746038 -588878 -555435 -508220 -431554 -623833 -1153790 -1491820
49099 -1491820 -1120514 -312359 146470 -55761 -438192 -409720 83057 674577 1043547 1089734
49089 1089734 846502 430235 45018 -86691 143211 633145 1111139 1359401 1452679 1663770
49079 1663770 2045844 2254156 1946984 1241700 559489 105638 -246879 -607849 -895294
49070 -895294 -1045892 -1137827 -1211642 -1167324 -933685 -595195 -299673 -169647 -282840 -542353
49060 -542353 -605030 -232157 269140 300444 -235050 -757182 -791512 -538512 -390504 -270871
49050 -270871 110280 610207 788408 592268 411926 443589 465009 340126 311637 589178
49040 589178 981562 1174189 1118058 908200 500558 -155121 -820280 -1101953 -888633 -459579
49030 -459579 -145456 -30257 -10208 -7005 -43627 -164059 -338435 -449141 -366253 -53484
49020 -53484 381049 727020 781824 481329 -32252 -505867 -784695 -900182 -937222 -916066
49010 -916066 -884241 -997244 -1327207 -1656436 -1684147 -1447651 -1314090 -1480318 -1681678 -1525013
49000 -1525013 -964426 -305586 158937 379088 482569 614533 816557 976734 922438 613784
48990 613784 198785 -160272 -436082 -665120 -835165 -932489 -1006523 -1079202 -1070132 -931736
48980 -931736 -785824 -782120 -871244 -883675 -821125 -884418 -1154010 -1402407 -1350442 -1026136 -723627
48969 -723627 -617052 -561896 -355113 -80465 -22506 -236065 -402108 -247191 39449 33400
48959 33400 -334624 -684072 -726139 -621548 -635332 -671061 -431648 51503 346559 124299
48949 124299 -464682 -987003 -1164275 -1046036 -854223 -742890 -674359 -500462 -197592 4042
48939 4042 -169617 -673810 -1110208 -1143296 -877902 -703516 -787577 -871325 -637061 -155122
48929 -155122 200472 252052 221243 341401 472406 326046 -41392 -264476 -198449 -93304
48919 -93304 -128521 -95100 205356 478931 216576 -604434 -1413415 -1684369 -1449300 -1118920
48909 -1118920 -997246 -1072568 -1150722 -1093606 -981555 -1051168 -1389941 -1730866 -1711908 -1338573
48899 -1338573 -991814 -923863 -950953 -762601 -360272 -25766 25301 -209465 -620640 -1038001
48889 -1038001 -1220537 -1001116 -491307 -22603 151040 12250 -329172 -747275 -1072056
48880 -1072056 -1129626 -935742 -744582 -770417 -930673 -1007409 -1004943 -1149484 -1511502 -1825561
48870 -1825561 -1789809 -1405299 -898055 -429599 -47684 167050 122980 -103063 -278350 -255988
48860 -255988 -99658 44753 91458 31794 -57070 -12863 256392 595760 729025 584091
48850 584091 338669 130232 -79712 -312315 -475192 -551592 -657746 -791234 -754193 -477955
48840 -477955 -185858 -46439 88285 361152 572659 470639 166723 -90543 -379609 -916697
48830 -916697 -1501421 -1628422 -1192889 -664657 -452922 -458421 -390786 -200954 -14333 111480
48820 111480 178329 183362 201347 358166 605790 689323 449887 28888 -295185 -345567 -119032
48809 -119032 196669 275514 -58322 -579485 -909873 -981753 -980599 -900010 -569382 -139790
48799 -139790 -42418 -302868 -381353 38652 540489 588177 262605 -11374 -144716 -330551
48789 -330551 -529653 -476866 -110021 376490 827546 1166090 1239454 942666 434576 -15038
48779 -15038 -311242 -488339 -557759 -599807 -763416 -938421 -732044 -70717 528510 670408
48769 670408 668434 917029 1103959 752223 209708 216311 631483 556354 -213540 -818434
48759 -818434 -662390 -208288 -60791 -98828 -47266 -153744 -624144 -982569 -730284 -202962
48749 -202962 -38364 -130749 132408 822838 1417967 1676252 1821425 1859948 1449571 606104
48739 606104 -80735 -190084 42346 216114 329443 579599 933917 1191627 1247554 1055894
48729 1055894 540187 -201281 -749768 -713504 -207128 220577 186360 -121019 -212012 78690
48719 78690 365665 191767 -362376 -748020 -633895 -277278 -106060 -182310 -278129 -263993
48709 -263993 -157755 50182 343255 583174 736026 1028597 1550129 1871320 1507675 690294
48699 690294 186803 320290 641175 674209 506547 427352 424360 344080 223687 147553 19827
48688 19827 -230616 -427388 -397126 -252447 -173736 -106497 57383 198102 181131 188378 486263
48677 486263 953879 1182061 1010103 664737 388993 232919 221530 426892 785014 1058028
48667 1058028 1061765 786426 285912 -366957 -1001043 -1421425 -1608086 -1681021 -1656315 -1418364
48657 -1418364 -951027 -401727 117713 604929 1013973 1236228 1277447 1238628 1076385 644620
48647 644620 72073 -193426 80321 558128 755637 625114 456899 344530 86068 -400594
48637 -400594 -873926 -1067989 -990048 -823025 -678089 -547777 -421801 -360741 -461275 -742902
48627 -742902 -1044580 -1103611 -833141 -462204 -269073 -225715 -84196 199117 351703 177262
48617 177262 -133144 -229463 -24969 257530 387168 325971 166259 16095 -29901 86689
48607 86689 326977 532465 490315 61295 -675985 -1378212 -1634782 -1326931 -766542 -383446
48597 -383446 -285030 -219671 26064 320358 349632 20275 -397020 -526323 -245061 213298
48587 213298 477675 364007 28835 -181571 -68594 211073 312858 105741 -165523 -208369
48577 -208369 -103349 -210650 -632711 -997390 -927533 -542947 -264229 -247564 -313071 -369294
48567 -369294 -529623 -732921 -627960 -57467 613102 899629 731034 353299 -63174 -417336
48557 -417336 -487803 -153867 277250 353096 64239 -210773 -317502 -452246 -636130 -554722
48547 -554722 -121272 236897 157939 -133656 -229612 -175571 -304859 -626981 -808962 -685374
48537 -685374 -398806 -63297 340001 713987 854630 789655 783499 884916 778644 277734
48527 277734 -296085 -490493 -336158 -307355 -700613 -1282276 -1605016 -1514364 -1242404 -1081834
48517 -1081834 -1088058 -1107112 -990722 -705972 -303796 78309 191411 -153503 -785233 -1198297
48507 -1198297 -1051250 -561072 -241585 -316102 -568072 -723908 -758271 -782336 -817242 -769700
48497 -769700 -535486 -87110 449410 791838 692548 181124 -441734 -850277 -886148 -589497
48487 -589497 -174966 80889 93026 75004 236974 450339 435853 221115 106012 165173
48477 165173 129983 -131467 -351129 -261517 21753 233284 323095 343335 204156 -142881
48467 -142881 -426501 -286938 264649 860851 1183847 1138343 744383 164818 -224402 -135412
48457 -135412 225630 344398 43898 -328477 -425629 -319220 -254906 -258212 -216736 -198136 -431448
48446 -431448 -982161 -1594404 -1888318 -1688556 -1193462 -819343 -794938 -914904 -815122 -480444
48436 -480444 -283277 -465714 -812227 -979085 -937294 -860707 -733321 -385335 104394 361037
48426 361037 185267 -147829 -227418 -14866 158961 41138 -266957 -481858 -444837 -209288
48416 -209288 68779 237499 200305 -33536 -329606 -514288 -508021 -357466 -148344 60607
48406 60607 210115 225581 103438 -10771 89353 470271 973628 1352703 1470943 1347219
48396 1347219 1051965 648462 256013 50532 63052 25370 -379281 -1054214 -1489300 -1371609
48386 -1371609 -992614 -799497 -727854 -381390 193845 443371 174168 -17942 432296 1186004
48376 1186004 1437553 1000489 414827 68734 -199120 -557709 -823044 -873494 -945157 -1181348
48366 -1181348 -1272331 -948683 -550053 -630699 -1128607 -1384289 -989177 -240586 298087 364421
48356 364421 40595 -466434 -920905 -1123342 -1039272 -787215 -470793 -155430 7615 -117839
48346 -117839 -360254 -319681 96340 446153 281780 -280257 -767621 -976440 -1073396 -1162968
48336 -1162968 -1127047 -941379 -810652 -851035 -911941 -880239 -912099 -1144847 -1389672 -1378449
48326 -1378449 -1164625 -993822 -896232 -732774 -568436 -614467 -787653 -742235 -460220 -397231
48316 -397231 -801201 -1250503 -1215000 -798749 -513170 -503012 -473621 -316427 -294146 -507558
48306 -507558 -626595 -368157 82315 355605 351204 183319 -89910 -418433 -619983 -577664
48296 -577664 -475426 -565544 -765645 -757862 -473478 -212718 -231261 -432246 -565772 -561821 -535798
48285 -535798 -567038 -608720 -594635 -533966 -464689 -361266 -173037 3587 -113478 -686688
48275 -686688 -1406647 -1659580 -1182899 -407049 15431 -104593 -458163 -745619 -933914 -1052351
48265 -1052351 -1047818 -929797 -832883 -832971 -869597 -913285 -1011712 -1084880 -898969 -403486 82583
48254 82583 207932 -12356 -301658 -489915 -573930 -533622 -363638 -262005 -514932 -1125744
48244 -1125744 -1756777 -2118135 -2247768 -2326180 -2388540 -2360450 -2251650 -2130378 -1942645 -1524305
48234 -1524305 -838011 -109586 329852 326740 35013 -207163 -143542 202318 557651 624634
48224 624634 290932 -327838 -974365 -1365847 -1334039 -972211 -630766 -646007 -1008680 -1357524
48214 -1357524 -1362213 -1076803 -851255 -923910 -1192301 -1388556 -1365275 -1136334 -729912 -150560
48204 -150560 502443 1000923 1150347 959654 625480 372593 291593 263571 59973 -371593
48194 -371593 -718523 -565167 87596 740590 958180 825536 654639 447092 -2062 -573557
48184 -573557 -839830 -666617 -376932 -175508 148259 675795 950674 558182 -182534 -614721
48174 -614721 -641262 -670071 -772222 -550754 62878 523600 457328 207611 249079 490782
48164 490782 564636 441532 308788 124133 -218283 -481760 -348622 36425 261501 283998
48154 283998 372533 484437 268916 -263734 -637082 -614043 -487134 -469821 -319406 131736
48144 131736 533637 501622 188895 -31641 -174207 -501628 -987565 -1343596 -1454121 -1403213
48134 -1403213 -1182256 -751442 -309135 -120433 -118894 -27119 176023 275948 269321 373489
48124 373489 560188 510223 149457 -170519 -211656 -216744 -497082 -935061 -1166241 -1053739
48114 -1053739 -729437 -330318 51607 279996 286302 202796 176339 119434 -141969 -523114
48104 -523114 -709041 -540943 -195649 44456 54942 -107907 -291703 -322143 -145355 44597
48094 44597 -32129 -357732 -537309 -260139 256770 504513 347668 193948 384715 660148
48084 660148 494948 -162664 -822207 -1119203 -1198360 -1306159 -1343726 -1098516 -693590 -476121
48074 -476121 -556881 -740669 -843065 -815294 -632961 -354585 -241509 -502429 -925284 -1078598
48064 -1078598 -888932 -683991 -633172 -532731 -260891 -61719 -172483 -481276 -764214 -975987
48054 -975987 -1099664 -1018583 -801475 -828183 -1318030 -1959587 -2310744 -2343198 -2275853 -2113936
48044 -2113936 -1750072 -1330042 -1070293 -825861 -296985 379905 698358 463757 11904
48035 11904 -284704 -344226 -181700 183045 516288 467165 33264 -395612 -575128 -636395
48025 -636395 -665058 -477617 -37481 322174 408136 534313 979014 1360252 1037866 24375
48015 24375 -943381 -1230395 -850843 -195222 427694 875569 1079842 1051440 880386 640205
48005 640205 337057 -40081 -469324 -866756 -1069225 -937290 -553631 -218151 -150010 -294092
47995 -294092 -493788 -684751 -796265 -675062 -322279 -23548 16005 4398 225012 505725
47985 505725 406944 -103261 -546260 -542269 -185861 233750 544028 637995 455954 153799
47975 153799 -15489 -122232 -536649 -1306417 -1892123 -1791487 -1162392 -539054 -162952 82537
47965 82537 269375 339190 332559 353981 335677 142232 -104860 -117636 108010 218750 -34020
47954 -34020 -488541 -819780 -887877 -732397 -401891 47993 466473 654439 519611 171619
47944 171619 -135431 -207194 -99508 -30135 -52049 34638 319768 523270 347597 -48329
47934 -48329 -249771 -189112 -177697 -333034 -388666 -194731 -10296 -65947 -155317 48921 496727
47923 496727 856369 933016 738877 330181 -127704 -278356 93219 677656 881915 470974
47913 470974 -235990 -783020 -979660 -916295 -799891 -781103 -781759 -540859 -3540 441248
47903 441248 370809 -90790 -398556 -268760 74881 339540 501008 631257 727842 848520
47893 848520 1114872 1428042 1465613 1135183 751975 566431 404723 39340 -360326 -497667
47883 -497667 -470189 -619507 -947085 -1075391 -807960 -388359 -130194 -74469 -115152 -215476
47873 -215476 -348913 -396525 -260928 4063 279504 522038 735020 866237 832288 636024
47863 636024 396912 231280 105134 -144769 -573960 -949153 -953353 -606544 -296288 -276454
47853 -276454 -329835 -128560 243886 427604 351834 312986 464245 579709 463903 291238
47843 291238 302073 365240 128891 -464375 -1061775 -1310711 -1196220 -921279 -614296 -284996
47833 -284996 -5426 32827 -269155 -717124 -969887 -908528 -742441 -695460 -722879 -650920
47823 -650920 -463388 -271443 -92514 121021 279801 229875 37117 -46932 39449 67023
47813 67023 -104880 -271150 -171066 117158 253960 46052 -339001 -524696 -261896 285949
47803 285949 588695 258392 -444318 -827088 -571263 -74922 136870 45672 -69115 -196506
47793 -196506 -543241 -1022154 -1215159 -915651 -405707 -92442 -93283 -280010 -540969 -861671
47783 -861671 -1233840 -1570517 -1693702 -1447700 -907376 -398776 -169966 -104519 76407 409576
47773 409576 701713 867040 965352 927731 584177 35660 -329468 -329891 -209524 -194771 -131901
47762 -131901 185825 574335 648795 313288 -210084 -709794 -1059159 -1079302 -673737 -97377
47752 -97377 206334 95155 -154469 -239473 -133409 12124 47868 -119093 -432184 -609415
47742 -609415 -388488 93592 390162 281466 -14347 -245936 -462941 -782429 -1080067 -1150727
47732 -1150727 -1000631 -760032 -469398 -177248 -70106 -211844 -289036 39545 593092 813863
47722 813863 475588 -74954 -429107 -540886 -541410 -458337 -308667 -203705 -130265 159152
47712 159152 765007 1291794 1189635 430928 -402680 -765285 -707882 -708971 -1043938 -1443079
47702 -1443079 -1415389 -867830 -277615 -156615 -458232 -713399 -680640 -554242 -499505 -365570
47692 -365570 -68000 75447 -264133 -887073 -1263826 -1181184 -895972 -735315 -843616 -1237803
47682 -1237803 -1766809 -2048368 -1801911 -1267843 -967025 -1017614 -1042947 -808774 -546847 -494714
47672 -494714 -507780 -386785 -276470 -421101 -731334 -907378 -869086 -789141 -776799 -766407
47662 -766407 -674442 -473079 -143048 285422 670463 855439 798329 549819 204579 -61073
47652 -61073 -60392 168732 333646 224866 -35595 -197036 -183619 -69431 79997 181551
47642 181551 114484 -93948 -216157 -138550 -65337 -213366 -481551 -653491 -750133 -907049
47632 -907049 -1053651 -1015736 -825010 -638442 -463238 -253174 -141250 -235252 -306359 -69358
47622 -69358 322369 487804 454082 592240 915237 974183 570128 52272 -294957 -669653
47612 -669653 -1260928 -1768458 -1794243 -1411518 -975376 -607909 -235952 57264 112005 29208
47602 29208 82185 316714 504670 482528 329201 225247 285914 480565 600721 423007
47592 423007 39584 -130719 152734 590667 707901 433910 63563 -225884 -490533 -706363
47582 -706363 -694568 -435655 -192044 -197064 -387146 -529866 -487424 -285123 -31027 156353
47572 156353 198146 80909 -166407 -477810 -712652 -718336 -510651 -285695 -153190 10719
47562 10719 301284 523760 421750 77833 -176165 -229684 -312999 -603069 -950266 -1112231
47552 -1112231 -1092281 -1103987 -1273122 -1477789 -1470391 -1124477 -567919 -56665 289313 552736
47542 552736 794598 900317 766984 524626 395151 394937 352043 179898 -33279 -178726
47532 -178726 -211335 -113215 60867 133996 -19263 -269713 -376670 -305367 -217828 -194300 -199318
47521 -199318 -300426 -627023 -1055112 -1226123 -1013337 -719793 -639159 -642249 -438780 -100174
47511 -100174 -23716 -367859 -753510 -647333 36763 818851 1140917 908519 484252 186372
47501 186372 -47693 -429354 -917820 -1234026 -1199437 -884251 -469818 -135581 -25784 -135394
47491 -135394 -274909 -334639 -488933 -881705 -1220336 -1064997 -504402 -105268 -104930 -118033
47481 -118033 155971 400805 210079 -216471 -333681 17837 540511 948031 1090950 787924
47471 787924 30046 -698657 -808004 -371940 -67055 -242468 -507873 -440397 -246393 -363868
47461 -363868 -732735 -905984 -735730 -514315 -451805 -409207 -247635 -114684 -190568 -366122
47451 -366122 -397658 -259389 -118736 -23429 149604 419314 608622 627423 651217 848760
47441 848760 1076080 1072264 896299 903265 1239069 1593227 1581430 1206756 780678 491438
47431 491438 226022 -205780 -801229 -1325550 -1478910 -1137291 -500300 37326 236243 204512
47421 204512 186033 232373 196595 7796 -193553 -219846 -34186 251395 492433 577091
47411 577091 445119 133499 -198532 -374975 -400691 -516080 -941490 -1534468 -1833176 -1566130
47401 -1566130 -1027702 -762339 -909460 -1082467 -928942 -561923 -298408 -177837 30561
47392 30561 428864 815925 921843 693653 342965 178510 353897 708668 903380 772729
47382 772729 482029 284651 236761 245871 280462 379988 522817 619670 595712 392151 -14967
47371 -14967 -480956 -703167 -540310 -221873 -45971 33280 274278 669783 897051 774993
47361 774993 499207 335067 310741 331518 384983 458427 396861 42582 -524428 -1021288
47351 -1021288 -1228727 -1149436 -933628 -730567 -614804 -595770 -648679 -712141 -681496 -491738
47341 -491738 -249343 -191523 -423812 -761763 -926454 -831272 -584353 -317884 -166480 -297757
47331 -297757 -729171 -1166682 -1283921 -1161040 -1181420 -1461755 -1688508 -1638962 -1563417 -1807477
47321 -1807477 -2249007 -2400383 -2014192 -1351563 -835740 -615644 -528754 -379307 -153031 35725
47311 35725 134578 199158 230638 91045 -294223 -729325 -918903 -820626 -652725 -568823 -529686
47300 -529686 -501315 -537214 -604176 -569852 -465721 -527881 -840586 -1163441 -1280359 -1305236 -1428673
47289 -1428673 -1543810 -1380896 -914547 -417944 -180006 -326611 -798093 -1310039 -1462006
47280 -1462006 -1114970 -573070 -189640 70833 418770 737987 677609 216995 -247565 -451622
47270 -451622 -552281 -745372 -914873 -866013 -668984 -551471 -614639 -841683 -1220440 -1638821
47260 -1638821 -1793003 -1463736 -852519 -428913 -432994 -682512 -858280 -806635 -544474 -154036
47250 -154036 229009 437130 390717 156565 -160699 -513455 -829512 -922121 -631629 -73914
47240 -73914 374089 416727 118309 -218498 -401487 -490447 -614509 -759469 -782133 -577248
47230 -577248 -188936 207073 412719 358697 194272 183911 450978 823991 967251 673229
47220 673229 45684 -562568 -795211 -547790 -36750 384505 481578 226478 -270483 -801883
47210 -801883 -1092993 -984562 -644043 -440849 -516793 -606981 -404668 3305 220849 19942
47200 19942 -406203 -675311 -607003 -355219 -200577 -257253 -424889 -628455 -977346 -1545445
47190 -1545445 -2085156 -2200675 -1813776 -1224364 -686677 -205513 189306 324383 217170
47181 217170 184264 354292 394336 53826 -324913 -271663 71208 173908 -56113 -204947
47171 -204947 -57505 160025 271466 370674 464708 386395 185276 135757 224731 127311 -144468
47160 -144468 -125951 296461 529841 131253 -467291 -579304 -209981 142817 286448 343214
47150 343214 229514 -215747 -700931 -719418 -318514 -69491 -240033 -538172 -741911 -1009767
47140 -1009767 -1381610 -1497382 -1124280 -593927 -397958 -589618 -837313 -880060 -722174 -525308
47130 -525308 -462714 -570882 -688520 -677713 -664396 -817227 -960037 -788691 -466877 -518368
47120 -518368 -1008517 -1350703 -1161761 -795190 -683441 -659624 -417928 -209057 -452868 -939484
47110 -939484 -1080478 -814198 -605489 -591732 -400101 98610 481038 410923 56879 -339042
47100 -339042 -791390 -1203084 -1184152 -627610 -49252 80063 -4598 169392 501433 545957
47090 545957 354620 442867 916529 1245110 1065487 687300 530057 485850 208818 -248685
47080 -248685 -500459 -406280 -225746 -202532 -279811 -283146 -181035 -76445 -52362 -92116 -109758
47069 -109758 -57416 -28144 -177125 -466075 -600419 -384587 -59250 -61623 -469341 -931223
47059 -931223 -1181812 -1331885 -1516863 -1561386 -1274172 -870265 -738341 -865969 -865530 -584449
47049 -584449 -314268 -283970 -313044 -189411 -71509 -183769 -335391 -147190 328515 615798
47039 615798 459546 93738 -211595 -503333 -867402 -1120459 -1055161 -781988 -536046 -287092
47029 -287092 144835 648506 818797 448292 -212617 -759079 -1011343 -1028782 -939255 -881357
47019 -881357 -985907 -1266515 -1572472 -1739637 -1746986 -1655626 -1449095 -1038896 -432557 181139
47009 181139 560237 610521 437699 208819 5493 -159710 -249951 -241126 -234389 -367014 -552362
46998 -552362 -483556 -31296 508945 744265 631571 384144 63145 -419544 -929319 -1107300
46988 -1107300 -844062 -463611 -298400 -328654 -382674 -440106 -547546 -650974 -713977 -810334
46978 -810334 -910862 -803138 -455399 -219181 -360203 -604554 -539684 -303536 -403955 -901455
46968 -901455 -1269219 -1149879 -804624 -650213 -739778 -901587 -1036946 -1042976 -769250 -336021
46958 -336021 -196230 -536443 -865080 -605719 62393 403215 103609 -398608 -612437 -578598
46948 -578598 -583100 -657013 -648289 -560655 -505480 -417568 -108066 400477 820558 936980 835749
46937 835749 723957 648089 494830 199024 -163281 -473354 -668025 -729917 -667525 -551603
46927 -551603 -507162 -598506 -753057 -864788 -940419 -1048610 -1136033 -1029929 -693830 -379789
46917 -379789 -402663 -783782 -1217559 -1402211 -1330445 -1235612 -1320186 -1579317 -1843662 -1937845
46907 -1937845 -1813393 -1579319 -1404997 -1352396 -1307506 -1133982 -890370 -786026 -869480 -901352
46897 -901352 -687535 -419711 -427710 -632379 -588416 -172259 140011 -56943 -463476 -510577
46887 -510577 -224590 -156088 -491448 -764567 -576417 -126385 208638 418602 659416 821730
46877 821730 689214 347604 69357 -113299 -395434 -811948 -1152895 -1251756 -1127852 -874985
46867 -874985 -624473 -561795 -733902 -872952 -662084 -167982 229605 332335 298841 320368
46857 320368 391131 459528 557035 677597 727734 687609 652128 649372 598140 498362 453189
46846 453189 423003 188304 -302100 -743011 -810674 -551746 -266607 -115278 -18544 109728
46836 109728 206851 158105 -37766 -228827 -241838 -92623 -37218 -313628 -836547 -1263960
46826 -1263960 -1368387 -1214029 -977181 -770067 -666735 -700094 -755655 -647501 -387498 -208209
46816 -208209 -228166 -275353 -156823 70907 233745 286563 292771 295633 328821 416640 474174
46805 474174 389265 289597 466795 876219 1008656 521122 -269132 -835676 -1123975 -1367369
46795 -1367369 -1457042 -1082097 -467558 -353955 -1036762 -1903688 -2212470 -1953193 -1607668 -1369491
46785 -1369491 -1046357 -595130 -291229 -298275 -406546 -364182 -264563 -406279 -850881 -1311992
46775 -1311992 -1509858 -1486725 -1463378 -1478279 -1357029 -1049159 -779208 -732869 -765208 -630157
46765 -630157 -394817 -371222 -660886 -1021883 -1223168 -1288595 -1309007 -1242154 -1032858 -746452
46755 -746452 -435659 -42677 393014 581229 264688 -414567 -1042789 -1386017 -1501787 -1431719
46745 -1431719 -1075150 -487354 -57902 -136138 -560453 -811419 -657223 -419673 -491415 -793471
46735 -793471 -930354 -768102 -571490 -561346 -630221 -617256 -610199 -768349 -1026691 -1213856
46725 -1213856 -1340488 -1521878 -1699157 -1697633 -1517421 -1314174 -1126502 -886454 -664515 -586960
46715 -586960 -503794 -104950 546154 972909 950080 844595 1036592 1325561 1254993 783324
46705 783324 248195 -161650 -476232 -587702 -304369 179617 301661 -187198 -855090 -1116656
46695 -1116656 -909216 -622225 -522483 -521491 -461185 -364379 -320991 -305244 -265768 -327175 -697583
46684 -697583 -1303276 -1694239 -1520681 -1025320 -788646 -965012 -1096785 -837248 -514946 -641870
46674 -641870 -1090132 -1215036 -760376 -204858 -105047 -444190 -792286 -829308 -522928 -20028
46664 -20028 422040 555948 396429 244617 314996 468273 467888 356009 367008 552912 699096
46653 699096 587891 208513 -251959 -518821 -419479 -95074 76646 -81714 -306580 -276294
46643 -276294 -96035 -123747 -398861 -592445 -543320 -476847 -553364 -528487 -117279 512439
46633 512439 894065 821796 531168 374119 508951 869833 1236716 1323894 979917 362460
46623 362460 -183337 -442981 -454965 -356665 -250734 -215108 -271943 -299036 -129335 187646
46613 187646 374892 285232 130409 202425 471900 651907 606920 486403 438451 401237
46603 401237 271648 119759 94638 202727 310410 321814 245661 123166 150 -52284
46593 -52284 -5265 36871 -85175 -403770 -801389 -1151483 -1368694 -1348823 -1057922 -736483
46583 -736483 -795157 -1344788 -1985429 -2247510 -2097805 -1777119 -1303967 -541223 264549 507374
46573 507374 18809 -548122 -500355 -12100 182773 -146787 -484767 -399685 -103809 5947
46563 5947 -74862 -144405 -210923 -333373 -282552 189666 840372 1135817 972032 790971 897044
46552 897044 1043482 867252 403133 -67851 -419423 -668917 -777252 -750165 -787782 -1033888
46542 -1033888 -1284370 -1257520 -1075948 -1116590 -1378769 -1395521 -904107 -256592 63927 64700
46532 64700 92182 248796 309618 167377 19483 27312 39961 -184187 -609830 -929411 -900710
46521 -900710 -592274 -301824 -274323 -496023 -750963 -871737 -890143 -907838 -899496 -768066
46511 -768066 -569087 -518689 -719337 -995975 -1089328 -931487 -649359 -369865 -126741 76907
46501 76907 221990 308174 381685 500847 661229 736656 545684 81120 -349086 -378683
46491 -378683 -25009 308835 355997 285613 323510 337197 105549 -199911 -228889 -68694
46481 -68694 -170641 -613368 -924829 -799680 -520775 -405270 -298185 -11696 148149 -167886
46471 -167886 -664445 -781132 -599807 -700011 -1128173 -1234682 -725213 -195510 -239277 -570864
46461 -570864 -539123 -127775 122226 -26012 -283033 -409866 -502738 -626420 -581219 -213711
46451 -213711 298930 645509 721662 666823 644264 634884 412254 -230080 -1155115 -1886649
46441 -1886649 -2064348 -1788362 -1365740 -880324 -273367 283822 473322 299543 130402
46432 130402 177625 226360 3076 -447142 -892946 -1189507 -1260203 -1039677 -651127 -451831
46422 -451831 -636239 -896123 -745057 -164084 315626 234534 -264789 -637554 -575708 -312395
46412 -312395 -270709 -518343 -706431 -552969 -214596 -50873 -149729 -287171 -283829 -160659
46402 -160659 35941 285360 421376 199283 -328395 -740822 -725355 -438253 -227197 -188025
46392 -188025 -201104 -233304 -336365 -427116 -327086 -32264 222267 187766 -180854 -682951
46382 -682951 -991637 -927459 -688354 -659173 -902950 -1043820 -794692 -355671 -64681 92175
46372 92175 292805 415729 195386 -252892 -505789 -433505 -326540 -390467 -515914 -614032
46362 -614032 -754063 -836561 -563643 37565 442231 266914 -218064 -496924 -449646 -290604
46352 -290604 -152495 -97606 -305333 -819449 -1258879 -1222446 -900151 -832942 -1088861 -1156875
46342 -1156875 -738970 -178536 95432 146307 270466 475798 566386 559772 671317 951833
46332 951833 1225401 1366316 1402506 1348613 1153586 840699 515297 198076 -178317 -558786
46322 -558786 -725537 -565453 -253127 -66928 -117372 -343256 -660473 -974686 -1126182 -1004154
46312 -1004154 -721766 -534883 -557772 -678679 -784313 -923256 -1165759 -1431201 -1589266 -1651471
46302 -1651471 -1704074 -1684725 -1407411 -857987 -317557 -82284 -132043 -186501 -65722 114033
46292 114033 137205 -8972 -145501 -220193 -461973 -1052314 -1707254 -1866886 -1425369 -1009571
46282 -1009571 -1231453 -1807347 -1832905 -975185 27051 269931 -244869 -783921 -901285
46273 -901285 -843346 -972740 -1231470 -1349707 -1294871 -1260154 -1328027 -1357090 -1187737 -837662
46263 -837662 -483464 -296843 -290438 -323301 -301530 -338777 -596096 -967751 -1115144 -898901
46253 -898901 -588858 -475220 -431768 -134664 347503 516397 104550 -495200 -679845 -364716
46243 -364716 -22286 -70525 -484646 -1014311 -1489820 -1782451 -1715795 -1272366 -766883 -546987
46233 -546987 -559436 -475032 -252293 -267774 -741617 -1292889 -1330671 -775138 -136434 98479
46223 98479 -59295 -255012 -220589 27647 284045 344845 168491 -79447 -157388 50889
46213 50889 458764 840445 919740 496216 -347380 -1175900 -1525534 -1369508 -1135646 -1192525
46203 -1192525 -1446726 -1552194 -1402728 -1248195 -1339791 -1607886 -1761588 -1652554 -1457353 -1458247
46193 -1458247 -1672037 -1790923 -1549903 -1071095 -725737 -699597 -841626 -926301 -885245 -747517
46183 -747517 -551055 -413727 -510336 -821556 -1041973 -922748 -613593 -465463 -550772 -604383
46173 -604383 -446898 -233660 -184577 -247567 -203625 -30323 26456 -213585 -581600 -723113
46163 -723113 -524564 -265649 -293483 -627251 -985321 -1153345 -1185198 -1237634 -1359218 -1502544
46153 -1502544 -1618712 -1655031 -1554806 -1340980 -1124976 -982247 -916316 -970233 -1191758 -1397855
46143 -1397855 -1202057 -496449 248222 441361 79336 -254806 -84083 501881 1084184
46134 1084184 1366410 1315743 1056728 751516 487393 207982 -184749 -654049 -1035642 -1202055
46124 -1202055 -1125983 -835352 -444093 -169903 -142180 -226045 -216092 -148404 -195537 -311861 -286984
46113 -286984 -155835 -216111 -550691 -855068 -880038 -753512 -699064 -718351 -748584 -860708
46103 -860708 -1055804 -1094219 -792469 -314705 65199 310368 498655 557863 396811 123353
46093 123353 -142674 -481700 -891597 -1006133 -507419 305276 787879 736731 496251 341227
46083 341227 222819 151994 327875 722473 972900 915861 870148 1125219 1443992 1373348
46073 1373348 856784 263611 -79910 -175490 -240793 -456405 -774295 -939468 -813831 -650411
46063 -650411 -808649 -1190399 -1290771 -912773 -474134 -410046 -621024 -788835 -908148 -1123927
46053 -1123927 -1291620 -1152225 -825832 -694351 -822595 -892898 -736133 -550368 -506385 -474179
46043 -474179 -293506 -57830 48754 29083 35420 161579 374068 563615 606181 464307
46033 464307 260289 141462 58924 -168293 -520293 -677951 -383793 193304 576438 427389
46023 427389 -192247 -940570 -1469266 -1600297 -1361909 -950554 -646820 -667578 -1001947 -1394858
46013 -1394858 -1566786 -1457069 -1181246 -777244 -156589 635683 1281441 1457427 1169034
46004 1169034 713994 392817 342118 532896 783816 851359 653989 370665 230223 283901
45994 283901 454417 644220 660843 245938 -563869 -1247107 -1269549 -681531 25362 565869
45984 565869 1020754 1395994 1463581 1180660 905823 955807 1166375 1118427 660722 23576
45974 23576 -480874 -706327 -690905 -578753 -521264 -584973 -736937 -891155 -943443 -853453 -784112
45963 -784112 -1028455 -1617483 -2118909 -2071227 -1534489 -944563 -525648 -199375 8900 -51792
45953 -51792 -239257 -186657 62950 47 -524894 -916412 -641271 13733 432406 535206
45943 535206 622877 660940 373595 -61344 -69030 486817 1059600 1172494 980643 880188
45933 880188 915004 833634 516982 113820 -152359 -181227 -66559 -9864 -92605 -182257 -189399
45922 -189399 -303009 -727115 -1268888 -1518251 -1429923 -1362853 -1468633 -1422018 -941698 -250500
45912 -250500 234898 419888 463841 406342 191220 -44552 -46243 175797 298344 93779
45902 93779 -285851 -503601 -395225 -79415 183786 191284 -47437 -276704 -191032 240399
45892 240399 691995 837202 765014 884640 1363212 1838378 1854197 1446075 1037882 819397
45882 819397 557807 94293 -317437 -378405 -192107 -82487 -138707 -195434 -125144 93321
45872 93321 452499 806930 846743 480943 94783 82054 267725 202140 -98096 -203490
45862 -203490 -18332 91439 -9331 18692 345885 625335 571630 404431 377917 319382
45852 319382 39304 -210413 -164455 -82631 -319220 -620589 -459208 71685 321192 35850
45842 35850 -327549 -342032 -141280 -25953 17095 145105 332303 474122 601238 776229
45832 776229 940159 1022052 1052951 1052847 962768 785892 612645 408502 -1490 -590651 -997226
45821 -997226 -942771 -605795 -337352 -148209 221232 772180 1115316 966103 542716 300479
45811 300479 381501 503914 388026 144952 153432 599692 1238696 1631636 1544315 1075134
45801 1075134 496161 86922 49463 379608 770728 822010 473323 130688 218341 670601
45791 670601 1026436 998392 750669 560647 416438 144178 -177419 -213172 148272 538214
45781 538214 520175 143997 -128518 -24163 236867 297244 136983 56250 282295 731934
45771 731934 1140577 1330049 1337861 1326468 1385082 1442425 1394882 1260043 1115110 932289 612663
45760 612663 170914 -260781 -610115 -882668 -1012356 -915914 -729529 -725291 -885139 -831380
45750 -831380 -370561 128292 145630 -354963 -933280 -1182887 -1029817 -667389 -420588 -543816
45740 -543816 -922032 -1098118 -818182 -390178 -251328 -376884 -445037 -390967 -367794 -289610
45730 -289610 82345 619985 905271 892656 999611 1397282 1688135 1514451 1072445 751306
45720 751306 612616 514568 446027 427614 323948 53953 -198867 -234561 -103907 92612
45710 92612 438844 967671 1404921 1446933 1136440 708341 257929 -148222 -246817 144937
45700 144937 728633 970758 721702 301609 32910 -15002 115644 330773 417190 232672
45690 232672 -25277 -35811 146026 112630 -319099 -841210 -1058981 -928638 -703299 -638099
45680 -638099 -812057 -1061345 -1058008 -651914 -146731 -2415 -244992 -454226 -401832 -376723
45670 -376723 -699452 -1189108 -1376511 -1093941 -603528 -212825 22394 223897 480289 743587
45660 743587 866106 732691 380761 -32787 -379405 -613103 -689366 -540869 -178784 255195
45650 255195 583660 716426 702459 709532 892158 1186797 1308403 1081454 705832 530683
45640 530683 628307 786724 858997 864796 769770 465082 23242 -302621 -423076 -496414 -575990
45629 -575990 -466847 -102141 201368 97322 -349912 -778356 -946121 -878188 -742400 -725072
45619 -725072 -879405 -981000 -736438 -262676 -85069 -447367 -910407 -937730 -616639 -409537
45609 -409537 -402361 -288753 -18994 50889 -269787 -714244 -962618 -978934 -810502 -398615
45599 -398615 217343 782775 1103832 1209810 1102935 654025 -23700 -405200 -126911 435532
45589 435532 543534 -1457 -671262 -927949 -785908 -564953 -397023 -199773 38243 200017
45579 200017 232220 210393 194550 150846 53656 -39845 -79061 -109688 -198457 -317815 -394730
45568 -394730 -448941 -577499 -785974 -927177 -849209 -550741 -186501 2744 -205253 -803662
45558 -803662 -1403077 -1495546 -1013042 -452402 -273375 -354649 -293241 -67902 -31833 -303738
45548 -303738 -582067 -633018 -569381 -496456 -269195 141680 380119 164455 -203697 -185650
45538 -185650 251789 625216 628858 458977 390217 372975 206824 -115921 -403866 -478685
45528 -478685 -303722 -7733 189280 208162 267414 621203 1139969 1410465 1317171 1228753
45518 1228753 1451569 1786574 1877828 1756185 1696462 1683738 1416189 826967 242648 -60463
45508 -60463 -167809 -285083 -443534 -589911 -738719 -844888 -713185 -269797 191535 278615
45498 278615 -29919 -398279 -586438 -657158 -711472 -669474 -440391 -133281 65429 122948
45488 122948 124753 99299 48681 94059 375266 780554 979777 823091 543677 427071
45478 427071 417368 252696 -84197 -306308 -253229 -150140 -300230 -668955 -931519 -836601
45468 -836601 -372169 331097 1053268 1488424 1448487 1127157 955028 1091185 1241613 1113243
45458 1113243 857446 839941 1097345 1313637 1319706 1309614 1456480 1584527 1446401 1162340
45448 1162340 1101008 1356482 1617795 1637262 1596469 1820034 2252999 2461307 2161019 1550688
45438 1550688 1033485 759489 588803 418978 343854 447348 596192 556195 259559 -137413
45428 -137413 -441662 -592730 -654068 -709508 -786883 -834244 -750281 -480444 -114180 149058
45418 149058 192449 153063 343596 932860 1704322 2208846 2201586 1864781 1539711 1332212
45408 1332212 1125570 917967 902615 1139669 1371052 1333076 1104899 948149 908298 804644
45398 804644 555545 264634 887 -237379 -308755 16472 657646 1156627 1219295 1101456
45388 1101456 1193987 1406999 1315167 843735 421318 368915 474844 379565 151253 204127
45378 204127 719853 1385916 1736915 1612159 1234288 931755 837341 818676 669220 363282
45368 363282 96287 50075 165197 209475 46457 -239578 -470848 -528511 -358396 59411
45358 59411 649981 1203190 1499900 1490213 1296085 1058408 855850 751292 789410 903082
45348 903082 940374 874340 884423 1094419 1306367 1197305 792500 524210 697959 1065335
45338 1065335 1124582 767530 393171 351592 510346 532195 428605 567009 1095882 1598464
45328 1598464 1505232 767155 -67789 -439313 -257707 221927 774210 1281028 1598084 1621330
45318 1621330 1490736 1507218 1778313 2101747 2261925 2289026 2343905 2496034 2726259 3014106
45308 3014106 3280352 3354277 3173977 2958943 2997711 3260264 3377222 3057445 2438895 1972647
45298 1972647 1978510 2314227 2486480 2149148 1499555 1070820 1100126 1274680 1203777 930345
45288 930345 757387 745096 701901 595827 608457 743259 728455 438955 126878 61022
45278 61022 169825 226878 195435 197509 302884 523973 853550 1128428 1049140 573669 122061
45267 122061 104947 373453 442449 162199 -176597 -350790 -417320 -380057 -71254 445476
45257 445476 701642 347661 -338169 -725820 -514008 59384 573394 778919 668432 406529
45247 406529 208620 171955 221422 259407 285471 311152 287127 213783 185872 213068 167727
45236 167727 69825 218434 784770 1448862 1770642 1796416 1895113 2050032 1810778 1064068
45226 1064068 370254 250647 501677 565439 324208 145160 288267 643326 985740 1155520
45216 1155520 1015878 571760 158461 197193 668520 1080012 1062877 779139 612294 660575
45206 660575 724434 675009 628408 752867 1030360 1268606 1322385 1246660 1186131 1169970 1160102
45195 1160102 1284370 1747615 2377285 2568748 1999124 1163258 783598 853816 791968 465630
45185 465630 396072 795289 1089844 808222 386145 522760 1101111 1374904 1056025 625166
45175 625166 593257 957247 1417748 1706477 1649655 1290476 1003783 1139379 1511380 1594785
45165 1594785 1264914 954877 1006879 1282096 1560723 1922148 2485049 3088523 3500868 3725936
45155 3725936 3891981 4044923 4232546 4573915 5072848 5604445 6267748 7465604 9380851
45146 9380851 11654776 13930673 16491597 19894856 23965307 27487049 29006434 27856131
45138 27856131 24510568 20179952 16038485 12632286 9925807 7826036 6415927 5610943
45130 5610943 4971409 4194368 3549539 3424231 3592232 3400927 2661990 1910433 1697177
45121 1697177 1995357 2414666 2659538 2626382 2357336 2098808 2175717 2610443 3028952 3087570
45111 3087570 2825914 2476483 2130493 1766826 1434481 1197048 1013148 859835 866125 1117712
45101 1117712 1406679 1415510 1167644 1096600 1571876 2449611 3179575 3333215 2979681 2551937
45091 2551937 2404387 2559156 2845667 3131386 3323210 3284973 2960348 2540787 2309232 2308194
45081 2308194 2355054 2401530 2634922 3115483 3523608 3447480 2822759 1968627 1286861 1015548
45071 1015548 1142081 1420750 1572276 1578449 1667334 1905107 1989305 1663457 1193295 1117339
45061 1117339 1530727 1918899 1813090 1378923 1162623 1372904 1633101 1462351 847379
45052 847379 238119 34857 199109 399850 432863 376428 378982 461131 579509 745186
45042 745186 965281 1149498 1199735 1157753 1149831 1188993 1134840 883177 529656 290769 275894
45031 275894 385608 470939 561991 833099 1292429 1638694 1591019 1290541 1148454 1288512
45021 1288512 1397148 1227569 1007407 1147390 1709458 2386699 2908713 3243422 3455428
45012 3455428 3591242 3712905 3879122 4094373 4414437 5051016 6167304 7577788 8886789
45003 8886789 9999824 11307862 13276627 16051230 19613083 24099896 29565091 35272002
44995 35272002 39472241 40301727 37195034 31457122 25319973 20356251 16795808 14199418
44987 14199418 12377383 11406706 11051667 10701400 10005834 9253838 8926430 9069983 9307241
44978 9307241 9330993 9161160 8954056 8755687 8482716 8029374 7352694 6527764 5745746 5188676
44968 5188676 4863195 4594344 4215752 3740522 3319827 3064761 2952561 2887275 2787207 2610264
44958 2610264 2377754 2204431 2192853 2215485 1946751 1305177 748097 804392 1307000 1478280
44948 1478280 944861 283639 230596 665325 864187 588274 337956 493333 772125 766141
44938 766141 554576 451919 479307 454599 378881 360220 301490 32338 -324994 -466481
44928 -466481 -350141 -197329 -47983 331707 994354 1575748 1717047 1536798 1473188 1734919
44918 1734919 2070442 2070682 1609767 975321 586438 587078 752611 817447 794086 867508 1087352
44907 1087352 1359041 1675667 2101275 2500865 2552301 2138072 1518507 998138 626185 374963
44897 374963 385671 772498 1304743 1569792 1444003 1187041 1065339 1087576 1158641 1311960
44887 1311960 1673277 2264849 2926394 3443969 3791105 4253674 5195904 6588717 7871171
44878 7871171 8451662 8292002 7819898 7328920 6717811 5837148 4819528 3940309 3336342
44869 3336342 2987521 2826724 2743014 2598000 2357549 2115250 1906702 1617958 1164668 645959
44859 645959 237535 43069 99948 368520 646534 687767 504088 351425 332209 284499
44849 284499 193688 351963 841626 1220412 1120348 858178 952935 1265041 1204885 683920
44839 683920 225184 130420 184716 272340 591993 1027807 993024 308427 -334131 -274923
44829 -274923 210802 437148 339994 401289 824077 1373273 1854108 2195828 2212524 1839916
44819 1839916 1498174 1649118 2058223 2076120 1625290 1287829 1360725 1468087 1284500 1033083
44809 1033083 981505 969393 784147 578226 553035 586492 529546 546737 780024 947310
44799 947310 688440 133834 -249830 -262149 -93107 41561 73371 -25364 -216770 -305195
44789 -305195 -124459 207621 420378 424703 347394 328258 465116 832121 1324500 1602843
44779 1602843 1455390 1134056 1063404 1280243 1441023 1335910 1076381 756823 266182 -425186
44769 -425186 -1027757 -1168648 -779288 -153482 333002 550284 733615 1243614 2105075 2845405
44759 2845405 2952491 2456186 1870598 1579783 1503433 1402972 1273422 1296147 1569683 2055006
44749 2055006 2711814 3557552 4630152 5987384 7696095 9693260 11632086 12964259
44741 12964259 13270883 12530990 11056085 9211013 7280078 5562841 4381423 3827037
44733 3827037 3602411 3302439 2803479 2220532 1602521 957802 517731 585545 1044920 1387555
44723 1387555 1379459 1346339 1591284 1882087 1813683 1395104 951779 669751 541766 542947
44713 542947 550689 319558 -146081 -450810 -381151 -303856 -554439 -772143 -439132 191270
44703 191270 423435 222799 200413 518061 648798 367847 149262 282995 372428 120166
44693 120166 -92523 83152 298715 145060 -63534 218838 891658 1444288 1725292 1848086
44683 1848086 1656304 1000375 339095 325584 864146 1245063 1165642 943664 746110 376081
44673 376081 -37832 92122 924093 1781150 2026843 1835795 1679830 1530945 1112718 599506
44663 599506 457194 734806 1064221 1310770 1679391 2101853 2057604 1295577 376244 111115
44653 111115 609364 1221023 1375121 1129365 820895 515562 60777 -503848 -903202 -956284
44643 -956284 -695547 -182808 503442 1067010 1117808 653346 142492 -58926 -113009 -288266
44633 -288266 -418681 -135248 513201 1045769 1113340 775524 268762 -184829 -358957 -139259
44623 -139259 299507 688152 1039585 1566433 2242751 2774636 3038909 3203642 3318598 3129727
44613 3129727 2476835 1612832 953541 716556 922137 1487142 2139729 2474981 2319146
44604 2319146 1906996 1567561 1403964 1389513 1539227 1806239 2017459 2100798 2179885 2268902
44594 2268902 2122709 1640433 1181507 1148780 1414584 1508987 1284657 1051239 1095377 1400889
44584 1400889 1835466 2282041 2545015 2442928 2088428 1816457 1750249 1696591 1558903 1549684
44574 1549684 1810014 2090620 2082008 1875837 1785388 1803126 1581864 995703 426358 354104
44564 354104 857529 1660005 2490877 3182407 3522283 3318045 2687006 2072142 1826033 1883436
44554 1883436 1948628 1890939 1820510 1874923 2107882 2532055 3078220 3523021 3651479 3525448
44544 3525448 3425167 3485894 3561076 3502910 3401876 3442076 3654507 3930594 4188306 4429689
44534 4429689 4699975 5037156 5380822 5534656 5384313 5179368 5370755 6049072 6743091
44525 6743091 6928135 6559176 5946870 5318316 4743707 4335716 4215794 4321014 4468490
44516 4468490 4567171 4580729 4390001 3953988 3534590 3463604 3699433 3893070 3878314 3779981
44506 3779981 3622545 3217696 2579875 2098169 2055339 2241481 2305113 2258339 2321483 2439963
44496 2439963 2343160 2052550 1962746 2318966 2884057 3260547 3339575 3277158 3192967 3096130
44486 3096130 3029191 3080812 3245192 3405005 3469430 3424975 3260017 2976833 2691100 2555072
44476 2555072 2526326 2394001 2143628 2093963 2458460 2928046 2997680 2662485 2462106 2775512
44466 2775512 3370575 3780977 3875300 3884932 4076066 4573140 5327641 6078761 6509295 6626951
44456 6626951 6833562 7435625 8276408 9076900 9928425 11121792 12623298 14073237 15243766
44447 15243766 16170541 16874212 17287426 17439967 17369993 16843200 15535113 13580412 11615149
44438 11615149 10164785 9259755 8695187 8309935 7900701 7242386 6393813 5672475 5153163
44429 5153163 4543664 3775489 3311107 3489886 3887252 3793610 3158741 2592594 2487755 2587395
44419 2587395 2486213 2197453 2062269 2281948 2653827 2717792 2210198 1453401 1145892 1585316
44409 1585316 2259892 2469796 2207041 2072118 2401847 2901216 3183970 3259261 3303871 3285553
44399 3285553 3073378 2726684 2436979 2289067 2247029 2275420 2326386 2302767 2183432 2113375
44389 2113375 2230509 2456446 2587782 2554285 2455808 2356116 2173550 1825004 1396922 1091858
44379 1091858 1009158 1040129 1026173 985425 1092027 1419511 1820421 2127975 2360663 2604471
44369 2604471 2789366 2762025 2552098 2394697 2471106 2751658 3085669 3306429 3259627 2903611
44359 2903611 2419685 2079031 1964676 1950286 1944803 1966940 1952387 1729990 1315877 1032078
44349 1032078 1146665 1514009 1752104 1705475 1559589 1523911 1569316 1532504 1391457 1350214
44339 1350214 1619067 2130639 2558818 2679451 2618822 2617638 2641650 2440520 1958092 1427141
44329 1427141 1033910 769158 678444 923385 1412399 1692795 1504696 1202120 1286664 1710444
44319 1710444 2026807 2097040 2182106 2345209 2266107 1816556 1397057 1407850 1668232 1690466
44309 1690466 1367482 1067440 1114876 1470747 1925252 2339268 2624331 2708793 2662469 2705535
44299 2705535 2925631 3067779 2797491 2175133 1678025 1654734 1903955 1962014 1718810 1510652
44289 1510652 1586035 1742015 1638825 1270053 893467 634576 451659 444496 850030 1624557
44279 1624557 2322712 2606556 2688095 3019766 3658105 4218182 4450174 4571711 4904869 5399406
44269 5399406 5735962 5816019 5907070 6249270 6701429 6922188 6826607 6708255 6899528 7429182
44259 7429182 8061257 8584884 8994950 9425674 9957462 10477287 10736410 10612253 10308945
44250 10308945 10169846 10229705 10092561 9394947 8301833 7370695 6958118 6932913 6967669 6909955
44240 6909955 6792649 6661956 6565593 6642328 7047658 7735116 8386806 8647317 8459629 8146762
44230 8146762 8116849 8495332 9108298 9802030 10616144 11560112 12393096 12833376 12919568 12953726
44220 12953726 13094944 13200120 13076735 12698676 12134717 11460869 10827952 10457966 10474311
44211 10474311 10829918 11425909 12159149 12848997 13344006 13790785 14591474 15969608 17743943
44202 17743943 19625147 21524998 23448689 25335656 27221324 29333327 31744842 34075483
44194 34075483 35812199 36828152 37350915 37576527 37646029 37903877 38786655 40422247 42652083
44185 42652083 45484926 49217229 54042459 59871618 66708748 74985445 85369246 98387393
44177 98387393 114340028 133453972 156014699 182263573 211755303 242243870 269211522
44170 269211522 287276824 292920895 286315462 270914511 251684453 233445163 219742428
44163 219742428 212245063 211030328 215503867 224575604 235557240 243568944 243341629 232332864
44155 232332864 212113752 186883495 160962118 137322441 117325343 100954332 87397073
44148 87397073 75904552 66287893 58642129 52835968 48443492 45004098 42162333 39666358
44140 39666358 37380712 35211053 32935645 30284165 27318992 24549870 22444494 20915689
44132 20915689 19484811 17874742 16237933 14837136 13713055 12713132 11714545 10756846
44124 10756846 10003052 9576751 9408414 9275327 9016977 8637030 8160537 7527773 6751794
44115 6751794 6074131 5776680 5842134 5934911 5741595 5253655 4725085 4435571 4488557 4757495
44105 4757495 5009172 5111561 5109270 5090507 5058408 4979410 4861798 4700101 4434932 4088517
44095 4088517 3864061 3957580 4298532 4612889 4726220 4672837 4522893 4266225 3912782 3576675
44085 3576675 3374488 3295003 3223560 3075848 2895813 2828502 2959512 3159558 3166670 2887704
44075 2887704 2534082 2368053 2412005 2536098 2719402 3016284 3327606 3463400 3458410 3583819
44065 3583819 3957399 4339650 4433392 4233397 3961206 3778317 3684778 3612012 3510741 3400168
44055 3400168 3369995 3443652 3432173 3095457 2509359 2072820 2026112 2153585 2138928 2035698
44045 2035698 2140317 2513655 2905809 3120655 3198400 3233868 3266138 3394738 3756974 4276726
44035 4276726 4633544 4626250 4427097 4337843 4418568 4515683 4559143 4640929 4829114 5075714 5314392
44024 5314392 5497465 5516851 5252243 4764855 4296905 3983750 3719230 3462133 3519870 4229145
44014 4229145 5361897 6176857 6227394 5894394 5904005 6480793 7228511 7723214 7896965 7846594
44004 7846594 7602676 7209363 6786389 6360974 5811907 5101941 4398188 3850791 3440831
43995 3440831 3174236 3194330 3486289 3673472 3404540 2835755 2438105 2389460 2456117 2453519
43985 2453519 2495261 2705678 2963853 3079188 3037966 2944452 2852588 2765608 2697059 2651310 2636988
43974 2636988 2741354 3063195 3518019 3852270 3936122 3926280 4059884 4393730 4807263 5128350
43964 5128350 5175176 4832128 4241876 3842851 4069971 5021485 6447570 7962678 9208862
43955 9208862 9968406 10293107 10483161 10827036 11401719 12190039 13269532 14735029 16520471
43946 16520471 18487472 20680604 23344423 26680548 30704755 35325514 40412512 45757292
43938 45757292 51078983 56077337 60338054 63158455 63686380 61479488 56976207 51318429
43930 51318429 45634096 40457379 35770276 31471630 27701584 24733543 22682215 21414967
43922 21414967 20705899 20379167 20316133 20438904 20739017 21272853 22114559 23359976 25140624
43913 25140624 27508159 30288023 33179053 36047488 38992985 42037165 44838042 46788494
43905 46788494 47330422 46168697 43372141 39415823 35016185 30748685 26812729 23186474
43897 23186474 19893969 17044614 14731381 12986342 11734502 10744427 9804245 9019331
43889 9019331 8681289 8692441 8428242 7459114 6149167 5173211 4661608 4270657 3913334
43880 3913334 3820668 3886614 3597629 2825040 2145385 2049665 2268643 2270149 2083392 2167776
43870 2167776 2642530 3085074 3067977 2595047 2017476 1727902 1888706 2282272 2489430 2344690
43860 2344690 2094156 1989630 1945353 1786869 1580533 1423269 1153178 672570 386525 831511
43850 831511 1889137 2817393 3115995 2963199 2730795 2492690 2179049 1853298 1615705
43841 1615705 1488842 1552327 1912350 2387502 2555896 2346819 2272147 2759245 3509819 3886814
43831 3886814 3755868 3538084 3522262 3562756 3503109 3495481 3704359 3948372 3881271 3450287
43821 3450287 3012044 2992396 3488862 4194199 4685345 4798495 4724003 4748982 4974831 5306717
43811 5306717 5608958 5787227 5822149 5850274 6133636 6794488 7622806 8304027 8818710 9458972
43801 9458972 10448809 11713267 13063938 14470578 16082672 18082832 20572228 23507293
43793 23507293 26685394 29854760 32882381 35755253 38375369 40402582 41352750 40875049
43785 40875049 38995524 36153643 32954942 29786916 26671996 23532573 20509115 17890080
43777 17890080 15801202 14151084 12862219 11944021 11303652 10700742 9993437 9276937 8693548
43768 8693548 8259515 7960970 7829061 7774378 7515674 6867822 5996693 5218046 4652242 4262973
43758 4262973 4108962 4277143 4597714 4717141 4528697 4309999 4334333 4525293 4613650 4489411
43748 4489411 4259175 4053055 3914869 3831843 3754962 3621200 3463150 3481546 3889579 4632805
43738 4632805 5328292 5567818 5306483 4910980 4775786 4916892 5031032 4952243 4885981 5075465
43728 5075465 5382068 5429844 5135217 4847256 4907143 5289190 5777047 6272661 6751017 7086149
43718 7086149 7173831 7157593 7302547 7659985 8055821 8406187 8830660 9409658 10034318 10592909
43708 10592909 11141854 11773771 12448751 13095344 13790388 14709817 15970697 17633098 19755233
43699 19755233 22273136 24903492 27409327 29969996 33006482 36488050 39622673 41476051
43691 41476051 41804070 41041126 39548834 37244958 34110496 30733749 27979879 26168918
43683 26168918 24884120 23647443 22512749 21830127 21633359 21544111 21261441 20910401 20820650
43674 20820650 21112383 21636025 22258128 23056913 24183646 25603992 27076953 28427278 29789656
43665 29789656 31507915 33795843 36590244 39783849 43509113 48089347 53765956 60601484
43657 60601484 68624659 77901765 88394484 99829246 111703556 123233151 133193305
43650 133193305 140045932 142612422 140833588 135886357 129576118 123614631 119255304 117206943
43642 117206943 117647485 120407767 125296239 132163925 140432172 148505855 153861038 154041520
43634 154041520 147915326 136277356 121404904 105914333 91673021 79384583 68911892
43627 68911892 59875467 52033658 45346612 39888844 35682098 32477867 29725859 26929743
43619 26929743 24071689 21527523 19515962 17832118 16232463 14835029 13870044 13186172
43611 13186172 12362081 11300342 10351758 9741413 9205957 8430308 7585655 7099603 7000747
43602 7000747 6833723 6256842 5455187 4861327 4659970 4699174 4764103 4784856 4801419 4826858
43592 4826858 4778823 4545667 4131918 3707998 3451547 3346765 3216735 2966424 2718522 2672885
43582 2672885 2875614 3152132 3246373 3037159 2657844 2387002 2379745 2537654 2683387 2784031
43572 2784031 2904660 3026133 3075271 3098170 3209471 3355356 3318838 3010857 2581227 2188417
43562 2188417 1854175 1623696 1643385 1924767 2220467 2323007 2333056 2436825 2578261 2602480
43552 2602480 2590319 2728959 2900215 2756004 2279542 1955451 2200132 2825250 3262902 3209371
43542 3209371 2874474 2655733 2715617 2872411 2812766 2405896 1856503 1543729 1684978 2159986
43532 2159986 2639496 2836034 2662130 2254656 1876094 1709548 1708507 1697655 1624766 1631424
43522 1631424 1855669 2247319 2607959 2744148 2569117 2145138 1658422 1272049 972820
43513 972820 634184 234829 -93329 -258759 -325910 -375013 -355117 -164231 190490 580729
43503 580729 857752 934684 838755 710004 671059 679738 599729 417792 264403 215581 245883
43492 245883 409271 849160 1523689 2122530 2404143 2441611 2383314 2176611 1763028 1380455
43482 1380455 1362537 1684439 1969786 1942912 1660041 1309567 1009545 824978 792176 882931
43472 882931 1061405 1337274 1627315 1678224 1366426 987101 939712 1165459 1245084 1058294
43462 1058294 927621 999431 938646 515886 119643 279785 893052 1321248 1161569 580488
43452 580488 -37496 -415604 -375197 131872 867343 1424724 1613156 1569603 1470589 1352425
43442 1352425 1264581 1332494 1513187 1507636 1146464 735968 754178 1209661 1549143 1319730
43432 1319730 768984 593221 1105855 1844227 2105500 1738506 1209047 929770 798364
43423 798364 511030 94341 -125174 18411 356824 666471 891064 1031989 1015305 797245
43413 797245 513840 420186 680132 1206693 1672243 1740065 1401990 1051322 1086229 1468546
43403 1468546 1828933 1970342 2044159 2207938 2365660 2357899 2192392 1938201 1577891 1141287
43393 1141287 832369 823499 1024105 1224334 1357015 1432631 1343880 1002862 632023 646300
43383 646300 1185287 1935220 2450093 2504905 2140163 1561007 1055904 851381 947671 1163286
43373 1163286 1345328 1439068 1395424 1189704 930689 753962 584547 222425 -285422 -602354
43363 -602354 -541063 -313034 -189397 -142265 -37392 17451 -184795 -543864 -674092 -351202
43353 -351202 247102 748588 894266 684785 386967 357110 685686 1048313 1075968 821710
43343 821710 660370 773674 981706 1077568 1057215 971070 822030 713191 845783 1224949
43333 1224949 1570430 1656792 1546087 1354153 1033829 605229 375298 616283 1133471 1452114
43323 1452114 1403278 1272875 1381635 1751344 2194347 2505973 2527188 2223475 1781211 1477192
43313 1477192 1383976 1317014 1113690 857164 790659 1087691 1684974 2240968 2325891 1830059
43303 1830059 1155723 820547 907036 1116768 1294460 1546211 1811027 1748314 1263210 778926
43293 778926 682452 798081 778591 758262 1125897 1769372 2095098 1863412 1508656 1447168
43283 1447168 1507725 1345363 1068730 1052552 1314560 1489144 1375685 1165836 1096417 1163457
43273 1163457 1251377 1312545 1330464 1295803 1300034 1466633 1700706 1712794 1436992 1239067 1503388
43262 1503388 2136488 2697339 2932367 2945047 2889818 2780944 2648897 2629202 2773722 2949855
43252 2949855 3041553 3101392 3198088 3270860 3270000 3300263 3462013 3652339 3678361 3483086 3130198
43241 3130198 2688297 2293146 2180974 2423932 2731487 2776741 2649627 2694269 2943786 3071941
43231 3071941 2941392 2817472 2892956 2952751 2748885 2431381 2321276 2451832 2624339 2771693
43221 2771693 2960995 3118278 3053547 2753851 2411025 2155432 1973038 1884959 1990548 2293505
43211 2293505 2663845 3012397 3351671 3662008 3863461 3974799 4165806 4581260 5178531
43202 5178531 5746484 6022802 5851713 5350775 4869919 4634645 4479359 4104118 3524645
43193 3524645 3026700 2714917 2419404 2091735 1943844 2033897 2040072 1720198 1348680 1334461
43183 1334461 1533993 1364870 653836 -6520 33172 641750 1060964 814767 178990 -300710
43173 -300710 -483099 -625555 -885427 -1131459 -1222322 -1162646 -916013 -380120 292150 666254
43163 666254 591459 508703 823389 1212623 1054530 413701 1245 121311 286621 94812
43153 94812 -108670 162884 727816 1015761 855276 516225 197448 -50348 -52162 344171
43143 344171 898378 1182573 1134002 1029633 967921 798442 551168 485757 652997 819475
43133 819475 900865 1051216 1227082 1123343 728070 501154 735277 1117660 1219373 1069318
43123 1069318 913538 740874 450849 218429 235348 282618 42898 -282029 -175876 394655
43113 394655 893930 995818 955558 1042867 1081140 858815 632234 808359 1312368 1664184
43103 1664184 1631458 1471481 1486106 1600278 1495570 1020779 374746 -56870 -15737 409675
43093 409675 849489 981779 805900 565734 456128 493417 635736 879969 1183854 1400772
43083 1400772 1395962 1201030 987316 898893 958743 1117219 1316770 1482663 1512378 1356495
43073 1356495 1124628 1045382 1252995 1630454 1943467 2143640 2440157 3005765 3716157 4325326
43063 4325326 4840194 5504872 6365116 7067438 7244382 6936992 6427500 5781053 4855360
43054 4855360 3752882 2922563 2655748 2716462 2666773 2381526 2026250 1685794 1306596 938879
43044 938879 727681 647125 535123 454981 706878 1306945 1734722 1492196 765641 224303
43034 224303 222207 512845 768066 1026883 1444844 1860135 1924512 1605757 1284622 1292620
43024 1292620 1547170 1748155 1788430 1810673 1925007 2047294 2040396 1877700 1600959 1224062
43014 1224062 785440 434762 331154 437012 515685 395563 186136 165971 467119 929756
43004 929756 1296945 1514263 1764518 2181844 2609617 2748961 2537209 2250267 2170461 2261646
42994 2261646 2278683 2123912 1957441 1972500 2185900 2462190 2641691 2625622 2431576 2203843
42984 2203843 2104908 2172505 2325970 2483516 2576038 2468686 2032129 1365606 836019 780390
42974 780390 1184228 1690073 1896911 1660430 1182218 829381 797717 934635 950805 772844
42964 772844 570429 472266 450926 511489 752812 1118063 1300380 1099335 730615 563921
42954 563921 641856 679697 499216 245284 160021 316138 602786 845241 928825 924176 1081752
42943 1081752 1565739 2184285 2513218 2315852 1754372 1199160 926968 969650 1125057 1127014
42933 1127014 918090 720717 731719 850323 893925 952629 1209638 1460845 1234366 511684
42923 511684 -52207 130247 898000 1649143 2064038 2212799 2176069 1976170 1801777 1895755
42913 1895755 2182597 2322628 2185624 1986782 1899659 1833653 1706594 1658918 1822388 2085666
42903 2085666 2269571 2365405 2419052 2330051 1978642 1469153 1057733 874547 843355 809736
42893 809736 631925 250816 -164317 -231505 276896 1120979 1832664 2224221 2444295 2561211
42883 2561211 2387800 1832629 1199892 949289 1231484 1759398 2077545 1926904 1460263
42874 1460263 1141887 1303570 1754041 1981532 1788424 1510947 1505583 1668184 1671746 1467162
42864 1467162 1258098 1114557 932680 720028 604574 564697 448893 281773 241942 283980
42854 283980 114478 -330543 -695190 -669590 -373415 -76142 184792 440433 511472 270498
42844 270498 31701 267953 964252 1614383 1879720 1901342 1901363 1859825 1762074 1811106 2086216
42833 2086216 2236015 1906120 1382802 1389767 2149743 2997635 3153286 2634331 2081805 1807708
42823 1807708 1439223 605418 -412787 -1023873 -1093964 -1001240 -1004781 -951807 -661570 -233294
42813 -233294 180011 602613 1047525 1358499 1467355 1583035 1872541 2152777 2173144 2021671
42803 2021671 1946429 1940853 1853263 1766781 1869131 2030804 1950262 1698937 1667910 1932022 2137371
42792 2137371 2130711 2214942 2569410 2873457 2807628 2540442 2370168 2222143 1899885 1557635
42782 1557635 1476929 1563635 1527718 1455886 1743656 2464496 3207841 3583523 3554172 3254245
42772 3254245 2837419 2558268 2642010 2945708 3054586 2851053 2695887 2880538 3191380 3258746
42762 3258746 3106293 3051800 3193343 3315467 3297662 3331459 3615303 3994845 4065684 3618006
42752 3618006 2884492 2305070 2088486 2079680 2050847 1988776 1999013 2042893 1961979 1747331 1600425
42741 1600425 1684932 1959822 2291377 2573691 2684166 2496503 2059552 1640225 1463984 1504707
42731 1504707 1636136 1869624 2274254 2734628 2988781 2926362 2705743 2536756 2457767 2379507
42721 2379507 2267910 2211900 2323500 2592316 2842984 2879022 2708982 2569370 2632858 2750301
42711 2750301 2639932 2330730 2211074 2530758 3031701 3256375 3100557 2832041 2648368
42702 2648368 2526049 2510836 2771017 3185750 3242343 2689455 2049475 2045466 2638506 3119616
42692 3119616 3143888 3111166 3343515 3448690 2920212 1974915 1263305 961251 709475 394073
42682 394073 409837 1002340 1806105 2292577 2376677 2328079 2303819 2235916 2064661 1858646
42672 1858646 1744729 1842282 2186782 2608719 2795686 2614318 2284851 2096611 2039517 1899273
42662 1899273 1671846 1661383 2091946 2765396 3227324 3228379 2925476 2633668 2485745 2407710
42652 2407710 2350884 2381235 2499713 2542208 2403698 2261344 2384878 2749872 3019860 2933640
42642 2933640 2561197 2156021 1908256 1874928 1987098 2061218 1954980 1787861 1861629 2278720
42632 2278720 2794981 3161708 3444896 3818380 4154797 4073185 3423228 2549561 1984839 1946352
42622 1946352 2193241 2342848 2259329 2101677 2035275 2012029 1905454 1768628 1803550 2081195
42612 2081195 2433151 2655210 2715182 2739465 2896632 3300145 3897396 4424218 4586834 4328946
42602 4328946 3843250 3350131 2986238 2835167 2837794 2692168 2125296 1321832 802966 779849
42592 779849 911856 850464 729053 891160 1371837 1891736 2174294 2055043 1504225 805396
42582 805396 489352 766167 1193928 1244368 1031302 1091014 1568283 2074408 2328466 2487920
42572 2487920 2777552 3197697 3708930 4323414 4856985 4944166 4513547 3965198 3659132 3482540
42562 3482540 3167494 2813959 2789344 3206380 3764127 4089857 4062787 3812091 3527871 3284320
42552 3284320 2996645 2575901 2117588 1830990 1780852 1855835 2005391 2281374 2571492 2570262
42542 2570262 2211125 1893507 2004032 2371035 2513194 2348004 2298087 2654552 3159097 3369187
42532 3369187 3212111 2982571 2918680 2978904 3008093 2967481 2956005 3067255 3266818 3421384
42522 3421384 3461543 3481671 3598961 3721799 3595389 3149997 2671342 2481941 2553221 2633629
42512 2633629 2693892 2949923 3394800 3647499 3482001 3227667 3315776 3625890 3700463 3509641
42502 3509641 3495639 3789196 3900652 3441312 2729711 2331799 2311572 2319017 2178878 1976738
42492 1976738 1729874 1415971 1257542 1553971 2212067 2782321 2980580 2888476 2670962 2420431
42482 2420431 2265302 2296642 2374055 2305537 2182696 2197293 2203100 1916293 1534871 1624284 2290274
42471 2290274 2996339 3361042 3583629 3841887 3858862 3464785 3070927 3074901 3189438 2899957
42461 2899957 2275398 1761988 1421111 987965 553058 551427 1049328 1577947 1765929 1700320
42451 1700320 1582885 1450285 1352893 1432728 1666564 1824226 1806754 1768976 1824930 1908008
42441 1908008 2002888 2206828 2428526 2330191 1779612 1138921 879632 1051228 1325922 1465943
42431 1465943 1549069 1755144 2079824 2312130 2261312 1973262 1690024 1597760 1683219 1843289
42421 1843289 2003258 2078101 1990614 1828017 1788754 1846257 1705776 1283448 941421 958504
42411 958504 1069789 947139 862176 1303589 2079469 2442233 2119877 1605445 1333567 1206345
42401 1206345 1126519 1343376 1906119 2327609 2239782 1945044 1862015 1829344 1483419 992030
42391 992030 809537 899882 816473 495594 400575 819229 1488734 2014475 2260051 2218200
42381 2218200 1886956 1460311 1340800 1737373 2413085 2971756 3254590 3362590 3447408 3589177
42371 3589177 3755003 3787881 3551314 3159221 2933388 3026814 3192409 3062728 2621439 2264209
42361 2264209 2352549 2790722 3140229 3148349 3046335 3238705 3788698 4360945 4621364 4502884
42351 4502884 4099961 3556605 3115058 2999640 3105510 3035445 2623306 2213352 2225784 2644249
42341 2644249 3146691 3536279 3778677 3798540 3558679 3232215 3004853 2798331 2453128 2056783
42331 2056783 1792994 1604798 1357726 1209603 1408622 1810066 2044758 2125731 2395711 2866740
42321 2866740 3164062 3220074 3422662 3842331 3914459 3297452 2553925 2466808 3024846 3607287
42311 3607287 3901143 4069625 4190582 4146985 4057226 4234387 4608543 4687350 4271444 3777427
42301 3777427 3603759 3541140 3142673 2439134 1921522 1896262 2163501 2352626 2355571 2351368
42291 2351368 2520410 2817630 3012042 2933651 2670059 2480927 2521331 2718134 2925379 3093602
42281 3093602 3231110 3305459 3287880 3232033 3202856 3168141 3061645 2915432 2813039 2736885
42271 2736885 2600035 2427491 2342935 2335679 2224436 1957830 1771047 1865743 2086233 2165578
42261 2165578 2188688 2470457 2971735 3234891 3065456 2910962 3245323 3835016 4024866 3637396
42251 3637396 3164952 3059488 3224251 3310734 3174327 2867520 2473060 2170071 2249940 2804208
42241 2804208 3497675 3857129 3733760 3357437 3036527 2947107 3118300 3452254 3788883 4049601
42231 4049601 4265398 4423063 4431575 4326248 4315400 4477065 4607200 4565661 4559501 4799827
42221 4799827 5062681 4963095 4559683 4265825 4182975 3986533 3565761 3298473 3445275 3680807
42211 3680807 3590335 3336473 3395495 3787418 4027067 3833170 3471632 3288058 3239443 3078930
42201 3078930 2769372 2499734 2436057 2646763 3155451 3848591 4389341 4458992 4119561 3756428
42191 3756428 3605682 3510867 3246103 2913385 2839765 3169034 3747994 4369657 4903981 5178528
42181 5178528 5003727 4466243 3996157 3930699 4130480 4241138 4227634 4360040 4686151 4849511
42171 4849511 4567440 4038249 3663999 3530674 3404620 3167656 2996398 3066022 3265091 3311166
42161 3311166 3065172 2650175 2294121 2101863 1967835 1702389 1264277 857528 758914 1058507
42151 1058507 1611296 2211733 2724522 3048294 3090615 2879431 2626861 2551565 2632243 2638536
42141 2638536 2444669 2231712 2301934 2721127 3222116 3480861 3443132 3348760 3458032 3796839
42131 3796839 4184159 4478131 4734955 5089092 5521071 5842281 5939453 5937764 6030104 6210717
42121 6210717 6318735 6336288 6476177 6898357 7468078 7910645 8117225 8162277 8078672 7787013
42111 7787013 7259029 6595553 5878079 5066016 4153029 3362117 3038138 3284025 3760619
42102 3760619 3947103 3649675 3202117 3078624 3336421 3575021 3458825 3084550 2725339
42093 2725339 2436681 2170123 2114882 2532338 3230931 3599059 3337418 2862207 2759809 3095434
42083 3095434 3534741 3924493 4376944 4877018 5192384 5192461 4940893 4450347 3683729 2867488
42073 2867488 2432722 2467896 2559412 2412776 2313310 2625275 3096449 3143684 2747877 2565760
42063 2565760 3059129 3927324 4568160 4730976 4482251 3885134 3098512 2576874 2718049
42054 2718049 3332728 3820032 3884268 3746275 3621536 3397948 3005223 2732102 2857911 3198566
42044 3198566 3360484 3310913 3352293 3596234 3813536 3817605 3668064 3439107 3116848 2840189
42034 2840189 2905501 3317616 3615834 3420776 2942131 2645842 2602932 2536395 2398083 2451369
42024 2451369 2741059 2908459 2714227 2420123 2418127 2721567 3073063 3365626 3677013 4013091
42014 4013091 4311055 4638385 5101690 5563867 5730190 5560232 5331283 5212826 5056975
42005 5056975 4772773 4633058 4906761 5343085 5402046 5013011 4744530 5061308 5699039 6043590
41995 6043590 5942508 5789381 5860913 5977382 5948870 5991615 6399449 7023770 7444595 7572091
41985 7572091 7725726 8136828 8731392 9421405 10175060 10659653 10301635 9057018 7750926
41976 7750926 7187445 7171802 6925240 6276614 5802952 5811659 5891984 5691824 5501093 5675736
41966 5675736 6006290 6165659 6391881 7133655 8244185 9119707 9525371 9703388 9710349 9287680
41956 9287680 8504890 7910874 7750924 7524491 6700168 5505043 4589586 4168696 3933345
41947 3933345 3663483 3477614 3473355 3489189 3328634 3010537 2728500 2692516 3004602 3550417
41937 3550417 4031056 4224533 4163746 3944453 3505076 2828827 2234963 2113952 2367614 2473002
41927 2473002 2213707 2011717 2315610 2922270 3210814 2924334 2420495 2166491 2247836 2447252
41917 2447252 2615133 2814170 3148432 3549653 3764054 3560436 2970522 2308137 1909996
41908 1909996 1857251 1986669 2163909 2463343 3008803 3675812 4087699 4000965 3622314 3388712
41898 3388712 3426726 3407877 3030300 2474299 2198720 2384351 2787041 3093157 3195803 3127512
41888 3127512 2971962 2907443 3101420 3443131 3584740 3389012 3132361 3067708 2979282 2475977
41878 2475977 1656257 1151430 1418759 2206114 2836752 2890244 2495395 2060388 1862034 1892527
41868 1892527 2002525 2114450 2262839 2442293 2501417 2272325 1787473 1288695 1008679 992911
41858 992911 1134030 1319216 1525315 1807840 2209239 2661707 3003262 3128165 3096291 3045080
41848 3045080 3023692 2983451 2909805 2867384 2893640 2931664 2925028 2935651 3097406 3435335 3765511
41837 3765511 3829099 3557507 3170292 2952706 2963046 3043291 3081978 3104031 3078319 2855978
41827 2855978 2437891 2108082 2070849 2089874 1789870 1279456 1136608 1674692 2496222 2948520
41817 2948520 2832570 2473050 2229588 2161093 2121326 1988315 1775965 1633691 1742047 2113079
41807 2113079 2491557 2555950 2266035 1963882 2072784 2669537 3356406 3604121 3278116 2801469
41797 2801469 2728007 3178308 3780835 4118318 4073662 3751286 3285248 2822968 2516330 2390823
41787 2390823 2350232 2412897 2773182 3483204 4256261 4791573 5124097 5386065 5378312 4771117
41777 4771117 3729686 2946739 2897553 3326342 3634210 3566342 3344709 3298828 3570701 4088100
41767 4088100 4647448 5051595 5265992 5401672 5515017 5549431 5534249 5665834 6054015 6533907
41757 6533907 6892897 7153866 7441136 7679491 7661588 7353768 6897242 6340721 5636828 4923943
41747 4923943 4531503 4593733 4877202 5124916 5375649 5768693 6194201 6371500 6216726 5924741
41737 5924741 5681317 5458634 5134723 4697333 4277434 4045170 4091292 4350123 4633495 4801802
41727 4801802 4890734 4989761 5026751 4834398 4482739 4363349 4756494 5389572 5655913 5327386
41717 5327386 4864466 4881653 5416075 5902880 5847357 5347269 4912174 4918900 5335976 5862630
41707 5862630 6186534 6138103 5739166 5162261 4606916 4198653 3999405 4031435 4205989 4293061
41697 4293061 4109862 3754378 3524410 3555931 3651358 3542593 3235449 2985877 2978001 3140179
41687 3140179 3288186 3355157 3425578 3587981 3823789 4052220 4235352 4393674 4537455 4642905
41677 4642905 4703854 4750452 4811937 4942818 5291051 5986859 6880064 7563887 7841314 8014887
41667 8014887 8437661 8873354 8678391 7656845 6344680 5296428 4477347 3632549 2894771
41658 2894771 2585319 2614092 2566120 2339746 2251762 2473818 2789828 3025909 3329482 3831967
41648 3831967 4355629 4674864 4818918 4931184 5087509 5426371 6118825 6928976 7161503
41639 7161503 6490588 5590761 5407348 5926578 6268710 6012732 5760477 6128087 6764469
41630 6764469 6846942 6186542 5314578 4658020 4149741 3621580 3107528 2660808 2242483 1933377
41620 1933377 1956647 2319779 2668275 2669863 2363607 1984800 1646597 1380298 1298235 1464938
41610 1464938 1721108 1878642 2005799 2271398 2578818 2651803 2478970 2356607 2406656 2349510
41600 2349510 1929770 1341856 1007320 1054936 1226705 1233765 1040060 838722 885298 1315215
41590 1315215 2001220 2610662 2886763 2838346 2613462 2306266 1986664 1780294 1743478 1738513
41580 1738513 1605124 1402896 1329427 1454446 1684893 1921130 2083257 2070417 1893231 1763905
41570 1763905 1828774 1895976 1701289 1372085 1286827 1484352 1593975 1428244 1264604 1377049
41560 1377049 1626211 1731891 1680337 1638145 1689452 1858124 2162958 2457507 2459760 2146969
41550 2146969 1857795 1780694 1656225 1286489 997620 1160793 1525246 1554353 1258806 1121757
41540 1121757 1252289 1222198 845265 559167 790407 1355229 1757125 1776882 1538766 1246282
41530 1246282 1062059 1046275 1059769 927778 793454 1032933 1684886 2267684 2364632 2123003
41520 2123003 1954850 2004334 2168017 2403561 2706566 2939556 2983092 2954198 3018176 3082125
41510 3082125 2927568 2571099 2254377 2130779 2174801 2347857 2646640 3016876 3380540 3697924
41500 3697924 3876268 3740479 3278510 2791883 2574390 2533378 2366862 2035203 1789143 1766989
41490 1766989 1840668 1885825 1961555 2151741 2397834 2549351 2475584 2132694 1630935 1201113
41480 1201113 979719 884356 807248 810524 968568 1155831 1209329 1178635 1172959 1096178 833557
41469 833557 579931 617954 844058 921747 881839 1109093 1655848 2035391 1892142 1489274
41459 1489274 1294288 1401505 1609469 1789089 1914070 1944494 1904772 1882801 1792915 1407459
41449 1407459 813405 515643 797748 1261765 1339128 1020299 718508 628555 633692 689623
41439 689623 856129 1021531 1013690 948388 1071081 1284199 1256011 1014285 991480 1389751
41429 1389751 1903349 2189515 2232573 2112242 1820161 1505102 1504527 1859700 2140772 2056977
41419 2056977 1924696 2174661 2675386 2973149 3004502 3098377 3366361 3566603 3571966 3519490
41409 3519490 3426266 3099810 2585014 2287424 2403245 2572358 2416220 2146534 2245648 2700890
41399 2700890 2987987 2794430 2348658 1943012 1524621 1003964 679152 971281 1793555
41390 1793555 2511423 2622136 2271846 1987834 2053790 2302043 2426021 2304232 2014647 1703812
41380 1703812 1522716 1580930 1858494 2212971 2542309 2861365 3115127 3026151 2364756 1393953
41370 1393953 787808 927253 1423491 1557970 1129813 639880 635882 1109982 1626600 1844499
41360 1844499 1762519 1582161 1503746 1603527 1764944 1750873 1455249 1064652 879026 1003860
41350 1003860 1307811 1624562 1864653 1974706 1965572 1997808 2266304 2730048 3086159 3087011
41340 3087011 2769195 2291828 1686579 930374 205240 -119489 139253 704092 1061491
41331 1061491 992316 793483 877765 1216859 1378673 1156439 901871 1028856 1399421 1536584
41321 1536584 1331068 1119000 1060739 926783 656015 633039 1072448 1537145 1536380 1306262
41311 1306262 1437289 1897236 2062017 1723338 1416089 1548588 1783841 1625374 1161838
41302 1161838 811237 664112 538491 455233 583439 838417 984719 1080605 1391645 1876073
41292 1876073 2175629 2144795 1974059 1738654 1285894 698353 377286 417216 367624 -23022
41282 -23022 -260728 201310 1058945 1549046 1544953 1581901 1831670 1794330 1211255 611796
41272 611796 549788 807126 852925 731664 933480 1562471 2170538 2387211 2280264 2078817
41262 2078817 1910396 1843044 1862631 1785748 1499618 1275578 1487922 2011182 2305578 2173198
41252 2173198 1986128 2013193 2003149 1739933 1581945 1996642 2820171 3443942 3596677 3513829
41242 3513829 3424154 3314320 3201336 3205574 3250847 3052594 2557200 2099061 1939986 1893846
41232 1893846 1626483 1164150 872529 997358 1410812 1799147 1965309 1932329 1849477 1854153
41222 1854153 2001046 2269742 2584038 2813461 2821960 2570028 2135519 1613790 1082360 701687
41212 701687 697205 1095089 1582081 1812447 1796401 1803100 1938188 2047655 2032024 1998557 2022481
41201 2022481 1972401 1707891 1316083 1027045 971108 1098895 1268960 1350172 1294502 1152986
41191 1152986 990592 811643 642576 631140 916430 1408256 1840390 2055508 2116929 2153807
41181 2153807 2237874 2393392 2566639 2597058 2377192 2009980 1647582 1273499 888132 778617
41171 778617 1206833 1864052 2110528 1845485 1654172 1916194 2277802 2304549 2157287 2183000
41161 2183000 2254744 2056680 1719835 1598976 1637561 1557987 1522819 1929410 2578272 2750750
41151 2750750 2238911 1642239 1414001 1239934 728274 179125 175195 754780 1459414 1957150
41141 1957150 2188343 2103930 1718629 1315227 1182630 1211725 1110841 933318 975951 1187248
41131 1187248 1139249 681705 213358 136280 392080 740612 1161057 1682638 2080167 2110997
41121 2110997 1930834 1917154 2116305 2201061 2003328 1756264 1690448 1687097 1537207 1317958
41111 1317958 1247308 1308448 1313755 1278310 1417096 1745886 1988148 1985356 1929067 2015790 2106816
41100 2106816 1965286 1657361 1443676 1375624 1284786 1127676 1048998 1081597 1053286 862034
41090 862034 617330 431549 284255 179577 224350 437711 677572 865339 1074813 1277460
41080 1277460 1254045 959959 734256 868286 1168576 1284167 1302898 1587606 2069173 2200704
41070 2200704 1756505 1240781 1214321 1521656 1546767 1069340 487108 213896 210880 234243
41060 234243 291577 616414 1243758 1806750 1861845 1386065 849201 718627 946550 1079980
41050 1079980 874121 599682 628332 892010 980688 700632 277633 -15134 -184404 -364133
41040 -364133 -528523 -525292 -299585 55115 413532 688267 855120 1003218 1266168 1583328
41030 1583328 1638283 1216024 548597 84482 -66786 -220349 -607163 -1022389 -1099204 -742331
41020 -742331 -150386 424903 776669 757687 429681 129569 165094 453149 640792 575487
41010 575487 459109 507150 658632 724078 667024 596129 558345 484732 334966 191635 176721
40999 176721 325053 575749 855182 1099572 1182818 933902 370871 -113285 -17427 694071
40989 694071 1436858 1606114 1254027 992159 1264200 1900537 2386493 2392364 2010717 1621527
40979 1621527 1561792 1812351 1999023 1809872 1373729 1074225 1049416 1105123 1092895 1070272
40969 1070272 1040303 878893 676006 805903 1374340 1854590 1637569 817442 83233 -112580
40959 -112580 59762 242250 345184 444032 508788 459211 360755 373675 535989 716647
40949 716647 793423 813900 941061 1226815 1473317 1417765 1095990 899241 1139832 1631105
40939 1631105 1854702 1531400 900349 441619 433582 763593 1054076 989644 638536 430049
40929 430049 689432 1229109 1553449 1438901 1121656 911389 846189 806933 771565 812845
40919 812845 959556 1191065 1519654 2002954 2695864 3574578 4431263 4904077 4788598 4310258
40909 4310258 3882286 3577840 3094735 2315183 1607093 1382383 1586649 1851463 1965176
40900 1965176 1944784 1803199 1545939 1323327 1307249 1442520 1547428 1610180 1740621 1875225
40890 1875225 1808069 1507567 1133904 757947 376759 209029 565807 1291974 1737515 1543797
40880 1543797 1131248 1085370 1339404 1380618 1090763 897698 1097332 1465260 1660878 1671001
40870 1671001 1678024 1745850 1826548 1895269 1909746 1788443 1585873 1545744 1806210 2164543 2307832
40859 2307832 2185109 1975751 1777163 1544112 1317956 1295994 1601858 2110934 2557913 2741510
40849 2741510 2617360 2289889 1939909 1687479 1513477 1365020 1291275 1371259 1546319 1660957
40839 1660957 1652363 1548242 1291092 772976 107114 -334224 -282932 151563 672807 1115806
40829 1115806 1453114 1653371 1745664 1923608 2339350 2806405 2922909 2525854 1858926 1272668
40819 1272668 938798 886828 1085585 1357146 1412056 1187486 1042558 1377588 2077861 2562720
40809 2562720 2443213 1942445 1560872 1482558 1471266 1257476 836849 401200 146813 181699
40799 181699 467607 781755 857742 656451 416487 370604 510259 696822 861230 959870
40789 959870 873021 563640 276099 349858 819988 1365543 1645442 1533823 1093275 563467
40779 563467 345816 678458 1257726 1494761 1268069 1099964 1403373 1891903 2035282 1812330
40769 1812330 1608993 1546253 1371165 991648 685658 664739 749645 643031 323936 33182
40759 33182 -9180 213992 531145 752376 898824 1215787 1849149 2603250 3188131 3591339
40749 3591339 3962774 4245759 4275028 4221692 4539195 5338589 6129496 6342325 5874648 5014417
40739 5014417 4100411 3414150 3137333 3190644 3273796 3204254 3037230 2777175 2284719 1653429
40729 1653429 1340228 1597493 2014620 1988677 1505631 1102652 1146938 1496867 1840635 2040251
40719 2040251 2107791 2102458 2103616 2111881 1994303 1702865 1470422 1539359 1744147 1663988 1218949
40708 1218949 824114 851687 1172502 1363952 1212793 888031 711799 841269 1120631 1224313
40698 1224313 988894 554823 124830 -267168 -583606 -565563 -10870 804745 1350291 1497967
40688 1497967 1588038 1770807 1715789 1200001 604772 457378 696429 781591 450959 18177
40678 18177 -100977 124578 406157 491050 358302 177802 153177 338667 556857 528810
40668 528810 121282 -514565 -1018873 -1062815 -619041 -28251 309833 364426 468648 811903
40658 811903 1112402 986078 522906 223447 354841 632102 653410 446630 380840 628353
40648 628353 946532 1036734 944431 966627 1231112 1521751 1545774 1253015 821722 437431
40638 437431 220694 310729 810870 1568318 2149746 2192320 1764589 1283244 1069680 1067603
40628 1067603 1017838 827051 671087 736157 956051 1095173 1062099 1020995 1148143 1381326
40618 1381326 1506644 1434560 1280044 1187643 1171805 1133757 976420 717248 529394 613039
40608 613039 961125 1337385 1579546 1798982 2109402 2291843 2030146 1458320 1130335 1332213
40598 1332213 1719186 1817312 1622080 1436457 1318985 1054669 630079 388446 605783 1143685
40588 1143685 1664211 2033372 2346904 2646592 2810611 2749582 2548176 2303148 1926584 1293039
40578 1293039 573500 205194 407999 888372 1192202 1223354 1193887 1171718 1004620 710079
40568 710079 598690 853463 1238469 1423597 1414164 1442015 1556107 1550156 1261219 777875
40558 777875 365552 279959 599444 1138573 1563980 1662271 1453587 1046646 531464 63965
40548 63965 -134621 2475 293054 527368 640315 591677 305592 -110607 -311309 -103096
40538 -103096 276555 484398 500036 502690 521985 503025 540886 712976 820102 654976 406349
40527 406349 405125 579842 615855 576437 822485 1286612 1418219 1027630 629729 662775
40517 662775 867346 815110 609100 585385 663980 543123 329557 405964 736164 836753
40507 836753 499395 96936 56231 386042 838138 1191202 1237273 840495 244780 43123
40497 43123 544983 1339275 1754773 1625938 1325003 1142812 994744 760161 551264 473960
40487 473960 389028 152554 -81783 -73651 97982 150618 99293 307613 943502 1674610
40477 1674610 2066721 2044276 1776638 1362476 892260 612881 690506 921769 995781 934801
40467 934801 927415 840307 369854 -303104 -513725 58952 979946 1682907 2111614 2466028
40457 2466028 2687291 2595130 2307270 2121630 2089619 2023107 1831575 1569600 1237425 806713
40447 806713 385255 131402 75174 196445 524366 942366 1097297 808833 401894 297264
40437 297264 434878 484404 459897 634663 924794 907812 504229 118895 -12362 -109039
40427 -109039 -304290 -327037 -4521 363027 470218 480485 679099 981793 1166817 1295702
40417 1295702 1476936 1462792 969455 257871 -81548 124950 511570 745309 809270 745191
40407 745191 560122 441471 642780 1046697 1225574 1069564 973444 1210214 1483743 1376488
40397 1376488 953132 604649 493148 470957 428812 421269 492995 624918 831864 1122222
40387 1122222 1393177 1536021 1594539 1644701 1586629 1279464 858426 678867 898874 1299283
40377 1299283 1558579 1539994 1280200 895950 583666 530354 699932 827022 720507 460433
40367 460433 217099 30200 -106427 -98980 109717 358230 447459 465571 696534 1174212
40357 1174212 1551562 1520347 1197936 962723 1019320 1274762 1564918 1812764 1949538 1854190
40347 1854190 1489957 1040584 796393 881254 1141476 1324226 1327175 1246151 1219849 1289990
40337 1289990 1403169 1474002 1415808 1166691 738739 226521 -247559 -565751 -611936 -349346
40327 -349346 44045 233684 46291 -324208 -535262 -460518 -218211 80809 418959 732077
40317 732077 902860 935014 946169 948707 854869 766965 989244 1567504 2050916 1985481 1506229
40306 1506229 1151851 1170067 1311269 1295004 1155192 1033870 919393 771115 713404 888910
40296 888910 1197082 1357564 1221790 901775 585498 321405 36075 -265635 -394352 -160539
40286 -160539 323523 667816 663554 609620 953649 1633608 2057465 1830785 1243854 852759
40276 852759 795372 790048 666251 547516 511400 418638 229572 228578 687794 1430694 1977251
40265 1977251 2099118 2015515 2011035 2074394 2029771 1853662 1670582 1520104 1343593 1192842
40255 1192842 1229176 1441609 1559697 1385571 1076626 937811 1025789 1124989 1048956 789981
40245 789981 416346 17683 -249317 -250846 -49232 160225 297462 422553 515845 452364
40235 452364 249325 112181 131732 155108 96819 148192 459717 803021 835460 603866
40225 603866 488729 666446 905479 933872 748997 471720 138357 -187542 -276629 40082
40215 40082 543949 758814 491600 101870 103284 563577 1056104 1207577 1105709 1055013
40205 1055013 1103544 1051790 863748 767282 870366 945788 771561 494328 442150 691749
40195 691749 1022845 1221453 1235236 1088997 846724 639439 561418 547085 487657 433922
40185 433922 532894 798584 1101299 1349059 1518889 1549391 1385992 1117172 901375 790620
40175 790620 786341 981223 1398999 1749777 1652975 1136154 640416 492324 642599 949161
40165 949161 1366746 1743894 1785506 1424283 966034 690941 577602 576868 809047 1234683
40155 1234683 1478710 1335002 1148932 1289176 1505092 1310267 822518 641666 930774
40146 930774 1204766 1127791 975620 1097193 1385760 1571708 1664867 1778846 1800052 1567963
40136 1567963 1185401 845486 521730 133809 -130797 -6352 410798 744813 857958
40127 857958 978475 1269883 1576072 1733176 1897057 2334580 2981500 3422603 3352771 2940430
40117 2940430 2645775 2710346 2925399 2944442 2720327 2496157 2411348 2322338 2069957 1724824
40107 1724824 1428599 1149526 790144 444342 329792 479476 684205 764042 752722 782904
40097 782904 907988 1074621 1187375 1184714 1121446 1164711 1429553 1842043 2243180 2568909
40087 2568909 2815089 2912362 2831193 2767976 2980767 3403849 3663442 3562034 3318568 3195905
40077 3195905 3111920 2828775 2374062 2035945 2012699 2267679 2667570 3057368 3247256 3160975
40067 3160975 3003422 3054617 3258952 3251495 2881803 2481359 2442175 2706528 2895103 2833596
40057 2833596 2697667 2654616 2621032 2466774 2264743 2185567 2250872 2343726 2408489 2490409 2596724
40046 2596724 2678259 2780407 3050761 3489217 3807975 3713831 3317572 3109676 3468147 4273051
40036 4273051 5057525 5462042 5474978 5307988 5168886 5163207 5298601 5503597 5680563 5806985
40026 5806985 5973931 6269202 6625109 6849987 6841114 6706789 6622880 6624131 6630472 6641983 6754917
40015 6754917 6942442 6983669 6758724 6523362 6688629 7308050 7955932 8207149 8125591 8148830
40005 8148830 8534443 9068062 9372654 9402902 9493185 9907832 10500279 10945157 11187924 11417919
39995 11417919 11619089 11502235 11065582 10894924 11522544 12642941 13400724 13442462 13256051
39986 13256051 13399585 13846982 14293893 14676319 15036779 15201008 15024213 14781052 14876174
39977 14876174 15235836 15385099 15124060 14753425 14570068 14478988 14238208 13836405 13478866
39968 13478866 13354053 13498390 13752552 13810299 13463991 12833824 12214896 11719879 11259041
39959 11259041 10824005 10512924 10263386 9872932 9364185 9020087 8924911 8770860 8311250
39950 8311250 7743000 7409603 7338051 7316195 7258384 7233817 7240806 7191779 7067552 6912772 6738903
39939 6738903 6560073 6430005 6327833 6138154 5867515 5714788 5766553 5794814 5559041 5167690
39929 5167690 4932295 4973673 5147458 5237135 5077705 4667230 4306360 4378445 4790254 4943799
39919 4943799 4558173 4162205 4327049 4747571 4713748 4290203 4265007 4898917 5482259 5374020
39909 5374020 4839520 4503304 4491429 4531057 4494892 4404263 4184893 3848936 3712064 4024586
39899 4024586 4517914 4676997 4390093 4037945 4000292 4314666 4754344 5025657 4949820 4637024
39889 4637024 4430705 4559007 4930271 5329647 5612438 5618009 5211896 4629251 4447205 4872446
39879 4872446 5314972 5080097 4306926 3778905 3901802 4323281 4549412 4489815 4307194 4112183
39869 4112183 3967724 3936291 3991198 4055047 4159166 4360475 4502899 4324271 3839895 3367833
39859 3367833 3125772 3047588 3028472 3053446 2999713 2632373 1983496 1490719 1526096 1920883
39849 1920883 2154125 1947905 1540177 1396058 1715791 2220039 2453740 2344931 2323998 2715726
39839 2715726 3169385 3026214 2215594 1407526 1196230 1482491 1804341 1942324 1971098 1969711
39829 1969711 1945361 1911774 1872963 1850159 1994134 2438868 2943804 2992278 2451276 1842258
39819 1842258 1686542 1840767 1801756 1445631 1081284 914333 861355 842119 880692 908443
39809 908443 790073 570901 417085 310665 110353 -72705 81791 580635 971871 905535
39799 905535 575686 390435 415350 396755 200027 -44605 -188747 -217634 -124249 179205
39789 179205 727432 1370032 1859547 2049162 1975502 1792915 1674300 1730031 1921890 2035007
39779 2035007 1836655 1347831 894615 781707 949240 1068110 940553 653313 349120
39770 349120 52361 -217211 -352918 -302635 -163502 -32433 106721 261729 359929 401231
39760 401231 497695 621596 515644 56832 -453222 -584500 -244364 339642 935858 1371983
39750 1371983 1455765 1148351 736040 553929 611202 726421 884270 1140491 1320180 1211867
39740 1211867 975387 928970 986195 782646 359524 185483 399710 579915 464777 378154
39730 378154 622900 912582 799089 323246 -140928 -407907 -495345 -398781 -224226 -285809
39720 -285809 -671732 -936836 -643111 -15661 365159 352513 258673 239433 169208 78434
39710 78434 193947 491761 667829 639021 655615 818985 899019 763560 589559 467302
39700 467302 171596 -425830 -1015394 -1189661 -921578 -496673 -168802 -78942 -306225 -752868
39690 -752868 -1107616 -1137713 -937160 -744630 -632275 -521211 -388548 -296813 -283280 -325650
39680 -325650 -352437 -249979 11464 238333 207248 50625 177523 678365 1099886 1036114
39670 1036114 684212 525176 666646 844371 920921 991088 1047465 932989 672980 521368
39660 521368 576381 620653 465776 235281 165572 287287 436521 472541 384137 264668
39650 264668 247022 380368 529720 490853 238961 -35472 -164442 -163794 -129174 -103424 -106918
39639 -106918 -176745 -288395 -324904 -206874 1325 164117 194928 83655 -98143 -179902
39629 -179902 1009 390220 709764 761282 656447 626139 665982 539871 148329 -271908
39619 -271908 -419232 -304212 -211547 -298261 -386286 -238828 75403 255359 169582 8683
39609 8683 9059 198877 491877 854243 1240255 1511008 1597624 1640035 1773510 1864911 1673247
39598 1673247 1209324 708385 294137 -67729 -298185 -198165 207929 597485 743402
39589 743402 749464 763388 697660 426516 64733 -171206 -246477 -246444 -145685 134865 485105
39578 485105 617014 344902 -221077 -727537 -800133 -351114 254695 496754 272724 15852
39568 15852 127789 507423 809886 920417 902276 708966 325737 54704 234939 710636
39558 710636 970928 829619 582461 452694 297492 -10440 -303090 -416346 -436217 -424961
39548 -424961 -204407 318358 845991 996365 760476 432747 241394 246179 409467 527473
39538 527473 274726 -397761 -1041683 -1171404 -846098 -535352 -515951 -673598 -780161 -645935
39528 -645935 -96983 820413 1638499 1845319 1485796 1042266 727142 333859 -149365 -321681
39518 -321681 -38210 179718 -159692 -732564 -814217 -317821 100165 -35329 -467561 -707892
39508 -707892 -682288 -630288 -621001 -478857 -121370 260119 393651 201457 -137230 -353749
39498 -353749 -323255 -154730 -50015 -101889 -276243 -542518 -893910 -1222913 -1320177 -1094343
39488 -1094343 -718932 -469053 -452857 -569381 -670734 -669486 -527226 -262864 10531 159191
39478 159191 185503 241400 430798 648254 677713 428406 13048 -399166 -736521 -997773
39468 -997773 -1120962 -963822 -461985 215558 733443 854761 625183 274480 -17189 -186433
39458 -186433 -168558 120824 601730 957157 920619 613732 430689 552190 725312 604489
39448 604489 177519 -271455 -526208 -609526 -639592 -688522 -794585 -955922 -1058888 -950806
39438 -950806 -668540 -477022 -565196 -795885 -901268 -853795 -837954 -857214 -635814 -72531
39428 -72531 413044 289887 -360009 -835639 -643341 -68060 277888 247392 178551 253043
39418 253043 268792 121020 85804 368453 677551 600607 225139 3880 77232 127291
39408 127291 -62892 -289383 -298449 -140622 51806 352325 818898 1188815 1140971 791505
39398 791505 605080 790008 1049981 1005397 630053 158044 -247448 -562947 -760485 -792322
39388 -792322 -719160 -718373 -903051 -1169496 -1263170 -1013688 -515238 -52465 189421 315551
39378 315551 555827 928670 1185307 1122728 829255 533511 322995 155235 64891 144604
39368 144604 303329 263992 -76849 -441544 -481042 -185163 191978 520848 856826 1120793
39358 1120793 1024886 477068 -142812 -329399 8915 518296 818364 773425 425265 -102233
39348 -102233 -605747 -904299 -1007932 -1067563 -1138261 -1128268 -993435 -812502 -627976 -390823
39338 -390823 -135791 -30057 -130249 -243237 -162648 82433 341242 557666 699697 603951
39328 603951 135844 -521641 -953639 -922556 -552782 -109096 244668 433911 392011 110643
39318 110643 -285474 -592985 -659864 -468631 -137023 158590 299020 271210 108720 -152643
39308 -152643 -425167 -563701 -500228 -328115 -164957 6715 261728 570199 856833 1170433
39298 1170433 1612162 2085514 2296302 2082476 1642543 1366384 1489813 1931580 2396492
39289 2396492 2613160 2527381 2282565 1997593 1629302 1124753 618339 328496 302679 427371
39279 427371 658334 1029287 1400560 1428789 932819 172134 -371842 -443658 -175554 130546
39269 130546 304436 425050 693318 1191494 1780797 2249127 2490441 2485367 2229382 1831670
39259 1831670 1580733 1683707 1973559 2100798 1990770 1850895 1739548 1473904 1052071
39250 1052071 798494 880385 991920 801698 467784 372028 509398 516749 258137 28675
39240 28675 114843 407490 553498 350374 -66469 -344160 -232723 125361 284515 -6375
39230 -6375 -472308 -629381 -355563 42999 275055 345306 392892 472130 563040 651273 731749
39219 731749 816001 938525 1072089 1084918 903228 649782 459156 229148 -217873 -755647
39209 -755647 -1003143 -809157 -455250 -279291 -293753 -299127 -213887 -137327 -163218 -249098 -252098
39198 -252098 -64836 249244 487281 558172 647511 995048 1558799 2072329 2380866 2499002
39188 2499002 2390463 2008657 1583432 1499785 1743960 1815972 1435714 1034458 1203271 1855742
39178 1855742 2342703 2339381 2223703 2485897 3070971 3507191 3541177 3434410 3611882 4147098
39168 4147098 4730754 5167673 5732392 6830094 8385107 9877689 11052738 12263073 13916413
39159 13916413 15883862 17766604 19510872 21325341 23062415 24130127 24118855 23183953
39151 23183953 21676891 19697190 17225353 14499027 11991470 10042417 8648586 7593533
39143 7593533 6682243 5860683 5188967 4734662 4489277 4362514 4194825 3769150 2946407
39134 2946407 1899141 1089524 834730 966371 1113367 1233939 1578523 2144960 2541309
39125 2541309 2530516 2385902 2455134 2611843 2461493 1964914 1517411 1412163 1512105 1519685
39115 1519685 1348051 1126897 1007069 1062810 1257902 1403718 1258330 788324 269760 24906
39105 24906 100511 286001 384307 352485 229393 79329 6748 71075 152427 63752 -132257
39094 -132257 -102418 303251 731228 701971 243176 -124446 -49616 273592 474622 475003 408521
39083 408521 296320 54960 -288048 -617935 -898346 -1112035 -1119917 -812256 -356499 -66657
39073 -66657 -47131 -174099 -378556 -681444 -963621 -1007101 -823452 -662595 -621711 -531536
$$ [...]
##END NTUPLES=NMR SPECTRUM
##END=
