##TITLE=31P_DE-80H_X3
 64 sc D2O
 26.2.2025
##JCAMPDX= 6.0         $$ Bruker NMR JCAMP-DX V2.0
##DATA TYPE= NMR SPECTRUM
##DATA CLASS= NTUPLES
##ORIGIN= UXNMR, Bruker Analytische Messtechnik GmbH
##OWNER= root
$$ XWIN-NMR		Version 3.5
$$ Wed Feb 26 17:58:36 2025 Russian Standard Time (UT+4h)  new_Human@DPX200
##.OBSERVE FREQUENCY= 81.013821
##.OBSERVE NUCLEUS= ^31P
##.ACQUISITION MODE= SIMULTANEOUS
##.ACQUISITION SCHEME= undefined
##.AVERAGES= 64
##.DIGITISER RES= 17
##SPECTROMETER/DATA SYSTEM= spect
##.PULSE SEQUENCE= zgpg30
##.SOLVENT NAME= Acetone
##.SHIFT REFERENCE= (INTERNAL, Acetone, 0, 198.062)
##AUDIT TRAIL= $$ (NUMBER, WHEN, WHO, WHERE, WHAT)
$$ ##TITLE= Audit trail, XWIN-NMR		Version 3.5
$$ ##JCAMPDX= 5.01
$$ ##ORIGIN= Bruker BioSpin GmbH
$$ ##OWNER= new_Human
$$ C:/Bruker/XWIN-NMR/data/yarkov/nmr/P31/2/pdata/1/auditp.txt
$$ ##AUDIT TRAIL=  $$ (NUMBER, WHEN, WHO, WHERE, WHAT)
(   1,<2025-02-26 17:57:25.29 +0400>,<new_Human>,<DPX200>,
      <created by zg, POWCHK disabled, PULCHK disabled
       configuration hash MD5:
       00 E9 B6 7A A2 85 ED C7 34 08 36 98 17 FE 4E 26
       data hash MD5: 32K
       3E BB BB 81 1F 27 71 AA 95 CE F3 0A 91 5F F5 79>)
(   2,<2025-02-26 17:57:33.17 +0400>,<new_Human>,<DPX200>,
      <Start of raw data processing
       efp BC_mod = 2 LB = 1.5 FT_mod = 6 PKNL = 1 PHC0 = 1762.124 PHC1 = 18.69542 SI = 64K 
       data hash MD5: 64K
       CF 61 06 46 45 4F 3B FC 14 FA 97 97 29 60 E9 C9>)
(   3,<2025-02-26 17:58:00.07 +0400>,<new_Human>,<DPX200>,
      <pk PHC0 = 20.4 PHC1 = 0 
       data hash MD5: 64K
       DB D5 A3 9E 98 DD C4 4A 8F 10 6A A4 67 CB 1D 42>)
$$ ##END=
$$ 
$$ hash MD5
$$ BC AF 9B 92 17 CE A3 4B 2C 94 AD C2 81 2D DD 19
##$RELAX= 
##$RELAX= 
##$RELAX= 
##$RELAX= 
##$RELAX= 
##$RELAX= 
##$RELAX= 
##$RELAX= 
$$ Bruker specific parameters
$$ --------------------------
##$DU= <C:/Bruker/XWIN-NMR>
##$EXPNO= 2
##$NAME= <P31>
##$PROCNO= 1
##$TYPE= <nmr>
##$USER= <yarkov>
##$AMP= (0..31)
100 100 100 100 100 100 100 100 100 100 100 100 100 100 100 100 100 100 
100 100 100 100 100 100 100 100 100 100 100 100 100 100 
##$AQSEQ= 0
##$AQ_mod= 1
##$AUNM= <au_zg>
##$AUTOPOS= <>
##$BF1= 81.014009
##$BF2= 200.13
##$BF3= 200.13
##$BF4= 200.13
##$BF5= 200.13
##$BF6= 200.13
##$BF7= 200.13
##$BF8= 200.13
##$BYTORDA= 1
##$CFDGTYP= 0
##$CFRGTYP= 5
##$CHEMSTR= <none>
##$CNST= (0..31)
1 1 145 1 1 1 1 1 1 1 1 1 1 1 1 1 1 1 1 1 1 1 1 1 1 1 1 1 1 1 1 1 
##$CPDPRG= <waltz16>
##$CPDPRG1= <>
##$CPDPRG2= <waltz16>
##$CPDPRG3= <>
##$CPDPRG4= <mlev>
##$CPDPRG5= <mlev>
##$CPDPRG6= <mlev>
##$CPDPRG7= <mlev>
##$CPDPRG8= <mlev>
##$CPDPRGB= <>
##$CPDPRGT= <>
##$D= (0..31)
0 1 0 0 0 0 0 0 0 0.06 0 0.03 2e-05 3e-06 0 0 0.0002 0 0 0 0 0 0 0 0 0 
0 0 0 0 0 0 
##$DATE= 1740578244
##$DBL= (0..7)
120 120 120 11 120 120 24 19 
##$DBP= (0..7)
150 150 150 150 150 150 150 150 
##$DBP07= 0
##$DBPNAM0= <>
##$DBPNAM1= <>
##$DBPNAM2= <>
##$DBPNAM3= <>
##$DBPNAM4= <>
##$DBPNAM5= <>
##$DBPNAM6= <>
##$DBPNAM7= <>
##$DBPOAL= (0..7)
$$ [...]
##$SUBNAM2= <"">
##$SUBNAM3= <"">
##$SUBNAM4= <"">
##$SUBNAM5= <"">
##$SUBNAM6= <"">
##$SUBNAM7= <"">
##$SUBNAM8= <"">
##$SUBNAM9= <"">
##$SW= 400.765351723535
##$SWIBOX= (0..15)
0 1 3 0 0 0 0 0 0 0 0 0 0 0 0 0 
##$SW_h= 32467.5324675325
##$TD= 32768
##$TD0= 1
##$TE= 0
##$TE2= 300
##$TE3= 300
##$TEG= 300
##$TL= (0..7)
0 120 53 12 22 120 120 120 
##$TP= (0..7)
150 150 150 150 150 150 150 150 
##$TP07= 0
##$TPNAME0= <>
##$TPNAME1= <>
##$TPNAME2= <>
##$TPNAME3= <>
##$TPNAME4= <>
##$TPNAME5= <>
##$TPNAME6= <>
##$TPNAME7= <>
##$TPOAL= (0..7)
0.5 0.5 0.5 0.5 0.5 0.5 0.5 0.5 
##$TPOFFS= (0..7)
0 0 0 0 0 0 0 0 
##$TUNHIN= 0
##$TUNHOUT= 0
##$TUNXOUT= 0
##$USERA1= <user>
##$USERA2= <user>
##$USERA3= <user>
##$USERA4= <user>
##$USERA5= <user>
##$V9= 5
##$VALIST= <valist>
##$VCLIST= <CCCCCCCCCCCCCCC>
##$VD= 0
##$VDLIST= <DDDDDDDDDDDDDDD>
##$VPLIST= <PPPPPPPPPPPPPPP>
##$VTLIST= <TTTTTTTTTTTTTTT>
##$WBST= 1024
##$WBSW= 4
##$XGAIN= (0..3)
0 0 0 0 
##$XL= 0
##$YL= 0
##$YMAX_a= 6540
##$YMIN_a= -6112
##$ZGOPTNS= <>
##$ZL1= 120
##$ZL2= 120
##$ZL3= 120
##$ZL4= 120
##$ABSF1= 0
##$ABSF2= 0
##$ABSG= 0
##$ABSL= 0
##$ALPHA= 0
##$AQORDER= 0
##$ASSFAC= 0
##$ASSFACI= 0
##$ASSFACX= 0
##$ASSWID= 0
##$AUNMP= <proc_1d>
##$AZFE= 0.1
##$AZFW= 0.5
##$BCFW= 0
##$BC_mod= 2
##$BYTORDP= 0
##$COROFFS= 0
##$CY= -3
##$DATMOD= 1
##$DC= 0
##$DFILT= <>
##$DTYPP= 0
##$F1P= 0
##$F2P= 0
##$FCOR= 1
##$FTSIZE= 65536
##$FT_mod= 6
##$GAMMA= 0
##$GB= 0
##$INTBC= 1
##$INTSCL= 9.790993e-09
##$ISEN= 30
##$LB= 1.5
##$LEV0= 0
##$LPBIN= 0
##$MAXI= 10000
##$MC2= 0
##$MEAN= 0
##$ME_mod= 0
##$MI= 50
##$NCOEF= 0
##$NC_proc= -9
##$NLEV= 6
##$NOISF1= 182.463
##$NOISF2= 159.3651
##$NSP= 0
##$NTH_PI= 0
##$NZP= 0
##$OFFSET= 198.0616
##$PC= 4
##$PHC0= 1782.524
##$PHC1= 18.69542
##$PH_mod= 1
##$PKNL= yes
##$PPARMOD= 0
##$PSCAL= 0
##$PSIGN= 0
##$REVERSE= no
##$SF= 81.0140089999434
##$SI= 65536
##$SIGF1= 159.3651
##$SIGF2= -187.1042
##$SINO= 113.3802
##$SIOLD= 16384
##$SREGLST= <1H.CDCl3>
##$SSB= 0
##$STSI= 65536
##$STSR= 0
##$SW_p= 32467.5324675325
##$SYMM= 0
##$S_DEV= 0
##$TDeff= 32768
##$TDoff= 0
##$TI= <>
##$TILT= no
##$TM1= 0
##$TM2= 0
##$TOPLEV= 0
##$USERP1= <user>
##$USERP2= <user>
##$USERP3= <user>
##$USERP4= <user>
##$USERP5= <user>
##$WDW= 1
##$XDIM= 65536
##$YMAX_p= 297640819
##$YMIN_p= -470385154
$$ End of Bruker specific parameters
$$ ---------------------------------
##NTUPLES= NMR SPECTRUM
##VAR_NAME=  FREQUENCY,     SPECTRUM/REAL,   SPECTRUM/IMAG
##SYMBOL=    X,             R,               I
##VAR_TYPE=  INDEPENDENT,   DEPENDENT,       DEPENDENT
##VAR_FORM=  AFFN,          ASDF,            ASDF
##VAR_DIM=   65536,         65536,           65536
##UNITS=     HZ,            ARBITRARY UNITS, ARBITRARY UNITS
##FACTOR=    0.49542278885378, 1,            1
##FIRST=     16045.7642231865, 0,            0
##LAST=      -16421.768244346, 0,            0
##MIN=       -16421.768244346, -470385154,   0
##MAX=       16045.7642231865, 297640819,    0
$$ Real data points
##PAGE= N=1
##DATA TABLE= (X++(R..R)), XYDATA
$$ [...]
8647 8508828 6264067 2042633 -6118810 -15880333 -21807590 -21043884 -16897460 -14661783
8639 -14661783 -14714625 -13010207 -8149085 -3645616 -1957414 -608235 3065021 6786369
8631 6786369 6485837 2341503 -1871415 -4164159 -5730832 -7578558 -8858945 -8714485 -7336535
8622 -7336535 -4740988 -586968 3829964 4948033 44596 -8926750 -15831762 -16001360
8614 -16001360 -11353395 -8263134 -9524692 -10512837 -5607580 3323171 8669845 7055003
8606 7055003 3307961 3076719 5195389 4079019 -2638820 -11609985 -17592831 -17625775 -12492060
8597 -12492060 -6013022 -2286520 -2262651 -3452781 -3255263 -1105954 2742110 7797611 11515024
8588 11515024 9957927 2788206 -4389538 -5106911 1864422 12872491 23236866 28516544
8580 28516544 25242646 14752253 4748217 2533069 6795266 9594557 6280813 -3807
8572 -3807 -3582253 -2321662 1989762 5801494 5309864 -1035719 -9959855 -15498053 -14931781
8563 -14931781 -10828191 -6648595 -2731337 2329126 8547694 14274196 17756515 18313319
8555 18313319 17247536 17371354 19328466 18622781 9832120 -5222702 -17108914 -18671564
8547 -18671564 -12475042 -6233817 -3649610 -2496772 683596 7220520 15805652 22183668
8539 22183668 21101616 12219034 2948088 1655329 8539975 16554387 20351076 20080517
8531 20080517 17001274 11035474 4193805 1115579 2996134 5012758 3623364 3110071
8523 3110071 9890176 22003338 29781770 27626756 20608554 17264111 18989115 19733751
8515 19733751 15076779 8234726 5586975 7818119 8417968 2306670 -6208104 -7550247
8507 -7550247 1097602 11805870 15699397 13088868 10591735 11272309 12461649 11742237
8499 11742237 9524509 5642383 -1045646 -8186323 -10090578 -4838225 2915253 8742590
8491 8742590 13718763 19606493 23278599 20914588 14478346 8420638 2425678 -6062362
8483 -6062362 -13527985 -12477081 -3192960 3875392 1137710 -6200676 -7820174 -1910396
8475 -1910396 4206426 4815924 1540568 -1631026 -4248127 -8362110 -14020256 -17961302
8467 -17961302 -16717162 -10583881 -4242860 -2457671 -4679101 -5298732 -427893 6881372
8459 6881372 9910332 5954108 -1140663 -5814237 -6423641 -5848258 -7729112 -12506787 -16746511
8450 -16746511 -16540094 -11739826 -5971033 -2205326 -127572 858770 -1734972 -10571693
8442 -10571693 -22596476 -29480228 -25577391 -13894668 -2820972 2169389 2464453 2632694
8434 2632694 4299255 4669228 1224987 -3319644 -2885039 4447745 12870971 14932276 10011889
8425 10011889 4187940 2255731 2995459 2786716 610192 -2362090 -5610620 -9017719
8417 -9017719 -11087032 -10157053 -7184976 -5198751 -5818577 -7923351 -9763359 -10594544 -9855391
8408 -9855391 -6584378 -768167 5825045 11159431 14588801 16450507 17043816 16757967 16047075
8399 16047075 14293833 10077568 4057637 35547 613766 2711423 631137 -6328880
8391 -6328880 -12712347 -14222882 -12648568 -11562059 -10583084 -7298339 -2635861 -474236
8383 -474236 -2808972 -8379959 -14994828 -19927286 -19299445 -11486478 -1065624 4952260
8375 4952260 5455456 5741119 8961729 11708806 10028299 5436692 2009505 1048108 1894918
8366 1894918 4910607 9793175 13181089 11923938 7523730 4010655 2618851 1918214
8358 1918214 2216528 6027574 13820143 22000683 25929115 23966312 18924645 15959487
8350 15959487 17326467 18694551 13813466 4243751 -83292 6558227 17192300 21641846
8342 21641846 20467955 21884242 27152547 28336396 21357001 12408200 8235368 7543276
8334 7543276 6423587 5784376 7608076 8681036 4679742 -2101722 -5246486 -3379185
8326 -3379185 -1657292 -4313231 -9937002 -14310054 -14319463 -8732057 1472067 12178471
8318 12178471 17652212 14654774 5195245 -4376884 -7045890 -40495 12075171 20528871
8310 20528871 20602834 16061209 13925404 16248927 19134840 18562505 14309062 8399892 2458935
8301 2458935 -2547735 -5513258 -5220781 -1260278 4688221 8686801 7361714 1699992
8293 1699992 -3623614 -5615747 -5568256 -5118991 -2748374 2960445 9034201 11089314 9560266
8284 9560266 9015706 11422770 13831527 13362917 11083875 9435472 8301739 5628604 931946
8275 931946 -3266976 -3657832 207304 4607989 5120364 1770363 -1060240 -690552 542369
8266 542369 -214598 -1815626 -2425748 -4160562 -9434961 -14791065 -14277959 -8056789 -1351137
8257 -1351137 4893955 14866166 27914586 35620116 32808636 24851728 18965835 14325964
8249 14325964 7401152 1960199 4952293 14471227 20651244 19244710 16846530 20453194
8241 20453194 27988251 32465418 30998957 25891865 19595608 12285951 3655135 -4974372
8233 -4974372 -10424687 -10023813 -5748111 -4770912 -12149220 -22984943 -26436184 -18923994
8225 -18923994 -8751207 -5067250 -6791468 -6529440 -1735857 3518453 6048360 7039033
8217 7039033 7819467 6879467 2556451 -4176103 -10574865 -13890126 -12607829 -8494616 -6754495
8208 -6754495 -10699231 -16494337 -17193956 -12199819 -7893586 -7538731 -5988497 2082304 13132923
8199 13132923 18914430 17117606 12815279 10526942 9762731 8413558 6186893 3805843
8191 3805843 2180349 3205187 8223617 14570503 16559194 11649975 3710121 -1342465
8183 -1342465 -1796475 -1153160 -4199746 -12603049 -22913438 -28580311 -25712395 -17355596
8175 -17355596 -10438098 -8377328 -8868291 -8991676 -9217596 -10973107 -13202708 -13658345 -11833585
8166 -11833585 -8795776 -5702758 -3974298 -5071197 -8379668 -10938497 -10753887 -8722595
8158 -8722595 -6294354 -3803354 -2389288 -4049684 -7368273 -6879735 -207089 7526320
8150 7526320 10546337 10239142 10872884 10930184 5966776 -1748113 -4943180 -2977179 -3092838
8141 -3092838 -7941975 -10542788 -5906668 371689 1488550 749690 5413925 13663697
8133 13663697 16748863 12339186 7162895 6285515 7525489 7774739 7724351 7901997 6304267
8124 6304267 3245273 3163899 7680449 11402679 9192671 4073150 2929532 6771192 10368201
8115 10368201 10135755 7236305 3361443 -1199649 -4284064 -1572226 7646958 17377688
8107 17377688 20424173 15559331 7367056 553696 -3437553 -5381010 -6590399 -8535220
8099 -8535220 -12200259 -16743354 -19241002 -16434768 -7383158 4744132 13541354 13612831
8091 13612831 5213347 -6003598 -14748865 -20625854 -25767616 -29559734 -28602912 -21896606
8083 -21896606 -13132684 -6683468 -3605007 -2999432 -4665830 -7520997 -7286606 -131991
8075 -131991 10931382 17210437 13912600 5827365 911413 441168 -909398 -6283371
8067 -6283371 -12314583 -14550996 -13413778 -12150655 -11153969 -7549737 118588 9343299
8059 9343299 15946510 17288167 13399336 6751549 993177 -1768570 -2678892 -3816197
8051 -3816197 -4566979 -2538199 1881515 4807192 3968176 2001929 2723474 6124204 9343782
8042 9343782 10975775 11713129 11722273 10344891 8436337 8586359 12364471 18510926 23684610
8033 23684610 24045251 17380992 5875976 -3962202 -6561950 -2221614 5034260 13060672
8025 13060672 21636403 27924709 27005972 18439737 8188412 1633839 -2148919 -6609569
8017 -6609569 -11088578 -11373149 -5605313 3105667 9557703 10535196 6946320 2936298 1809863
8008 1809863 2587990 2503363 2419201 5725082 11199301 12501466 7702981 3854172 7177918
7999 7177918 13402787 14302782 10365358 9196078 12997267 15924197 14136601 10469337
7991 10469337 7517552 3853754 83794 1228325 8385648 14196224 12339625 6808986
7983 6808986 5595371 8912566 10582768 8757354 7711495 9150024 8849888 3916831
7975 3916831 -2102568 -4279128 -2700991 -902254 -655517 -1335918 -2672492 -5069390 -7842583
7966 -7842583 -9733699 -11226249 -14104563 -17944811 -18937824 -14064701 -5800104 -435757
7958 -435757 -948586 -3300752 -1498694 4846944 10369874 11011263 8513029 7082694 7928898
7949 7928898 8663250 6707269 1995899 -2602025 -2796034 3482442 12733814 17880293 15146644
7940 15146644 7648048 1143162 -1482353 122976 6253742 15173104 20558067 16402667
7932 16402667 5327305 -2435663 -484108 6455479 9079876 4801663 -777858 -2498379
7924 -2498379 -2082202 -4965673 -12908703 -21582128 -25013756 -21107810 -12666529 -4310565
7916 -4310565 468682 123058 -4568808 -9814013 -10376786 -4195996 4867435 10722643 11390133
7907 11390133 9864555 8794139 7005800 2652007 -2442301 -4146907 -1077140 3951557
7899 3951557 7563461 9032572 9449039 9514871 9380341 9665086 11347489 14785538 19183305
7890 19183305 22328633 20789840 12342594 -246624 -9488068 -9772183 -3160775 3548517
7882 3548517 6437609 6029906 2522052 -5062728 -13806775 -16873201 -12286874 -7223610
7874 -7223610 -8840648 -14511748 -16685342 -14303094 -12561761 -13193215 -12788237 -10686597 -10462024
7865 -10462024 -11949536 -9666293 -2319117 3447770 3263000 2439407 7620809 16558298
7857 16558298 22530295 24333023 24834818 23285270 17141162 9735743 8008181 12473789
7849 12473789 16386149 15534775 12508853 10272789 8067366 5971322 7679742 15132855
7841 15132855 24246982 29229443 28536357 24432641 19459996 15503946 13829155 13778053 13116135
7832 13116135 11014806 8875961 7446232 5560488 2732804 514464 265763 1977187
7824 1977187 5933064 12541293 19549960 22659074 20296567 14914897 8715576 1855033
7816 1855033 -4008449 -5393827 -3006515 -3228339 -9430102 -15882604 -15414545 -9769604 -6227274
7807 -6227274 -6168565 -4166646 1806240 6636368 6571254 5097433 6502131 8305785 5118535
7798 5118535 -2512152 -8136030 -7573861 -2792376 2601485 7744581 12889251 16626734
7790 16626734 17555807 17260343 18840901 22687851 25840160 25607468 21853983 15545634 7528160
7781 7528160 -223980 -4669902 -5070398 -4377585 -4832154 -4056148 937004 7049247 7319002
7772 7319002 780567 -4594955 -1649315 6821365 12602954 13328845 14010690 17497413 18961640
7763 18961640 12876252 2057295 -4616896 -2687551 3651437 8330986 10456139 12210201
7755 12210201 12933092 9635425 2591562 -3799401 -6351395 -5820527 -3576105 553502
7747 553502 5537143 8423980 9261821 12954119 22127514 30963113 30902251 20957345 7902923
7738 7902923 -2524789 -9882578 -15190939 -17935453 -17647007 -14883464 -10428419 -6480312
7730 -6480312 -7325760 -14339143 -21335763 -20450535 -12578406 -6262854 -5936781 -7645382 -7513895
7721 -7513895 -7369379 -9188230 -10495885 -9091938 -6753591 -4333483 1330257 11065789
7713 11065789 18973965 19425380 14135677 7462031 -592224 -10812639 -18566544 -18264861
7705 -18264861 -11460947 -4017811 2501667 10023178 16660368 17752290 13728287 9965150
7697 9965150 8414749 5759864 780135 -2568627 -1276745 2440396 4882377 4973609 3268364
7688 3268364 414355 -2293026 -3887033 -5569230 -8422965 -9913408 -6973277 -2127593
7680 -2127593 -1210920 -4452898 -5446168 -511027 6353439 10159889 11363220 12335685 11869971
7671 11869971 7376044 -175032 -7079483 -10786295 -10435061 -5897621 833539 5259928
7663 5259928 4362870 -90953 -4137570 -5826696 -4905534 -682939 6272642 11153906 7366408
7654 7366408 -6569142 -23892802 -34603367 -33945063 -26255726 -20346717 -20637924 -23198781
7646 -23198781 -21132593 -12787494 -2964916 3085760 4214398 1941440 -2478292 -7992984
7638 -7992984 -12388760 -12773988 -7639554 1485374 10349353 15028941 15409414 14308980 12615423
7629 12615423 8150511 1152021 -2979435 -568849 3590463 1693887 -6617510 -14774988
7621 -14774988 -18687468 -19113436 -15696489 -6908471 2765943 4057000 -4880919 -14352217
7613 -14352217 -15657567 -11681318 -9981570 -11189754 -10902984 -8818180 -8430192 -9696342
7605 -9696342 -9173062 -7106369 -8056973 -13451102 -18552935 -18712289 -15126316 -12368506 -12376167
7596 -12376167 -12878679 -11053554 -7262029 -4395496 -3647961 -2640487 434808 2442087
7588 2442087 -1085484 -8235531 -11467936 -7518574 -1784099 -191435 -1237781 -22086
7580 -22086 3539950 5507222 4946572 5483029 10162545 17679458 23260672 21948097 13166530
7571 13166530 3705942 2835631 11492608 19532916 17461571 8023370 1822949 3827609
7563 3827609 9152037 10961734 7791012 3125020 1212848 3250682 5649449 3418086
7555 3418086 -2945723 -6725371 -3649890 2458586 6341995 9115335 13763482 16882795
7547 16882795 12738136 3733277 -1362537 190540 1939727 -1349001 -6999355 -10284515
7539 -10284515 -10877308 -10345921 -7848263 -1738828 7109476 15488501 19399957 15483297
7531 15483297 4313385 -7595802 -12897649 -10956029 -6920430 -3960741 -1134288 1470512
7523 1470512 1568282 -102176 942965 6306524 12054040 14473800 13871976 11121760 5729444
7514 5729444 -472205 -3134701 -1933930 -2345904 -7473422 -12692053 -12260508 -7205018 -2608784
7505 -2608784 -526389 474405 1715875 3904897 7276906 9149656 5001314 -4333329
7497 -4333329 -10557294 -7924833 -2112443 -3366762 -12730343 -20857990 -19896310 -11352142
7489 -11352142 -1966910 3667791 5349649 5547091 6857369 9414704 10395736 7449374
7481 7449374 2399220 150002 3996376 12491948 20085241 20857047 13723829 4340138
7473 4340138 -742525 -2070880 -5738829 -13236561 -18232733 -16114263 -11214148 -10040502
7465 -10040502 -11980788 -12283261 -10404402 -8913293 -6923525 -1810021 3967656 5098323
7457 5098323 2375763 2389598 7307831 11659583 11394817 10057578 12600000 17810161 20910902
7448 20910902 20625218 19759478 20220425 20506584 17944892 12004411 5496229 2438365 3794966
7439 3794966 5907053 4775142 1108852 -1115234 -269295 1676645 3004173 3969315 4575666
7430 4575666 3946230 2432029 1358809 206997 -3054685 -8478703 -13883284 -18075577
7422 -18075577 -20956004 -20609273 -14804813 -6256384 -1723073 -4017063 -8956867 -12032710
7414 -12032710 -13594205 -14941940 -14126799 -9728549 -5073030 -3974545 -4805509 -3387015
7406 -3387015 165565 2215667 1982413 2301395 4245951 5469571 4491877 2788115 1601561
7397 1601561 31437 -2242812 -3060995 -491550 4200697 7863455 8811577 7933793 7195516
7388 7195516 7592978 8047394 6419012 2521371 -306059 1692505 7818274 12720406 11560744
7379 11560744 4251106 -5393052 -12846248 -14835634 -10610840 -3166313 2210753 2828521
7371 2828521 1595163 3276067 7944021 10269546 6005240 -2610031 -9340269 -10842715
7363 -10842715 -9401622 -9035459 -10660722 -11983705 -11217013 -9563407 -9721979 -12459845 -15212549
7354 -15212549 -14416502 -9294740 -2992960 402384 -221513 -2405203 -3010306 -966829 2586609
7345 2586609 5793397 7484388 8023921 9121640 12057642 15817254 17756277 16381216
7337 16381216 12748755 9079018 6967094 6913691 8194384 8907254 7593994 5174483 3839439
7328 3839439 3963318 4129256 4371476 6662062 11399990 16351767 20105849 23030234 23265416
7319 23265416 16470760 3099210 -8434093 -11081196 -8547979 -9442867 -14380790 -15947211
7311 -15947211 -10840664 -4665493 -3289662 -5753648 -7872669 -7471772 -3870319 2702296
7303 2702296 8825008 10011067 7621443 8605041 15550558 22314594 22994673 19770964 17519056
7294 17519056 16220532 14410228 15121383 21291073 28772450 31294497 29808824 29389670
7286 29389670 29132838 24038669 16353153 15276796 23136861 30496844 29062216 22407061
7278 22407061 19052974 20760407 23271610 24112327 23479455 20330640 13813635 7269702
7270 7269702 5287045 7120085 7847954 6127508 6013074 9990248 14624105 15590196 13851608
7261 13851608 13512525 15071265 14442706 9183359 2847184 1040165 4296288 7442593
7253 7442593 6391904 3135670 2428301 5456935 9264010 11160026 10612735 7417584 1811737
7244 1811737 -3138233 -3289851 833152 3751478 2719156 1952868 5889631 11768036 13650660
7235 13650660 11275228 9065748 7525606 2419646 -6457971 -12422699 -11090373 -7005556
7227 -7005556 -6498459 -8102756 -5855519 399901 4579713 3815495 1970245 2299883 2348825
7218 2348825 -801098 -4793576 -5730624 -4604306 -5389695 -8428672 -10362555 -9965037 -9335018
7209 -9335018 -8914138 -6009656 -15359 4899494 5076395 2489132 1589070 3139797 4377770
7200 4377770 3854706 2728414 1899926 1148866 1019081 2393095 3847699 2698248 -239700
7191 -239700 -122294 5561782 12556825 14559025 10830986 5999243 3087132 635543 -2337578
7182 -2337578 -2432693 3654451 12515961 16137081 11259829 3169142 -1561229 -2732604 -3619809
7173 -3619809 -3262191 2514914 12309524 17621448 13217431 4319509 -930833 -2481350
7165 -2481350 -6024642 -11875126 -13532258 -8205540 -2093913 -2048563 -6872515 -10647500 -10747913
7156 -10747913 -8117714 -2770483 5271183 11735561 10797033 3328847 -2022120 1578430
7148 1578430 11351332 19086317 20903242 19789214 19350495 18590150 14359561 6976312 735345
7139 735345 -1420309 -1615641 -3875836 -8491961 -11882742 -11822996 -10080850 -8971090 -7837085
7130 -7837085 -4709324 540688 6680753 12818021 17258441 16826255 10957458 5171522
7122 5171522 6002476 12366595 16283821 13040369 6220534 954775 -2940657 -7398451
7114 -7398451 -9727499 -5551539 3140716 8453533 6100720 477298 -1426256 1684260
7106 1684260 5089036 4172844 -876800 -5506777 -4968649 942981 6791242 6539502 291424
7097 291424 -5735468 -6809541 -4960333 -4707480 -5703946 -3324029 3631174 9711048 9322349
7088 9322349 4127909 1101286 3954479 9424358 12632006 13254831 14078745 15184527 13201653
7079 13201653 6761876 -585603 -4713202 -5656790 -5592727 -4447943 -1368338 739901 -2803593
7070 -2803593 -11106400 -17136699 -16844294 -14651040 -16276661 -19621764 -17867883 -9831395
7062 -9831395 -1594931 2172899 3119046 3971050 3347452 -1010915 -7098357 -10490137 -9870856
7053 -9870856 -7713783 -6317597 -5771979 -5338679 -4386269 -1941392 2607805 7951867 11493396
7044 11493396 11990960 10588937 8987747 7379845 4361145 -1493240 -9568070 -16243837
7036 -16243837 -17018784 -11015787 -2908469 1186517 -291624 -3678979 -5100016 -4386051
7028 -4386051 -3804607 -4846427 -7289256 -9998114 -11333337 -9787631 -5728335 -1921804
7020 -1921804 -764122 -1277266 -616112 1342918 1133166 -3415981 -9480398 -12775730 -13486568
7011 -13486568 -15333979 -18787809 -19238349 -13838277 -6638472 -3441049 -3874337 -2801245
7003 -2801245 1690344 6409532 8738659 8929727 6222597 -1035477 -8723461 -6869157
6995 -6869157 8029364 24902903 29400528 21334101 13630228 14237215 16975765 12886268
6987 12886268 3574151 -2204256 -1145404 1667673 1309255 -1036368 -1875789 -1387959 -3073721
6978 -3073721 -8721056 -15703531 -19431858 -17649828 -12041544 -6203552 -2839166 -2855474 -5826193
6969 -5826193 -10061173 -12684339 -11146259 -5328904 2029865 7020326 7031907 2749936 -2054080
6960 -2054080 -4300504 -5631226 -10242057 -17492036 -20137521 -13236186 -2030399 3639415
6952 3639415 1052480 -4349483 -8190300 -10798774 -11517003 -7188456 663542 4063685
6944 4063685 -1070104 -8065142 -8547452 -4046223 -2098029 -3894308 -3354482 2292636 8234743
6935 8234743 9592882 7349685 4634623 1842165 -1531810 -3369909 -693236 5915342
6927 5915342 11676002 11644364 5340139 -2360320 -5763444 -4432189 -3162158 -4976980 -7060277
6918 -7060277 -6069883 -4027472 -4519177 -5933233 -4518384 -2454866 -5504723 -12401986 -14351926
6909 -14351926 -7356016 2143169 7356770 9918277 13543140 15347654 10777566 3137934
6901 3137934 207088 2908065 4655866 1849061 -1680517 -1836323 -156682 -438154 -3721087
6892 -3721087 -8743626 -14076213 -17992469 -19026698 -18142092 -17770760 -17758863 -15502547 -11408349
6883 -11408349 -10238754 -14093183 -17231767 -12018103 1298384 14425717 20244682 18991588
6875 18991588 15274257 12297440 10312419 8282856 5063422 108853 -5330007 -8531263
6867 -8531263 -8447600 -7866820 -10306882 -14747303 -16021487 -11659347 -5890348 -4374036 -6775802
6858 -6775802 -8180056 -7055743 -7036392 -9574813 -9748839 -3030828 7015183 12345709 10168702
6849 10168702 4749547 491895 -1993759 -2753308 -427830 4637667 8733265 8665687 5308758
6840 5308758 1931295 1136769 4334883 11246330 18291784 20433511 16845911 12227572
6832 12227572 10370508 9483101 6879574 5037881 8132376 14130060 15779066 9982634
6824 9982634 1783980 -2301795 -1315522 1566661 4367623 7414979 10522284 11680917
6816 11680917 8886596 2388330 -5106928 -10577768 -13286716 -14691165 -15281128 -12950743
6808 -12950743 -6368949 1076243 3543168 -714776 -7196808 -9941397 -6717581 315596
6800 315596 6504999 6981268 110342 -10027002 -16958524 -18684073 -18664638 -19017964 -16545286
6791 -16545286 -8420601 1321173 5375740 2116364 -2961606 -4422407 -1961501 1769350
6783 1769350 4599375 4800380 874932 -6019986 -10938190 -8929439 -30407 10641180
6775 10641180 17728183 19884357 19412240 18632683 17343947 13949922 8429660 3187626
6767 3187626 725796 1191827 2506003 2257719 -481811 -4041411 -4880321 -1439411 2209923
6758 2209923 -683746 -11075062 -21092699 -22403542 -15847220 -9428591 -8225076 -10543974
6750 -10543974 -13452370 -16786307 -20056127 -19928020 -14050071 -4982177 2289159 4965541
6742 4965541 2691086 -4282405 -14117717 -22008817 -23002991 -16327795 -5549099 4559566
6734 4559566 10000336 8738425 3085476 -444836 2480707 7926459 7816833 834487
6726 834487 -4857410 -2029847 5776194 8508242 2185895 -6835714 -10557530 -8617210
6718 -8617210 -6635694 -7637164 -8880706 -7509816 -5804165 -8026624 -13633428 -17291713
6710 -17291713 -16102467 -13306247 -12701768 -12277393 -7242760 1725923 7845779 6935964 2936597
6701 2936597 2320475 5981859 10033159 12337342 13458712 11926968 4737443 -5153498
6693 -5153498 -7578047 3104744 18062803 22409199 13102141 1838486 -1168137 878848
6685 878848 -126036 -3032391 526089 12306707 23546009 25821438 20010258 12809620
6677 12809620 9226265 10590715 15607413 20374665 20356217 15014964 8404179 3651673
6669 3651673 -326041 -5131771 -9488053 -11824928 -12787889 -12503109 -8995126 -2608194 1811906
6660 1811906 1410013 409949 3459560 7070415 4364917 -3390648 -7409097 -3641429
6652 -3641429 2665806 5968976 7100880 8216677 7304171 2094213 -4815678 -9113141
6644 -9113141 -10208080 -10005751 -9003091 -7121596 -5849324 -5687514 -3516371 3313504 11450464
6635 11450464 14279892 10110982 4213545 2294194 4666059 7524540 7848445 6053285
6627 6053285 4840664 6005299 8300976 9105657 8295601 8675133 11552035 13991991 12466485
6618 12466485 7603044 3056694 1071309 1584877 4217781 7907200 9403056 5792105
6610 5792105 -1187945 -6379850 -7183289 -5532778 -3676704 -1444574 1092114 1689949 -928646
6601 -928646 -4383633 -5649238 -5043882 -4665022 -4319293 -2078811 1738813 4311648 4323817
6592 4323817 3487876 3373198 3344184 2803050 2737377 2899921 -116186 -8583102 -18536377
6583 -18536377 -22718051 -18751415 -10954333 -3543892 3859500 12133858 18337770 19370841
6575 19370841 17257303 16351798 16775002 15109452 10759302 6764734 4268405 1172186
6567 1172186 -2785012 -4590452 -3367327 -2473228 -3748498 -4240094 -1771652 728661 528178
6558 528178 566262 4594663 10381368 13733774 16427055 22686011 28852667 25029287 9110236
6549 9110236 -7920087 -14638108 -12062305 -9506038 -11347481 -13153549 -9467716 -674542
6541 -674542 8506002 14405640 16917519 17661186 16834420 12809952 5317378 -2417347 -6823354
6532 -6823354 -8367029 -9711128 -9864648 -4476183 6731022 17191747 21059105 19995505
6524 19995505 18753091 17072515 11049570 1115828 -6912802 -9305815 -8234358 -6785930
6516 -6785930 -4650778 -1450480 -606556 -5605444 -13983725 -19243464 -18769200 -16355485 -16234957
6507 -16234957 -17961494 -18720971 -17448252 -13916142 -6580299 4298368 12779802 12102048
6499 12102048 4576738 1490545 10019452 24067967 32024135 30539230 25672132 22346248
6491 22346248 18822098 12173330 3898488 -2143478 -3999137 -1986550 2494645 7088035
6483 7088035 9946224 12241622 16662907 22523325 25451669 23266354 19054026 16840815
6475 16840815 17186093 18451775 18958538 16305783 8794642 15190 -2495748 3274516
6467 3274516 9935066 10422803 7151877 6124860 6490020 3573843 -624987 808921 7461511
6458 7461511 9836571 2073208 -10684618 -20365218 -25044050 -26699226 -25880376 -22962614
6450 -22962614 -20079736 -17345991 -10906918 737008 11455114 13195716 5451765 -4309633
6442 -4309633 -8222435 -3810769 5351958 12338112 12760156 9972214 11064377 16028565
6434 16028565 16410793 8313255 300999 1956282 10023165 14276346 13031974 12740080
6426 12740080 14349825 11685758 4387674 1052630 5570332 10250521 8290061 4789013
6418 4789013 8255094 17301404 23195212 21440227 14329987 5782520 -51286 1256070
6410 1256070 8951135 14498658 11292703 4273385 2482607 4576073 829722 -10892560
6402 -10892560 -20721140 -20496394 -13792439 -8811732 -7963594 -8621587 -8926415 -8406981 -6524663
6393 -6524663 -4211146 -3807210 -4825210 -3232342 2348282 7166384 5849850 -1639026
6385 -1639026 -11438010 -19117466 -19580511 -9311057 7014307 17212820 14661035 7194190
6377 7194190 7257614 16338144 25623398 29609099 31272199 33959299 35631354 33217571 27287452
6368 27287452 20068763 12638833 5741339 158640 -4811882 -10197702 -14182738 -13617306
6360 -13617306 -9294063 -5942569 -5970782 -6859534 -5900789 -3781815 -1940400 28400 2356388
6351 2356388 3610800 3277323 3261745 5076140 7910683 10818231 14144171 17496830 19169796
6342 19169796 18866023 17839513 15082311 7410841 -4313622 -13056217 -13191789 -7331038
6334 -7331038 -2266936 -820024 -1214151 -1931938 -2955549 -3765879 -4008026 -4986713 -7146665
6325 -7146665 -7754003 -5041537 -3021354 -7151457 -15670276 -20508085 -17623232 -11443005
6317 -11443005 -7215051 -3837241 2040031 8307974 9063450 3347761 -2646054 -3819850
6309 -3819850 -3003433 -6023426 -11798446 -12433128 -4310728 5904115 10157503 9997104 12673773
6300 12673773 18484840 20024749 14813769 10150246 11577184 14239144 11927573 8343408
6292 8343408 10997311 17949397 20002800 14585876 8244543 5094021 1910207 -3171064
6284 -3171064 -5736832 -3132695 -384081 -2683504 -7255331 -8540160 -7476909 -9134678
6276 -9134678 -13293878 -14084135 -9233318 -4168908 -4843681 -9772120 -11747784 -6396758 2818190
6267 2818190 8483357 7335198 3081687 428718 -1706705 -7887262 -17633835 -23615561
6259 -23615561 -20346843 -11511258 -5799767 -7331294 -12637682 -15472382 -12018304 -2689166
6251 -2689166 8218982 14852067 14045214 7698661 307551 -4828752 -5981473 -1753516
6243 -1753516 7507837 17515709 22301428 19990830 15151895 14294280 19029546 23973365
6235 23973365 21923984 11602243 -557003 -7680889 -10499874 -15250266 -23724181 -29602553
6227 -29602553 -26705782 -17241034 -8498946 -4029809 -2135429 -1262101 -1939916 -3435557
6219 -3435557 -3115971 -529165 1399201 1069827 1282180 5271046 11618966 15792691 15912090
6210 15912090 14418569 13855221 13340206 10641867 6356040 3714240 4115935 5153938 4445951
6201 4445951 3391571 4474865 6093928 3885011 -2442988 -7454068 -6850905 -2702344
6193 -2702344 551582 2320198 4813778 7975768 9342482 8015513 5270336 1667827
6185 1667827 -3098894 -7521109 -8710181 -6175913 -2588254 -37989 2286218 5909711
6177 5909711 10326394 13248648 12646727 8629260 4322017 4002246 8573708 13768945 15020310
6168 15020310 13127530 12324734 13729119 14558483 13780469 14099507 16858234 18847413 16768142
6159 16768142 12238436 9607921 10303992 11707180 10932413 8127539 6307997 8363502
6151 8363502 13419365 16399868 13074227 5711391 1575172 5324162 14846511 24497977
6143 24497977 29615611 27857400 20168245 11813670 8607177 10131514 10308731 6611329
6135 6611329 4167904 7539897 13218148 15241029 14217187 14312245 13980404 7490967 -4493643
6126 -4493643 -13341600 -13372555 -8362750 -4581860 -2638037 171110 3536322 4588431 2545987
6117 2545987 -809845 -4273189 -7990857 -11566857 -13343414 -11523657 -5563119 2508815
6109 2508815 8137300 7798917 3110255 -938175 -2297433 -3236951 -4645637 -3565543 694623
6100 694623 2277147 -4513755 -16626862 -25513684 -27835270 -27902288 -29652034 -31392011 -30015040
6091 -30015040 -26378477 -23980598 -24294645 -25090710 -22411450 -14074434 -2675103 5532816
6083 5532816 7108030 6001602 8461049 14080525 16506506 13537140 11148812 14917545
6075 14917545 21928075 24904251 21242728 14294174 8264932 5557321 6856980 9759174
6067 9759174 9008242 2287068 -5466662 -7680161 -4972981 -3782273 -6870160 -10495128
6059 -10495128 -11460220 -11354979 -11706267 -9887659 -3421727 4854849 9511283 8508776 3720811
6050 3720811 -2496779 -8032303 -9646819 -4557802 5996514 16640474 21799806 19252745
6042 19252745 10765683 563921 -7522629 -12777432 -17172604 -21643928 -23994906 -21648946
6034 -21648946 -15222912 -7839797 -1999058 1162690 683540 -3631940 -9584144 -13788926
6026 -13788926 -15060258 -15134944 -15725080 -16367805 -15896640 -14774105 -14604070 -15446555 -14761778
6017 -14761778 -10119927 -3082549 943925 -1782288 -8523241 -12738651 -11644493 -8763585
6009 -8763585 -8224063 -9255930 -8350431 -4707018 -652679 2320942 5048617 8292427 11094991
6000 11094991 11784954 9162760 3023556 -4732086 -9862795 -8971493 -3489398 1247073
5992 1247073 1650117 -630301 -1506265 469059 3004298 3726779 3671024 5910379 10572395
5983 10572395 13033554 9347050 2783171 1533608 8723126 17724294 19535358 12491868
5975 12491868 2520227 -3690744 -3060474 3494965 11005392 12654847 6443515 -1537953
5967 -1537953 -4846593 -6288143 -14073801 -28599247 -39670737 -38955989 -29450255 -19368121
5959 -19368121 -11694457 -4353592 2856766 7054984 7085846 5464999 5402632 8142023 12653556
5950 12653556 16050171 15281790 10363857 4939671 1951937 240083 -2537718 -5491019
5942 -5491019 -6173984 -5590685 -7731753 -13680309 -19370685 -20556983 -17726195 -14359427 -11903215
5933 -11903215 -8745623 -3863020 841298 3068132 3556524 4738837 6197506 4381007
5925 4381007 -1767768 -7736939 -8900097 -6920955 -6698165 -8160213 -6251599 417805
5917 417805 6134008 5335080 -1017578 -8593535 -14665853 -16718500 -10935081 2389363
5909 2389363 14780842 17073625 10195656 3231902 1112843 -101570 -4686733 -9802785
5901 -9802785 -10020893 -5607380 -1990509 -2379925 -4885202 -7174007 -10338806 -15784064 -20321152
5892 -20321152 -18301680 -9477556 -1308795 -685607 -5710567 -9443039 -9863132 -10550089 -11869860
5883 -11869860 -8729190 94302 7014108 5291770 -1161997 -3888535 -2383813 -3390607
5875 -3390607 -9378097 -15230735 -16783426 -15696765 -13876982 -9146825 -76913 9029127
5867 9029127 12157756 8800869 4061969 2285642 2743748 1815121 -1540914 -3466373 358188
5858 358188 7983555 11707145 7173418 -921009 -5370547 -5899869 -7413379 -10842571 -11800056
5849 -11800056 -8342588 -4247790 -3122607 -4002595 -4601921 -4965723 -6058539 -7897960 -10304942
5840 -10304942 -12520830 -11679965 -5355836 3918159 10582072 12707253 12409747 10072056
5832 10072056 4228998 -2335621 -3723305 -408606 -334933 -7117806 -14241418 -15325773
5824 -15325773 -13030724 -12286382 -11852428 -9732524 -10364402 -17449546 -24681220 -23682906 -17862177
5815 -17862177 -17664877 -23622179 -25326393 -17918690 -8643778 -4136659 -1148592 5229234
5807 5229234 12245832 14414293 11995421 8855897 6171819 3486796 2654653 5850698
5799 5850698 11910101 18176212 23430636 26177384 23841603 17641741 14494674 18835527
5791 18835527 25112235 23931655 14089487 3026374 -3670323 -7277634 -10190721 -11189001
5783 -11189001 -8817911 -5271748 -3991687 -5767792 -9103110 -12187035 -12959683 -9802979
5775 -9802979 -4264171 -821760 -1521578 -2889571 -1147745 1201828 -1955399 -11222535
5767 -11222535 -19235349 -18753707 -10307278 -83498 7158894 10716003 11763705 11923230
5759 11923230 13073139 15354617 15551356 10480622 2139706 -3698845 -4744646 -4867462
5751 -4867462 -8202382 -13673282 -17436441 -18072240 -16721084 -14125892 -10393050 -6307671
5743 -6307671 -2323205 2509656 8211098 11896206 10816189 6197269 1520183 -1537772
5735 -1537772 -2692054 -708009 4416864 8340755 6302251 -164135 -5147618 -6946501
5727 -6946501 -9506119 -14501176 -17589939 -14823444 -8060669 -1459087 2982682 3708382
5719 3708382 -1531801 -10896758 -16825715 -14511542 -9077289 -8788766 -13217431 -14134413 -7255610
5710 -7255610 3088192 11465585 17551256 22751830 25583706 23817103 18341519 11910646
5702 11910646 5908580 653151 -3013886 -5079161 -7886250 -13337985 -19009032 -19884936
5694 -19884936 -14510154 -7190724 -3055075 -2634285 -2724440 -1183195 1299756 3601527 5598980
5685 5598980 6501559 4384515 -603109 -4421108 -3357056 690433 2083105 -1327635
5677 -1327635 -5582730 -5796112 -1448341 4292540 8034538 7737034 3166304 -3478784 -8842820
5668 -8842820 -11434097 -12023794 -10857296 -7050083 -1381811 3549589 7195857 11465318
5660 11465318 15635896 15460376 10487327 7446644 11303090 16973277 16441812 11217835
5652 11217835 9838245 14024021 16043410 11372067 5677191 5353149 8042267 8156254
5644 8156254 6860043 9849513 17380251 22768696 21104523 15200531 11838805 14500402
5636 14500402 20476287 23760782 20559412 12712063 5631656 2963128 4116751 6236428
5628 6236428 6224872 1454571 -7612850 -15027082 -14363901 -8034740 -6404412 -14209269 -23218603
5619 -23218603 -23873595 -19378940 -20121127 -26547097 -27347665 -16055979 -690319 7280520
5611 7280520 7000012 5966508 8475967 12443203 15170294 16110636 14247050 7826478 -2218303
5602 -2218303 -12024795 -19161521 -24808959 -30683078 -35964332 -38469808 -37284867 -33057014
5594 -33057014 -26857864 -19963491 -14043870 -10335928 -8590771 -7452449 -6110497 -5475238
5586 -5475238 -7358916 -11759389 -14801493 -10892403 1203712 14842917 20430517 14865116
5578 14865116 4450583 -2605137 -4555583 -5029457 -5859635 -5317797 -3583312 -5107235
5570 -5107235 -12516469 -21177975 -23777496 -18958247 -11609126 -5427206 203812 5410199
5562 5410199 6886092 2434051 -5057339 -11351755 -15934773 -19912961 -21160202 -16117613
5554 -16117613 -5928922 3278189 6804422 5192680 1490952 -2217419 -4997101 -6672683
5546 -6672683 -8198221 -10170113 -10599307 -6827117 -88428 4955085 6109761 5801554 6187517
5537 6187517 5958513 4200205 3563809 6060832 8668315 7348976 3594842 2657531 6216434
5528 6216434 10831912 13147664 12707901 9921179 5482288 2268824 3611315 8418717
5520 8418717 11690892 11288034 10439424 11550370 11508839 6718041 38338 -1695072 3720423
5511 3720423 11381468 15423727 14563954 10925783 6117603 358872 -5486944 -8842531
5503 -8842531 -7382512 -2207585 1942734 1246111 -2567257 -4296913 -2465669 -1481303 -4794731
5494 -4794731 -9045376 -8687581 -4405776 -2142830 -4178634 -6205272 -4387210 -640490
5486 -640490 1475812 2126292 3206873 4151182 3583129 2914523 4201367 6003970 5742400
5477 5742400 5080451 7964017 13402783 15669481 12959489 10373817 11518117 12248949 7323062
5468 7323062 -442909 -3323575 618198 5336043 5104854 571445 -3719440 -4007069 573045
5459 573045 6700000 7712326 206555 -9767775 -12092615 -5279490 1720869 2373038 773415
5450 773415 2940993 6326494 4918812 438332 68229 4818227 8479263 8180867 7928256
5441 7928256 10134996 11379834 9590933 8315044 9417774 7827158 -490421 -9897790
5433 -9897790 -11135383 -3506084 5069622 8597062 7945946 6444452 6409693 9757098 16290748
5424 16290748 20898624 17981802 9718802 4450997 5297092 6266736 2496053 -1753421
5416 -1753421 -266855 4845826 6681117 4564618 4158059 7082410 7991285 4131318 1281137
5407 1281137 5605948 13695923 16159411 9602754 182976 -4712169 -4115969 -1793354
5399 -1793354 -471597 -23128 589230 1857075 3481059 4175914 2478872 -1147842 -4077549
5390 -4077549 -4716082 -4796565 -6743720 -9853990 -11512016 -11595887 -12654197 -15277137 -16291366
5381 -16291366 -13062332 -7382210 -3307317 -2770195 -5032655 -8869648 -13064208 -15634708
5373 -15634708 -14761769 -10406238 -3940261 2945472 7870344 8151470 4066007 510769
5365 510769 2227448 7599566 10262769 7070507 1261013 -2926608 -5096142 -6277833
5357 -6277833 -5218219 -720411 4136469 4193089 -1337738 -7753995 -10705571 -10247213 -7991515
5348 -7991515 -3405890 4021304 10534618 10168063 2233156 -6018815 -6544491 819455 8815739
5339 8815739 11081451 7810106 3626043 2597995 5800740 11049225 13790967 10638259
5331 10638259 3573801 -1538963 -2188786 -2228416 -5325401 -8558029 -6587120 1797 5604686
5322 5604686 7962923 10183851 14028303 16676571 15904512 13498174 10918233 6098300
5314 6098300 -1883081 -8622880 -9134048 -4419466 589623 3776537 6635578 9757250
5306 9757250 11510841 10691639 7279499 1314508 -5832328 -10011040 -7839260 -1591835
5298 -1591835 2632185 1556537 -3174736 -8737113 -13467566 -15915232 -15245782 -12511862
5290 -12511862 -8361130 -885386 9468743 14553503 5902222 -11412933 -20821642 -14166220
5282 -14166220 -1815763 2927613 1821943 4989728 12029141 12303100 3182537 -4584919
5274 -4584919 -3187213 1202832 -128384 -4334801 -2696019 4960693 10821763 11992333
5266 11992333 13956540 20305590 26246168 25148361 16953715 7373628 1703986 1287959
5258 1287959 3560686 4122330 964695 -2518747 -1218936 4548541 8992333 8946919 7989248
5249 7989248 10258503 14099511 15284778 13434260 11151836 9075579 6287175 4264264
5241 4264264 5771234 10159665 13881762 15507735 16186674 15351661 10899671 4591629 2198334
5232 2198334 5805403 10074965 9225372 4455614 1136780 1430684 3506662 6079637 9552710
5223 9552710 13452314 16392848 18310489 19607213 18578590 13338912 6408404 3333269
5215 3333269 5366004 7148606 4065603 -1081994 -2223144 779002 1085854 -6657022
5207 -6657022 -19997236 -31853821 -37300818 -35565765 -28091296 -18001113 -10134184 -7324552
5199 -7324552 -6072027 57330 10915536 17645430 13623109 4428894 1711165 8307734
5191 8307734 15228952 14181614 7448608 2577369 1831471 1280239 -2006042 -6205681 -7679959
5182 -7679959 -4664919 1806726 8599190 12410832 12586545 11475213 11087305 11046891 11247514
5173 11247514 13937172 20025461 25123285 23413675 15248091 7147860 3853968 4048525
5165 4048525 5036439 7677349 13584019 19804036 20381285 13415544 3627823 -3278458 -6622822
5156 -6622822 -9182485 -11433433 -11013620 -8075066 -6807017 -9039119 -10097679 -5454004
5148 -5454004 1386366 3744943 2861383 6189628 13985254 16709825 9674277 1604037
5140 1604037 1966588 7061193 7458596 3654779 3671577 8178843 9597777 5751658 3127278
5131 3127278 4697485 5233728 2367873 2123903 7767859 12050609 7888406 -134500 -2738525
5122 -2738525 1078288 6088165 11142307 18225818 24028898 22288693 14486732 9604848
5114 9604848 11794258 15476815 14552640 9817427 4629710 -602739 -5810409 -8163801
5106 -8163801 -6305287 -4469440 -7690388 -14470289 -18093074 -14521930 -6066328 2091981
5098 2091981 6267281 5650091 2163261 -666048 -708220 439967 -450413 -3848964 -6880318
5089 -6880318 -7111353 -4686088 -151142 7017616 15596097 20456780 16686008 5724266
5081 5724266 -5270644 -10339677 -8532752 -1113262 10756390 23499858 30190339 26350792
5073 26350792 15338943 4595532 -2396871 -7217747 -11039214 -12645814 -12053531 -11673981
5065 -11673981 -12548404 -13023402 -12721427 -14372411 -19360128 -24067502 -23371161 -16521967 -7822645
5056 -7822645 -2576550 -3333079 -8411970 -12811664 -11985792 -5920716 1346437 6137543 7248474
5047 7248474 4253528 -2826511 -11420745 -17408118 -19578552 -19987620 -18779639 -12726315
5039 -12726315 -1196125 10334082 16003808 15851925 13366674 9980113 5819525 3136964
5031 3136964 4174062 6710304 5881573 303825 -6314897 -9078676 -5499225 3115254
5023 3115254 11525564 13878430 9943286 5996836 6769338 9322892 8575005 5750984 6060446
5014 6060446 10011020 12984973 12637564 10689592 7250637 -333356 -11094913 -18166046
5006 -18166046 -16000148 -6865007 2070137 5871668 4826389 2798058 3893890 8743366
4998 8743366 13327324 13351391 9674436 6884883 6986841 8132930 9566848 13067054 17958731
4989 17958731 19460467 15340626 10848425 12870424 20792405 27059377 26434975 21265738
4981 21265738 16854144 14480362 11103235 4738296 -2411744 -6767249 -7444916 -6037870
4973 -6037870 -3693971 -744269 1474221 1515082 865687 2931490 7973672 12121371 12672702
4964 12672702 11013575 8612704 4050527 -3117940 -9061369 -9790687 -6039390 -1199624
4956 -1199624 2536303 3242059 -1137321 -7916005 -8725720 641343 12395337 14712415
4948 14712415 5307469 -8303926 -18943327 -23533299 -19793540 -7844703 5348282 10936246
4940 10936246 8208965 3479808 -258748 -5107740 -9977411 -9233497 -1737541 5977631
4932 5977631 8158712 5602804 1228165 -3964626 -8287397 -8471373 -4183800 726385
4924 726385 3231644 3920872 4651389 7166446 12842340 19242746 19416566 10827126 1976494
4915 1976494 2183947 7763333 8085297 2718679 715401 4158854 5790680 3622855 3956730
4906 3956730 7568433 7061210 1815507 1611080 10281773 19096391 21796561 22890465 25476300
4897 25476300 24847482 20329738 18758637 19461525 11627332 -5533850 -16970213 -15346330
4889 -15346330 -12411865 -16077969 -15817041 -4672068 4345645 454542 -6144937 -5693503
4881 -5693503 -7707407 -18087003 -21675617 -12755145 -15551189 -41950509 -60708830 -56764350
4873 -56764350 -90699872 -226012804 -403461324 -470385154 -360961812 -179756101 -68362184
4866 -68362184 -48537658 -47796882 -27801031 -14328037 -22575172 -26712203 -10319950 7187528
4858 7187528 9116537 6922984 12356062 15951353 8924924 1480791 3877277 8591250
4850 8591250 5401602 -947226 -720444 4791609 7752278 5666870 1343858 -1808736
4842 -1808736 -105837 7448229 14625986 14787901 12195486 15927827 23103029 21672503
4834 21672503 11060039 4899345 9472749 14528636 11449793 5965460 4802494 3084601
4826 3084601 -5206192 -15634257 -22540603 -29768896 -40949355 -47632362 -39554028 -21280846
4818 -21280846 -7197294 -3544805 -5340463 -7743633 -10556393 -13425010 -15541654 -19038689
4810 -19038689 -25207496 -28961455 -24532779 -15275456 -10304325 -12219435 -15339854 -15431070
4802 -15431070 -13659125 -10750784 -4993316 2165509 5256338 2311101 -1877842 -2562884
4794 -2562884 -650942 869561 1721444 2525284 1911308 -972852 -3719939 -4013540 -3772402
4785 -3772402 -6206488 -9971728 -10476769 -7168098 -5298085 -8552478 -13299650 -13527515 -9525637
4776 -9525637 -7261250 -9190234 -10449307 -6385078 76826 2518207 148359 -1798948
4768 -1798948 -28807 3094211 4209551 2870221 -723296 -7779075 -17911838 -26907465
4760 -26907465 -30579298 -29335267 -26625484 -24518215 -23196145 -22945507 -23164222 -20245152
4752 -20245152 -10546890 3420668 12897400 11207356 766136 -9989400 -15334398 -15624009
4744 -15624009 -12976434 -7552752 121984 6202048 6614680 2477320 -784337 86350
4736 86350 3399219 6446953 8828147 10671975 10893020 9398442 8524703 10042748 12729092
4727 12729092 14673057 15709982 15969549 14947782 13892647 15446008 18372361 17079465
4719 17079465 10262294 5266928 8100267 13201875 10642537 959983 -5635745 -4192472
4711 -4192472 -473684 -205169 -1010814 1665142 6853110 10081943 9003992 4561403 136226
4702 136226 446372 6655081 12095795 8855516 -409415 -4393522 1046554 7057521 5627208
4693 5627208 974589 1050876 5108001 7699527 9214569 13175855 16942905 15025371 9925498
4684 9925498 9880133 15720675 19445165 17623991 17010610 22706270 28710463 26772331 19447778
4675 19447778 16706518 21443582 25644934 22123130 14436649 11724360 16657720 22715901
4667 22715901 23073188 18411625 14182138 12747075 11449040 7717567 2687208 -1145272
4659 -1145272 -3309285 -4904436 -6453426 -7727061 -8678686 -9452562 -10258991 -11786425 -14618111
4650 -14618111 -17781972 -19196886 -18026243 -15241701 -11645644 -7179185 -2696550 -395478
4642 -395478 -1423660 -4466090 -7432520 -9318836 -10150053 -10495543 -11060325 -11382808 -9598215
4633 -9598215 -5296320 -1254107 414297 2078869 6566293 11097008 10977578 8567089
4625 8567089 11415457 20273128 26271895 23029069 15002531 9968873 9206423 9617071 9963591
4616 9963591 9810560 7304583 3599482 4777026 13130462 20776478 19002795 10683426
4608 10683426 5790277 6751395 6399723 36739 -8301240 -13034658 -14086178 -14237198 -13978080
4599 -13978080 -11844654 -7612819 -3258202 -1289669 -2078922 -2723459 -417055 2674884
4591 2674884 1396099 -4272771 -7746734 -5053472 -225362 2262420 4515669 9180858
4583 9180858 12218749 9140258 3880458 3232561 6037332 6547580 5398255 7604525 11736661
4574 11736661 11435211 7085339 5646171 8396902 9166592 6252324 5742886 10011725 12545463
4565 12545463 8353293 1207551 -3688046 -6584609 -8540257 -7396257 -3290829 -1592931
4557 -1592931 -5261585 -9798199 -10174917 -7404368 -4324023 -676421 3373978 4668898
4549 4668898 2717664 2529838 6938033 11052142 9216148 3010261 -2168125 -4147486
4541 -4147486 -3534938 -856101 1795634 833688 -3449317 -6481973 -7213687 -9588386 -12653251
4532 -12653251 -7859541 7331591 21437666 23284487 17613849 16494585 20588110 20267396
4524 20267396 12377780 4275309 1331630 453383 -2661250 -7939716 -14053869 -20237239
4516 -20237239 -23668558 -21131609 -14658745 -10479053 -11445976 -14741288 -16979357 -17222435
4508 -17222435 -15568803 -13416537 -14330398 -19788487 -24903798 -23298444 -15374747 -6976751
4500 -6976751 -1197157 3264658 7107707 9642390 11956135 15194263 16825182 14262472
4492 14262472 10530814 10005477 10382287 6238902 -855620 -4011862 -2232813 -1422016 -3972752
4483 -3972752 -5990753 -5700936 -5770139 -5796015 -1564103 5894142 9548181 7707788 7136512
4474 7136512 11098502 13371342 9057913 2675935 -421094 -2652763 -7650816 -12566177
4466 -12566177 -14303884 -16651002 -22922205 -27287794 -22589846 -12657856 -7505473 -8722539
4458 -8722539 -8514152 -2205518 6258568 11145084 10527406 5046780 -3002760 -9246277 -10887799
4449 -10887799 -10450959 -11407071 -11481214 -5743495 4621946 12429982 13231645 8934190 3360817
4440 3360817 -404738 1038634 8793863 17499098 19720455 15520645 12133825 13234927
4432 13234927 14705128 12899363 10651899 11423849 12747591 10108956 3843374 -2142871
4424 -2142871 -5917435 -7757314 -6947100 -2660725 2714596 4858185 2525620 -924829
4416 -924829 -1257118 2670963 8258615 11259067 9097483 3343285 -1481809 -2328400 -280541
4407 -280541 1505534 1146186 -1288744 -4484171 -5892565 -3057599 2865824 6556267 4322332
4398 4322332 -684131 -2451904 -722717 -1292728 -6900259 -12651326 -13432914 -11573437 -12141248
4389 -12141248 -13443429 -8946886 1455922 9065745 7732576 1673112 -2083072 -3982010
4381 -3982010 -8864655 -15862869 -18238510 -12660163 -2774024 6702636 14102890 18254151
4373 18254151 17045091 10577458 2080325 -5747533 -12125760 -15590695 -14302757 -9769778
4365 -9769778 -5707260 -2239052 3672981 10944691 13901076 11551303 10411420 13846867
4357 13846867 15368309 8653632 -1523523 -5911543 -4029181 -2495478 -3064194 -1518845
4349 -1518845 2368277 3160268 -372851 -1961053 2213847 6816181 5059158 -1370073
4341 -1370073 -4761596 -1309111 5469171 10247573 11508160 11153638 10637610 9542065 8362239
4332 8362239 10234773 16385051 20714372 14636575 -608960 -12318196 -11306998 -3343776
4324 -3343776 98170 -2385106 -3203277 1098651 6899347 11846147 16543884 18265990
4316 18265990 12994804 5092501 4994271 14212352 21835123 19898935 13299181 9373355
4308 9373355 6586790 857195 -4194156 -2125623 5606030 11714545 12774932 10091654
4300 10091654 4222713 -3993546 -9231653 -6002331 3393393 11115692 13178948 11381086
4292 11381086 7543096 2220580 -1417309 997871 8623600 15295120 16661327 13359115
4284 13359115 7182131 -836444 -7593307 -8148454 -1303207 7814775 12426258 9692080
4276 9692080 1611413 -7080919 -11736137 -11229505 -9166995 -9709027 -12285922 -12536053 -8134167
4267 -8134167 -1471914 3142396 3106374 -793687 -4496962 -3931959 -168598 875808 -3683244
4258 -3683244 -9269329 -10957558 -11143366 -14145035 -16285783 -9710818 4318651 14728070
4250 14728070 15539740 13833314 18724109 28438580 33686888 30266307 23282916 20441895
4242 20441895 24586746 31868505 35253427 31025933 22797946 17306350 16196915 15220359
4234 15220359 11785209 8524526 7615127 6557097 2867203 -1239579 -2781862 -3132558
4226 -3132558 -4893682 -6462612 -4313465 1357776 7816267 14825337 23393041 30390080
4218 30390080 30040858 21724246 11704039 5504798 2528398 394378 780049 6896316
4210 6896316 16784760 23448667 22368770 15973724 9502277 5246952 3184673 4611453
4202 4611453 10565681 17147501 17727056 11605120 5649169 4228012 2332402 -6312000
4194 -6312000 -18269728 -24222222 -21563971 -16067066 -12067812 -8650828 -5710417 -5632455
4186 -5632455 -7202946 -5694111 -1710738 -2196103 -9004695 -14292918 -12153293 -7152063
4178 -7152063 -4959163 -1796182 8392995 21756147 28895629 28118329 25328993 22877402
4170 22877402 17639440 9673964 4259990 4287241 7327079 11060608 15673558 20381297
4162 20381297 23227308 24722090 26544330 27009165 23383889 18064322 16311240 18304404
4154 18304404 19789559 19942613 21492971 23601173 22747087 20928270 24317718 32814947
4146 32814947 39887418 43962624 49898717 57204225 58487914 53611131 53124628 62299392
4138 62299392 76099090 98553031 149053075 229706573 297640819 296437146 218219037
4131 218219037 115389546 45358895 19706269 13864593 7988077 1911475 -286283
4124 -286283 -1275236 -4490668 -8787727 -12622555 -17096164 -22461359 -26279374 -26920594 -25418625
4115 -25418625 -22699161 -18319455 -13138514 -9873703 -9149871 -7868069 -3958617 -507154
4107 -507154 -1954189 -7302314 -10685400 -9003714 -5650295 -5155049 -7026060 -7609776 -6133325
4098 -6133325 -5353327 -6733500 -8546076 -9337051 -10037976 -11229186 -10980105 -7392123 -1528638
4089 -1528638 3934918 7563640 9185141 8572564 5949485 3037570 2220242 4843976 10252040
4080 10252040 15289177 15430435 9182839 1470787 -733558 3129467 6787132 6037307
4072 6037307 3355205 1780245 -138573 -3626984 -5567216 -4594078 -6338726 -15359228
4064 -15359228 -25395437 -26163543 -18371964 -13304295 -17194010 -24266324 -26666441 -23154592
4056 -23154592 -15357441 -3582796 8883321 14117721 8490538 -1043931 -5385589 -4781844
4048 -4781844 -6334438 -12723231 -19589662 -23048355 -23785733 -23146086 -20375784 -15797721 -12940214
4039 -12940214 -14395766 -17144635 -14958773 -5873296 4511273 8595415 5079770 -108139
4031 -108139 -1385909 585041 2281094 3770393 7950119 14641195 19941923 21664767
4023 21664767 21345172 20151698 16769627 10545899 3125571 -4205831 -11170562 -15565318
4015 -15565318 -14220455 -8743419 -5618829 -7733180 -10028477 -6907268 -2973 5257528
4007 5257528 7242044 7886502 7800700 6292082 4391565 3672183 3443015 2438776 1461187
3998 1461187 1290458 497724 -1325939 -1290408 1812885 3773358 1309185 -1378046 1115125
3989 1115125 5443453 3749790 -3409424 -6766436 -1410272 7846399 15455912 21288240
3981 21288240 25092847 22976389 14376976 6276431 4796001 7100670 6858831 3565558
3973 3565558 645725 -2314206 -8622112 -16928327 -20777646 -16417291 -6932606 1928875
3965 1928875 6806452 7444135 5585535 3846765 3444700 2803775 245529 -2625514 -3001510
3956 -3001510 -2025852 -4363008 -11594395 -19127856 -21741175 -20073317 -18999129 -20586399
3948 -20586399 -21582333 -18376964 -12100343 -7106336 -5555428 -5489766 -4021184 -412618 4338004
3939 4338004 8815969 11074906 9453429 5412118 3594333 6367504 9699887 7698338
3931 7698338 541802 -5540273 -5974831 -1844623 3987346 10324792 15594576 16616177
3923 16616177 12738509 8624141 9331834 13676300 15376339 10614185 2553797 -1707863
3915 -1707863 2132874 11416815 18685338 18902803 14446617 11380315 11372444 10400128 5634340
3906 5634340 -564370 -5203409 -8957573 -12760645 -13681588 -8549709 314614 7097546
3898 7097546 9001468 7252571 3116362 -2853312 -8077855 -8490193 -2386637 8558346
3890 8558346 21266101 31439829 33492890 25023334 11359840 1246304 -2686868 -5281685
3882 -5281685 -10319956 -15352487 -16595520 -14366814 -10883831 -6475624 -1533556 559816
3874 559816 -3387125 -11189369 -16479656 -15122021 -8884951 -3403235 -3544487 -9212160 -14185315
3865 -14185315 -10954238 1050063 13439087 17383905 12890357 7137668 5073137 5233379
3857 5233379 4456791 2614920 1300256 929282 1277596 2913524 5896884 8259586 7970974
3848 7970974 5970508 5386791 7748629 11480216 14256089 15281479 14719384 12416477 8457469
3839 8457469 4047721 372258 -2956624 -6781737 -10006079 -10303873 -7669534 -5188241
3831 -5188241 -5050239 -5593437 -4043869 -629650 2311672 4055143 5401948 5616173 3057609
3822 3057609 -845887 -2172775 -562905 -934136 -6337559 -12156020 -11413823 -4290917 1862966
3813 1862966 1773699 -2231538 -4419176 -2076452 3182261 7585123 7434364 1947945 -4431560
3804 -4431560 -5095873 1131461 7453724 6586357 -927890 -8597632 -12452690 -13738194 -13761324
3795 -13761324 -10976877 -5219186 -1055472 -3129164 -9504135 -13176891 -10390651 -4644394
3787 -4644394 -1450343 -1415736 -527488 3923414 10245036 15252212 17799139 18162207 16107132
3778 16107132 12209769 9897807 12465961 17575187 18557490 13163644 7466728 7804793
3770 7804793 12006997 13479031 11876188 13218850 19274779 23760708 21709755 16678670
3762 16678670 14717661 16287454 19092132 24238660 32759017 38933045 35096028 22967589
3754 22967589 13058760 11588940 14248035 14573579 11913917 7822203 816614 -9605621
3746 -9605621 -17496174 -15280568 -3306671 9810785 16279791 15561893 12302040 10923239
3738 10923239 12324504 13546669 10511936 2772697 -4670751 -5955338 -681611 5686012
3730 5686012 7668607 5015823 2218137 3412347 7709240 9910031 6735947 1404246
3722 1404246 -323383 2010548 3444082 1846742 1546857 6175964 12192254 13710483
3714 13710483 10931981 9189650 11254453 14966300 17551740 18079805 15912794 10605661
3706 10605661 3847981 -1260329 -3202860 -2593427 -625464 1047802 548603 -1388161
3698 -1388161 -596982 5229239 12175916 14691647 12750064 10347189 8897616 7268643
3690 7268643 6701387 9444661 13056511 12629865 8971729 7811119 9963611 9685237 5077945
3681 5077945 2498871 6390314 11377831 10129400 4080277 275159 1082053 3098911
3673 3098911 4080837 5252867 7534437 9866143 10972506 9954442 6299369 1639232
3665 1639232 -626374 -90597 -1078575 -6505349 -12918785 -15472363 -14892010 -14841190 -14967981
3656 -14967981 -12236497 -7690932 -5821783 -7179417 -7097583 -2765380 2885861 5557709
3648 5557709 4183835 130853 -4808776 -8338485 -8274882 -4604486 492255 4698367 6278933
3639 6278933 4117181 -336880 -2549595 178637 4264162 4138005 167894 -2121903
3631 -2121903 -422843 1632684 642539 -2464551 -5650357 -8479610 -9927062 -7807789
3623 -7807789 -2638720 1548698 2314166 1312620 5065 -2964440 -7506408 -9306229
3615 -9306229 -4999915 2872254 9696239 14892635 20288825 24595593 24032836 17803951
3607 17803951 9353895 2435415 -1309786 -1483104 1336877 4933491 6804948 6383397
3599 6383397 4756291 3123465 2838248 5156606 8707959 9018373 3455860 -4805523 -10830799
3590 -10830799 -14217151 -17331107 -18810449 -14564807 -5741511 207970 -1086488 -5291088
3582 -5291088 -6482717 -5640810 -7459257 -11767861 -13725892 -11332509 -7219772 -2963408
3574 -2963408 2822321 9339587 12047198 9461963 7119805 10287764 15788578 16318963
3566 16318963 11151550 6674696 6541276 7568762 7019102 7676529 11767206 14771831 10805218
3557 10805218 1312893 -7185662 -12258245 -16515725 -20156341 -19355916 -13707979 -9197669
3549 -9197669 -10372911 -14037445 -14599295 -12103734 -10489995 -10501815 -9433974 -6708194 -4590566
3540 -4590566 -3401126 -995132 1887355 616503 -6274748 -12873575 -12649699 -7164940
3532 -7164940 -3687516 -5082926 -6853887 -4999005 -2116208 -2845551 -6650368 -9218437
3524 -9218437 -9161373 -8522456 -6914436 -526569 10840944 20045866 19820919 11648062 3797692
3515 3797692 1657322 3473279 5109875 5220017 4780191 4261538 2805364 -859308 -6942592
3506 -6942592 -12963690 -14391819 -9206304 -1420199 2812609 2781919 3651705 8287238 12141009
3497 12141009 8959932 -532745 -8835700 -10109194 -6018751 -2788956 -4047861 -7647227
3489 -7647227 -9239199 -7854568 -6631399 -7927935 -9632131 -7940614 -2539542 3056568
3481 3056568 5530711 4112607 -39480 -4278117 -5350434 -2937847 -1325798 -3825004
3473 -3825004 -6602111 -3199698 4942992 8826551 4470274 -1291434 -1033164 3311925
3465 3311925 5822025 6629521 9681403 13816436 13929234 10111182 8058653 9257626 7450445
3456 7450445 -2140936 -14809869 -21148196 -17075157 -6256199 5137467 12773670 14383751
3448 14383751 9365606 -182117 -9250367 -12677163 -9074538 -1623409 5687899 11903115
3440 11903115 17958211 22825050 23619985 19620276 13150969 6080428 -939186 -5101704
3432 -5101704 -2571929 4288910 6227791 -1439986 -10932777 -11639979 -4361552 1324560
3424 1324560 1868881 3219231 8768486 12418716 7593934 -2719614 -9575712 -8266803
3416 -8266803 -1266887 6292765 10597242 10221486 6216124 1033332 -3312125 -5299175
3408 -5299175 -3100123 3470163 10618803 13840848 13749753 14699346 17161202 16315641 9820943
3399 9820943 2058608 -2107660 -3504960 -5382471 -7890698 -9543160 -10818188 -12258670
3391 -12258670 -11853373 -8646068 -6512065 -9414393 -14297675 -13776130 -5803240 3799004
3383 3799004 9174866 10941665 13225490 16965766 18731763 15731178 10213771 7595533
3375 7595533 10086388 13877048 14380142 12499164 12050851 11971464 6823865 -3391973 -9852479
3366 -9852479 -5349428 6136558 14750887 16125650 12649987 6820905 -362275 -5878505
3358 -5878505 -5884575 -988856 3890005 4967906 1686052 -5045090 -12238250 -14056723 -7266580
3349 -7266580 2993977 8285765 7394526 6281132 8133102 10253438 11106546 12555461
3341 12555461 13110528 7242410 -4420499 -11701639 -7506729 2064237 6448647 4223313
3333 4223313 1046152 -1156460 -4236853 -5989720 -1948311 5276829 7612736 3956062
3325 3956062 2436226 7257959 11395777 7561648 -158278 -2535030 1154040 3296219
3317 3296219 72712 -3970168 -4224321 -2704298 -3843700 -7765099 -10897480 -11084592 -9463074
3308 -9463074 -8429403 -9614621 -13114366 -17495114 -21266189 -24853172 -29656402 -34612017
3300 -34612017 -36087487 -32747858 -27917925 -24454662 -19865866 -10883913 -1460098 -390159
3292 -390159 -9803935 -21156832 -25295818 -22268330 -17826016 -14281900 -9857656 -4587807
3284 -4587807 -1080046 108875 855686 1150549 -821190 -3710187 -3014105 2474897 8715551
3275 8715551 12654581 15715526 18624984 17989470 12393931 7585310 9716213 15944995
3267 15944995 17876580 13057142 6686644 2106444 -3338034 -10809467 -14770283 -9814459
3259 -9814459 1029965 9403194 11051571 8451422 5664366 4500125 5104722 6604523
3251 6604523 6772238 3882949 -491631 -2726769 -1636645 292998 623989 -115243 -18513
3242 -18513 1419110 3019680 3043157 -47274 -6283746 -12683886 -14689263 -10625008 -3752539
3233 -3752539 1252634 2691278 1499597 -1811963 -7447542 -14142410 -19163231 -20831902
3225 -20831902 -19412954 -15591802 -10156261 -5377675 -4098858 -6165646 -7895677 -6887734
3217 -6887734 -5609973 -7864043 -12836631 -15478408 -12593787 -5870537 1390170 7536260
3209 7536260 11356593 10898658 6691720 4329963 9576784 20478643 28046897 26479743
3201 26479743 19731869 15463068 15138800 14068669 9854945 5633872 3918631 2109297
3193 2109297 -2595773 -7075892 -5507714 2333063 9904578 11143491 5813183 -2460679
3185 -2460679 -9972017 -13552490 -10747909 -2299641 6704477 10613511 8453347 4563496
3177 4563496 4089670 8169543 13223557 14788934 12196957 8957847 8139167 8858790 8948135
3168 8948135 9249200 11825734 14627909 12457365 4389474 -3901557 -7364031 -7380407 -7522485
3159 -7522485 -7147715 -3554240 1758724 3919034 1277144 -2932598 -5563289 -6478027 -6096379
3150 -6096379 -3738479 80710 2455744 1218457 -2098975 -3989828 -3112424 -1760798
3142 -1760798 -3200565 -7751634 -11903696 -12034531 -8513626 -4350151 -156234 6264775
3134 6264775 14551226 20190082 20613877 18621356 16342668 10791231 1169468 -3976329
3126 -3976329 4323875 20938895 30307305 25607076 15700124 10886144 10696565 10236651
3118 10236651 10284135 13836074 17973832 16836190 10175471 3032332 -997629 -1186687 2977348
3109 2977348 10278913 15634713 15227947 12612894 14375729 20688443 25484742 25299123 22418754
3100 22418754 19475565 16651381 14961675 16749303 21025231 22710466 18672644 11417208
3092 11417208 5467756 3020697 3903037 6482415 7826816 6372540 5058108 7969444
3084 7969444 13173657 13546239 6515380 -1525926 -3130273 1808745 8266238 12597870
3076 12597870 13294309 9072393 1056871 -5418436 -5932759 -2539701 109618 2766556
3068 2766556 10337710 22557214 31560538 31280857 25373783 22310536 24593336 26448835
3060 26448835 21989718 12493717 4047906 -222689 -2863141 -6752480 -9808980 -7664020
3052 -7664020 -640169 5344695 5730325 2347825 -112424 -5718 1473062 4159692 8751303
3043 8751303 13549316 15543107 15523378 18369983 26288230 34830631 38600665 38667280 40195906
3034 40195906 43369085 41619285 30988514 17363932 10287531 11304329 13155727 10569028
3026 10569028 6766626 6976735 9896423 10065377 6427157 3471988 4177364 6401791 7217006
3017 7217006 6940005 7193005 8048721 9061209 10709961 12905358 14111040 13695180 13028279
3008 13028279 12279900 8348349 -1168798 -13064324 -20232863 -18198253 -8738378 2028035
3000 2028035 8051771 7558061 4667824 5357075 10070767 12321614 6983220 -2222334 -6971226
2991 -6971226 -4513464 515516 3718642 5613683 7846452 9077268 6954153 1524980
2983 1524980 -5351924 -12084162 -17295125 -19601276 -19067470 -17373822 -15200457 -10993284
2975 -10993284 -3629415 5265831 12989489 18122440 19904337 17376772 11445342 6208468
2967 6208468 5362046 7877871 9833102 10140178 11503427 15204878 17956609 15916084 10237194
2958 10237194 6432761 8470809 14896326 20762916 22303466 19607035 15806058 14241218
2950 14241218 15745893 17867233 16896948 11378982 3779236 -1711798 -3062840 -1686118
2942 -1686118 -69635 781785 1053216 397686 -2008528 -5622596 -7870985 -6159560 -580424
2933 -580424 5724042 9388526 10275617 11456772 14934684 18344659 18080973 15436350 16162904
2924 16162904 22247347 27586171 25587463 18938413 16801794 22384835 28314455 26145269
2916 26145269 16432433 6589904 1704610 824521 582574 -1098653 -4681667 -9574142
2908 -9574142 -14215705 -16828637 -16582023 -13942950 -10512781 -8503771 -8844262 -9422672 -7252260
2899 -7252260 -3111723 -1339677 -3440128 -4882965 -916364 7171557 14915296 20914546
2891 20914546 25428012 25050737 15719713 1529481 -6327809 -2580765 5102953 5847857
2883 5847857 -1481959 -9124956 -11111631 -8266264 -4166621 -1092340 -136434 -1502877
2875 -1502877 -3802622 -5400130 -6577232 -8147690 -8421113 -4618396 2511539 8612821
2867 8612821 10967217 10867473 9883406 7239039 3053273 1134659 5025632 12555854 17628597
2858 17628597 17199098 13778854 10880945 8584931 4526749 -2633197 -11849226 -20392882
2850 -20392882 -24908155 -23226320 -16742365 -10199814 -7428035 -7522227 -6735785 -3977487 -2431482
2841 -2431482 -4961840 -9720078 -12053146 -9961877 -5887329 -3297232 -3200242 -4225472 -4475115
2832 -4475115 -2626580 1377957 5774485 8212939 8496041 8928541 10745381 11477153 7909547
2823 7909547 1205356 -3165616 -1269955 4859160 9406935 8759262 4866587 2888964
2815 2888964 5478066 9470211 9214767 3491806 -2771194 -5186195 -6148289 -11169516 -20069181
2806 -20069181 -26088908 -24528792 -18424463 -13924395 -13357874 -15193125 -17812150 -20044997
2798 -20044997 -19965136 -16749921 -12945809 -11849393 -12924466 -12324715 -7961469 -2263538 -75222
2789 -75222 -4725782 -14705761 -22906550 -21688470 -11427639 -1646501 -171318 -3734301
2781 -3734301 -4132137 -1192978 -2389900 -9783595 -15527484 -13167917 -6388679 -2057688
2773 -2057688 -353467 2505804 5926357 5789586 1635289 -2479921 -3196559 263655 7505898
2764 7505898 15600422 18390033 12866480 5125039 3997635 9114879 11461443 6133500
2756 6133500 -2001582 -6789062 -8282993 -8948390 -8501247 -6696157 -6402849 -9287244 -12184385
2747 -12184385 -12215484 -11963510 -14602455 -16996183 -13518287 -5028134 1783139 3381929 2371676
2738 2371676 1661680 1122227 916994 3096243 7974183 12868818 16327221 20064059 24683264
2729 24683264 26882247 23693746 17175604 12212552 11151371 12643641 14317703 14578724
2721 14578724 12874917 9962735 7270980 5139469 2831549 720268 325072 1182409
2713 1182409 200919 -4119935 -9117666 -11578826 -11573440 -10395309 -7327822 -1730531 3895731
2704 3895731 6926380 9125372 13798519 19575562 21989350 20820517 20188905 20547599 16806266
2695 16806266 7203920 -1528111 -2274413 3276407 8389819 10863007 13061490 14604544
2687 14604544 11971473 5742760 1886221 3591860 6731700 6433813 4281666 5243408
2679 5243408 10072878 14946662 17592455 19800421 23370727 26586268 26295223 22185242
2671 22185242 17502580 15395539 15071543 12418148 5211560 -2957969 -5799603 -1532842
2663 -1532842 5150476 8972857 9173607 7134235 2259433 -5984684 -13940020 -16557047
2655 -16557047 -14251290 -12500949 -13883984 -14948433 -12560084 -8816644 -6803835 -5549280
2647 -5549280 -3207170 -2005466 -5047466 -10227599 -12706605 -12430481 -13518142 -16265782
2639 -16265782 -16000780 -11421539 -8043256 -10298306 -15387175 -18760872 -20890023 -23756462
2631 -23756462 -24926618 -21294554 -15707636 -13057370 -11786415 -6846032 -192489 357962
2623 357962 -6008816 -10220511 -6680773 -1205200 -452503 -1342976 1426443 3942840 -636255
2614 -636255 -7926392 -5901629 7026475 18001347 16996385 9557311 7414275 12780071
2606 12780071 17746801 15329437 5887741 -4975909 -10735140 -8163972 -770881 3697341
2598 3697341 1794032 -1980315 -2523028 -1405670 -2528411 -3706408 1290481 12911688
2590 12911688 23441082 25411790 18864973 9706617 3959592 4033825 7693362 9883804
2582 9883804 7554835 2885708 312590 1334623 4148336 6682931 7270212 4434632
2574 4434632 -267476 -1510645 2745439 5705191 24530 -9514464 -10255544 80119
2566 80119 8669872 5354963 -3522422 -6006806 -2157934 -1181822 -4773398 -4095807 6077862
2557 6077862 19089368 25180921 22425103 15800068 10112857 7236162 7023883 7570595
2549 7570595 6364395 3464800 1893101 3065299 3776407 238276 -5826709 -7727252
2541 -7727252 -1114317 10400546 18025085 16471516 9116609 3273748 1001389 -2307430
2533 -2307430 -9224984 -14405836 -11378641 -2422753 3866125 4042665 3116616 5924259 11095197
2524 11095197 15588480 19611581 23485405 24216333 19828138 14130089 12546223 14962594
2516 14962594 16670459 14836717 10212352 3957012 -2960370 -7994453 -8745150 -6152604
2508 -6152604 -2547891 2452091 9762336 15357281 12686924 1768794 -9163658 -13235772
2500 -13235772 -11987962 -10667769 -10687689 -9844839 -6581747 -787245 6523922 11109398 6818921
2491 6818921 -6184013 -17408258 -16303942 -5536955 1859934 -1463397 -9990330 -15205204
2483 -15205204 -16118946 -16519194 -17032448 -15310140 -11521462 -8414162 -6532674 -3608827 977575
2474 977575 4471034 4351973 1332555 -2154465 -4742679 -6545558 -7962687 -8835062 -8319876
2465 -8319876 -5632454 -1491193 1746818 2565591 2469205 4168435 7659644 9690413 7498942
2456 7498942 1809620 -4340471 -8597480 -10462717 -10414228 -8919801 -6370549 -3542289 -1634778
2447 -1634778 -1405332 -2444712 -4024623 -6343103 -9539581 -11802622 -11097116 -9402007 -11658714
2438 -11658714 -18138547 -21421311 -15176678 -3433967 4113544 4459422 2758648 2047077
2430 2047077 -702161 -5954038 -6755684 1870094 13583101 17142899 9767020 -1298145
2422 -1298145 -8813096 -11931244 -13415872 -15356478 -17933594 -19186046 -16409779 -10353244
2414 -10353244 -6134375 -6461706 -6496170 -574009 8198082 11798372 9656179 9072027 12322627
2405 12322627 12119239 3788653 -5757605 -7344457 -2254072 1272706 468859 -398560 1006809
2396 1006809 2037882 1411304 2401569 7655669 14747041 18688417 16455386 8521334 -1386353
2387 -1386353 -7710679 -7190060 -2366613 1296884 2029680 2922359 6370502 10491787 11962394
2378 11962394 9630388 4283651 -2444117 -7652317 -8377744 -5138691 -2347038 -3456731
2370 -3456731 -7221079 -9978610 -9723400 -6489576 -911318 5369320 9390520 9342230 6706413
2361 6706413 4436072 3939595 4995061 6906502 7924593 5319333 -1376927 -8244589
2353 -8244589 -10463210 -7048451 -222816 8013497 15668246 19259579 17337566 14691986
2345 14691986 17438246 23247895 22546978 11976866 809195 -635307 5635490 9472945
2337 9472945 7173875 4824952 7704774 13354737 16924504 17711129 17395538 16032516 13397391
2328 13397391 11596416 12878894 16293485 18937200 19046909 15905043 8843642 -803616
2320 -803616 -8354127 -9644724 -5710515 -1105465 1646440 3253370 4184140 3507416 1560258
2311 1560258 648542 1890356 3541387 3591346 2258795 806735 -596631 -2531905 -4730364
2302 -4730364 -5875300 -4665489 -756384 4784037 9724102 11899150 10441417 5873706
2294 5873706 -317392 -6033726 -9882049 -12797365 -16427637 -18695972 -13835753 83659
2286 83659 15889916 23798171 22097340 16957635 12508247 6958836 -604258 -5985864
2278 -5985864 -5798119 -2752536 -833492 1239334 7098734 15570573 20974536 19614390
2270 19614390 12665060 3973283 -1751425 -408174 7405014 14502839 13815046 7276947
2262 7276947 3979807 8600321 15543428 16436469 10366393 4019765 3293601 7449298 11495565
2253 11495565 12515133 12551364 15370787 21237441 25901572 24723142 16735697 4780931
2245 4780931 -6468138 -12190064 -9787547 -1606674 6133969 8837236 7074315 4267066
2237 4267066 3253078 5947023 12675978 19528905 20233555 14193276 8961614 10258583
2229 10258583 13330487 10345799 3149389 539199 4145204 6307130 3389099 1981854
2221 1981854 7667280 15243445 16057877 9659957 1957257 -4134131 -9419310 -12171785
2213 -12171785 -8278168 1817851 11328935 13876505 9547707 3673596 1305756 2806457
2205 2806457 3650387 -734041 -9149287 -15455188 -16416089 -16052770 -19710346 -26159640 -28949989
2196 -28949989 -24349881 -14965617 -6398073 -2799240 -4495497 -7338737 -5607138 1733255
2188 1733255 8823932 9542150 4691691 -459884 -3675629 -6269710 -7547438 -4661774
2180 -4661774 1034832 2947737 -2519491 -10197305 -11924623 -6251454 447468 1751814
2172 1751814 -2132489 -5512957 -3662756 2501789 8107502 10104923 10094980 10960497 12534563
2163 12534563 12367914 9394017 4455790 -1869374 -9082282 -14514227 -14189537 -7045703
2155 -7045703 3103205 10276022 10283613 3019574 -7163437 -13845333 -13527766 -8504744 -3812115
2146 -3812115 -2376356 -4374719 -8946128 -13621185 -14353369 -10282194 -6793986 -8932413
2138 -8932413 -13037697 -10999628 -2535888 3959111 4325075 4724207 10864563 17905414 17182977
2129 17182977 8458506 -978628 -6414788 -8440977 -7438607 -2131812 6096478 12840001
2121 12840001 15667345 15767602 14436516 11702942 8521777 6316184 3929626 -982578
2113 -982578 -6970705 -9573962 -8424706 -9135479 -15471858 -23119302 -24563768 -18138833 -9337185
2104 -9337185 -4490256 -5457683 -9199646 -10172166 -4162435 7716668 19086706 24158773
2096 24158773 23211071 20796841 19399028 17128320 11579256 3682509 -3002112 -5406335
2088 -5406335 -2909769 2400942 6796748 7539495 5381414 3586511 3836761 4312830 2925343
2079 2925343 1165715 2653268 8088287 13779122 15778774 13695991 9448827 4101925
2071 4101925 -2120878 -7774705 -10538744 -9602036 -5868062 120868 8204847 16034262
2063 16034262 18956010 14323083 4851628 -3679267 -7386189 -6351144 -3360336 -2012040
2055 -2012040 -4714087 -10610928 -16076812 -18672128 -19729386 -21534988 -23292441 -22273559
2047 -22273559 -18123550 -13211041 -9027530 -5365125 -3342653 -5653674 -12074304 -17482209
2039 -17482209 -16732191 -9947288 -1251602 5794729 9235861 7284519 -310034 -9530531
2031 -9530531 -14150450 -11932563 -6950757 -4646572 -5999377 -7663615 -6662508 -3531173
2023 -3531173 -1233850 -2034000 -5429680 -8632528 -9094311 -6844304 -4361610 -4203442 -6828910
2014 -6828910 -10249080 -11220503 -7394437 366299 7779342 10605081 8692195 5435915
2006 5435915 3192664 1228851 -1101260 -1813875 768134 4449529 5729248 5079589 6125798
1997 6125798 9442904 10935309 7826244 3001769 946088 1550675 658975 -4418288 -12086282
1988 -12086282 -18146642 -18651439 -12716266 -4568770 -892146 -3339056 -5603004 -1619986
1980 -1619986 5067568 5277450 -2884163 -10965733 -11517011 -6860099 -3614239 -3649023 -4963515
1971 -4963515 -7482529 -12159629 -16381563 -16070052 -11824549 -7879632 -5077816 -201395
1963 -201395 6801769 10385214 6918842 473256 -2570819 -2125248 -3813148 -10920287 -20283658
1954 -20283658 -26159026 -25600167 -19509561 -10521902 -1437377 4933378 6352473 3223704
1946 3223704 -131630 1485844 8224731 13867473 12804356 7049006 2967157 1778697
1938 1778697 -1864059 -10608624 -18727563 -19158461 -12588044 -5200200 -27420 4152203
1930 4152203 6565987 3405668 -5372067 -13184424 -13989797 -9490937 -6166724 -7093004 -9927886
1921 -9927886 -11922286 -13191486 -14243190 -13361388 -9070622 -4170570 -4224841 -10740038 -17900363
1912 -17900363 -18679953 -13402479 -8852870 -8454920 -7667738 -1950830 4718396 4731633 -1549490
1903 -1549490 -5559910 -2489504 2911080 5022188 5915143 10579407 17942185 22463856
1895 22463856 22319253 20241239 17469478 12656066 6587466 2245944 -624072 -5428997
1887 -5428997 -11514187 -12536903 -5128533 5367465 11649302 13411018 15414499 19409664
1879 19409664 22571164 22482993 19563022 15406897 12169021 12528891 16794756 21046116 21553142
1870 21553142 19678936 18589084 17099288 12406825 7803240 10282000 18988120 23314602
1862 23314602 16360266 4469392 -1588350 -285071 1757869 1225712 1477915 5237923
1854 5237923 10322686 13921349 16507093 19787794 24069229 29100360 34727187 39175152
1846 39175152 38946283 32147328 20818175 9297246 1461706 -569220 2626116 7206034
1838 7206034 8364379 4559756 -1420826 -6007963 -8113371 -8516748 -7870785 -6549306 -5337644
1829 -5337644 -4920085 -4906728 -4018937 -1369255 2154727 3683311 731423 -5169168 -8483161
1820 -8483161 -5142651 2937118 10717857 15896943 18789922 17819211 10402354 -586357
1812 -586357 -6454059 -2224765 6745122 11399771 9892549 7726453 8363245 8626835 4534624
1803 4534624 -2042351 -5226865 -2242585 3739688 7990421 9624713 11130651 13234835
1795 13234835 12976817 8492494 3406120 2936933 6338444 7440538 3567950 -465569
1787 -465569 231066 3027354 1649810 -4459471 -9099659 -7261322 -533022 5772155 8026990
1778 8026990 6077303 1783018 -3003680 -7636682 -12180707 -15911656 -17576852 -17491804 -17309402
1769 -17309402 -16861099 -14195382 -10582896 -11703998 -20080524 -29541909 -32377284 -29715446
1761 -29715446 -28651320 -30396124 -28743811 -21061338 -13164932 -10405119 -10670321 -10347466
1753 -10347466 -11087720 -15073524 -18505753 -16642801 -12378268 -12854137 -18816504 -23768058
1745 -23768058 -23400824 -19865759 -16287124 -12923655 -10195930 -10156198 -12543396 -13592274 -11198903
1736 -11198903 -7690777 -5306232 -2743030 1050141 3360198 1661968 -1711456 -2727918
1728 -2727918 -1337878 -75563 1087578 3887468 6817928 6069818 1710079 -1692143
1720 -1692143 -1641180 -569011 -471268 856493 5130919 8713648 6702495 42293 -5603465
1711 -5603465 -7222721 -6629048 -5403633 -2145664 3580808 8219587 8248529 5449087 4996182
1702 4996182 8583516 12024738 10401053 3951465 -2288760 -4059730 -2056692 -363414
1694 -363414 -1224343 -2221268 595897 7064629 11889253 10233161 3316472 -3163072 -5758607
1685 -5758607 -6295167 -7626613 -8772901 -6626290 -1495699 2146282 1470359 -362735 2230487
1676 2230487 10097353 17743801 19032427 13078134 4258732 -2146433 -3620673 -1125120
1668 -1125120 2239221 3418842 1454356 -1891003 -3359410 -289941 7452419 16439255
1660 16439255 21109373 18321067 11225123 6992042 9593127 16043968 20557915 20474970
1652 20474970 16507576 9327390 -891771 -12153265 -20927243 -25302578 -26027519 -24499793
1644 -24499793 -21726791 -19059808 -17474604 -15829992 -12198925 -7353111 -4498847 -4864192
1636 -4864192 -5963495 -5292233 -3664618 -3780484 -7105053 -12673464 -17129788 -16057749 -8237979
1627 -8237979 1108240 5024570 3794017 5028638 12882208 21767738 24226597 20950757
1619 20950757 18379442 19378999 21469086 22334747 21808568 19380746 14804330 10849857 10757553
1610 10757553 12892560 12333672 8068792 4386648 4507974 6723394 7684941 6264344 3685836
1601 3685836 2700230 6092596 12581003 15513478 10430759 2651746 1064302 4967139
1593 4967139 4925848 -2304658 -8750854 -8580883 -7423670 -12035090 -18279753 -17818460 -11541297
1584 -11541297 -7227398 -6925628 -5744318 -1728264 2017729 5156431 11461891 20512573
1576 20512573 25536802 22667127 16598274 13862473 15149277 17221307 18129590 17256382
1568 17256382 13702183 8019700 3211515 1534406 2347832 4420466 7251853 8729772
1560 8729772 5704412 -486834 -3362494 63762 3903075 1503565 -4379284 -5743391
1552 -5743391 -1794761 21901 -4067885 -8345387 -6560725 -933453 2295328 2327574 3500780
1543 3500780 7607925 12040294 15285426 19047781 23568924 25238320 21375750 14211194
1535 14211194 7397170 1464467 -3789888 -5114011 665122 9545832 12534603 6530768
1527 6530768 -1771552 -5411706 -6036155 -9118833 -13931041 -14207709 -7830502 -142386 3405732
1518 3405732 3409490 3445145 4358367 4140982 1380236 -3460347 -8977900 -13335146 -14709896
1509 -14709896 -12565167 -8051715 -2846463 1401091 2628166 -444857 -5860052 -9147174
1501 -9147174 -7652996 -2597412 3652418 9623254 12759866 9028964 -1881314 -13054352
1493 -13054352 -16386082 -11713564 -6099338 -4107702 -3233308 -341118 1856331 -1635427
1485 -1635427 -10465709 -18727191 -21471737 -18140429 -10204098 425329 9683030 12235344
1477 12235344 7239973 957223 54449 3253414 3246809 -3082808 -10276463 -11674691 -7818664
1468 -7818664 -4566389 -4945667 -6556656 -6474725 -4917328 -2986379 124338 5332322 10760010
1459 10760010 13267117 12468288 10819225 9381998 6028663 -476156 -6497775 -6554648 20448
1450 20448 8427473 14924454 20574665 26597454 29657699 25984253 18146290 12691040 11591959
1441 11591959 11279850 10436230 12498950 17959267 20120901 13274596 1202617 -7417785
1433 -7417785 -9327047 -7625046 -4993245 -1661240 1052800 817194 -1816788 -3818994
1425 -3818994 -3987461 -3266780 -1718629 508687 312286 -4890782 -11263550 -12071118 -7460892
1416 -7460892 -4377970 -5504419 -5271407 53190 4881780 1932103 -7203338 -14337960
1408 -14337960 -14533882 -8999615 -706316 7854599 13621604 14164131 10465655 6214589
1400 6214589 4167485 4023209 2876945 -2513882 -11770163 -19016961 -18362422 -11931771 -8006025
1391 -8006025 -9528499 -9767321 -2809276 6741974 9778005 4950987 -618965 -906097 3740397
1382 3740397 9544817 13040971 12628414 9954194 8870244 10411059 10748336 6833751 1252204
1373 1252204 -1880743 -2583479 -2516049 -483660 4244891 7301081 4223740 -1842576 -3550191
1364 -3550191 1029780 7817997 13692470 17706667 17495019 12004555 6685956 8143952
1356 8143952 14035045 16114933 12930585 10697796 11263904 9225588 3251511 64908
1348 64908 2781618 4536409 -420273 -7088286 -7638789 -2470389 3054452 7020934 9559043
1339 9559043 8655394 4611761 3790096 10029075 16243397 12988234 2746550 -2968104
1331 -2968104 424681 5910917 6305303 2277955 -2740155 -8440669 -14781652 -18088753
1323 -18088753 -14262697 -4103800 6956768 13519776 13747603 9556963 4300773 6740
1315 6740 -3166040 -5274066 -6059003 -6083132 -5920867 -3896557 1956597 8822102 10471423
1306 10471423 5842809 1445366 1936854 3313632 182454 -4896430 -5657820 -2440545
1298 -2440545 -1286814 -4361428 -7819586 -8674873 -8097678 -8081973 -9611954 -13459051 -18310910
1289 -18310910 -19545803 -14846647 -9236280 -8827919 -11499261 -10526289 -5862857 -3714561
1281 -3714561 -5184532 -4097491 2309639 8694200 10242736 8763489 7328591 5901626
1273 5901626 5609114 10254737 19118132 24510385 21552973 15137399 12250495 12545177 12120410
1264 12120410 11962519 15793365 22200418 25385503 22734357 16572982 9176901 673802
1256 673802 -7966969 -13446522 -12779651 -6561580 127606 737822 -6103029 -13114623 -11588115
1247 -11588115 -2499804 4647261 4870484 2815174 2434842 -292547 -8813137 -17301796
1239 -17301796 -18135874 -12998835 -8717195 -6270021 -2274812 2196943 3621921 4532296
1231 4532296 10250392 18201086 20592929 17811659 18278080 22969490 21404713 8150413
1223 8150413 -6513893 -9840920 -3340626 1758880 542716 -2656251 -4291058 -5837062
1215 -5837062 -8234608 -9260305 -7780563 -5508843 -3242266 257002 4050640 3750464
1207 3750464 -2781531 -10908397 -13385267 -8349435 -1088203 2086005 316086 -1613712
1199 -1613712 1448752 9896430 18738209 21790031 17507942 11341386 10933210 17395968
1191 17395968 22807157 19380645 10313284 6864025 13534971 21494452 20353554 11806525
1183 11806525 5799105 6248915 7939319 6923094 6089607 8030780 8921876 3962437 -4930530
1174 -4930530 -11233543 -11722496 -9024660 -7457437 -8645976 -10397989 -8555747 -1148910
1166 -1148910 8480019 14413479 14666500 12728991 12003934 11794895 10285119 8249032 7296731
1157 7296731 6935934 6126919 5847843 7322840 8991090 7833315 3184342 -2321196 -4848312
1148 -4848312 -1764818 6083851 13403589 14220758 8456624 2625570 2292004 6264240 10084961
1139 10084961 12095136 13017967 12391893 9449960 5859396 3724253 2029705 -1271072
1131 -1271072 -4668910 -4502887 -557246 3370045 4454788 3179241 836961 -1839778
1123 -1839778 -3213763 -1216296 3679792 8330139 10546166 10991078 11136306 11149675 10073951
1114 10073951 6836846 1696050 -2000863 613097 9794824 18417110 19305791 14249687
1106 14249687 10990301 11724586 10494106 3400934 -4561989 -6466668 -2689292 1466711
1098 1466711 4330283 8481306 13584502 14079853 6185802 -5668889 -12169869 -8451407
1090 -8451407 1483872 9794236 12729939 12333725 11497097 10398923 8625783 7407857 6939281
1081 6939281 4082547 -3192951 -10607296 -11643673 -6590762 -2489251 -3236687 -4933942
1073 -4933942 -3207665 -166566 -260925 -2804129 -3232915 -134356 3107746 3275359 867243
1064 867243 -1375124 -1459914 369309 1963042 1443794 -382311 -850678 958966 3222817
1055 3222817 4442929 5011024 4768570 2125178 -2464692 -5218286 -4097955 -2845897 -6778082
1046 -6778082 -15994932 -25382187 -29942641 -27937622 -20738697 -12258530 -6807636 -5047279
1038 -5047279 -3959723 -2699962 -4810286 -11196602 -15243393 -10841235 -2346597 533642
1030 533642 -3606759 -6902298 -4826312 -1659277 -1445960 -1371831 1738838 4734306 3339276
1021 3339276 -451432 -1776910 -652547 -785617 -2547953 -2711486 -922317 -1446429 -6924129
1012 -6924129 -13411207 -13732657 -5094907 7507667 15626750 15220748 9773060 5157763
1004 5157763 3117684 2018332 1937332 4196762 6307762 3448642 -3430775 -7132225 -4913249
995 -4913249 -3468256 -8420971 -14701885 -14189021 -8349794 -4975358 -5137997 -2618060 4434388
986 4434388 10662907 13367549 15923912 18647497 15621953 5975651 197376 7444542
978 7444542 21840521 29644964 26959454 22132426 22000492 24096050 23553679 20591710 18243949
969 18243949 17602541 18415297 21092421 25449575 29694370 32389903 33274777 31129617 23909376
960 23909376 12816549 3260407 -839617 -1505456 -2918941 -5274592 -5457167 -2417574
952 -2417574 1390603 3347003 2636064 -527853 -4641258 -6137820 -2246789 4667530 8551062
943 8551062 6588206 2162564 -386197 -1350650 -3913649 -8847440 -13675360 -16304712 -17076102
934 -17076102 -17200984 -16876361 -15250190 -11405873 -5524866 397915 3747082 3937701 2788948
925 2788948 1218724 -2862668 -11212992 -20732152 -24996585 -20700651 -10760740 -794664
917 -794664 5706287 8430865 8546287 7174768 4736232 1186934 -2724432 -4952395 -4192827
908 -4192827 -2055166 -1465406 -2858208 -3652506 -1740532 2002522 4770844 4028284 -796743
899 -796743 -6847525 -8919389 -5080959 -910430 -4261875 -15145807 -24879561 -26699717
891 -26699717 -22885897 -19009831 -15787845 -10891652 -5375873 -2879916 -3720704 -4412145 -2697713
882 -2697713 557334 4005657 7022108 8774580 9124868 9680197 10985915 10060076 4445962
873 4445962 -2637255 -5704290 -4717324 -4468796 -6737308 -8665464 -9268718 -11312857 -14965788
864 -14965788 -15659962 -11269158 -5978670 -3239546 189878 8428090 18645269 24415136
856 24415136 24297016 21911741 19373333 15967725 12440070 11323909 12582272 13090685 11213454
847 11213454 8607577 6899869 5597656 4082739 3200668 4130000 7487186 13492288 20761560
838 20761560 25041099 22005847 12237350 1421402 -5160875 -6785944 -5814133 -4308694
830 -4308694 -3091369 -2529969 -2962540 -4682811 -7529184 -9913548 -9133572 -4393803 865093
821 865093 1808106 -2233523 -6800314 -7430922 -4159284 -212607 2197016 3411804 4382280
812 4382280 4729690 3371255 506385 -2201219 -3979261 -6283995 -10237791 -13751443 -13849969
803 -13849969 -11550725 -11019643 -13315756 -14837887 -13340641 -11083863 -9556035 -5956513
795 -5956513 913980 5822352 3984138 -637218 -684091 3218776 3964598 -119288 -2890215
786 -2890215 -657645 2870311 3880720 3629691 3623082 2177891 -953817 -2583700 -2156011
777 -2156011 -3793745 -8473026 -10518375 -6732969 -2577002 -2967487 -3024128 3793835 13002489
768 13002489 14516504 8843691 7516405 16083786 25659570 25053060 14828542 4873086
760 4873086 2150334 5244691 9069378 11360839 14174016 19905474 26418679 27813734
752 27813734 21309228 11162500 3376690 -929632 -3414131 -2848225 2688068 9472527
744 9472527 10754788 6299446 3321182 6551993 12828060 17056410 17886054 15257891 8169806
735 8169806 -1597688 -8471176 -9819273 -9659419 -11819936 -13541065 -10444345 -4160475 441877
726 441877 3042494 7125106 12776785 15749105 13557522 7982997 1559917 -4180379 -6950239
717 -6950239 -4750749 229412 2522712 -272530 -4794655 -6633400 -5096550 -2247351
709 -2247351 127271 1175228 861050 649540 2461121 5783807 7850121 7980050 9396287
700 9396287 14551033 20553171 22227552 18999104 15707060 16171872 18525049 18174755 13521776
691 13521776 6918771 1102393 -2993974 -4914099 -3627488 696554 5099438 5841917
683 5841917 1969488 -4107382 -9358048 -12523785 -14107471 -15086590 -15545040 -13899095 -8272782
674 -8272782 146457 6274004 5927306 991044 -2675565 -2210868 260226 2474762 4925731
665 4925731 7766264 9004528 8439035 9899050 15942552 22764555 24263114 19496588 12208451
656 12208451 4392403 -4889645 -14292843 -18618080 -14526191 -5218984 2317570 3409184
648 3409184 -1463839 -8110349 -12044163 -11495733 -7522571 -1255501 7150206 15566506 18765542
639 18765542 13886132 5386571 213679 -1118594 -3831854 -9618709 -13904609 -13594787
631 -13594787 -11582361 -10652593 -8324642 -2125031 4156301 4625914 -744288 -6798490 -9760672
622 -9760672 -8906030 -4144268 2736242 5985028 1076754 -8025102 -12245826 -8545130 -2462837
613 -2462837 954756 2442867 2813315 -943556 -9000542 -13760853 -8462312 2256525
605 2256525 7405764 4000065 -643989 -990799 -44272 -1586337 -2900968 -540674 1774680
596 1774680 -1942889 -9366493 -11370028 -4549766 3959542 6270424 3373511 1812698
588 1812698 4392540 8135539 9608188 8668424 7541643 8733587 13321648 19288212 22278661
579 22278661 19878481 14241789 8810605 4070311 -991595 -5036804 -5668869 -3763686
571 -3763686 -2651167 -3058893 -2604263 -514506 1135070 1696913 3513999 7820384 12606133
562 12606133 15885599 17461260 16324562 10978061 4342387 2878593 7155033 8714056
554 8714056 1781390 -6701597 -6103243 2055289 6179787 1891206 -2103963 2220184 10847269
545 10847269 14843503 12678499 9538833 8244508 6996318 4449852 1562843 -1471433
537 -1471433 -5870359 -11171322 -14440555 -13406593 -8745755 -3246879 -125176 -1437936
529 -1437936 -6040089 -9416856 -7778616 -2526695 1192577 524931 -2429049 -4308890 -4547435
520 -4547435 -4337437 -3344201 14150 5071940 8088842 6484160 2701912 1510141 3342925
511 3342925 3041294 -3062266 -11065607 -13571854 -8721431 -1513428 3611411 7021946 9484920
502 9484920 8476941 2837617 -2110987 594377 10096769 17572768 16459102 9546281
494 9546281 4500120 4896975 7764097 8635124 6629924 3970278 1743121 -1998623 -8902702
485 -8902702 -16342415 -19336933 -16718588 -12657606 -10894287 -10331502 -8324199 -5257176 -2660552
476 -2660552 492536 5280613 8587844 6637336 2086710 1929303 7602342 12664571 12152119
467 12152119 9095819 8743513 10671247 10603833 7134114 2661506 -522244 -1640454 -290916
458 -290916 3030980 6175469 7495244 7796980 8361811 8683642 8203172 8301144 10039902
449 10039902 11730183 11380612 9797848 8627157 7418709 5658523 5297814 7388895 8411765
440 8411765 4623470 -1532003 -4415556 -3404009 -2559191 -2840092 -1089612 2677464 3686422
431 3686422 111521 -3702603 -4388644 -4113719 -4664687 -2833998 3509454 9644056 10079274
422 10079274 6992320 6683973 9979578 12110143 10847436 9026698 9279366 11302894 14423027
413 14423027 18158108 19767800 15669701 6479123 -2654756 -7470750 -7568516 -4261058 724463
404 724463 4220482 3611937 1049084 1832840 7111655 11837245 11829658 9324153 8922689
395 8922689 10884763 11450705 8164376 2419682 -2157353 -2189799 3185461 10877439 15830273
386 15830273 15760732 12939489 10873158 11101669 13538061 16876449 17398104 10863587 -1813284
377 -1813284 -13442929 -17892903 -16379541 -14044957 -13191413 -13342918 -15069510 -18774773 -21266028
368 -21266028 -18885575 -13687382 -11324348 -12535932 -12180361 -7996366 -4627462 -5907752
360 -5907752 -8043641 -5016811 2375815 7799751 8088957 5991692 4721832 4144890 2926874
351 2926874 727861 -2958474 -9079940 -16548570 -21917372 -23211197 -22044293 -20306942
343 -20306942 -17040918 -11096093 -5070007 -3226717 -5953304 -9347503 -10426175 -9809522
335 -9809522 -8751186 -6758885 -3744093 -1724634 -1993899 -2550638 -876445 2232476 4280381
326 4280381 5234812 6867562 8516851 7095686 1980183 -3161354 -4830449 -3881852 -3816625
317 -3816625 -6314134 -9680444 -10977044 -9176388 -6696310 -7119736 -10125305 -10209611 -3455411
308 -3455411 5439074 7362966 640502 -6010024 -4410937 3400429 9298488 8967924 3906518
299 3906518 -3029108 -9092696 -10629737 -5890405 1347998 5092437 4056050 1826215
291 1826215 654774 -814659 -3499833 -5831236 -6836317 -7609646 -8265186 -6710551 -2368794
282 -2368794 1573481 1962413 87357 215039 4404250 10083375 12637572 10223937 6288833
273 6288833 6377920 11348235 15279595 12382955 4474004 -1752702 -3735025 -4813689 -7050260
264 -7050260 -7586285 -4065081 903953 3638842 4116222 3576943 677453 -5831319 -12714975
255 -12714975 -15078825 -12951133 -11066873 -11857987 -12201139 -8364634 -1542362 3581896 4669772
246 4669772 4139370 5433995 8213005 8792354 5437876 1345128 820107 3765222 6178172
237 6178172 5465879 2789267 455683 -273162 1207917 4374000 6233294 3523366 -2898384
228 -2898384 -8593790 -10962590 -10948327 -9025551 -3838815 3704652 9412461 11137198 11063960
219 11063960 10519336 7430094 2187130 624540 6014127 12539579 12865497 8704118 7032041
210 7032041 8512846 7631411 3376373 1459001 4679800 8452503 8417279 6301475 5029607
201 5029607 3248900 -1410132 -7386486 -11166632 -11592513 -9404802 -5065163 290115 4106723
192 4106723 5332389 6116677 8153418 9332978 6839855 2121291 -203564 2093684 6705640
183 6705640 10081189 10996189 10559077 9966345 9105734 7404742 5582190 5459633 7465305
174 7465305 9659078 10587819 11680971 14592415 17310171 15935650 10122992 3876874 720076
165 720076 556960 1388398 1574231 354307 -1316588 -675566 3247776 6422879 3843930
156 3843930 -3309455 -8527071 -8259852 -5084469 -2111294 704890 3103678 2524834 -1542442
147 -1542442 -5286605 -5576956 -3739282 -1742494 1654323 7929430 15309160 21152173 24642628
138 24642628 24738786 19657609 11673460 7933836 11931384 17759482 17613492 11825895 6564669
129 6564669 4701956 4529477 5057525 6701770 8285141 8747866 10246121 14256769 16636505
120 16636505 12743640 5782218 2950668 4071980 1839894 -5989940 -12581812 -12493966 -9043283
111 -9043283 -7686497 -7990298 -6471428 -2984859 7493 1468102 1594056 139872 -2270975
102 -2270975 -3560345 -3195011 -3290581 -4890433 -6085511 -5687499 -5342853 -5683450 -4054911
93 -4054911 821577 5319860 5792191 4205749 4778598 7110293 7177400 4129479 1685128
84 1685128 2600716 5266083 6511878 5262771 2660816 384668 -481239 -25261 697657
75 697657 1010147 1482851 3006722 5671240 8979889 12105438 13423041 11294261 6362582
66 6362582 1839736 432887 1910227 4259114 5867169 5986900 4793058 3838333 4710096
57 4710096 6375479 5730447 1644855 -3595585 -7641271 -10260734 -11111800 -8584095 -3015410
48 -3015410 1821994 3149424 2760586 3502411 4547281 3308063 47613 -2848570 -4633637
39 -4633637 -5756606 -4983309 -770368 5011357 8218353 7320991 4466851 2037264 824801
30 824801 1189645 3230870 5937629 8397324 11145069 14025089 14195701 9685395 3851234
21 3851234 2146477 4645635 5997441 3309094 -53302 197535 3639808 6396445 5242697
12 5242697 -653715 -9205522 -15414356 -14811581 -8382598 -1608595 2366196 5558978 9943107
3 9943107 13244995 12648104 9670972
0 9670972
$$ Imaginary data points
##PAGE= N=2
##DATA TABLE= (X++(I..I)), XYDATA
65535 4851026 4757766 4712566 3510675 2784175 4261669 6911793 8186221 6880273 4013473
65526 4013473 1813648 2117099 4787554 7501434 7899045 5988325 3850342 3363163 4894763
65517 4894763 7547393 9723576 10131125 9270340 9221368 10944988 12697144 12233698 9476850
65508 9476850 5766589 2069114 -169969 1752019 8489577 15399971 16299749 10921808
65500 10921808 5434462 4621075 6577669 6675687 3890992 660677 -1633255 -3936623
65492 -3936623 -6704105 -8411364 -7519666 -4412531 -630695 2931526 6259233 9002305
65484 9002305 9990307 8668212 6846334 7875419 13103379 19694049 23288437 22815178
65476 22815178 21300021 21599869 22858602 22150117 18389857 13105513 7927488 3046857
65468 3046857 -1593581 -5034078 -6219687 -5602857 -4791978 -4453493 -3242515 562658 6410987
65459 6410987 11100252 11659216 8547220 5341968 4958559 6777393 8097336 7762089 6994260
65450 6994260 6630128 5307024 1594607 -3294880 -6674165 -7594439 -6883858 -4421959 732765
65441 732765 6807601 9148657 5913876 1547455 1417969 4488591 5031138 1096778 -2885394
65432 -2885394 -2870073 -758438 -1031038 -4505908 -8098339 -9236957 -7964716 -5329629 -1865496
65423 -1865496 2205645 6390777 9564083 9962136 6537445 884494 -3524973 -5086466
65415 -5086466 -5883130 -8620155 -12901408 -15933799 -15940980 -13341600 -9291116 -4730941 -636752
65406 -636752 2212108 3939518 5498112 8052893 12491069 18530620 23884139 25594046
65398 25594046 23060763 18678622 14758764 11165985 6901808 2481426 -649611 -1931429
65390 -1931429 -1682155 -280092 1694445 3647817 5977280 9310047 12177678 11763715
65382 11763715 8035822 4540968 3657734 3942731 3909073 4815387 6904200 6697847 2178009
65373 2178009 -2601401 -3006657 -1112384 -1657315 -2934053 1085615 9915721 15291201
65365 15291201 12281607 5197119 120705 -2377605 -3841520 -2833901 2093746 8026642
65357 8026642 10853291 10539352 9590393 8388342 5741252 2571971 1485695 3131408
65349 3131408 5452133 6140467 4296491 639600 -2532184 -2841738 -595259 1297325
65341 1297325 1128353 230767 -87925 -1066505 -4118160 -7886769 -9589013 -7928813 -3607362
65332 -3607362 1103571 2469655 -2037057 -9474643 -12829495 -8903836 -2060677 2091930
65324 2091930 3472993 4984200 6568870 6175084 4540897 4434419 6035670 7076749
65316 7076749 7101333 7932733 9919078 10819990 8792596 4422010 -81970 -2220791 -724123
65307 -724123 2672621 4425523 3796728 4150741 7600425 11126579 11049918 8631329 7393959
65298 7393959 7259188 5709461 2784189 143069 -3203895 -8944470 -14209577 -13811928
65290 -13811928 -7728103 -1332696 1963963 3433394 4302518 3686094 2221711 2766102
65282 2766102 5875896 8680266 9456066 9467703 9473985 8482393 6653587 5221213 3121316
65273 3121316 -1508582 -6054638 -5264613 537377 4998340 5218067 5509674 9257597 13418473
65264 13418473 14666766 15017197 16993550 18513190 17192734 14865433 13073531 8878818
65256 8878818 398540 -7990399 -11630968 -12640324 -15073759 -17095717 -14742688 -10179553
65248 -10179553 -8847298 -10544309 -10510525 -7799117 -5447210 -3450960 1116621 7298854
65240 7298854 10627094 10611969 11331228 14092021 15835675 15352118 14678444 13663057 9810546
65231 9810546 4601001 3112782 5801451 7604048 7102125 8990808 14453219 17022365
65223 17022365 12840950 7948104 9257863 14127947 15707097 13949258 13769165 15350241
65215 15350241 14106388 9263703 5681858 6842044 11096126 15002725 16222189 13620123
65207 13620123 8767623 6715162 10712177 16446311 16216258 9047350 2094235 1367748
65199 1367748 5499591 9683894 11287636 9761017 5147272 -604119 -3872835 -3636026
65191 -3636026 -3277031 -5810609 -9497065 -10829902 -10012533 -10287042 -12736001 -15013396 -15382577
65182 -15382577 -15023636 -15075671 -13690165 -8474659 -1286563 1939840 -2606533 -11761467
65174 -11761467 -18238407 -17920716 -12875132 -7408880 -3269267 432141 4403164 7982510
65166 7982510 10001472 9567434 6431329 1324137 -4586513 -10711080 -16302160 -18866735
65158 -18866735 -15929042 -9341517 -4869967 -5485953 -7931272 -8538873 -9130415 -12880011
65150 -12880011 -17086182 -16048312 -10325501 -6873615 -9134900 -12852579 -13540524 -12297228
65142 -12297228 -11060977 -7585684 -140221 6600267 6244525 -292763 -5592951 -5084423
65134 -5084423 -1279425 1203990 807941 -1199878 -2525432 -632032 5076431 10805261
65126 10805261 10924255 4258708 -4460213 -10423693 -13526931 -16079793 -18475689 -19328450
$$ [...]
##END NTUPLES=NMR SPECTRUM
##END=
