##TITLE=31P Pdec_DE-81_1d 
 64 sc
 21.2.2025
##JCAMPDX= 6.0         $$ Bruker NMR JCAMP-DX V2.0
##DATA TYPE= NMR SPECTRUM
##DATA CLASS= NTUPLES
##ORIGIN= UXNMR, Bruker Analytische Messtechnik GmbH
##OWNER= root
$$ XWIN-NMR		Version 3.5
$$ Fri Feb 21 14:01:17 2025 Russian Standard Time (UT+4h)  new_Human@DPX200
##.OBSERVE FREQUENCY= 81.013821
##.OBSERVE NUCLEUS= ^31P
##.ACQUISITION MODE= SIMULTANEOUS
##.ACQUISITION SCHEME= undefined
##.AVERAGES= 64
##.DIGITISER RES= 17
##SPECTROMETER/DATA SYSTEM= spect
##.PULSE SEQUENCE= zgpg30
##.SOLVENT NAME= CDCl3
##.SHIFT REFERENCE= (INTERNAL, CDCl3, 0, 198.062)
##AUDIT TRAIL= $$ (NUMBER, WHEN, WHO, WHERE, WHAT)
$$ ##TITLE= Audit trail, XWIN-NMR		Version 3.5
$$ ##JCAMPDX= 5.01
$$ ##ORIGIN= Bruker BioSpin GmbH
$$ ##OWNER= new_Human
$$ C:/Bruker/XWIN-NMR/data/yarkov/nmr/P31/2/pdata/1/auditp.txt
$$ ##AUDIT TRAIL=  $$ (NUMBER, WHEN, WHO, WHERE, WHAT)
(   1,<2025-02-21 13:58:55.93 +0400>,<new_Human>,<DPX200>,
      <created by zg, POWCHK disabled, PULCHK disabled
       configuration hash MD5:
       00 E9 B6 7A A2 85 ED C7 34 08 36 98 17 FE 4E 26
       data hash MD5: 32K
       0F 90 75 B3 75 41 18 19 AF 6A AE C3 19 0B D0 D8>)
(   2,<2025-02-21 13:59:41.79 +0400>,<new_Human>,<DPX200>,
      <Start of raw data processing
       efp BC_mod = 2 LB = 1.5 FT_mod = 6 PKNL = 1 PHC0 = 1772.874 PHC1 = 41.49541 SI = 64K 
       data hash MD5: 64K
       A2 97 AB 6C F0 9C 9C A3 4F 88 07 75 77 E0 17 D0>)
(   3,<2025-02-21 14:00:19.45 +0400>,<new_Human>,<DPX200>,
      <pk PHC0 = 0 PHC1 = 0 
       data hash MD5: 64K
       A2 97 AB 6C F0 9C 9C A3 4F 88 07 75 77 E0 17 D0>)
$$ ##END=
$$ 
$$ hash MD5
$$ 66 3D 41 98 A8 73 85 B2 BB 23 BA 5C 87 9F 1F DC
##$RELAX= 
##$RELAX= 
##$RELAX= 
##$RELAX= 
##$RELAX= 
##$RELAX= 
##$RELAX= 
##$RELAX= 
$$ Bruker specific parameters
$$ --------------------------
##$DU= <C:/Bruker/XWIN-NMR>
##$EXPNO= 2
##$NAME= <P31>
##$PROCNO= 1
##$TYPE= <nmr>
##$USER= <yarkov>
##$AMP= (0..31)
100 100 100 100 100 100 100 100 100 100 100 100 100 100 100 100 100 100 
100 100 100 100 100 100 100 100 100 100 100 100 100 100 
##$AQSEQ= 0
##$AQ_mod= 1
##$AUNM= <au_zg>
##$AUTOPOS= <>
##$BF1= 81.014009
##$BF2= 200.13
##$BF3= 200.13
##$BF4= 200.13
##$BF5= 200.13
##$BF6= 200.13
##$BF7= 200.13
##$BF8= 200.13
##$BYTORDA= 1
##$CFDGTYP= 0
##$CFRGTYP= 5
##$CHEMSTR= <none>
##$CNST= (0..31)
1 1 145 1 1 1 1 1 1 1 1 1 1 1 1 1 1 1 1 1 1 1 1 1 1 1 1 1 1 1 1 1 
##$CPDPRG= <waltz16>
##$CPDPRG1= <>
##$CPDPRG2= <waltz16>
##$CPDPRG3= <>
##$CPDPRG4= <mlev>
##$CPDPRG5= <mlev>
##$CPDPRG6= <mlev>
##$CPDPRG7= <mlev>
##$CPDPRG8= <mlev>
##$CPDPRGB= <>
##$CPDPRGT= <>
##$D= (0..31)
0 1 0 0 0 0 0 0 0 0.06 0 0.03 2e-05 3e-06 0 0 0.0002 0 0 0 0 0 0 0 0 0 
0 0 0 0 0 0 
##$DATE= 1740131935
##$DBL= (0..7)
120 120 120 11 120 120 24 19 
##$DBP= (0..7)
150 150 150 150 150 150 150 150 
##$DBP07= 0
##$DBPNAM0= <>
##$DBPNAM1= <>
##$DBPNAM2= <>
##$DBPNAM3= <>
##$DBPNAM4= <>
##$DBPNAM5= <>
##$DBPNAM6= <>
##$DBPNAM7= <>
##$DBPOAL= (0..7)
$$ [...]
##$SUBNAM3= <"">
##$SUBNAM4= <"">
##$SUBNAM5= <"">
##$SUBNAM6= <"">
##$SUBNAM7= <"">
##$SUBNAM8= <"">
##$SUBNAM9= <"">
##$SW= 400.765351723535
##$SWIBOX= (0..15)
0 1 3 0 0 0 0 0 0 0 0 0 0 0 0 0 
##$SW_h= 32467.5324675325
##$TD= 32768
##$TD0= 1
##$TE= 0
##$TE2= 300
##$TE3= 300
##$TEG= 300
##$TL= (0..7)
0 120 53 12 22 120 120 120 
##$TP= (0..7)
150 150 150 150 150 150 150 150 
##$TP07= 0
##$TPNAME0= <>
##$TPNAME1= <>
##$TPNAME2= <>
##$TPNAME3= <>
##$TPNAME4= <>
##$TPNAME5= <>
##$TPNAME6= <>
##$TPNAME7= <>
##$TPOAL= (0..7)
0.5 0.5 0.5 0.5 0.5 0.5 0.5 0.5 
##$TPOFFS= (0..7)
0 0 0 0 0 0 0 0 
##$TUNHIN= 0
##$TUNHOUT= 0
##$TUNXOUT= 0
##$USERA1= <user>
##$USERA2= <user>
##$USERA3= <user>
##$USERA4= <user>
##$USERA5= <user>
##$V9= 5
##$VALIST= <valist>
##$VCLIST= <CCCCCCCCCCCCCCC>
##$VD= 0
##$VDLIST= <DDDDDDDDDDDDDDD>
##$VPLIST= <PPPPPPPPPPPPPPP>
##$VTLIST= <TTTTTTTTTTTTTTT>
##$WBST= 1024
##$WBSW= 4
##$XGAIN= (0..3)
0 0 0 0 
##$XL= 0
##$YL= 0
##$YMAX_a= 37442
##$YMIN_a= -66541
##$ZGOPTNS= <>
##$ZL1= 120
##$ZL2= 120
##$ZL3= 120
##$ZL4= 120
##$ABSF1= 0
##$ABSF2= 0
##$ABSG= 0
##$ABSL= 0
##$ALPHA= 0
##$AQORDER= 0
##$ASSFAC= 0
##$ASSFACI= 0
##$ASSFACX= 0
##$ASSWID= 0
##$AUNMP= <proc_1d>
##$AZFE= 0.1
##$AZFW= 0.5
##$BCFW= 0
##$BC_mod= 2
##$BYTORDP= 0
##$COROFFS= 0
##$CY= -3
##$DATMOD= 1
##$DC= 0
##$DFILT= <>
##$DTYPP= 0
##$F1P= 0
##$F2P= 0
##$FCOR= 1
##$FTSIZE= 65536
##$FT_mod= 6
##$GAMMA= 0
##$GB= 0
##$INTBC= 1
##$INTSCL= 9.790993e-09
##$ISEN= 30
##$LB= 1.5
##$LEV0= 0
##$LPBIN= 0
##$MAXI= 10000
##$MC2= 0
##$MEAN= 0
##$ME_mod= 0
##$MI= 50
##$NCOEF= 0
##$NC_proc= -6
##$NLEV= 6
##$NOISF1= 182.463
##$NOISF2= 159.3651
##$NSP= 0
##$NTH_PI= 0
##$NZP= 0
##$OFFSET= 198.0616
##$PC= 4
##$PHC0= 1772.874
##$PHC1= 41.49541
##$PH_mod= 1
##$PKNL= yes
##$PPARMOD= 0
##$PSCAL= 0
##$PSIGN= 0
##$REVERSE= no
##$SF= 81.0140089999434
##$SI= 65536
##$SIGF1= 159.3651
##$SIGF2= -187.1042
##$SINO= 113.3802
##$SIOLD= 16384
##$SREGLST= <1H.CDCl3>
##$SSB= 0
##$STSI= 65536
##$STSR= 0
##$SW_p= 32467.5324675325
##$SYMM= 0
##$S_DEV= 0
##$TDeff= 32768
##$TDoff= 0
##$TI= <>
##$TILT= no
##$TM1= 0
##$TM2= 0
##$TOPLEV= 0
##$USERP1= <user>
##$USERP2= <user>
##$USERP3= <user>
##$USERP4= <user>
##$USERP5= <user>
##$WDW= 1
##$XDIM= 65536
##$YMAX_p= 533244564
##$YMIN_p= -67077499
$$ End of Bruker specific parameters
$$ ---------------------------------
##NTUPLES= NMR SPECTRUM
##VAR_NAME=  FREQUENCY,     SPECTRUM/REAL,   SPECTRUM/IMAG
##SYMBOL=    X,             R,               I
##VAR_TYPE=  INDEPENDENT,   DEPENDENT,       DEPENDENT
##VAR_FORM=  AFFN,          ASDF,            ASDF
##VAR_DIM=   65536,         65536,           65536
##UNITS=     HZ,            ARBITRARY UNITS, ARBITRARY UNITS
##FACTOR=    0.49542278885378, 1,            1
##FIRST=     16045.7642231865, 0,            0
##LAST=      -16421.768244346, 0,            0
##MIN=       -16421.768244346, -67077499,    0
##MAX=       16045.7642231865, 533244564,    0
$$ Real data points
##PAGE= N=1
##DATA TABLE= (X++(R..R)), XYDATA
$$ [...]
46946h03035j92429l68150m24571o06089o70392k44073L68922M77766O9763j19860
46936b512148K94878Q19433Q54061M57284N2943j80375k99308l12342k35073j86053
46926a246700j60881L3622L45706K84109m26750j204859j140373j51578Q59871
46917b807833J103783P25425L53394K31523J52992R465l6217Q2419J40958o7984
46907a12075m07155n20825k54383J31110K12604j04508m25923l31552O2976K71230
46897a478501J85857K73802P95692J229243R37257J63747k39532m2753M6468n14192
46887A357088j253095j331646o70215L2019K41105J34579J93755N45148Q37567
46878H6305O94085J87757k29166k96425k46457l48828m12019j49537J60163J3161
$$ y = [-803035, -995464, -1363614, -1788185, -2394274, -3064666, -3308739, -2939817, -2462051, -2392288, -2512148, -2217270, -1397837, -543776, -86492, -33549, -213924, -513232, -825574, -1060647, -1246700, -1407581, -1373959, -1028253, -744144, -1170894, -2375753, -3516126, -3667704, -2807833, -1704050, -978625, -625231, -393708, -240716, -231251, -267468, -185049, -44091, -112075, -519230, -1040055, -1294438, -1163328, -950724, -1055232, -1481155, -1812707, -1749731, -1478501, -1292644, -1018842, -223150, 1006093, 1943350, 2107097, 1867565, 1824812, 1871280, 1357088, 103993, -1227653, -1897868, -1865849, -1624744, -1490165, -1296410, -751262, 86305, 780390, 968147, 738981, 442556, 196099, -152729, -564748, -714285, -554122, -540961]
46868e40961l47692q4208Q83847J504653J086403L97138M76876R46062N72171
46859D894289p09140j511557r54315Q9093K25358o52911j443993j347842o40489
46850b051507j2104L00996N05103O78358N84580J13505l73358m34749j91739j74513
46840a055428m69214n12657m367M89935L55347n4170Q9023P75059J127074P21653
46830A462255J80682J84866N20413N18624L1195m74483o03619m83962n65408j087354
46820c16791j693572j653473o85973N46853J129030R91408Q35608R71538Q84183
46811A008811J97835n58845o41699j38085K18649P4163k08332j75242J63781M64994
46801D06030M72993K31963k1446j55737l23965p28611j215153j320398q01315
$$ y = [-540961, -888653, -972861, -89014, 1415639, 2502042, 2899180, 3376056, 4322118, 4894289, 4185149, 2673592, 1719277, 1808370, 2033728, 1380817, -63176, -1411018, -2051507, -2063611, -1762615, -1257512, -579154, 5426, 118931, -254427, -689176, -880915, -1055428, -1524642, -2037299, -2041666, -1551731, -1196384, -1250554, -1161531, -386472, 740602, 1462255, 1642937, 1827803, 2348216, 2866840, 2898035, 2423552, 1819933, 1335971, 770563, -316791, -2010363, -3663836, -4349809, -3802956, -2673926, -1682518, -846910, 124628, 1008811, 1206646, 647801, 6102, -131983, 86666, 160829, -47503, -222745, -58964, 406030, 879023, 1110986, 1089540, 933803, 609838, -118773, -1333926, -2654324, -3455639]
46792c455639Q0123Q57810J236201J151774P67926M70764N25661O49838L21146
46783B605604l80817p53947n23127l17851o58164j028032o44669K33401N99055
46774h68547J65098l02685k09069J12087J59749R3540L01094O10514N20607o42
46764E81746m65975n42449l43884o5309K63023N63626N98223K57275k35343n61902
46754D9031o10331m31981r4135K58917L72990J45623j73695k56097p6875J85730
46744f30823M95744Q70858J029785N77937l50264j035114r72235m42948q6514
46735e43574j59182m13058m77691j79920L12410N64404L44842K8525J03977K87996
46725a31271j73021j137020j396498l99043P55568Q70444L93985M73258R07078
$$ y = [-3455639, -3375516, -2517706, -1281505, -129731, 638195, 1108959, 1634620, 2284458, 2605604, 2224787, 1470840, 947713, 629862, -28302, -1056334, -1701003, -1467602, -868547, -703449, -1006134, -1215203, -1103116, -943367, -849827, -548733, 61781, 582388, 581746, 115771, -426678, -770562, -835871, -572848, -9222, 589001, 846276, 610933, 49031, -561300, -993281, -1087416, -828499, -455509, -309886, -483581, -739678, -816553, -630823, -135079, 735779, 1765564, 2343501, 1993237, 958123, -14112, -457060, -543574, -702756, -1115814, -1593505, -1773425, -1461015, -896611, -551769, -523244, -419267, -131271, -304292, -1441312, -2837810, -3236853, -2481285, -1610841, -1216856, -743598, 163480]
46716A63480N16696o72637j221114m99098L21783R1985o80897p97515r2404O24302
46706b245419P67229M10167p4653k73755L2784N36728O78124M49182L70765N00599
46696A151751K32187n84074j144613q27757p8826L98757O12596Q20130P99485
46687A379636K95295l83315q60759j211517j393234q99047K82121J101591P44280
46678i44949j53784m95255k77972j58677j24062K13995N34747L10417k0538K70805
46668h45273O97022K18499p63358p38260M32875J043768R1766j178118j115011
46659b156090J02082J032866R74381M31530O5860J5635R3171J03551k489q3085
46649E77412j5909P3895N2427Q2009K72174K66751k33525q00450q70724p18983
$$ y = [163480, 680176, 7539, -1213575, -1712673, -1390890, -1298905, -1979802, -2777317, -2869721, -2245419, -1478190, -1068023, -1142676, -1416431, -1383647, -846919, -168795, 280387, 651152, 1151751, 1383938, 799864, -344749, -1172506, -1251332, -852575, -239979, 580151, 1379636, 1674931, 1291616, 430857, -780660, -2173894, -3072941, -2790820, -1689229, -944949, -1098733, -1593988, -1871960, -2030637, -2154699, -1940704, -1405957, -1095540, -1116078, -845273, -148251, 70248, -693110, -1431370, -998495, 45273, 137039, -1041079, -2156090, -2054008, -1021142, -46761, 384769, 450629, 466264, 559435, 662986, 660497, 577412, 561503, 635398, 687825, 769834, 1042008, 1308759, 1075234, 274784, -595940, -1314923]
46639a314923q91114r34438M3889J555894J902627N54211r49100j077804j41878
46630a252636O52173Q87051Q24043N17198j3963l69147l39115l37718o05756o46919
46620f84789j56011K10061j71167p52330o00236J63034O04137L12516l05345p38055
46610b118185o70912L2929R44544J105078K16435o61332m50105L69885N24374
46601g07289p6396l01396L32385R37981O78415m1555k85345J16672M85637K65625
46591A404734k89385m61025l8484K82223j79078r39813q63168J11744P15538K31218
46581b5496m10277j44717O15980Q83263O92812N78774K33084q30181j809704j447701
46571a664163r3628O68880L87457J00414K70535J40974m51635m18211O15824J260038
$$ y = [-1314923, -2206037, -3140475, -3096586, -1540692, 361935, 916146, -32954, -1110758, -1252636, -600463, 286588, 1110631, 1627829, 1613866, 1244719, 905604, 567886, -37870, -684789, -840800, -630739, -801906, -1554236, -2154472, -1991438, -1387301, -1074785, -1380130, -2118185, -2789097, -2756168, -1811624, -706546, -490111, -1151443, -1601548, -1231663, -707289, -783685, -1085081, -752696, 185285, 863700, 822145, 536800, 653472, 1139109, 1404734, 1115349, 654324, 615840, 898063, 718985, -220828, -1083996, -972252, -256714, -25496, -435773, -580490, 35490, 918753, 1611565, 2190339, 2423423, 1593242, -216462, -1664163, -1757791, -1088911, -701454, -601040, -330505, -189531, -641166, -1059377, -443553, 816485]
46561H16485L86981j026524j320611m94359J34701k7268l92895m35654k72436
46552b631580r0663J43617L85281N01768N19332M78684K52543j18666k39620N1213
46542g48091K74861J2602l38134j06805O13912J085815R08597L22294l28160q63247
46532H33644j075989q07495k47579K28477N03109O67738O40546K36142m26695
46523E51898r55584j110987r16486m38833J96164O41079N71845J30141j80624
46514a511387p6165K72693N70406O96906O66238N47440M85696N89923P23891N78810
46504C544451N2078n49264p85556n44945j58983k2850j53040k50128j97468k48366
46494F85929n69342q77492q32747n45081k93306J5900N61416R74562P09457O072
$$ y = [816485, 1203466, 176942, -1143669, -1638028, -1503327, -1530595, -1923490, -2359144, -2631580, -2722243, -2578626, -2193345, -1691577, -1172245, -693561, -441018, -559684, -799304, -748091, -473230, -460628, -798762, -905567, -291655, 794160, 1702757, 2025051, 1696891, 833644, -242345, -1049840, -1297419, -1068942, -565833, 101905, 742451, 978593, 551898, -403686, -1514673, -2431159, -2869992, -2673828, -2032749, -1460904, -1330763, -1511387, -1587552, -1314859, -744453, -47547, 618691, 1166131, 1651827, 2241750, 2965641, 3544451, 3596529, 3047265, 2261709, 1716764, 1557781, 1534931, 1381891, 1131763, 934295, 685929, 116587, -760905, -1593652, -2138733, -2432039, -2416139, -1854723, -880161, -170704, -164632]
46484a64632l13509j05278q8899n31424p10653j93338K96302N7883l38468K9903
46474b062113Q55867J046230M29472r4094j6511K18176J99253J25786J69625R6016
46464I67707j74711l18762k13488j63113k52891j23278K83886L98741j12472p13735
46454d22116p46678l60353j42516j86828j33705R3100K15471J82416K43549M12833
46444h44827L86149J18403p195J62382J49061m70365j224002j149228q7020R41869
46434b024773R50570K01493k44474M3018M99525O08980N83700P01032O28123J1875
46424A959069o85024o67208M0571O08021N32231J14627k25951m49867n44019l10867
46414C71583J89033N02992M16970K57989K52682R6901l99185p32175l81777K79152
$$ y = [-164632, -478141, -583419, -672318, -1203742, -1914395, -2107733, -1811431, -1753548, -2092016, -2062113, -1206246, -160016, 269456, 175362, 158851, 377027, 576280, 702066, 871691, 967707, 792996, 474234, 260746, 97633, -155258, -278536, 5350, 404091, 291619, -422116, -1168794, -1529147, -1671663, -1858491, -1992196, -1899096, -1683625, -1501209, -1257660, -844827, -458678, -340275, -347470, -185088, -36027, -506392, -1730394, -2879622, -2966642, -2024773, -1074203, -872710, -1117184, -1074166, -574641, 34339, 618039, 1319071, 1947194, 1959069, 1274045, 606837, 647408, 1255429, 1787660, 1902287, 1676336, 1226469, 682450, 371583, 560616, 1063608, 1480578, 1738567, 1991249, 2088150, 1688965, 956790, 575013, 854165]
46404H54165M45433O7140j63189J345l4190o59617j284132j097803k05686N35098
46394a541436O22813L50690J84248J88015K03524J98018J67546m1806m73449p53447
46384h95284m33665L32724Q31412O59827K29615J23108K33605l459o26268r30730
46374d79115m08131N11683R61908O44252K2417l34241k68660L9509L25822L54684
46364A370128N1155l50666m65174j81793J93705L14150J59154p9876k94136m23198
46354B93449k76620K72411R05646J018868M34291k89561m82168j22950K60527
46345B013893L07467J28727l5104j16175j37554j32637k36846n85663j004338
46336B01770j068074o35210q3862J62352J16963M0227Q193n6034j15062r6247
$$ y = [854165, 1299598, 1366738, 1203549, 1204894, 1170704, 511087, -773045, -1870848, -2076534, -1541436, -918623, -567933, -383685, -195670, 7854, 205872, 373418, 331612, -141837, -895284, -1328949, -996225, -164813, 495014, 724629, 847737, 1081342, 1077883, 451615, -479115, -887246, -375563, 586345, 1230597, 1253014, 918773, 650113, 689622, 1015444, 1370128, 1421283, 1070617, 605443, 423650, 617355, 931505, 1090659, 1010783, 716647, 293449, 16829, 289240, 1194886, 2213754, 2648045, 2358484, 1876316, 1753366, 2013893, 2321360, 2450087, 2414983, 2298808, 2161254, 2028617, 1791771, 1206108, 201770, -866304, -1501514, -1585376, -1423024, -1306061, -1265834, -1257641, -1313675, -1428737, -1524984]
46326a524984j09820k72926m03896k13038K39785N76028N69626L15926l1258l81983
46316a236540n80015m85629k34087r8430m8549K01511O14831P03274K06484m37266
46306a394416o10298k71415J27662K96157L10778K75939J84924J43754L42770
46297e94145O52740N82318q0446p93228p86650k2874P24155Q19261M55758K12394
46287A169283K64698L91152M95567N99649M31250l25009j251367j362174m18661
46278e612N26013M58011k15397l50610K10135N26800J23814l10759r3966L93914
46268A262343L53455k77648q91865j096628r86446p34268m16260j61874n7037
46259c006228P9729M75239R56176J046954N77473n5657l43607k30081j05358k79353
$$ y = [-1524984, -1634804, -1907730, -2311626, -2524664, -2284879, -1708851, -1139225, -823299, -854557, -1236540, -1816555, -2302184, -2536271, -2634701, -2683250, -2481739, -1866908, -1163634, -957150, -1394416, -2004714, -2276129, -2148467, -1852310, -1541532, -1265593, -1080669, -936915, -594145, 58595, 640913, 560467, -232761, -1019411, -1042285, -318130, 501131, 956889, 1169283, 1433981, 1825133, 2320700, 2920349, 3351599, 3026590, 1775223, 413049, -5612, 520401, 978412, 763015, 412405, 622540, 1149340, 1273154, 962395, 868429, 1262343, 1615798, 1338150, 446285, -650343, -1636789, -2371057, -2787317, -2949191, -3006228, -2926499, -2451260, -1495084, -448130, 129343, 73686, -269921, -500002, -605360, -884713]
46249h84713n53121m12252L05487J072115J203771O64877N9947j59572j17200
46240A179339o8290K5413K19731K56251j05352o27327q30351n82312j65721J30617
46230e68002K21199J38336M005N685J84500L47999L55953L03950K48746M7864
46220A290235k58457k70101J51893M49682J23856l86002l00833K26897L26496
46211A353666j34255l14115J45916M78942J45503j48632L46631R78107N83893
46202C435656n74261j021982k11577P06969N59276l74262j036317r76794m73339
46193C3369J32662N71918N39067P8659k25831j8234K02812j35501o05692l39620
46183B33609M81212O86292j62958j056082r70442k33185J57865l3871k34725m5246
$$ y = [-884713, -1437834, -1850086, -1544599, -472484, 731287, 1396164, 1456111, 1296539, 1179339, 1111049, 1136462, 1356193, 1612444, 1507092, 879765, 49414, -532898, -698619, -568002, -346803, -208467, -204462, -198777, -14277, 333722, 689675, 993625, 1242371, 1290235, 1031778, 761677, 913570, 1363252, 1487108, 1101106, 800273, 1027170, 1353666, 1219411, 905296, 1051212, 1530154, 1675657, 1527025, 1873656, 2851763, 3435656, 2861395, 1839413, 1627836, 2334805, 2894081, 2519819, 1483502, 506708, 33369, 166031, 737949, 1277016, 1355675, 1129844, 1111610, 1314422, 1178921, 573229, 233609, 714821, 1401113, 1238155, 182073, -788369, -1021554, -863689, -897560, -1132285, -1177531]
46173a177531M08993Q46825R51328L99730n93675j060427l62444P31463R28419
46164A072681K40414j01746L77505O99185J22212o25207n95191j52858k13743
46155H23252o09046m11882M17801R09120N79887j4984l64318o10982p98700m94467
46145e74319L19743P97329L35421m72173o78858k92748L637M7442K26293M81183
46135A92950K38037m92304p93206q7266Q71889Q55527k46288j254917j135594
46126a851172j74951M56636J09366o29333o73687K49076J265110J415550P74700
46117I41295J73050j3860k20091p31746j038348o23761O7415J54206l91124p24317
46107b407281m04684P2700K20524K76355N39346O51278J99233m07160m11456J57453
$$ y = [-1177531, -768538, 78287, 1029615, 1429345, 835670, -224757, -587201, 144262, 1072681, 1313095, 1211349, 1588854, 2288039, 2410251, 1785044, 1189853, 1036995, 823252, 214206, -197676, 220125, 1129245, 1709132, 1694148, 1329830, 718848, -79852, -574319, -254576, 542753, 878174, 406001, -272857, -565605, -561968, -514526, -288233, 192950, 430987, -61317, -854523, -941789, -69900, 785627, 539339, -715578, -1851172, -2026123, -1569487, -1460121, -2089454, -2763141, -2514065, -1248955, 166595, 941295, 1114345, 1100485, 880394, 148648, -889700, -1513461, -1446046, -1291840, -1682964, -2407281, -2811965, -2739265, -2518741, -2242386, -1703040, -1051762, -852529, -1259689, -1671145, -1513692]
46097a513692N48116L77685m5404m58157r34426j304102j049793j37031O69878
46088c846926P59226M58145M23798O77322P62163N56566L80028M33443N82385
46079A186150O18160M09811o4758n48619n91283j53041J40439k01296p25560o04808
46069e34805J34006O12673L48838j76835l75226l16180k75153o9722N60036J185194
46059A092826R75815j39219j093760q28882L57137J024172K93528j009310j329590
46050f57283l57203N90052L46552n72003p72154R7503R81034Q85633J3179p20370
46040a65060p56583k73420J27523m2017o29483q28068q1308J019982J294060M98685
46030A64311l40985l65532N2515J23414j20912r9381K10522K36013k16520o35896
$$ y = [-1513692, -965576, -587891, -633295, -1091452, -2025878, -3329980, -4379773, -4516804, -3846926, -3087700, -2629555, -2205757, -1528435, -766272, -209706, 170322, 603765, 1186150, 1804310, 2214121, 2149363, 1600744, 1009461, 856420, 996859, 795563, 70003, -534805, -400799, 211874, 560712, 383877, 8651, -307529, -582682, -652404, -92368, 1092826, 2068641, 1929422, 835662, 6780, 363917, 1388089, 1681617, 672307, -657283, -1014486, -424434, -77882, -649885, -1422039, -1324536, -343502, 542131, 555310, -165060, -921643, -1195063, -1067540, -1109557, -1739040, -2567108, -2648416, -1628434, -334374, 164311, -176674, -542206, -489691, -366277, -487189, -586570, -376048, -140035, -356555, -992451]
46020i92451n40313m6535L94463M69880J72736j81144j22973M31791Q61067M80501
46010I27022m81369j038508o84701K4232L33104K21997J12666Q1232j09636m43530
46000a057491o53980o61989m97788P1250J161598K021009J506887l04513j746285
45991a61302j464464j37585N25515Q9185l55900r4406K93316K02141J6093J88256
45981h99151K84271j48301n08540j4724Q65805J029263M81122K22205M58377K48123
45971B018450p97907j705472j570840p78752j30845L40132Q93696J173776P26849
45962A69087k8513k54309J23960M41256L18128q572k30091k36525J2035L40709
45952F47165K91900k26392m86031J64333J147629J229907K14714p73556q31790
$$ y = [-992451, -1532764, -1579299, -1184836, -714956, -542220, -723364, -846337, -414546, 446521, 927022, 445653, -592855, -1277556, -1253324, -920220, -698223, -585557, -504325, -613961, -1057491, -1711471, -2373460, -2871248, -2799998, -1638400, 382609, 1889496, 1584983, -161302, -1625766, -1763351, -1237836, -1148651, -1504551, -1598957, -1305641, -1103500, -1087407, -899151, -614880, -763181, -1271721, -1286445, -420640, 608623, 1089745, 1311950, 1770327, 2018450, 1220543, -484929, -2055769, -2834521, -2965366, -2625234, -1731538, -557762, 169087, 140574, -113735, 10225, 451481, 769609, 761037, 530946, 294421, 306456, 647165, 939065, 712673, 226642, 390975, 1538604, 2768511, 2983225, 2209669, 1377879]
45943A377879l03370J2375o1687k36225m17207o61488p93954n70300r5055K71439
45933a477593L59988L23666L80531N64634O78201M48257j57969p72030r54701
45924f07016p07672m61067n10569o57068m80888J36944P93901Q43139N2241r07410
45914b505465r25021K85813J642086J832252Q06528l50205q29584p44427m62726
45905a250749r5103J80247K4789m51512n63315L8128P78063R20477N38056K50155
45895C69236K75402K56911o3766m23011l65877J61662O07963L04728o59160j234823
45885g70735n50078Q18210J362627N65950m39352m86401J09542K77948j83674
45876G04037n61227m63227k30792j76884j72033p1025L6999J14554K51464L91847
$$ y = [1377879, 1074509, 1086884, 1025197, 788972, 371765, -289723, -1083677, -1653977, -1749032, -1477593, -1117605, -793939, -413408, 151226, 829427, 1277684, 1119715, 347685, -607016, -1314688, -1775755, -2286324, -2943392, -3424280, -3287336, -2493435, -1650296, -1598055, -2505465, -3430486, -3144673, -1502587, 329665, 1136193, 785988, -43596, -788023, -1250749, -1345852, -1165605, -1140816, -1592328, -2155643, -2117515, -1339452, -418975, 119081, 369236, 644638, 901549, 837783, 414772, 48895, 210557, 818520, 1123248, 464088, -770735, -1320813, -502603, 860024, 1425974, 986622, 500221, 609763, 887711, 704037, 142810, -320417, -551209, -728093, -900126, -971151, -934152, -819598, -568134, -176287]
45866a76287L91362L47490M41061M62558l329q43950j353272j071570l17795K67659
45856a856073L83441J44582j69960k87595j33275J1167k07840o49418o76151P4522
45846c366600J099021J448287P37675l75072q02074j69120P33108Q37073O6899
45837B09197o66528p49836n27856m19915j36663N69273J036935N59997k92246
45828d17642l48042L39997N61390q9528n98439k37058L48451L78098J74248L43833
45818D55308O35402N32067K53473K22651J60724l14345p57606o20423m01385q84343
45808g18477j580983j261117N1402R54520P21974K36993M68224J091598J208543
45799A172677O22269j78722p10650p22740k62628J74400J05294j56821J12241
$$ y = [-176287, 215075, 562565, 1003626, 1466184, 1462855, 618905, -734367, -1805937, -2123732, -1856073, -1472632, -1328050, -1498010, -1785605, -1918880, -1907713, -2115553, -2764971, -3441122, -3366600, -2267579, -819292, -81617, -456689, -1258763, -1427883, -694775, 142298, 209197, -457331, -1207167, -1735023, -2154938, -2291601, -1722328, -685393, -125396, -417642, -765684, -425687, 135703, 46175, -552264, -789322, -440871, -62773, 111475, 455308, 1090710, 1622777, 1876250, 2098901, 2259625, 1945280, 1187674, 567251, 165866, -718477, -2299460, -3560577, -3509175, -2554655, -1832681, -1595688, -1127464, -35866, 1172677, 1794946, 1616224, 905574, 182834, -79794, 94606, 199900, 43079, 155320]
45790A55320P21077N89462n07208j289038p70321K73340N65568K03557J31471
45781G3228L99382K84684j78557j63041M59910Q33475N18935R1014K2932j8693
45771B323269l26601m91454j67144J87374m5731p14501j142364r62818l22664
45762a662634L88667O84214K78770l92302m11978M12233J037167M69261p85117
45753A8281j258815l84890Q66438J283379P65046J44106N7878L37443M08897M9380
45743B287143l73606m17375j78798j60943n28304q33346o64484k55706j35413
45734a260832l67471n00128j92361M20297R58246J131702Q52316K61712k96749
45725A006732m96175k78679J46781M96630N51812K48547k30367n49496n28627
$$ y = [155320, 876397, 1465859, 958651, -330387, -1100708, -827368, -261800, -58243, 73228, 472610, 757294, 578737, 415696, 875606, 1709081, 2228016, 2319030, 2341962, 2323269, 1996668, 1505214, 1338070, 1525444, 1479713, 765212, -377152, -1339970, -1662634, -1273967, -589753, -310983, -703285, -1115263, -703030, 334137, 803398, 18281, -1240534, -1625424, -758986, 524393, 1289439, 1433545, 1491423, 1828866, 2237763, 2287143, 1913537, 1496162, 1317364, 1156421, 628117, -205229, -869713, -1125419, -1260832, -1628303, -2128431, -2320792, -1900495, -942249, 189453, 1041769, 1303481, 1006732, 510557, 231878, 378659, 875289, 1427101, 1675648, 1445281, 895785, 367158]
45716C67158k82048M11K48672M12227L84694J79621m770m2740k0009p753M4362
45705A279825M8770k56979q41330j182498q63704j33971M18542N19623K63686
45696g48036j80088n59609n20907k989N69080Q25986Q83972Q72520M83707m29986
45686A193650j215271j122416l92336J26141K23381L36316M69995J28667o04197
45677h56070r28270n40638r1437p9575j24235K44299Q16697J166248J192370Q10096
45667A609485j47239j249520j495114o24407L30042M67244K26524L71658N49909
45658C8582l0159j015138j250776n15947K48695M31947L82919M26254K99166q9811
45648a074268k31502J70887O07745M58350j77478p14052p52156k32472O49369
$$ y = [367158, 85110, 85521, 334193, 746420, 1131114, 1310735, 1305965, 1263225, 1243216, 1235463, 1279825, 1328595, 1071616, 230286, -952212, -1815916, -1949887, -1531345, -1011722, -748036, -928124, -1487733, -2008640, -2011629, -1442549, -616563, 267409, 1139929, 1623636, 1193650, -21621, -1144037, -1536373, -1410232, -1186851, -850535, -380540, -251873, -856070, -1784340, -2324978, -2416415, -2495990, -2620225, -2375926, -1559229, -392981, 799389, 1609485, 1462246, 212726, -1282388, -1906795, -1576753, -1109509, -882985, -511327, 38582, 8423, -1006715, -2257491, -2773438, -2524743, -2092796, -1709877, -1283623, -984457, -1074268, -1305770, -1134883, -527138, -68788, -246266, -960318, -1712474, -1944946, -1295577]
45639a295577J350950J213959K04774q34237j047618n02216N6584K02999J87821
45630d62561L19753L95308J0899o94090r71055l51284O08386Q68243J84503o08890
45620g00788p18541k70867J96319N29694P44057N64462p7553m91526m5804P09208
45610D38661P07850N4820o7299O76725J131207M47439n38343n64102J89205M92907
45600B969070q2281p19793o65507j24033K69949K23084j65514o29463q01165m47524
45590a73177J25173K20537m03232j052856q16422K93858J269762J278728N76358
45581A318729o636j70048k32783k94365o7629L05117J20789o89774j017910n1359
45571g85869J307136J523367N30491m17363p30010r43562j190750p73326K71872
$$ y = [-1295577, 55373, 1269332, 1474106, 639869, -407749, -909965, -853381, -650382, -462561, -142808, 252500, 263399, -430691, -1401746, -1753030, -1144644, -276401, -91898, -700788, -1419329, -1690196, -1493877, -964183, -220126, 344336, 266783, -224743, -270547, 438661, 1146511, 1201331, 1134032, 1810757, 2941964, 3389403, 2851060, 2286958, 2476163, 2969070, 2886789, 2166996, 1501489, 1377456, 1647405, 1870489, 1704975, 1075512, 274347, -173177, -48004, 172533, -230699, -1283555, -2099977, -1806119, -536357, 742371, 1318729, 1312093, 1142045, 909262, 614897, 547268, 852385, 973174, 283400, -734510, -785869, 521267, 2044634, 2575125, 2157762, 1427752, 484190, -706560, -1479886, -1208014]
45562a208014O66367k05553j130950q38000J24075M52749J46742J33242M79957
45553a379385M53698N0686L3011M89475O67583L33372R1527J59032k4292o31542
45543B43165r55389n40784P9616K75661J82878J88187K41711J97931K58035N54949
45533G25960P64369N78123J64436j81656m01850l97873O3355P94035J084783O11733
45523C805415n4634l09832l58606o34969q79670n27761K76509P82832O39831J82836
45513B921951k13769m97874o50100n50720k38444N1148J67120J17269p8138l24543
45503G03900l45913J2870M32803M34758N2989j52208J62027O40575O41340K553
45493B585694p15963p89391j56109M07045J51359o64417j037983n16046K59787
$$ y = [-1208014, -541647, -747200, -1878150, -2716150, -2592075, -2139326, -1992584, -1859342, -1379385, -925687, -875001, -841990, -352515, 315068, 648440, 739967, 898999, 874707, 243165, -712224, -1253008, -1173392, -897731, -714853, -526666, -284955, -87024, 171011, 725960, 1490329, 2068452, 2232888, 2051232, 1649382, 1251509, 1314864, 2108899, 3193682, 3805415, 3750781, 3440949, 3082343, 2447374, 1567704, 1039943, 1316452, 2099284, 2739115, 2921951, 2708182, 2210308, 1560208, 1009488, 771044, 822192, 989312, 1106581, 1028443, 703900, 357987, 370857, 803660, 1238418, 1291407, 1139199, 1301226, 1941801, 2583141, 2585694, 1869731, 1080340, 924231, 1331276, 1482635, 818218, -219765, -735811, -476024]
45484d76024N00712K37322k8936j29144j44675N9424N56674Q87338N68537o2581
45474A968647k07802K34429N40911K27399l94422q12386q65491n70796K4240O26265
45464G70994Q31125O54836M94339M70309L19718K6131n7245J10047R4314k24817
45454C489751l52112j5938L25376K57065P1216J20388J03959l16459o84638l54899
45444B643709L65366N32164n8512n91953m06982K08256N56343L57150j49879n55528
45434B900134n79482k76746j3247n3901k44478k97435j96432l6911K51052O03586
45424B056140N57715j23623p89484n78927L23583Q58296N42462j2415j72933r8503
45414B562311j91994m21181n66902n93369m33091N6501N98723N55735j07726n07537
$$ y = [-476024, 24688, 262010, 233074, 103930, -40745, 18679, 575353, 1462691, 2031228, 1968647, 1760845, 1995274, 2536185, 2763584, 2369162, 1556776, 691285, 120489, 144729, 770994, 1602119, 2256955, 2751294, 3221603, 3541321, 3567452, 3510207, 3620254, 3714568, 3489751, 3137639, 3121701, 3447077, 3704142, 3775358, 3895746, 3999705, 3683246, 2998608, 2643709, 3009075, 3541239, 3482727, 2890774, 2483792, 2692048, 3248391, 3605541, 3455662, 2900134, 2320652, 2043906, 2030659, 1976758, 1732280, 1434845, 1238413, 1201502, 1452554, 2056140, 2613855, 2490232, 1700748, 1121821, 1445404, 2303700, 2846162, 2833747, 2660814, 2562311, 2370317, 1949136, 1382234, 788865, 355774, 412275, 1010998, 1566733, 1459007, 951470]
45404I51470j1220P80973Q21373m302q75561j129158p98231k79351M6928L2566
45394d64513l8794K82315Q64330R53361K63998m39127m11759k1543l8399l53194
45384E96675l22026j0082m8363m21753m43699P1671N75475P43678P31899M75550
45374A949025k15938p99241m15499N81419P59768k62484j078359n85558L84540
45365C17673N09208o490q8323L06860L52255k682L4551N65453O73673j15094j032508
45354A514576j096229k58156P62953J260839R53013R7368o10503o24192j31891
45345A867778K34654K02804p320k04459l64721l35985K3111M13272L61456m2868
45335B147722k03066J43973O35620Q52933O88768J76287m86264p63000k72156
$$ y = [951470, 940250, 1721223, 2542596, 2538294, 1662733, 533575, -264656, -544007, -497079, -464513, -503307, -220992, 643338, 1596699, 1860697, 1421570, 1009811, 988268, 949869, 596675, 274649, 264567, 216204, -205549, -649248, -577577, -2102, 741576, 1473475, 1949025, 1733087, 933846, 518347, 1099766, 1859534, 1597050, 518691, -66867, 317673, 826881, 820391, 732068, 1038928, 1391183, 1388501, 1423052, 1988505, 2662178, 2547084, 1514576, 418347, 160191, 923144, 2183983, 3136996, 3234364, 2623861, 1999669, 1867778, 2102432, 2305236, 2297916, 2093457, 1728736, 1392751, 1415862, 1829134, 2190590, 2147722, 1944656, 2088629, 2724249, 3577182, 4265950, 4442237, 3955973, 3192973, 2920817]
45326B920817N17984P47184L56956R2737K53877L26284P5420K5875L97289N08312
45316F222735q7899p05975n92806j87847l44932q15935o13578L54192J096338
45307D324293R84031M25230k0753l20790n32347m93751k92748l67387p60739q92358
45297B052681n03293k18650n72234r78996m78466P38370J416799R21778K7024
45288B405013l01150j91058l18940n79298k15842P63204J235866M54435p90479
45279B461751j144743m32996L14496L99514J94312K26661L13435L4860m62391
45270A904899o72468m72012j96927j12356j59717j54190Q165K40750K17317l35575
45260B67886j100753j251448m25294O52578R66977M47443q9097j06249J40014
$$ y = [2920817, 3438801, 4185985, 4542941, 4635678, 4889555, 5215839, 5291259, 5317134, 5714423, 6222735, 6134836, 5428861, 4836055, 4648208, 4303276, 3487341, 2873763, 3227955, 4324293, 5308324, 5733554, 5712801, 5392011, 4859664, 4365913, 4073165, 3705778, 2945039, 2052681, 1549388, 1330738, 758504, -220492, -698958, 39412, 1456211, 2377989, 2405013, 2103863, 1912805, 1593865, 1014567, 798725, 1561929, 2797795, 3252230, 2461751, 1317008, 884012, 1198508, 1598022, 1792334, 2018995, 2332430, 2367290, 1904899, 1232431, 760419, 563492, 451136, 291419, 137229, 145394, 386144, 603461, 267886, -832867, -2084315, -2509609, -1857031, -890054, -442611, -531708, -637957, -497943]
45251d97943L04731N22428R38595J154415O73644k67563q35628o34064j90667
45242A167948j84873n05707m88877L5078M65130L42722J1049j9816R2471p1087
45232H44038k73205P5877P73594Q91098J75371m96420m59230k19564m76071r19328
45222h3840p94695j21763M85470Q13540J015757R20387K98594l83510m31915m5789
45212A672236j3542l30819j87091N37618Q95163L85239k03475q2272L18910K09819
45202C201786k10671j92876K46492M12189J26600o5004J15885K74977P8177k59666
45192C727889m52966n66039o37965l53306M31229J096370Q00615l27370j090455
45183B628002o77461J82259J37595q59735j387693n69726O09936P08785j34843
$$ y = [-497943, -193212, 329216, 1267811, 2422226, 3095870, 2828307, 1992679, 1358615, 1167948, 983075, 477368, -11509, 23569, 488699, 831421, 842470, 822654, 915125, 844038, 570833, 646710, 1420304, 2311402, 2486773, 1990353, 1531123, 1311559, 835488, -83840, -878535, -1000298, -514828, 298712, 1314469, 2234856, 2533450, 2149940, 1718025, 1672236, 1658694, 1327875, 1140784, 1678402, 2573565, 2958804, 2755329, 2673057, 2991967, 3201786, 2991115, 2798239, 3044731, 3456920, 3583520, 3518516, 3634401, 3909378, 3987555, 3727889, 3274923, 2708884, 2070919, 1717613, 2148842, 3245212, 4045827, 3718457, 2628002, 1950541, 2132800, 2270395, 1410660, 22967, -546759, 63177, 771962, 637119]
45174F37119o00077k40462J16571K1333R1656O23294P98415J14576m53469J45531
45164A254487J209050J167468n0281r00483m99347K88824M25323K07807M38488
45155C541336Q81639N93520m44715j001460j61654J422725K347859K228108K048787
45146A1456145K701403L775782M229673L793950K972530J848668q7061k619825
45138B8071265m307398m081625k754591k028315k338965k626204k111255j287362
45130F535550r39439j045429j079717q11995l70427O5851K71242L9831m17378
45121B248089m92059M8467O16117N04734k19492r06181j156658j042087o79566
45112a078636j08655M46044O88083P07213Q81316J184327J064594L12465l82248
$$ y = [637119, 37042, -203420, -86849, -65516, 26140, 649434, 1447849, 1562425, 1108956, 1254487, 2463537, 3631005, 3580724, 2680241, 2180894, 2469718, 2895041, 3102848, 3541336, 4422975, 5016495, 4571780, 3570320, 3408666, 4831391, 7179250, 9407358, 11456145, 14157548, 17933330, 22163003, 25956953, 28929483, 30778151, 30691090, 28071265, 23763867, 19682242, 16927651, 14899336, 12560371, 9934167, 7822912, 6535550, 5596111, 4550682, 3470965, 2658970, 2288543, 2354394, 2625636, 2665467, 2248089, 1756030, 1804497, 2420614, 2925348, 2705856, 1799675, 643017, -399070, -1078636, -1187291, -741247, -53164, 654049, 1535365, 2719692, 3784286, 4096751, 3714503]
45103C714503k50979M19670O00415o1646q08920r45330p40784p02001n87777N7655
45093F94806P99585P47937J1613l39708O0515L50903L3040n1534P88391J579242
45083D674790R20168p94754j770227j283239m14489j66568j89861J15234M23275
45074A514329K62335J02263O31268J416058J319041J41244j032879j249866p54912
45065B348881l91843m56893n45359k89094J61878M25549L99326K99338K57938
45056B209721J26792j97258m60014l39907L2121J53852k20256p88876j075239
45047e59064q49989j75776O76905J290975J350696R27977L37807k66904q83269
45038A849358j303847j197949o18242k7326K79474L80120K82052k03306r17844
$$ y = [3714503, 3463524, 3883194, 4483609, 4421963, 3613043, 2667713, 1926929, 1224928, 637151, 694806, 1494391, 2242328, 2253941, 1914233, 1974748, 2325651, 2358691, 2307157, 3095548, 4674790, 5594958, 4800204, 3029977, 1746738, 1332249, 1165681, 975820, 1091054, 1514329, 1776664, 1878927, 2510195, 3926253, 5245294, 5386538, 4353659, 3103793, 2348881, 1957038, 1500145, 954786, 665692, 827570, 1253119, 1652445, 1951783, 2209721, 2336513, 2139255, 1679241, 1339334, 1371455, 1525307, 1305051, 516175, -559064, -1409053, -1584829, -907924, 383051, 1733747, 2661724, 2999531, 2732627, 1849358, 545511, -652438, -1270680, -1298006, -1018532, -638412, -356360, -559666, -1477510]
45029a477510j204396o75591K29633Q09491Q95551P53790N35188K40257j1532
45020I4881p5629M342J48970L93670O51349O39194L45710K22938N27579Q11423
45010C764427N42710m6787k69501N1897M64795O30437O73332P96523R71406J061438
45000H640677J016229J000574J439387K618043M050699M771895M628263M576395
44992C2742162M983305M396529J283904l330434o458669o571875n088352m020683
44984A7935887l512279k606646j333528o75428r17471j276784j151894p88232
44976E673625n71466m25282j78027R891r9221m29072o75663o36194l59716q3060
44966B225815k6061j52349j97419l7378J17443O6698k7980Q4239K49067N0520
$$ y = [-1477510, -2681906, -3357497, -3127864, -2318373, -1422822, -669032, -133844, 106413, 94881, 19252, 23594, 172564, 566234, 1217583, 1856777, 2202487, 2425425, 2953004, 3764427, 4307137, 4260350, 3990849, 4042746, 4507541, 5137978, 5811310, 6607833, 7579239, 8640677, 9656906, 10657480, 12096867, 14714910, 18765609, 23537504, 28165767, 32742162, 37725467, 42121996, 43405900, 40075466, 33616797, 27044922, 21956570, 17935887, 14423608, 11816962, 10483434, 9808006, 8890535, 7613751, 6461857, 5673625, 5102159, 4676877, 4498850, 4508741, 4409520, 3980448, 3304785, 2668591, 2308875, 2225815, 2199754, 2047405, 1849986, 1812608, 1930051, 1996749, 1968769, 2053008, 2302075, 2352595]
44956B352595n34007r46366o59831J87008Q92795Q80874K64516k31955L5135R40790
44946C181554J667543J569983Q64830L04422K70992M73534N64444P13151J266833
44937A0877286J970869J964321Q01648p56143j391805p08549L27266N75446n0333
44928A3610006q50027j394525j720477j725834j171318l69428j21693o47696j171896
44919D437112r73203l22525J01001K41029M66048O62895L03717n85989j193097
44910C136988q68923R5099Q53237R01941M31429k4202j35915m4193j14437m18669
44900C812355n88158k92090K98402P06586O67505K63480k70311o27304n19725
44891C450740l2818K50256j38411q85516j222235q69382k60704J58357L97916
$$ y = [2352595, 1818588, 872222, 212391, 399399, 1292194, 2173068, 2437584, 2205629, 2240764, 3181554, 4849097, 6419080, 7283910, 7588332, 7859324, 8332858, 8897302, 9610453, 10877286, 12848155, 14812476, 15614124, 14857981, 13466176, 12757627, 13084893, 13660339, 13610006, 12759979, 11365454, 9644977, 7919143, 6747825, 6378397, 6256704, 5609008, 4437112, 3463909, 3141384, 3242385, 3483414, 3949462, 4612357, 4916074, 4330085, 3136988, 2268065, 2363164, 3216401, 4118342, 4549771, 4525569, 4389654, 4345461, 4231024, 3812355, 3224197, 2932107, 3230509, 3937095, 4604600, 4868080, 4597769, 3970465, 3450740, 3417922, 3668178, 3529767, 2644251, 1422016, 552634, 291930, 450287, 848203]
44882H48203N91378O33928L99653N5785p4752J42904N33478P31397M69155o1210
44872D269919k34076L14235J101164J320564R11339N76832O58539O21528j3268
44863I526776p91057r22861m22888n9640l11193q93240j296265j323939j040397
44854B465296n83347j69491j4375j22895l28984n48449p53052p02981p2184R90994
44844A60532J726625J474667M11285o30623r92116o81823j70709O7946j27949
44835A237835n02700n71597j24215M46546N44384J22456k50339j67384J11891
44826H46877J51738j2435q5912r7850k68148m31781j71173M58601Q95787Q70765
44816B156469O88447N50477K04395m28824q81631q36893o49772o41794m16138
$$ y = [848203, 1439581, 2073509, 2473162, 2528947, 2454195, 2597099, 3130577, 3861974, 4331129, 4269919, 4035843, 4350078, 5451242, 6771806, 7683145, 8259977, 8918516, 9540044, 9526776, 8735719, 7812858, 7389970, 7330330, 7019137, 6125897, 4829632, 3505693, 2465296, 1881949, 1712458, 1698083, 1575188, 1246204, 697755, -55297, -758278, -830462, 160532, 1887157, 3361824, 3773109, 3142486, 2150370, 1468547, 1297838, 1365784, 1237835, 735135, 163538, 39323, 485869, 1030253, 1152709, 902370, 734986, 846877, 998615, 986180, 900268, 802418, 534270, 102489, -68684, 389917, 1285704, 2156469, 2844916, 3395393, 3599788, 3170964, 2289333, 1452440, 802668, 160874, -255264]
44807b55264M18231J285476J279506N31748M6339K35430N03774L55614L2790j73389
44797D260255m35435q61058j120705r85141o86340m24140o6519L44356L79615
44788D04888q2944m87245l45775J19719M77260P14375R28539Q96077M67584k1233
44778C071245k12287k03048j55306O9332M17375L69490k43014p14282m43438J18251
44768B074318K68773K13707M71428O67550J16180p34826p72933n8693J73783m60320
44758A958967q16374m9680J039552J201335M21564l13212l39885J98151P25185
44749D025603O33299k47428j248802j432541p94036k60286k56649j30185N60578
44740H49553J117027Q04646J08386k1779L90447O17668N35406O74834J167042
$$ y = [-255264, 162967, 1448443, 2727949, 3259697, 3306036, 3541466, 4045240, 4400854, 4433644, 4260255, 3824820, 2963762, 1843057, 857916, 171576, -252564, -319083, 25273, 404888, 321944, -165301, -511076, -391357, 85903, 800278, 1728817, 2624894, 3092478, 3071245, 2858958, 2655910, 2500604, 2569936, 2987311, 3356801, 3113787, 2399505, 1956067, 2074318, 2343091, 2556798, 3028226, 3695776, 3811956, 3077130, 2304197, 2245504, 2419287, 1958967, 1142593, 1092913, 2132465, 3333800, 3755364, 3442152, 3102267, 3300418, 4025603, 4658902, 4411474, 3162672, 1730131, 936095, 675809, 419160, 288975, 849553, 1966580, 2771226, 2879612, 2857833, 3248280, 3865948, 4401354, 5076188, 6243230]
44731F243230J556079J631873J645995J634072J217031K47460q36263j465392
44723A1874085j482204j227299j263787j825961k358376j971607o42801N20958
44715A623008O39434J35810j05014n3438k13140m93072l86300K5079K27911K27586
44705A627864L52044L16142l94470j291199j263320l01296L93007K74464J71698
44696a15066O83291J111895P34897P1824k6055K52808J51410l84951p54918o08881
44686A116254n3963O13640Q49892J34778j091924j459104l96813Q36629P78723
44677A328112k10427o41591j28380L45848J80534j22529p5267J20451K58344M90565
44667A545660O99677M07748l20143o83110k64711L56081N24196L69309K79670
$$ y = [6243230, 7799309, 9431182, 11077177, 12711249, 13928280, 14175740, 13339477, 11874085, 10391881, 9164582, 7900795, 6074834, 3716458, 1744851, 1102050, 1623008, 2262442, 2398252, 2293238, 2239800, 2026660, 1533588, 1147288, 1172367, 1400278, 1627864, 1979908, 2296050, 1901580, 610381, -652939, -954235, -561228, -286764, -115066, 568225, 1680120, 2415017, 2486841, 2460786, 2713594, 2865004, 2480053, 1725135, 1116254, 1062291, 1675931, 2525823, 2660601, 1568677, 109573, -287240, 549389, 1328112, 1117685, 476094, 347714, 693562, 874096, 751567, 676300, 796751, 1055095, 1545660, 2245337, 2653085, 2332942, 1649832, 1385121, 1741202, 2265398, 2634707, 2914377]
44658B914377J46153k56893n81815k78154N04352R25233M08806o86041j392828
44649A703190j054701L3407Q97674Q84638K81494j95938k67922j29091M9662J33844
44639B336257j70742q43968j125070m21859N08569L59058p06306j071539n5204
44630a190804J020451Q41587l5287l56688j79391l88593q94995p68297R3901P65727
44620a092389P41272M33495J90220q7313k30149J90491Q72984Q37255j24647r63026
44610G68193q17763j34370K11864J65556K10153M17931M83037L36816J34419r7360
44600A678476l27038l35914j02763k6873l04916m51231J5134P22857R01962M64264
44590B233958L069j42806j76582k37675j55231R3696K22872Q8277j26422k80711
$$ y = [2914377, 3060530, 2803637, 2221822, 1943668, 2448020, 3373253, 3782059, 3096018, 1703190, 648489, 681896, 1579570, 2464208, 2745702, 2549764, 2281842, 2152751, 2202413, 2336257, 2165515, 1321547, 196477, -225382, 283187, 642245, -64061, -1135600, -1190804, -170353, 671234, 635947, 279259, 99868, -288725, -1183720, -1952017, -1858116, -1092389, -351117, 82378, 272598, 185285, -44864, 145627, 1018611, 1855866, 1731219, 768193, -49570, -183940, 27924, 193480, 403633, 821564, 1304601, 1641417, 1775836, 1678476, 1351438, 1015524, 912761, 885888, 580972, 129741, 144875, 867732, 1769694, 2233958, 2237027, 2094221, 1917639, 1679964, 1524733, 1618429, 1841301, 1929578, 1803156, 1522445]
44580A522445m08445l85116N0688P44402J051652O24754p3255l64605j84529L1862
44570B609853N4627L5860R0741J32724J73157M11225Q38767J010992N06100m42211
44560E421835j053436q61534k80585p9052l68764m58846J56830J000225J149341
44551D626014M28463l63317m52132O3026N28874N95362M71780M67141N54642M35385
44541G355238n9818o65809q54783m54099o407j81687p91649q59673M0004R74363
44531D495680P49195m48818j232752q35643J9341L32513J71687K32863O00710
44522D084776P35872M76737K50601K56195J65101j67089l38695p1272K99689L77312
44512F069227K59317J21402k48250r13580j221319n33152O87639J309207R84681
$$ y = [1522445, 1114000, 728884, 779572, 1523974, 2575626, 3200380, 3127125, 2762520, 2577991, 2609853, 2664480, 2700340, 2791081, 2923805, 3096962, 3508187, 4346954, 5357946, 5864046, 5421835, 4368399, 3506865, 3226280, 3147228, 2778464, 2319618, 2476448, 3476673, 4626014, 5054477, 4691160, 4239028, 4302054, 4830928, 5426290, 5898070, 6365211, 6919853, 7355238, 7295420, 6629611, 5774828, 5320729, 5314322, 5132635, 4340986, 3481313, 3521317, 4495680, 5244875, 4796057, 3563305, 2727662, 2747003, 3079516, 3251203, 3484066, 4084776, 4820648, 5297385, 5547986, 5804181, 5969282, 5802193, 5463498, 5392226, 5691915, 6069227, 6328544, 6449946, 6201696, 5288116, 4066797, 3533645, 4221284, 5530491, 6515172]
44503F515172M02931J02492q5699k59874p9411L92723L79962m07483j025692n96304
44493E338817K61137L18734l44863n03697K35294Q50466N81536O2336J79454O75881
44483G655095O92938J37141l48297m81381n77262p42683o08330p1812K80163j13238
44473E822334r41285j289851p16166K30913O69687L92740n805R477K34575J27254
44463D533873l46297o80213n98552l91478l54798l34163j05600J42524R1220j52406
44453A804110j72594J57812N24157N96743L53761j6640l15597m12089k85287l1807
44443B202569K20837L78610L74968K54353K52920N20860P16679K84352o62793
44434D543355j196005p14853J60572M06934K1025q2745M92291J067100R38374
$$ y = [6515172, 6918103, 7020595, 6934896, 6675022, 6595611, 6988334, 7368296, 6960813, 5935121, 5338817, 5599954, 5918688, 5573825, 5070128, 5305422, 6155888, 6737424, 6799760, 6979214, 7655095, 8348033, 8485174, 8136877, 7655496, 7078234, 6335551, 5727221, 5655409, 5935572, 5822334, 4881049, 3591198, 2875032, 3105945, 3775632, 4168372, 4162567, 4172044, 4406619, 4533873, 4187576, 3507363, 2908811, 2517333, 2162535, 1828372, 1722772, 1865296, 1956516, 1804110, 1631516, 1789328, 2313485, 2910228, 3263989, 3247349, 2931752, 2519663, 2234376, 2202569, 2423406, 2802016, 3176984, 3431337, 3684257, 4205117, 4921796, 5206148, 4543355, 3347350, 2632497, 2793069, 3200003, 3221028, 3138283, 3630574, 4697674, 5636048]
44425E636048L18235j23560j59268l4543O5281J70625L24608N31326P86175R57739
44415H472666Q10144L49177j5513J42377Q34327J723657K418119K586861K120775
44406A9442590J449033J383748K220287L152650L044129J753811K68452n33435
44398C2181265q03872j221488j968749k606792k786501k630094k352368j907902
44390A5903499j274535q05557q64534j173184j025161l15296J35647l20586j135267
44381I125026j244981n71774r7095l94216q70437p91743l64017k42884m75695
44372D072184n98560m78951l70328k78402L6446M35443M53135J02944P814M57459
44362C839184Q68680N81486j89526o57636n08423j93857k27810n61034p49902
$$ y = [5636048, 5954283, 5830723, 5671455, 5636912, 5702193, 5872818, 6197426, 6728752, 7514927, 8472666, 9282810, 9631987, 9616474, 9758851, 10593178, 12316835, 14734954, 17321815, 19442590, 20891623, 22275371, 24495658, 27648308, 30692437, 32446248, 32714700, 32181265, 31377393, 30155905, 28187156, 25580364, 22793863, 20163769, 17811401, 15903499, 14628964, 13823407, 12958873, 11785689, 10760528, 10445232, 10580879, 10260293, 9125026, 7880045, 7308271, 7211176, 6816960, 5946523, 5154780, 4790763, 4547879, 4072184, 3473624, 2994673, 2624345, 2345943, 2382389, 2817832, 3270967, 3373911, 3381725, 3839184, 4707864, 5289350, 5099824, 4442188, 3933765, 3739908, 3512098, 2951064, 2201162]
44353B201162n26166o4709K58927L01037K79294M20480N77673M13988l6783k93472
44343C531431m8573M18247O76400P16359P32947N77755k9524p88970r54197l97012
44333D434863M0737l09977r19136p84582J19355Q62613R16430O52803L90736j22174
44323E281668q59292j050277l21085M12861J60717n60051n12189K14762L50623
44314C117737l31359n03857M62033J238816N82678n94391o23197K76484M40380
44305D065324m66303r06214J7966J102154Q71086k90126q50924k96768M52340
44296C698535N16640P5066j38940K21983Q52514J189471R62311M35217R1861J01517
44286H006175K58086M07235O17898Q74011R71001R00068J008751J525379K135723
$$ y = [2201162, 1674996, 1610287, 1869214, 2170251, 2449545, 2870025, 3447698, 3861686, 3824903, 3531431, 3482858, 3901105, 4577505, 5293864, 6026811, 6604566, 6575042, 5786072, 4831875, 4434863, 4475600, 4165623, 3246487, 2461905, 2581260, 3443873, 4360303, 5013106, 5403842, 5281668, 4422376, 3372099, 3051014, 3463875, 3624592, 3064541, 2552352, 2767114, 3117737, 2786378, 2282521, 2744554, 3983370, 4566048, 3971657, 3348460, 3624944, 4065324, 3599021, 2692807, 2710773, 3812927, 4684013, 4393887, 3542963, 3246195, 3698535, 4215175, 4290241, 4151301, 4373284, 5225798, 6415269, 7377580, 7812797, 7904658, 8006175, 8264261, 8671496, 9289394, 10163405, 11134406, 12034474, 13043225, 14568604, 16704327]
44277A6704327K244160J528292J80066j176814j807306j480010q52336q25280
44269A4515099j372599j494325n91716O10486R36303J83749p88189j150042q25518
44260A0023248k69797O3735M9681r1403j39064k57018p51181j391067j447448
44251E789686o55874L12258O71819L98245l9435l20685k50145L39713J114990
44242G360572J227130M46585k26508J11696Q47714P45241j61233p54413o73740
44233H923044o07630p21981k77986P68356J215918M67151k73409K83666J505384
44224A1282513J792085R67423L61497O71098J060516O86179M0433J18231Q65422
44215A7845397J230492O36458k25016l10545L90533Q22728K46952p82832j167851
$$ y = [16704327, 18948487, 20476779, 20656845, 19480031, 17672725, 16192715, 15340379, 14515099, 13142500, 11648175, 11056459, 11666945, 12603248, 12786997, 11998808, 10848766, 10023248, 9753451, 9817186, 9866867, 9775464, 9636400, 9379382, 8628201, 7237134, 5789686, 5133812, 5446070, 6117889, 6516134, 6476699, 6156014, 5905869, 6245582, 7360572, 8587702, 9034287, 8807779, 8919475, 9767189, 10512430, 10351197, 9596784, 8923044, 8315414, 7593433, 7315447, 8083803, 9299721, 9766872, 9493463, 9777129, 11282513, 13074598, 14042021, 14403518, 15074616, 16135132, 16821311, 16861744, 16979975, 17845397, 19075889, 19712347, 19487331, 19176786, 19567319, 20390047, 20636999, 19854167, 18686316]
44206A8686316o77002n4816J54112J89284L59282M52512K35426k4897p623J22664
44196A9435258J05040J37796N19621J023557J178864J003510R58466J288326J832320
44187B7482758K367133K744486K830010K685503K642093K807702K724319J980324
44179D8264328R66108M99072Q35010J566581K351463L149478L833211M229614
44171F5694865M603013N508000P074628Q966252J1081392J3701989J6869000K0267493
44163A53766632K3922798K8391594L4007268M0441763M7034350N2601854N4521448
44156D34687707M9202078L4936805J4417974o254969k1243717k7683712k5746281
44149D52315885j7494688o140597M367020J0022999P825071k875451j9240254
$$ y = [18686316, 18009314, 17954498, 18108610, 18297894, 18657176, 19109688, 19345114, 19320217, 19312594, 19435258, 19540298, 19678094, 20197715, 21221272, 22400136, 23403646, 24362112, 25650438, 27482758, 29849891, 32594377, 35424387, 38109890, 40751983, 43559685, 46284004, 48264328, 49230436, 49729508, 50564518, 52131099, 54482562, 57632040, 61465251, 65694865, 70297878, 75805878, 82880506, 91846758, 102928150, 116630139, 133499139, 153766632, 177689430, 206081024, 240088292, 280530055, 327564405, 380166259, 434687707, 483889785, 518826590, 533244564, 526989595, 505745878, 478062166, 452315885, 434821197, 428680600, 433047620, 443070619, 450895690, 448020239, 428779985]
44142D28779985l5448885m5675468m7645080m3447237l6930838l0703672k5539615
44135A63389190k1484807j8382062j5604078j2463508r260738p186546o742814
44128G2264637o853359o113646m489387l114256k707318k969769l413452l873654
44120C8729796m046688l438011k239303j511395j864737k535007k465743j799087
44112A8829825j441692j528021j349845p25784l72426o80990j042305q12486k39330
44103A0636946N1748n4097k57283l89530m21877k83988o2149n0353k67714k79183
44093H622520J56867O27879O29190K37960j56645m35202o37144o25469l42448
44084H077508q9258o2182O9924N74157R56994N47304m02252r36062p15360m21502
$$ y = [428779985, 393331100, 347655632, 300010552, 256563315, 219632477, 188928805, 163389190, 141904383, 123522321, 107918243, 95454735, 86193997, 79007451, 72264637, 65411278, 59297632, 54808245, 51693989, 48986671, 46016902, 42603450, 38729796, 34683108, 31245097, 29005794, 27494399, 25629662, 23094655, 20628912, 18829825, 17388133, 15860112, 14510267, 13784483, 13412057, 12731067, 11688762, 10876276, 10636946, 10688694, 10634597, 10377314, 9987784, 9565907, 9281919, 9219770, 9169417, 8901703, 8622520, 8779387, 9407266, 10036456, 10274416, 10117771, 9682569, 9045425, 8419956, 8077508, 7988250, 7926068, 7995992, 8570149, 9527143, 10074447, 9672195, 8736133, 8020773, 7599271]
44074G599271o87640j207883j186542l19122Q97912J638861J447905O25335r6991
44065H711106l59272m53102o63356p50570m59751r4911j2939N7477M80704Q64405
44055G319791O35899J97467M21865J075038R80046m2042o81546j13884P38845
44046A0531479P30366K43524L59433J018213J219670O96615K37580L89238P78653
44037A6204771Q39889N10816O2008k80904m75547p43721j387696k217579k482581
44028A0029456j822593q98731m83008l48316J35064O73588L82263o58573j301272
44019E707878r67393l57781j88243j83266J37014M91141L58439q7098k48997K2720
44009D684414L86922N74807N42118K86090r9335l68737m05004l50225k88987j13035
$$ y = [7599271, 6911631, 5703748, 4517206, 4198084, 5095996, 6734857, 8182762, 8808097, 8711106, 8351834, 7898732, 7235376, 6484806, 6025055, 5930144, 5917205, 5974682, 6455386, 7319791, 7955690, 8153157, 8575022, 9650060, 10630106, 10588064, 9906518, 9792634, 10531479, 11261845, 11505369, 11864802, 12883015, 14102685, 14799300, 15036880, 15426118, 16204771, 17044660, 17555476, 17617484, 17336580, 16861033, 16117312, 14729616, 12512037, 10029456, 8206863, 7308132, 6825124, 6476808, 6611872, 7285460, 7667723, 7009150, 5707878, 4740485, 4382704, 4194461, 4011195, 4148209, 4639350, 4997789, 4910691, 4661694, 4684414, 5071336, 5646143, 6188261, 6474351, 6375016, 6006279, 5601275, 5251050, 4962063, 4849028]
43999D849028J53774L06270L81066O09892P80993L39385n47249q19832P507R78372
43989G039206J042962N66927N46048R21858Q42824K24075k20467l55319p37213
43980I870901j297717j226890m65319n4045m95571r25887n82065j9044j6428k21993
43970D565942O9785N24065L50201j57554R3385J258803K213678K083056J224946
43961A2226307M62284Q7275o0944j21462j87092l86889o94160q51813o38521q9001
43951I745984N16457P38549K67039n86717r59665m42727K55373K32708k67960
43942I499041k24801N60542J149267R14565L96651L20342N56734O26038O15254
43933A4413633R46493J624648K283516K696117K799160K546091K182748K314615
$$ y = [4849028, 5002802, 5309072, 5690138, 6300030, 7081023, 7420408, 6873159, 6053327, 6060834, 7039206, 8082168, 8649095, 9195143, 10117001, 10959825, 11183900, 10963433, 10608114, 9870901, 8573184, 7346294, 6880975, 6826930, 6331359, 5405472, 4823407, 4804363, 4787935, 4565942, 4635727, 5159792, 5509993, 5352439, 5445824, 6704627, 8918305, 11001361, 12226307, 12688591, 12775866, 12714922, 12593460, 12406368, 12019479, 11325319, 10473506, 9834985, 9745984, 10262441, 11000990, 11268029, 10681312, 9721647, 9278920, 9534293, 9767001, 9499041, 9274240, 9834782, 10984049, 11898614, 12295265, 12615607, 13172341, 13798379, 14413633, 15360126, 16984774, 19268290, 21964407, 24763567, 27309658, 29492406, 31807021]
43925C1807021L208011M347434N173746N888792O937302Q050407Q545325Q344772
43917H2302810P863250O925898M684274Q82472l411380o658645q079440p943974
43909G6565265p114157o441687o163662n699869m400220k554922j193881p95021
43901D2201846p61591l78265L39138J102371K026693L240802M244843M388618
43893E6404455L859884L530416L727671L671220K364027k34895l132195n240524
43885F4950059o212979o387774o129648n482870m523418l702719l422080l382906
43877B5705665k883694j850547j056837j092878j601484j874891j772605j598134
43869A1974595j416717j044234n41468k17587j95307l31779m73869m90149k39899
$$ y = [31807021, 35015032, 39362466, 44536212, 50425004, 57362306, 65412713, 73958038, 82302810, 90166060, 97091958, 101776232, 102658704, 99247324, 92588679, 84509239, 76565265, 69451108, 63009421, 56845759, 51145890, 46745670, 44190748, 42996867, 42201846, 41440255, 41061990, 41401128, 42503499, 44530192, 47770994, 52015837, 56404455, 60264339, 63794755, 67522426, 71193646, 73557673, 73322778, 70190583, 64950059, 58737080, 52349306, 46219658, 40736788, 36213370, 32510651, 29088571, 25705665, 22821971, 20971424, 19914587, 18821709, 17220225, 15345334, 13572729, 11974595, 10557878, 9513644, 8972176, 8754589, 8559282, 8227503, 7753634, 7263485, 7023586]
43860G023586J48825K19282j85347n27573l33281k8918l13255r20549q98993j05216
43850D078561N34278M54340J97733L30463N08530K41643j72913k40200j86643
43841E745792m33755o16821j00796P72494R73609L20344k43150r6252K16306k1312
43831F516459n98659q05063m34271J65499O63128Q63083N69080j37820o88315
43822F113121n98476j24714J12892J4685j7151J25706J31824N948K29705Q79037
43812F872577J198803N73267n00251r83038n63690K24801R13977J406907J479157
43803A0622510Q51275k3314p8203R67848K005819J966508J304656J259248K030662
43794B0907009K672938K683986K656948L139647L800717M189603M535188N156581
$$ y = [7023586, 7172411, 7391693, 7206346, 6678773, 6345492, 6316574, 6003319, 5082770, 4183777, 4078561, 4612839, 5067179, 5264912, 5595375, 6103905, 6345548, 6172635, 5932435, 5745792, 5312037, 4695216, 4594420, 5366914, 6340523, 6660867, 6417717, 6321465, 6537771, 6516459, 5917800, 5112737, 4678466, 4843965, 5507093, 6370176, 6939256, 6801436, 6113121, 5514645, 5389931, 5502823, 5517508, 5500357, 5626063, 5757887, 5763835, 5993540, 6872577, 8071380, 8644647, 8144396, 7161358, 6597668, 6822469, 7736446, 9143353, 10622510, 11473785, 11450471, 11372268, 12340116, 14345935, 16312443, 17617099, 18876347, 20907009, 23579947, 26263933, 28920881, 32060528, 35861245, 40050848, 44586036, 49742617]
43786D9742617N655928N385107M320013K817436Q63304j667115m186664n647716
43778E7282910n688874m923074m046699l278618k747113k714748l107111l364841
43770B7411832l127291k665762k351290k110070j724144j254877q01749k59887
43762A3116762K45930J36316p80447j576140j133187K51730J031352L74170p86524
43753A0879962j073682l99700K31079K26034n0217j22923n4447n6413k6656J73556
43743I726593L33946J59552k75366o43347p68703o38598k23232L36986N58527
43734H566358J47322l80827k36817M30492N95064r7754o44967j50077P41352P98525
43724I768671J29459j6180P38890J325590R43976J90029j16658k16080o66733
$$ y = [49742617, 55398545, 60783652, 65103665, 67921101, 68784405, 67117290, 62930626, 57282910, 51594036, 46670962, 42624263, 39345645, 36598532, 33883784, 30776673, 27411832, 24284541, 21618779, 19267489, 17157419, 15433275, 14178398, 13376649, 13116762, 13362692, 13499008, 12718561, 11142421, 10009234, 10260964, 11292316, 11666486, 10879962, 9806280, 9406580, 9637659, 9863693, 9813476, 9690553, 9636106, 9579693, 9553037, 9726593, 10060539, 10220091, 9944725, 9301378, 8532675, 7894077, 7670845, 8007831, 8566358, 8713680, 8332853, 8096036, 8526528, 9121592, 9023838, 8378871, 8228794, 8970146, 9768671, 9898130, 9881950, 10620840, 11946430, 12890406, 13080435, 12963777, 12747697, 12080964]
43715A2080964j107508q13115k4509L59215K21157L18049R24401J368882J146524
43706A4474060O64918N34931P56323R61634R67978P90364N49974N93243J227831
43697B1521256K124798K504458K178354J872106K212603K960871L619739M195505
43689D3189690M836678N254966N113800M546520L685135K174275p6646k099650
43681F6624768k798429k462890k360064k880470l155161k651878k027737j920086
43673D6368053j853473j071424K19166J206758J630090J839869K031259K171430
43665E2541728K534406L557773N109393O504041P394678Q147007R136421J0151100
43657A05076547J0875282J1680593J3413399J6285123J9283744K0931199K0477424
$$ y = [12080964, 10973456, 10160341, 10135832, 10495047, 10716204, 11034253, 11958654, 13327536, 14474060, 15138978, 15673909, 16430232, 17391866, 18359844, 19150208, 19700182, 20293425, 21521256, 23646054, 26150512, 28328866, 30200972, 32413575, 35374446, 38994185, 43189690, 48026368, 53281334, 58395134, 62941654, 66626789, 68801064, 68724418, 66624768, 63826339, 61363449, 59003385, 56122915, 52967754, 50315876, 48288139, 46368053, 44514580, 43443156, 43662322, 44869080, 46499170, 48339039, 50370298, 52541728, 55076134, 58633907, 63743300, 70247341, 77642019, 85789026, 94925447, 105076547, 115951829, 127632422, 141045821, 157330944, 176614688, 197545887, 218023311]
43650B18023311J8036596J3655514O935177j893162j0883581j7194900j9242164
43643B07436791j7704270j4456829j1063901q292769o202501m159734j297658
43636A44259129K496164O396513R792009J3044639J6502214J9236651J9510989
43629B31238308J6244255R470027q1205j0841212k0163310k5540646k6481909
43622A73844308k4545591k1481069j8094473j4843042j2303693j0540903q922101
43615F3113436p147786n756209n118621m723327m073683l524036l454412l320507
43607B5994855k473186j384868r96574j184859j013946l94115l02626j152354
43599A7092327k007997j901708j123789o20372o68622p71884n57960k06998n4877
$$ y = [218023311, 236059907, 249715421, 256650598, 254757436, 243873855, 226678955, 207436791, 189732521, 175275692, 164211791, 155919022, 149716521, 145556787, 144259129, 146755293, 153151806, 162943815, 175988454, 192490668, 211727319, 231238308, 247482563, 256952590, 256871385, 246030173, 225866863, 200326217, 173844308, 149298717, 127817648, 109723175, 94880133, 82576440, 72035537, 63113436, 55965650, 50209441, 45090820, 40367493, 36293810, 32769774, 29315362, 25994855, 23521669, 22136801, 21140227, 19955368, 18941422, 18547307, 18244681, 17092327, 15084330, 13182622, 12058833, 11438461, 10769839, 9997955, 9439995, 9232997, 9178120]
43590I178120j55308k73012j46525K28199N20170L62323k28531q36712j071640
43581G577084r03741o04642m72428n54966n33138l6270P45832J020119L27204
43572F565054o80548r18761k81601K04531k23218j047311j173207l04105P68661
43563B909495J132712P26047K86878M13618P98237O13180l07601j087886r29162
43554D555518k03155J46960P730J29918Q19878J410374J222899L86603n23961
43545G952764j068487r84165l20076K42354p5636r84507j259627m49301L76184
43536C429503J80349n44860o64146j11979K67746J57033J1427Q8993J78524K04186
43526C196776K72009K15512j05351k13973L57501R70735M95092q82584j594148
$$ y = [9178120, 9022812, 8749800, 8603275, 8831474, 9351644, 9713967, 9485436, 8648724, 7577084, 6673343, 6068701, 5596273, 5041307, 4508169, 4471899, 5217731, 6237850, 6565054, 5884506, 4965745, 4684144, 4888675, 4665457, 3618146, 2444939, 2140834, 2909495, 4042207, 4768254, 5055132, 5468750, 6266987, 6880167, 6572566, 5484680, 4555518, 4352363, 4499323, 4507053, 4636971, 5456849, 6867223, 8090122, 8476725, 7952764, 6884277, 5900112, 5580036, 5822390, 5746754, 4762247, 3502620, 3053319, 3429503, 3609852, 3064992, 2400846, 2288867, 2556613, 2713646, 2725073, 2814066, 2992590, 3196776, 3468785, 3684297, 3578946, 3364973, 3722474, 4693209, 5188301, 4305717, 2711569]
43517B711569p96049M93793Q96081L78845k24955o00960r50463j122876p34563
43508E0422o543L34655N5933k72622q0690N20795R93670J013601P26577N08650
43498C844448N26244N10838P9967o66107j094370p66260k4137L93128K08369j63061
43488B849059k03322R7145K79840n781n39388p32599l26741K88089O01804N94864
43478B902970N15540L12554j69352n58917k26572P04263J287095R46189J34850
43469E848620m75590p93155q84296m75960M52246J131780Q57885L8885l66751
43460E333664j88937l3004j45643j88235j05410l07924q17248j030921o18012
43451A898330L4769N39504R64874J229848Q01656l91440j347447j083289j8940
$$ y = [2711569, 1915520, 2409313, 3305394, 3684239, 3459284, 2858324, 1907861, 784985, 50422, 43879, 378534, 434467, 161845, 81155, 601950, 1595620, 2609221, 3335798, 3844448, 4370692, 4881530, 4961497, 4295390, 3201020, 2434760, 2410623, 2803751, 3012120, 2849059, 2645737, 2742882, 3022722, 3016941, 2477553, 1744954, 1418213, 1706302, 2308106, 2902970, 3418510, 3731064, 3561712, 3002795, 2776223, 3480486, 4767581, 5713770, 5848620, 5373030, 4579875, 3695579, 3219619, 3671865, 4803645, 5661530, 5700415, 5333664, 5144727, 5111723, 4966080, 4777845, 4672435, 4364511, 3547263, 2516342, 1898330, 1933099, 2472603, 3437477, 4667325, 5468981, 5077541, 3730094, 2646805, 2627865]
43442B627865N29407J22630l35480k4082O49696P43064J10055n30779o67369n56390
43432B668617o24251p70186n83392k0430N07641O80809N75970L94611K10455J00178
43422C140022J91899L68868K37061k94749o67841l25699M61179R11557Q00097
43413D822394O52716Q05918Q63837L88296l50167p54752p36092o81093p39337
43404D271720o40994k49179J52749K96395L16919M46488N35325K20388m56750
43395D893061r22253p10153m5114M16914L51912O3126J9306L10373O42096P03991
43385E723259M16805p8224n49972q51678j036308j226306j338955j104092m62849
43376e08320K16140N00236L74865J88064J89983L11334L58801K45676J1629k50534
$$ y = [2627865, 3157272, 3279902, 2944422, 2920340, 3570036, 4313100, 4423155, 3892376, 3225007, 2668617, 2044366, 1274180, 690788, 670358, 1177999, 1858808, 2434778, 2829389, 3039844, 3140022, 3331921, 3700789, 3937850, 3643101, 2975260, 2649561, 3110740, 4022297, 4822394, 5475110, 6281028, 7144865, 7533161, 7182994, 6428242, 5692150, 5011057, 4271720, 3630726, 3381547, 3534296, 3830691, 4147610, 4594098, 5129423, 5349811, 4893061, 3970808, 3260655, 3215541, 3632455, 3984367, 4047493, 4066799, 4377172, 5019268, 5723259, 6140064, 6061840, 5511868, 4660190, 3623882, 2397576, 1058621, -45471, -508320, -292180, 208056, 582921, 770985, 960968, 1272302, 1631103, 1876779, 1888408, 1637874]
43366A637874m40590m84177l57158j01230J49439K15805O0494j20335j26333J1196
43356D44985J96091M82170P86974O30423k28010j000029n69888Q37378J622863
43347C202957R17756j95592l05843L30402M54110j70131o62864o50248o39437
43338B281110p79703n39324J26664M47754R8076k28489j5141K13372j55448p53813
43328F95058q10849k71477K75004M04009J30155k72637l89036J1394N43737O00302
43318I15660L20896M64026J078034J191409K99825p27880q89813l89602K0534
43309B283089K59909N82244O98746K70091k25963j52215J67019J4166m05148l36358
43299C155580R8409O0449m93650o76864j78649K28130j7168m53690m76931j91702
$$ y = [1637874, 1197284, 713107, 355949, 254719, 404158, 619963, 680457, 560122, 433789, 444985, 641076, 1123246, 1910220, 2540643, 2312633, 1312604, 742716, 1580094, 3202957, 4120713, 3925121, 3619278, 3949680, 4403790, 4233659, 3570795, 2920547, 2281110, 1501407, 962083, 1088747, 1536501, 1634577, 1406088, 1390947, 1604319, 1448871, 695058, -115791, -387268, -112264, 291745, 421900, 149263, -239773, -228379, 315358, 915660, 1236556, 1700582, 2778616, 3970025, 4269850, 3541970, 2652157, 2262555, 2283089, 2542998, 3125242, 3823988, 4094079, 3868116, 3715901, 3882920, 3897086, 3491938, 3155580, 3253989, 3314438, 2820788, 2143924, 1965275, 2193405, 2176237, 1722547, 1245616, 1053914]
43289A053914K8864J36463J56584n3366m01944m15202J48118Q96181J255449J018059
43279C823120L65937k89363n05144k65889j48325n28931q25969k45487Q61748
43270B241697J286714O45462j50412k88891j6920R0983k4074j66527k50393p1585
43260C296054N59156J184957J014835J59019l48165j05992J04550j73155j80189
43251E511070O15038J262708O70692n73996r71025k19712O28945Q46442P14980
43242H485142O54223O91642Q36721J141210J343097J131397O98557L83197k6882
43233A5338304q40521j520893j197974j42183L11608l99079j210985q99630K95512
43224I734159J100905Q53766J55740K4180P93094J901383K600566K739852K727457
$$ y = [1053914, 1082778, 1219241, 1375825, 1322459, 920515, 505313, 653431, 1549612, 2805061, 3823120, 4189057, 3899694, 3394550, 3128661, 2980336, 2451405, 1625436, 1379949, 2241697, 3528411, 4173873, 4023461, 3734570, 3717650, 3808633, 3784559, 3618032, 3367639, 3296054, 3855210, 5040167, 6055002, 6214021, 5865856, 5759864, 5864414, 5691259, 5511070, 6126108, 7388816, 8059508, 7485512, 6514487, 6294775, 6923720, 7770162, 8485142, 9139365, 9831007, 10667728, 11808938, 13152035, 14283432, 14981989, 15365186, 15338304, 14497783, 12976890, 11778916, 11636733, 11948341, 11549262, 10338277, 9438647, 9734159, 10835064, 11688830, 11844570, 11868750, 12661844, 14563227, 17163793, 19903645, 22631102]
43215B2631102K764219K481825J542710K21867r62957j865314k530607k748137
43207B1534708k345674j703392j396857j475605j610269j739203j962183j981598
43199G319927j368886l69741K03405m2516o81181j037109p44704J02442Q99751
43190D281388Q84983P6274m98279j57232L31005q2650r38990r13959l34M35925
43180C418131j29138o21834k23102M60732O78837O35623N56484k6884j078477
43171C670372j369291k28575J004918O90357o72459j205201m24272K98255j6289
43162A747815o86550o44801J51482J010656J398374J141783L50942n14333r12829
43153C042539p68082m40470j47819J84583N14070N84005L01329j45473n56887
$$ y = [22631102, 25395321, 27877146, 29419856, 29641723, 28678766, 26813452, 24282845, 21534708, 19189034, 17485642, 16088785, 14613180, 13002911, 11263708, 9301525, 7319927, 5951041, 5581300, 5784705, 5742189, 5061008, 4023899, 3279195, 3381637, 4281388, 5166371, 5242645, 4744366, 4587134, 4918139, 4835489, 3896499, 2982540, 2982206, 3418131, 3288993, 2667159, 2444057, 2904789, 3583626, 4219249, 4775733, 4748849, 3670372, 2301081, 2072506, 3077424, 3767781, 3095322, 1890121, 1465849, 1764104, 1747815, 1061265, 416464, 567946, 1578602, 2976976, 4118759, 4469701, 3955368, 3042539, 2274457, 1833987, 1686168, 1870751, 2384821, 2968826, 3270155, 3124682, 2567795]
43144B567795q25331q76400q10055q94685j074273q10228R1316Q70762P29059
43135a032040N6561q7994M47732Q05460N74807L19250M15302L89493r2630m60180
43125A335761j60297L10343J16919n59106p23252l1376P05688O52753L4210k67620
43115A414023P6477M70014K89247k03152k10667M27876R17029N43816m04656j116887
43105B203120j268216j085285p30309k30604J61546J69109j8574j125K07587L71710
43095b21041O20933J096774J229590L66444r01346j172911k24153O08253M70067
43086A872610K07942P87629J616004J559969Q52112P16624J509326K418488K827691
43077A4368395K889990K787449K392985J715828Q50546m84136k447046m123876
$$ y = [2567795, 1742464, 866064, 56009, -838676, -1912949, -2723177, -2631861, -1761099, -1032040, -975479, -1063473, -615741, 189719, 764526, 1083776, 1499078, 1888571, 1795941, 1335761, 1175464, 1485807, 1602726, 1043620, 320368, 288992, 994680, 1647433, 1681643, 1414023, 1490500, 1960514, 2249761, 2046609, 1835942, 2263818, 3180847, 3724663, 3320007, 2203120, 934904, -150381, -880690, -1111294, -949748, -780639, -799213, -800338, -592751, -221041, 399892, 1496666, 2726256, 3092700, 2191354, 1018443, 794290, 1402543, 1872610, 2080552, 2868181, 4484185, 6044154, 6896266, 7612890, 9122216, 11540704, 14368395, 17258385, 20045834, 22438819, 24154647, 25005193, 24521057, 22074011, 17950135]
43069A7950135m160870k625971j212754j108717j592515j404109o33586k71882
43061D939731m62776m02229J25825K82656m11807j133398q91347j6421L29245
43052B359479j21043m34360k9144L93233K5567o48398n20289M39651J159441J100888
43042C725025Q64307R20423P97636R4608o25051p38672o10647q16510r63228l75300
43032B272591N07451O55442J36031l0912L28411K75748m68754r04330m67974o9199
43022B234505n42299j167436q33546J43913N83333K84096P4701K87044M06057
43013A470368K37281K93387P68460J044843O01416k51327q79443j030797p64861
43004A489327k10000K95032K88359k19184n87852l31909K26886M22860J35667
$$ y = [17950135, 13789265, 11163294, 9950540, 8841823, 7249308, 5845199, 5211613, 4939731, 4476955, 4074726, 4200551, 4483207, 4071400, 2938002, 2046655, 2030234, 2359479, 2238436, 1804076, 1774932, 2168165, 2193732, 1545334, 1025045, 1464696, 2624137, 3725025, 4589332, 5509755, 6307391, 6401999, 5776948, 5038276, 4427629, 3611119, 2647891, 2272591, 2780042, 3435484, 3571515, 3540603, 3869014, 4144762, 3676008, 2771678, 2303704, 2234505, 1692206, 524770, -308776, -164863, 418470, 702566, 777267, 1064311, 1470368, 1707649, 2001036, 2769496, 3814339, 4415755, 4164428, 3284985, 2254188, 1489327, 1279327, 1574359, 1862718, 1643534, 1055682, 723773, 950659, 1373519, 1509186]
42995A509186j44179m1233K38072K34027j27805l80038r1827M66930N48550l4450
42985B177233m79126j2935R62037J350327Q27362J02449k69315n03283p93083
42976C361666p67178k55758J06013k61458r03966r41230l09783L27760O45736
42967A001802Q36073Q77474M90940j13593k71177J23581L58327j1727m76427m06677
42957B408596n717J29768m0672j22535o2267j18449j91440J08721O68764Q22651
42947C597420L38464j30439J2487L66817R7015p98298j400892j082524k55972
42938G44078K81217L16941K16482K52926L55801L93125L13470L4792m54934q53393
42928A600505p36963j10763M94066N85862J64695m37953q87355r30882m87817
$$ y = [1509186, 1365007, 1323774, 1561846, 1795873, 1668068, 1288030, 1196203, 1663133, 2211683, 2177233, 1698107, 1685172, 2647209, 3997536, 4824898, 4927347, 4658032, 4154749, 3361666, 2594488, 2338730, 2444743, 2183285, 1279319, 338089, 28306, 356066, 1001802, 1837875, 2715349, 3206289, 3092696, 2821519, 2945100, 3303427, 3291700, 2815273, 2408596, 2402879, 2532647, 2491975, 2369440, 2307173, 2188724, 1997284, 2106005, 2774769, 3597420, 3935884, 3805445, 3817932, 4184749, 4281764, 3483466, 2082574, 1000050, 744078, 1025295, 1342236, 1558718, 1811644, 2167445, 2560570, 2874040, 2908832, 2453898, 1600505, 863542, 752779, 1246845, 1832707, 1997402, 1559449, 672094, -258788, -746605]
42919g46605J76687O42517Q20037R14826Q46123K74545n29401n65081N25726J567756
42909C927130J213395j93957j120273r71581n55665m16310n4694P50562J121378
42900C699985M18332n63705p17074k09624P7094Q8417L98146Q58720P25092L4252
42890D809635l55077j94762j58281m88377n04345P3506L98062j88154r79359q89997
42880A522851J4974Q01798R84462P33435J95228m82057p13678l8482R34697J039871
42870D993099J02808q37729j008475p77165p52793q12223n48316p9614K04788
42861D84380K96645L67115K46609k41265o44243l10542N57831R86414N33893j15156
42851B161681j78779J55707J75312k53590o26960o41222m45775j00280N27208
$$ y = [-746605, -569918, 72599, 892636, 1807462, 2653585, 2928130, 2398729, 1833648, 2359374, 3927130, 5140525, 4946568, 3826295, 2854714, 2299049, 1882739, 1828045, 2578607, 3699985, 4118317, 3554612, 2837538, 2627914, 2705008, 2793425, 3191571, 4050291, 4775383, 4809635, 4454558, 4259796, 4101515, 3613138, 3108793, 3182299, 3580361, 3392207, 2412848, 1522851, 1537825, 2339623, 3324085, 4057520, 4252748, 3770691, 3057013, 3018531, 3953228, 4993099, 5095907, 4258178, 3249703, 2472538, 1719745, 907522, 359206, 279592, 484380, 781025, 1148140, 1394749, 1153484, 509241, 198699, 756530, 1742944, 2276837, 2161681, 1982902, 2138609, 2313921, 2060331, 1433371, 792149, 346374, 246094, 773302]
42842G73302J139711R75996j30696j149097r44030K58960J143578R57474K38635
42833C263833j87378k45663l12564m31105l54585r6287P2480Q9168J68103L98366
42823B364368N53253L38686k95248j026842j276456o69141M45019J185579J092756
42814B711974O07546L19954J21807l82474r40240q62059j14835N21832N08736
42805B492241J04473k93105o66070r24239o25481L18464J164903J165638N24029
42796C260853k4168k53324m40626n75721l35007J77421L70956J5085m07127m05971
42786A382371r6504J36814K13695L07753M62617N27011L76979O4157j99973k08135
42776B966785k0104J5914l02263o85402p05114l52739R8667O05699J205259J481929
$$ y = [773302, 1913013, 2889009, 2758313, 1609216, 665186, 924146, 2067724, 3025198, 3263833, 3076455, 2830792, 2518228, 2087123, 1732538, 1636251, 1708731, 1797899, 1966002, 2364368, 2917621, 3256307, 2961059, 1934217, 657761, -11380, 433639, 1619218, 2711974, 3319520, 3639474, 3761281, 3378807, 2438567, 1576508, 1461673, 1983505, 2492241, 2596714, 2303609, 1637539, 713300, 87819, 406283, 1571186, 2736824, 3260853, 3236685, 2983361, 2542735, 1967014, 1632007, 1809428, 2180384, 2195469, 1788342, 1382371, 1285867, 1422681, 1636376, 1944129, 2406746, 2933757, 3310736, 3374893, 3174920, 2966785, 2946681, 2962595, 2660332, 1974930, 1269816, 917077, 1015744, 1621443, 2826702, 4308631]
42766D308631R10132j69411o75632k00741L97013K40998l87999o83875n07807
42757C231309k41185K9735L34776K23872o55963j569284j337982n5790Q42783
42748H02271M88297l68543o08003j83959K73068N57559Q05501P90240J84867o13929
42738B127369p09236J16012R80872R12554j959o89755k69970R36764J680102J148298
42728F231051j05853q93616q57117o52651p18878o69929k21367R3414k24454o81089
42718A299511m81050K21444N99187M34989K70332L73612M17991K40378J23740
42709C500134J62710O0418k30682l14869m8514J58269L163k69290l35558k01767
42699B484014N3995L97332M90649j26539j187314j670022j059001o2628L90973
$$ y = [4308631, 5218763, 5049352, 4373720, 4172979, 4569992, 4810990, 4422991, 3739116, 3231309, 2990124, 3019859, 3354635, 3578507, 2922544, 1353260, 15278, -40512, 802271, 1290568, 922025, 314022, 130063, 403131, 960690, 1766191, 2556431, 2741298, 2127369, 1418133, 1534145, 2515017, 3427571, 3425612, 2735857, 2465887, 3402651, 5082753, 6231051, 6125198, 5231582, 4374465, 3721814, 3002936, 2333007, 2111640, 2205054, 1980600, 1299511, 818461, 1039905, 1639092, 2074081, 2344413, 2718025, 3136016, 3376394, 3500134, 3662844, 3723262, 3492580, 3177711, 3129197, 3287466, 3290629, 3021339, 2685781, 2484014, 2538009, 2935341, 3425990, 3299451, 2112137, 442115, -616886, -679514, -288541]
42690b88541L03153K14666K46856K29993L34734P82963J193858R81194K74135
42681D273011k22218j87003Q8719K94383L05748m1746o85236r48635k24867R16800
42671C568956J135199O2094j100108j095726j20916O40830N23526r8325n45261
42662B970269o09483n76085o92012p32164k42709O85227J207060P04161k79159
42653B435105o76529l22027J2764m2655j1024L30735L89783j79661p02222m70696
42643G63573J77483N36438O61296R29197J005277L32260o43365q92654l94900
42634B474605j51778m79467m87219L04853R64986N53857l35566m41202K87952
42625B691021P41217L84222r2525j040L55597L22913j04117m39360m95142m77712
$$ y = [-288541, 14612, 229278, 476134, 706127, 1040861, 1823824, 3017682, 3998876, 4273011, 4050793, 3863790, 3952509, 4246892, 4552640, 4510894, 3825658, 2877023, 2652156, 3568956, 4704155, 4766249, 3666141, 2570415, 2449499, 3090329, 3613855, 3515530, 2970269, 2360786, 1784701, 1092689, 360525, 117816, 803043, 2010103, 2714264, 2435105, 1758576, 1436549, 1449313, 1406658, 1395634, 1726369, 2116152, 1936491, 1234269, 763573, 941056, 1477494, 2138790, 3067987, 4073264, 4405524, 3762159, 2869505, 2474605, 2322827, 1843360, 1356141, 1660994, 2625980, 3179837, 2844271, 2403069, 2691021, 3432238, 3816460, 3723935, 3722895, 4078492, 4401405, 4297288, 3857928, 3362786, 2885074]
42615B885074m50245k16402J99034L67081o994n82032p22316l11125O6002j12140
42605A115937n74021n89945K0496N89316M80902l8545j77934K62687O08238K52102
42595A949233n01646q30108m11201K87319O73695O59668N48935N46669N57063
42586C479627L95672Q5193r0580J31671O16002Q31038L95136m22995r39226p84685
42576C696853k00931L85558P96238J018197R94193P17190L45358K0528k73945
42567G499239n23654n83986m81560n33756q33664q83964k36260O55835Q32960
42558D911190J36201m94144k86722L24440L76284k76118q68229q71016o28913
42549B322973o70993q42318n45256L10212J058600J097569N96572J29875r3229
$$ y = [2885074, 2434829, 2218427, 2417461, 2784542, 2777548, 2195516, 1473200, 1162075, 1228077, 1115937, 541916, -48029, -27533, 561783, 1042685, 1004140, 826206, 1088893, 1697131, 1949233, 1447587, 617479, 206278, 493597, 1167292, 1826960, 2375895, 2922564, 3479627, 3875299, 3960492, 3869912, 4001583, 4617585, 5448623, 5843759, 5420764, 4481538, 3696853, 3495922, 3881480, 4677718, 5695915, 6690108, 7407298, 7752656, 7773184, 7499239, 6975585, 6391599, 5910039, 5376283, 4542619, 3658655, 3422395, 4078230, 4911190, 5047391, 4553247, 4266525, 4590965, 4967249, 4691131, 3822902, 2951886, 2322973, 1651980, 809662, 264406, 574618, 1633218, 2730787, 3327359, 3457234, 3364005]
42540C364005j99570p1584N42066J294605J372600O81373J71298M31312O56961
42531H243066j40570j441433j823003r99739p6713K24416L54322O89110P24059
42522E753515R7737n93554p08376m59455k34255J36424O68454O48685k62656j101840
42512C944679q80152j71740j98821q28396q74525j35529L60995J82264J02184
42503A500959N86842R90207P49731K49927m4454k95266n89449n27786j00363K3313
42493B543661k76804j18347P87702J203354J79701j151972j057340J83158P57226
42484C050339J14852m48450j10373K96116Q935k54392L76703J257115J086917
42475E377762j36880j162671j229283p69979m18478k21207j8038J36094K55462
$$ y = [3364005, 3164435, 3092851, 3634917, 4929522, 6302122, 6983495, 7154793, 7586105, 8243066, 8102496, 6661063, 4838060, 3838321, 3761608, 3986024, 4340346, 5029456, 5753515, 5851252, 5257698, 4549322, 4089867, 3855612, 3992036, 4660490, 5309175, 5046519, 3944679, 3064527, 2892787, 2693966, 1865570, 991045, 855516, 1216511, 1398775, 1500959, 2087801, 3078008, 3827739, 4077666, 4033212, 3737946, 3148497, 2620711, 2520348, 2543661, 2266857, 2148510, 2936212, 4139566, 4319267, 3167295, 2109955, 2293113, 3050339, 3165191, 2716741, 2606368, 2902484, 2911419, 2657027, 3033730, 4290845, 5377762, 5240882, 4078211, 2848928, 2078949, 1660471, 1439264, 1421226, 1557320, 1812782]
42466A812782N72084J017988R98449J63254q62249j053059k34463P27180J039489
42457D181455Q04353N15820K29111k84203q29614q72487l61633Q1910N731k84360
42447C186083k65464L3195J80897K9487j55662j45602K984R2524n9809m84249
42437B414384q37480n55637L83873J085720O98340l41718p31676p7361N42951
42428B581396K00457m54248j87061Q47268J197205K34480q39854o32705N25662
42419C472600J107434M88779l76917m54500L6024K22059n9232j88621J39485M47671
42409D834782K61351j42506j29213L78014P34509L40957o17999j287141r74936
42400C397818J28168J080829J080338K09768p19659r80927n11958J73519M67430
$$ y = [1812782, 2384866, 3402854, 4401303, 4564557, 3702308, 2649249, 2414786, 3141966, 4181455, 4985808, 5501628, 5730739, 5446536, 4616922, 3744435, 3382802, 3464712, 3470443, 3186083, 2920619, 2953814, 3134711, 3164198, 3008536, 2862934, 2865918, 2958442, 2898633, 2414384, 1576904, 1021267, 1405140, 2490860, 3189200, 2847482, 2115806, 2038445, 2581396, 2781853, 2327605, 2140544, 2987812, 4185017, 4419497, 3579643, 2946938, 3472600, 4580034, 5068813, 4691896, 4237396, 4273420, 4495479, 4436247, 4247626, 4387111, 4834782, 5096133, 4953627, 4824414, 5202428, 5936937, 6277894, 5659895, 4372754, 3397818, 3525986, 4606815, 5687153, 5896921, 5177262, 4196335, 3684377, 3857896, 4325326]
42391D325326J41516m49625o79577l30275J54642L05179K84577M98354P38497
42382D988614L75725n42078j095840p03687Q2763M09594K18761J556q4097k09136
42372C442175k82212k6846M75733Q71930J050612J083208Q34682J98499m51686
42363G196095o74451o76335r09034j088233n11757N90010J024218L01915n76487
42354D675941n36201J58803N65417M47170J92689j26967o78700j104465p75394
42345B818293J85912R06672Q83457M70911J75723Q6415J34813L05778L61636p7328
42335F252282q75418j290713q87989j39743K27860J06888j48907l64412n31978
42326B347870m52071K9647N51841N73118J66095n7756J25202K37890j10663o25598
$$ y = [4325326, 4466842, 4017217, 3337640, 3007365, 3162007, 3467186, 3751763, 4250117, 4988614, 5364339, 4822261, 3726421, 3022734, 3105497, 3515091, 3733852, 3735408, 3651311, 3442175, 3159963, 3133117, 3608850, 4480780, 5531392, 6614600, 7449282, 7647781, 7196095, 6521644, 5845309, 4936275, 3848042, 3336285, 3926295, 4950513, 5252428, 4675941, 4139740, 4298543, 4863960, 5311130, 5503819, 5376852, 4698152, 3593687, 2818293, 3004205, 3910877, 4794334, 5265245, 5440968, 5527383, 5662196, 5967974, 6329610, 6252282, 5376864, 4086151, 3198162, 3058419, 3286279, 3393167, 3244260, 2879848, 2347870, 1895799, 1925446, 2477287, 3050405, 3216500, 3158744, 3283946, 3521836, 3411173, 2785575]
42316B785575q00337n80455k13025K15675O78903R13975P07248L42641L07197
42307D357397O01130P72340O17524L85471K21963r5592o54046j044103q38381
42298D323703k06871K44851J56368k58308m91855k48791K62685N32345L39489
42289D653616L5169K1805J57857J10447R4173N42755J069238O93210n81132j381775
42279E415363p93396L10734O34446L76662O06666J245376J093344j83785j430264
42270G275146j604773r03544K968P84724J124008O34730l36354p61439l81493
42261E833973j92474p97351j233059m28243R34112J226140J58228r39609j035831
42252C525886n31705l15175n24731o01856j16670P06533J139606P16695l2373
$$ y = [2785575, 1985238, 1404783, 1191758, 1407433, 2086336, 3000311, 3707559, 4050200, 4357397, 4958527, 5730867, 6348391, 6733862, 6955825, 6860233, 6206187, 5162084, 4323703, 4116832, 4361683, 4518051, 4259743, 3767888, 3519097, 3781782, 4314127, 4653616, 4688785, 4710590, 4868447, 4978894, 5073067, 5615822, 6685060, 7378270, 6797138, 5415363, 4621967, 4932701, 5567147, 5943809, 6550475, 7795851, 8889195, 8705410, 7275146, 5670373, 4766829, 4769797, 5554521, 6678529, 7313259, 6976905, 6215466, 5833973, 5641499, 4844148, 3611089, 3182846, 4116958, 5343098, 5501326, 4561717, 3525886, 2994181, 2679006, 2154275, 1552419, 1435749, 2142282, 3281888, 3998583, 3966210]
42243C966210l5084Q35409J354865O42043m25231m70996K42918K66812o47697
42234E729249j123322l96734M80717L93712j12665R0913P70030P02136l55779
42225F178257j252474j063407k20618K71745J38287o0621J64498O04307O66431
42216E426405J60377m07649m33043J3253K72753m8075o40889j006672j051482
42207B284978r41805o57899n3392P21215J164775R03839J51476l94105k10799
42198B968283M47017P79020M06626j31919j37708K65121L87230N7717j64107J09200
42188D986480N65879P01758L47196m08221j264412j586342q91789L23795R24744
42179C699088N75429J27512K23036L51625j03823o89229o07047k8559K77108K24266
$$ y = [3966210, 3931126, 4766535, 6121400, 6763443, 6338212, 5867216, 6110134, 6376946, 5729249, 4605927, 4209193, 4689910, 5083622, 4970957, 5061870, 5831900, 6534036, 6178257, 4925783, 3862376, 3641758, 3913503, 4051790, 3991169, 4155667, 4759974, 5426405, 5586782, 5179133, 4746090, 4759343, 5032096, 4984021, 4343132, 3336460, 2284978, 1343173, 685274, 631882, 1353097, 2517872, 3421711, 3573187, 3179082, 2968283, 3415300, 4194320, 4600946, 4469027, 4331319, 4596440, 4983670, 5041387, 4877280, 4986480, 5552359, 6254117, 6601313, 6193092, 4928680, 3342338, 2450549, 2774344, 3699088, 4274517, 4402029, 4625065, 4976690, 4872867, 4183638, 3576591, 3548032, 3825140, 4049406]
42169D049406L35633O29515N87493J81257p755K14383L53840O1944m55992r78331
42159D971393j472907j607136q47346N97261J593655J326583L01880k94814M3261
42150D611830P29709Q32055N4460q96290r65315J2315R39498P45118k25607p69775
42140E067998n44435k88996l54511j54998N51920R36935L50393n51821p55785
42131D256700l26913o1085j95223l26811k77859k19251j60896l4984m8560k67205
42121B337913j58577O45105J405818J053434k01792j012037p05043J888K76164
42112C642873K04000K05675K89432L69388N88633Q02182M21128o11157j290453
42103D621701p41314M86183J079194O56941L0550j15445j5741j68808n21521o17848
$$ y = [4049406, 4385039, 5014554, 5602047, 5783304, 5775549, 5989932, 6343772, 6405716, 5949724, 4971393, 3498486, 1891350, 1044004, 1641265, 3234920, 4561503, 4863383, 4568569, 4611830, 5341539, 6173594, 6228054, 5331764, 4366449, 4378764, 5318262, 6063380, 5837773, 5067998, 4523563, 4234567, 3880056, 3725058, 4276978, 5213913, 5564306, 5012485, 4256700, 3929787, 3868702, 3673479, 3346668, 3068809, 2849558, 2688662, 2653678, 2605118, 2337913, 2179336, 2824441, 4230259, 5283693, 5081901, 4069864, 3364821, 3366709, 3642873, 3846873, 4052548, 4341980, 4711368, 5300001, 6102183, 6523311, 5912154, 4621701, 3880387, 4366570, 5445764, 6102705, 6133255, 6017810, 6002069, 5833261, 5311740, 4693892]
42093D693892k33666L71339O94160M28907j94141n61951l41317J36668L70981
42084E364872L56721L97654M60066K44393j62514l02459j03670m0488l30561n38336
42074E345678l05084M9999J02620L7645K19204L93147J3487p73758j173162q13088
42064C096688j61505K57210M73723O72531P31297N35260L35552L63328L73449
42055F677533J4896n11142n83592P5866J040248J539221J054010k33516j374921
42046G698603j334727j06022J076838J058655J04609n50946l11121K48431M09899
42037H294219J78777o9816j99326k33214j16045J08203K17318J78292K42659M23010
42027I024077K95495l17072q66034p52437j86999J32921Pj84256j64700j55764
$$ y = [4693892, 4460226, 4831565, 5525725, 5954632, 5760491, 5198540, 4857223, 4993891, 5364872, 5721593, 6119247, 6579313, 6823706, 6661192, 6358733, 6255063, 6214575, 5884014, 5345678, 5040594, 5090593, 5193213, 5230858, 5450062, 5843209, 5856696, 5082938, 3909776, 3096688, 2935183, 3192393, 3666116, 4338647, 5069944, 5605204, 5940756, 6304084, 6677533, 6692429, 6181287, 5597695, 5673561, 6713809, 8253030, 9307040, 9073524, 7698603, 6363876, 6257854, 7334692, 8393347, 8497956, 7947010, 7635889, 7884320, 8294219, 8472996, 8403180, 8203854, 7970640, 7854595, 7962798, 8180116, 8358408, 8601067, 9024077, 9319572, 9002500, 8136466, 7384029, 7197030, 7329951, 7329958, 7145702, 6981002, 6825238]
42017F825238l47988n37101m11878M7701N75210Q60107P48558L31046j61858n85769
42007G343266q86335q81069l69983L84196O93092K85014k51499k60842J11956
41998F167796L31605L50499M08019K86110l63795j074272q97599J85502J077197
41989F471062J039318N23045J70587j52204p38683j176112q70310j4322O70228
41980E922609Q74849P71222M16271k23553p81352o86863R2408R85572J534837
41971H906000J780790J906848J865228J442723N03376p88076j835790j948144
41963A1832955j123181k63322j80275n80749n53818Q2162N72164M06077L7057
41954A0229070J41011O78491J093053J119646R90494R90795J136295J233121J034847
$$ y = [6825238, 6477250, 5940149, 5528271, 5575972, 6151182, 7011289, 7759847, 8090893, 7929035, 7343266, 6456931, 5575862, 5205879, 5590075, 6283167, 6568181, 6316682, 6055840, 6167796, 6499401, 6849900, 7257919, 7544029, 7180234, 6105962, 5208363, 5393865, 6471062, 7510380, 8033425, 8204012, 8051808, 7313125, 6137013, 5266703, 5252381, 5922609, 6797458, 7568680, 7984951, 7761398, 6980046, 6293183, 6385591, 7371163, 8906000, 10686790, 12593638, 14458866, 15901589, 16404965, 15616889, 13781099, 11832955, 10709774, 10446452, 10266177, 9685428, 9131610, 9213772, 9785936, 10192013, 10229070, 10370081, 11048572, 12141625, 13261271, 14251765, 15242560, 16378855, 17611976, 18646823]
41945A8646823L95321n44634j354998j666389j530810j325110j301391j357700
41937I961112j294086j150502j104576j061954o37410K54285J020734R96297L51538
41928G335438p9854L4129P6322n03097j240104j276884o17178j03388j97400m06578
41918C021406r2910O03083R43270N11408k57816m78824K30806J202374J346457
41909G029254M49103m95692n27541R3697M30832K44608Q2163J34098q5742p00413
41899F654367r52906k74085O94281Q18558k8378q11536o73197P3755M80347J77661
41889F158867k73976k35565J41495K08435j46023k75248K14780P66538O67299
41880G226602J32284r3453K6524j86762q91052j338540r92561l00395M2903J6600
$$ y = [18646823, 19042144, 18497510, 17142512, 15476123, 13945313, 12620203, 11318812, 9961112, 8667026, 7516524, 6411948, 5349994, 4712584, 4966869, 5987603, 6983900, 7335438, 7255584, 7289713, 7366035, 6862938, 5622834, 4345950, 3728772, 3625384, 3427984, 3021406, 2928496, 3531579, 4474849, 4986257, 4728441, 4249617, 4480423, 5682797, 7029254, 7478357, 6982665, 6455124, 6548821, 6979653, 7224261, 7306424, 7440522, 7354780, 6654367, 5701461, 5427376, 6121657, 6940215, 6911837, 6100301, 5427104, 5500859, 5981206, 6158867, 5884891, 5649326, 5790821, 5999256, 5853233, 5577985, 5792765, 6559303, 7226602, 7358886, 7265433, 7291957, 7105195, 6214143, 4875603, 3883042, 3582647, 3625550, 3642150]
41870C642150K0652J73927L27857M31975M70642L06992p2145m04716m98715m42509
41860C956110k87837P5300N09984N90127K81990J58276N33503Q99434P09821K26661
41850G653369m067o0620l31961o61665n84898j98221o345j3473K42565P37737
41840F772421Q08881J23494q13939j332018j286094r27791n26527k66759j38699
41831B412969J50504P71989J274106R84727k182p71181o90529p6051M54892P51309
41821E260553Q97369P16239P9347n30768l89471M67164J069974O06564n48920
41812G628051j221747q36149r4654m4077p19589j161273p39369P3285M51235K48746
41802C584459q7061k53946k77078j84545M1915K94382M41948M85741M07841J34967
$$ y = [3642150, 3662802, 3836729, 4164586, 4596561, 5067203, 5374195, 5302050, 4897334, 4398619, 3956110, 3668273, 3743573, 4253557, 4843684, 5125674, 5283950, 5817453, 6716887, 7426708, 7653369, 7649302, 7588682, 7256721, 6595056, 6010158, 5811937, 5805592, 5792119, 6034684, 6772421, 7581302, 7704796, 6890857, 5558839, 4272745, 3344954, 2818427, 2551668, 2412969, 2563473, 3335462, 4609568, 5594295, 5592113, 4820932, 4130403, 4054352, 4509244, 5260553, 6157922, 6874161, 6953508, 6422740, 6033269, 6500433, 7570407, 8176971, 7628051, 6406304, 5570155, 5475501, 5431424, 4711835, 3550562, 2811193, 2884478, 3335713, 3584459, 3497398, 3243452, 2966374, 2781829, 2823744, 3118126, 3560074, 4045815, 4453656, 4588623]
41792D588623j47224p5086K22743J26735l82373l98139M33834R50379J06388j117545
41782D308335r39014M64426J147909L84945l73943p33O52274N14714J14930L40189
41772F614032O63915J54863o52004n55899J85211K26250n69940q84710j43787
41763E037931O11591N55877L86333R42120J577056J049566m92024j538283j175509
41754F954658j21129M11300K19102N7786M53939J099320J393385J153816O35595
41745A2257772J63197l1174J26212L64650K20201k71573l62585L76512J117936
41736A3961148O89435o77143j490573j052648l27068l33568p13105o29849k15127
41727I211502j38990l71350m10944l20964m84849o17653j05768P83058J090931
$$ y = [4588623, 4441399, 4366313, 4589056, 4715791, 4333418, 3935279, 4369113, 5319492, 5425880, 4308335, 3369321, 3833747, 4981656, 5366601, 4992658, 4991925, 5644199, 6158913, 6273843, 6614032, 7277947, 7432810, 6780806, 6224907, 6410118, 6636368, 6066428, 5181718, 5037931, 5649522, 6205399, 6591732, 7533852, 9110908, 10160474, 9668450, 8130167, 6954658, 6833529, 7244829, 7463931, 7521717, 7975656, 9074976, 10468361, 11622177, 12257772, 12420969, 12389795, 12516007, 12880657, 13100858, 12829285, 12466700, 12843212, 13961148, 14650583, 13973440, 12482867, 11430219, 11103151, 10769583, 10056478, 9426629, 9211502, 9072512, 8701162, 8290218, 7969254, 7484405, 6866752, 6760984, 7544042, 8634973]
41718H634973O02134Q6269L282k4223k01675m9764O04775R92941M41759n44408
41708A0546063r47088o09780k77105m23733o50204l22138N65496J340559J374350
41699A0596420P54691J63609N8804J71001J5405l20009l05223J94553O79481O78440
41689A2687172K43239l28266q69400j261099j301789r24954l97592j24170k90083
41680G433058p05438r37598p00604k22258k7557j96602j77160L32933P31671L38959
41670E869404m33895n47816J18479N75286K32182k67861j29620M13643O05893
41661F435695L71448L32201P96805J306400J259378O64233J18278J00961L94770
41652A1780169L72476r8944l72762O1221P04609O27122k65158j146709j388435
$$ y = [8634973, 9237107, 9323376, 9326658, 9302435, 9100760, 9050996, 9655771, 10648712, 11090471, 10546063, 9598975, 8989195, 8712090, 8288357, 7638153, 7316015, 7881511, 9222070, 10596420, 11351111, 11514720, 11573524, 11744525, 11759930, 11439921, 11134698, 11329251, 12008732, 12687172, 12930411, 12602145, 11732745, 10471646, 9169857, 8244903, 7847311, 7723141, 7433058, 6727620, 5790022, 5089418, 4867160, 4839603, 4643001, 4465841, 4798774, 5530445, 5869404, 5435509, 4887693, 5006172, 5581458, 5813640, 5545779, 5416159, 5829802, 6435695, 6807143, 7139344, 7936149, 9242549, 10501927, 11166160, 11284438, 11385399, 11780169, 12152645, 12053701, 11680939, 11742160, 12446769, 13073891, 12808733, 11662024, 10273589]
41643A0273589j123744p04399k73746O924m1528k17247j29043Q2486j38543p67212
41633F967537j029129m92491L43161Q42975R67480R18112P38024N84541O99857
41624A0540067Q09140L48324l80306k77105P81818J323104K97697j244114j593639
41615A0604986o98694K09967O46430J045370J257330M88055j100794k120019j728856
41606H603775o52074O766Q2305K3300K1162j1293j30460m48473j076740j678764
41596D739504j574195o37916L37386N36615L8072m67150n34736k24568K14014
41587B427026N44198N58333J94645l42881o89844n73166k5584N67919P48007M46469
41577C855122N5893q4063m8516j2535Q6216K65663K42511j06269l46011n7967
$$ y = [10273589, 9149845, 8445446, 8171700, 8178624, 8137096, 7919849, 7790806, 7873292, 7734749, 6967537, 5938408, 5445917, 5789078, 6632053, 7599533, 8517645, 9255669, 9840210, 10540067, 11349207, 11697531, 11317225, 11040120, 11821938, 13145042, 13442739, 12198625, 10604986, 9906292, 10116259, 10762689, 11808059, 13065389, 13553444, 12452650, 10332631, 8603775, 7951701, 7958467, 8040772, 8064072, 8085234, 8073941, 7943481, 7495008, 6418268, 4739504, 3165309, 2527393, 2864779, 3401394, 3439466, 2972316, 2437580, 2213012, 2427026, 2971224, 3529557, 3724202, 3381321, 2691477, 2118311, 2092727, 2660646, 3408653, 3855122, 3911015, 3826952, 3778436, 3765901, 3852117, 4117780, 4360291, 4254022, 3908011, 3850044]
41567C850044M73833O91860N76655M11646Q5209n67180r90473m61413O36633J081526
41557E788340M63136l76319p15845p74292q38030n65370K83596J195474J549485
41548F010175J317722P10428j93755j029959j117435m15598J80117R2164q9562
41539E464297L12717Q51824O89346j5034l90863j67250J84927L27000K33741k08485
41529G282220r16697j185717m84128N00538N92526j79775o44233k64464K15091
41520D915361J05331l07984n66396p67193r34655n50413N53968J507620J399769
41511E355408N17553j38368j94237l4540P7733J98943J77985k57846q62138j020038
41501C820455o43765k87968k46576j84421J08595K61209J9341j71942J63415O87396
$$ y = [3850044, 4323877, 5015737, 5592392, 6004038, 6089247, 5522067, 4531594, 4070181, 4706814, 5788340, 6251476, 5875157, 5159312, 4385020, 3546990, 2981620, 3265216, 4460690, 6010175, 7327897, 8038325, 7844570, 6814611, 5697176, 5281578, 5461695, 5553859, 5464297, 5777014, 6628838, 7318184, 7303150, 6912287, 6745037, 6929964, 7256964, 7490705, 7282220, 6365523, 5179806, 4695678, 5196216, 5788742, 5608967, 4964734, 4700270, 4915361, 5020692, 4712708, 4146312, 3379119, 2444464, 1894051, 2448019, 3955639, 5355408, 5872961, 5734593, 5540356, 5505816, 5583549, 5782492, 5960477, 5702631, 4840493, 3820455, 3176690, 2888722, 2642146, 2457725, 2566320, 2827529, 2846870, 2674928, 2838343, 3525739]
41491C525739O86726J13972m29706o19800o68101o58125l00274M34429J006232
41482C091092R83301O22077M09491L49419J08267l43887o52026n60943j68829
41473C837962K60437M99550M20404O0100l80242o76448o51574j71217O29649J134590
41463D963211P66517j27246n05716n4840L15811p7451n15492m5364Q00591O86917
41453F206938l98656j051094n53823K45424N08958N85666R79598J262631R09676
41444H695318L99980N24905J143882J515135J454913J338818J264768R99605N41334
41435A7878658M9604n71717j390653j987358j924646j459362j160896j069601
$$ y = [3525739, 4212465, 4326437, 3896731, 3276931, 2608830, 1950705, 1650431, 2084860, 3091092, 4074393, 4696470, 5105961, 5455380, 5563647, 5219760, 4567734, 4006791, 3837962, 4098399, 4597949, 5018353, 5078453, 4698211, 4021763, 3370189, 3198972, 3828621, 4963211, 5729728, 5602482, 5096766, 5041926, 5357737, 5280286, 4764794, 4719430, 5520021, 6206938, 5808282, 4757188, 4203365, 4448789, 4957747, 5543413, 6523011, 7785642, 8695318, 9095298, 9620203, 10764085, 12279220, 13734133, 15072951, 16337719, 17337324, 17878658, 17928262, 17356545, 15965892, 13978534, 12053888, 10594526, 9433630, 8364029]
$$ [...]
##END NTUPLES=NMR SPECTRUM
##END=
