##TITLE=31P_DE-81K2_TFA
 64 sc cdcl3
 26.2.2025
##JCAMPDX= 6.0         $$ Bruker NMR JCAMP-DX V2.0
##DATA TYPE= NMR SPECTRUM
##DATA CLASS= NTUPLES
##ORIGIN= UXNMR, Bruker Analytische Messtechnik GmbH
##OWNER= root
$$ XWIN-NMR		Version 3.5
$$ Wed Feb 26 16:37:49 2025 Russian Standard Time (UT+4h)  new_Human@DPX200
##.OBSERVE FREQUENCY= 81.013821
##.OBSERVE NUCLEUS= ^31P
##.ACQUISITION MODE= SIMULTANEOUS
##.ACQUISITION SCHEME= undefined
##.AVERAGES= 64
##.DIGITISER RES= 17
##SPECTROMETER/DATA SYSTEM= spect
##.PULSE SEQUENCE= zgpg30
##.SOLVENT NAME= Acetone
##.SHIFT REFERENCE= (INTERNAL, Acetone, 0, 198.062)
##AUDIT TRAIL= $$ (NUMBER, WHEN, WHO, WHERE, WHAT)
$$ ##TITLE= Audit trail, XWIN-NMR		Version 3.5
$$ ##JCAMPDX= 5.01
$$ ##ORIGIN= Bruker BioSpin GmbH
$$ ##OWNER= new_Human
$$ C:/Bruker/XWIN-NMR/data/yarkov/nmr/P31/2/pdata/1/auditp.txt
$$ ##AUDIT TRAIL=  $$ (NUMBER, WHEN, WHO, WHERE, WHAT)
(   1,<2025-02-26 16:35:24.70 +0400>,<new_Human>,<DPX200>,
      <created by zg, POWCHK disabled, PULCHK disabled
       configuration hash MD5:
       00 E9 B6 7A A2 85 ED C7 34 08 36 98 17 FE 4E 26
       data hash MD5: 32K
       69 AD CB 06 E7 4F F0 A1 63 9A 59 07 5B 76 20 6C>)
(   2,<2025-02-26 16:36:18.57 +0400>,<new_Human>,<DPX200>,
      <Start of raw data processing
       efp BC_mod = 2 LB = 1.5 FT_mod = 6 PKNL = 1 PHC0 = 1805.438 PHC1 = 9.49542 SI = 64K 
       data hash MD5: 64K
       D7 59 6A 05 26 AB 1A C6 93 5E 59 D3 64 F3 72 AA>)
(   3,<2025-02-26 16:36:54.93 +0400>,<new_Human>,<DPX200>,
      <pk PHC0 = -7.750407 PHC1 = 6.2 
       data hash MD5: 64K
       8F 59 E6 20 49 49 F6 8C 35 80 B1 D5 60 F2 32 29>)
$$ ##END=
$$ 
$$ hash MD5
$$ F1 B4 B9 D8 B4 16 4C 16 2A 14 38 73 50 77 90 D0
##$RELAX= 
##$RELAX= 
##$RELAX= 
##$RELAX= 
##$RELAX= 
##$RELAX= 
##$RELAX= 
##$RELAX= 
$$ Bruker specific parameters
$$ --------------------------
##$DU= <C:/Bruker/XWIN-NMR>
##$EXPNO= 2
##$NAME= <P31>
##$PROCNO= 1
##$TYPE= <nmr>
##$USER= <yarkov>
##$AMP= (0..31)
100 100 100 100 100 100 100 100 100 100 100 100 100 100 100 100 100 100 
100 100 100 100 100 100 100 100 100 100 100 100 100 100 
##$AQSEQ= 0
##$AQ_mod= 1
##$AUNM= <au_zg>
##$AUTOPOS= <>
##$BF1= 81.014009
##$BF2= 200.13
##$BF3= 200.13
##$BF4= 200.13
##$BF5= 200.13
##$BF6= 200.13
##$BF7= 200.13
##$BF8= 200.13
##$BYTORDA= 1
##$CFDGTYP= 0
##$CFRGTYP= 5
##$CHEMSTR= <none>
##$CNST= (0..31)
1 1 145 1 1 1 1 1 1 1 1 1 1 1 1 1 1 1 1 1 1 1 1 1 1 1 1 1 1 1 1 1 
##$CPDPRG= <waltz16>
##$CPDPRG1= <>
##$CPDPRG2= <waltz16>
##$CPDPRG3= <>
##$CPDPRG4= <mlev>
##$CPDPRG5= <mlev>
##$CPDPRG6= <mlev>
##$CPDPRG7= <mlev>
##$CPDPRG8= <mlev>
##$CPDPRGB= <>
##$CPDPRGT= <>
##$D= (0..31)
0 1 0 0 0 0 0 0 0 0.06 0 0.03 2e-05 3e-06 0 0 0.0002 0 0 0 0 0 0 0 0 0 
0 0 0 0 0 0 
##$DATE= 1740573324
##$DBL= (0..7)
120 120 120 11 120 120 24 19 
##$DBP= (0..7)
150 150 150 150 150 150 150 150 
##$DBP07= 0
##$DBPNAM0= <>
##$DBPNAM1= <>
##$DBPNAM2= <>
##$DBPNAM3= <>
##$DBPNAM4= <>
##$DBPNAM5= <>
##$DBPNAM6= <>
##$DBPNAM7= <>
##$DBPOAL= (0..7)
$$ [...]
##$SUBNAM3= <"">
##$SUBNAM4= <"">
##$SUBNAM5= <"">
##$SUBNAM6= <"">
##$SUBNAM7= <"">
##$SUBNAM8= <"">
##$SUBNAM9= <"">
##$SW= 400.765351723535
##$SWIBOX= (0..15)
0 1 3 0 0 0 0 0 0 0 0 0 0 0 0 0 
##$SW_h= 32467.5324675325
##$TD= 32768
##$TD0= 1
##$TE= 0
##$TE2= 300
##$TE3= 300
##$TEG= 300
##$TL= (0..7)
0 120 53 12 22 120 120 120 
##$TP= (0..7)
150 150 150 150 150 150 150 150 
##$TP07= 0
##$TPNAME0= <>
##$TPNAME1= <>
##$TPNAME2= <>
##$TPNAME3= <>
##$TPNAME4= <>
##$TPNAME5= <>
##$TPNAME6= <>
##$TPNAME7= <>
##$TPOAL= (0..7)
0.5 0.5 0.5 0.5 0.5 0.5 0.5 0.5 
##$TPOFFS= (0..7)
0 0 0 0 0 0 0 0 
##$TUNHIN= 0
##$TUNHOUT= 0
##$TUNXOUT= 0
##$USERA1= <user>
##$USERA2= <user>
##$USERA3= <user>
##$USERA4= <user>
##$USERA5= <user>
##$V9= 5
##$VALIST= <valist>
##$VCLIST= <CCCCCCCCCCCCCCC>
##$VD= 0
##$VDLIST= <DDDDDDDDDDDDDDD>
##$VPLIST= <PPPPPPPPPPPPPPP>
##$VTLIST= <TTTTTTTTTTTTTTT>
##$WBST= 1024
##$WBSW= 4
##$XGAIN= (0..3)
0 0 0 0 
##$XL= 0
##$YL= 0
##$YMAX_a= 17881
##$YMIN_a= -15593
##$ZGOPTNS= <>
##$ZL1= 120
##$ZL2= 120
##$ZL3= 120
##$ZL4= 120
##$ABSF1= 0
##$ABSF2= 0
##$ABSG= 0
##$ABSL= 0
##$ALPHA= 0
##$AQORDER= 0
##$ASSFAC= 0
##$ASSFACI= 0
##$ASSFACX= 0
##$ASSWID= 0
##$AUNMP= <proc_1d>
##$AZFE= 0.1
##$AZFW= 0.5
##$BCFW= 0
##$BC_mod= 2
##$BYTORDP= 0
##$COROFFS= 0
##$CY= -3
##$DATMOD= 1
##$DC= 0
##$DFILT= <>
##$DTYPP= 0
##$F1P= 0
##$F2P= 0
##$FCOR= 1
##$FTSIZE= 65536
##$FT_mod= 6
##$GAMMA= 0
##$GB= 0
##$INTBC= 1
##$INTSCL= 9.790993e-09
##$ISEN= 30
##$LB= 1.5
##$LEV0= 0
##$LPBIN= 0
##$MAXI= 10000
##$MC2= 0
##$MEAN= 0
##$ME_mod= 0
##$MI= 50
##$NCOEF= 0
##$NC_proc= -9
##$NLEV= 6
##$NOISF1= 182.463
##$NOISF2= 159.3651
##$NSP= 0
##$NTH_PI= 0
##$NZP= 0
##$OFFSET= 198.0616
##$PC= 4
##$PHC0= 1797.688
##$PHC1= 15.69542
##$PH_mod= 1
##$PKNL= yes
##$PPARMOD= 0
##$PSCAL= 0
##$PSIGN= 0
##$REVERSE= no
##$SF= 81.0140089999434
##$SI= 65536
##$SIGF1= 159.3651
##$SIGF2= -187.1042
##$SINO= 113.3802
##$SIOLD= 16384
##$SREGLST= <1H.CDCl3>
##$SSB= 0
##$STSI= 65536
##$STSR= 0
##$SW_p= 32467.5324675325
##$SYMM= 0
##$S_DEV= 0
##$TDeff= 32768
##$TDoff= 0
##$TI= <>
##$TILT= no
##$TM1= 0
##$TM2= 0
##$TOPLEV= 0
##$USERP1= <user>
##$USERP2= <user>
##$USERP3= <user>
##$USERP4= <user>
##$USERP5= <user>
##$WDW= 1
##$XDIM= 65536
##$YMAX_p= 390637503
##$YMIN_p= -272811176
$$ End of Bruker specific parameters
$$ ---------------------------------
##NTUPLES= NMR SPECTRUM
##VAR_NAME=  FREQUENCY,     SPECTRUM/REAL,   SPECTRUM/IMAG
##SYMBOL=    X,             R,               I
##VAR_TYPE=  INDEPENDENT,   DEPENDENT,       DEPENDENT
##VAR_FORM=  AFFN,          ASDF,            ASDF
##VAR_DIM=   65536,         65536,           65536
##UNITS=     HZ,            ARBITRARY UNITS, ARBITRARY UNITS
##FACTOR=    0.49542278885378, 1,            1
##FIRST=     16045.7642231865, 0,            0
##LAST=      -16421.768244346, 0,            0
##MIN=       -16421.768244346, -272811176,   0
##MAX=       16045.7642231865, 390637503,    0
$$ Real data points
##PAGE= N=1
##DATA TABLE= (X++(R..R)), XYDATA
$$ [...]
47479 -4979626 -9429347 -17589019 -21045717 -12303666 4038450 15584630 16621140 12572290
47471 12572290 10430076 10919592 11373545 10777509 9320222 6818163 3969293 2214296
47463 2214296 955226 -1567979 -3390516 471009 9728585 15924575 12190840 2635401
47455 2635401 -2695163 84719 6236402 9988773 9413587 5019073 -742687 -2543995
47447 -2543995 3497895 13284229 17646053 13633878 7929949 6532641 6497663 2459075
47439 2459075 -3281828 -3918270 693501 3319629 285720 -3636010 -3699788 -2470164 -4133219
47430 -4133219 -6133931 -2863958 4259311 7188577 2346217 -4603805 -7184843 -5991043
47422 -5991043 -4600885 -2321370 3282452 9042561 7977154 -1065617 -10891476 -14797857
47414 -14797857 -13608054 -11619114 -9615743 -5804006 -1321915 -164980 -3351684 -6348764
47406 -6348764 -3728840 4828005 14103717 18572658 17698041 15883649 17116625 20396659
47398 20396659 21445309 18159092 12439116 6927757 2637148 542827 2672382 9434682
47390 9434682 17260485 20826315 17371341 8572718 -565627 -4740272 -2673213 923367
47382 923367 131152 -4884228 -8474611 -8088414 -7852373 -11380453 -15581035 -15426170 -11195881
47373 -11195881 -6619560 -2957944 360540 2160497 1911971 3136753 8549034 14056627
47365 14056627 14239427 11861005 13938955 19119300 18248536 9044013 812858 693702
47357 693702 3695990 2182976 -1847176 -1277689 4260420 8879111 10187242 11329207
47349 11329207 14236206 16970173 17751208 16677743 13297266 6759495 -1222399 -7159760
47341 -7159760 -10024355 -11933147 -14562482 -17385536 -19255717 -19389470 -17230931 -13582289
47333 -13582289 -11012464 -10580404 -9081578 -2611698 7495740 15245185 16631635 13393982
47325 13393982 10132445 9798231 12112800 14786892 16242545 17765889 21737263 27078569
47317 27078569 29137193 25929720 21378110 19474426 18686891 16379703 15250483 18982053
47309 18982053 23505478 20474369 10186052 3578117 8403913 19371997 25984349 25472718
47301 25472718 23090916 22626959 22117720 18538333 12493991 7027835 3856822 2067212
47293 2067212 23128 -2164525 -2523526 409050 5858299 11688530 15677797 15549641
47285 15549641 10351237 3490616 1288985 5259144 8671867 5260608 -1179055 -1786785
47277 -1786785 4315152 9176908 8463125 6991496 9374886 12207894 9884432 2929120
47269 2929120 -4031125 -8565118 -10476512 -9095882 -4715606 87881 3885733 7849553
47261 7849553 10756347 7292464 -3734002 -13700833 -13114449 -3854493 3666758 3875170
47253 3875170 346316 -2162527 -3232877 -3684085 -2908685 -1283625 -1126282 -3458636 -6534343
47244 -6534343 -8156107 -6846023 -1198116 8297712 16933862 19276734 15458478 10506993
47236 10506993 7344799 4407453 476830 -2646494 -3561662 -3389211 -2995412 -1660308
47228 -1660308 70644 -254081 -3125772 -5732203 -5971526 -4864069 -4052581 -4405992 -7701230
47219 -7701230 -14755936 -20253106 -15428292 115731 14498145 16984462 11369215 9373503
47211 9373503 13401429 14125444 5734121 -4424449 -5435742 3105943 11879096 14383536
47203 14383536 13402213 14650694 18540121 21179035 21364594 22433209 26396331 29706993
47195 29706993 27672618 21131482 15127703 11728463 8385659 3973189 1868808 4649373
47187 4649373 9387676 11584563 11270699 11627564 13265251 13625098 11346214 7912199 5096584
47178 5096584 3334832 2394110 1606798 293343 138962 5526794 18008951 31397360
47170 31397360 36528367 31189063 21738951 14703199 10825753 8229901 6827193 7043971
47162 7043971 7547006 7151557 6772283 7156187 6891376 5073849 3868365 5701439 9395466
47153 9395466 11537427 10410711 6543644 1136464 -3590522 -4316472 -21476 5596912
47145 5596912 7830513 5901758 1747572 -3840432 -9918368 -12346854 -7708689 167094
47137 167094 3586423 1726813 1847866 7684682 13003560 10867299 3943651 -91690
47129 -91690 347114 716695 -661414 -361096 3339438 7286015 8459966 7729319 7082649
47120 7082649 6758261 6689351 7774267 10125551 12280165 13057715 12180554 9082709 3953301
47111 3953301 -187874 -152011 2484811 3418397 3056833 6366179 13394064 16285420 10115447
47102 10115447 1295420 -960497 2253376 2165718 -3841342 -8825824 -7304392 -2718108
47094 -2718108 -1448749 -4776817 -10034336 -15570421 -20463911 -21680236 -15865668 -4123001
47086 -4123001 7412711 12534151 10045237 4252312 814937 1629687 3527124 2266002
47078 2266002 -2613683 -7522989 -8504627 -3967608 5152264 15781484 23597870 25838999
47070 25838999 23702263 20588207 18215582 16180460 14815203 15814192 19409768 22995229
47062 22995229 23584866 20720688 16815591 15370146 17993932 21899436 21802626 16370993
47054 16370993 10950753 10816086 13705197 13588024 10287488 8945574 9587742 4749205
47046 4749205 -8911261 -22756397 -25555423 -17172298 -7246214 -2245251 430966 5638876
47038 5638876 12954828 17865365 17789901 14918994 13609393 15624015 18122854 16861884
47030 16861884 11080964 3882962 -1802776 -5102507 -4971398 201014 8934191 15793050
47022 15793050 16906051 14220428 11898099 10660053 8361462 4264404 -178457 -3571347
47014 -3571347 -5227211 -4738343 -2751324 -671513 1856782 6778308 13119491 15812120
47006 15812120 11977074 5543896 2148420 2034686 1923078 1541069 3701163 9194637
46998 9194637 15610586 20054083 19747151 12233634 -738778 -11741768 -14912496 -12831118
46990 -12831118 -11502144 -11314885 -9123321 -6293389 -6230559 -5384162 3236099 16523221
46982 16523221 21594859 13347918 2361184 -204251 2641297 1139061 -5832422 -11531680
46974 -11531680 -13383483 -15165899 -18400786 -19284352 -14854439 -6859772 910140 5045418
46966 5045418 2938524 -4534393 -10997857 -9948810 -2578764 3789737 5140690 4078121
46958 4078121 3185587 555448 -5272574 -10280257 -9372419 -3951777 -737293 -2960921
46950 -2960921 -6390121 -5690607 -2048396 -1261983 -4910473 -7300352 -3250117 3772982
46942 3772982 4936288 -3228404 -14874957 -21900158 -21704435 -17171144 -12251399 -9166181
46934 -9166181 -7343293 -3661371 3710193 10734159 10477309 2670745 -3857854 -1882987
46926 -1882987 4585337 5913685 -560388 -8792352 -13110288 -12922156 -8616168 480527
46918 480527 11570316 17248933 13449665 5972606 4716053 11937143 19706956 19538910
46910 19538910 11649139 2996148 -1639619 -3281674 -3800508 -1673048 4470520 11022646
46902 11022646 12766530 10217992 8829176 10678009 12124658 11064905 10948748 14626735
46894 14626735 19263798 21404681 22649310 25546670 27855042 26405358 23236578 21781062
46886 21781062 20060302 14763997 9555129 10802576 16016831 15904659 8992466 4641984
46878 4641984 8266224 12694884 9907590 3710099 3121798 8279987 11247105 8357120
46870 8357120 3886662 1802649 666041 -1934387 -4945580 -5911943 -4367570 -1572747
46862 -1572747 1201197 3336957 5318720 8604675 13547434 17771419 18347581 15214564
46854 15214564 10795427 7010493 4761757 5376818 9416376 14053384 14917989 11515829
46846 11515829 7998424 7224007 6937397 4192619 1067910 2085731 6535607 7599679
46838 7599679 829503 -9473100 -15077214 -13271773 -8277394 -4169903 -643127 3258898
46830 3258898 5582848 4851416 4109468 7376726 13319895 16709286 16000595 15292446 17985686
46821 17985686 22484379 25860424 28127796 30141270 29975678 24900888 15896026 7275095
46813 7275095 2029038 -404838 -1973499 -3568126 -4963923 -5666829 -5187297 -3181615
46805 -3181615 157052 3886753 6578398 7100320 5584229 3340890 1219197 -1458886
46797 -1458886 -5334075 -8946056 -9813279 -7551994 -4524432 -3406901 -5409759 -10508076
46789 -10508076 -17550675 -24113118 -27986217 -28861809 -27186237 -22314544 -14254511 -6313103
46781 -6313103 -2460479 -2066684 -928650 2117377 3758282 2522395 2261733 7073079
46773 7073079 16079030 25302571 31450446 31948233 25183493 13717181 4036339 130404
46765 130404 108649 1330874 4657990 10307808 14204651 13489812 11824122 13346108 14506891
46756 14506891 8830676 -1927260 -8759707 -7719636 -4726611 -6804330 -13854447 -20698004
46748 -20698004 -22924816 -19341798 -12321751 -6652323 -4752317 -3035165 3141313 11399276
46740 11399276 14183034 8815457 366158 -6099405 -10274063 -12377247 -10692599 -6196237
46732 -6196237 -3806133 -5343840 -6302604 -3407403 -297107 -1088945 -3121672 -1857939
46724 -1857939 811932 -303374 -4704002 -7089817 -6257445 -6591784 -10269423 -13729076
46716 -13729076 -13345684 -9982601 -6112715 -2252476 1630738 4149854 4237182 2958931
46708 2958931 1763397 276674 -2694776 -6961914 -10962248 -13449548 -14498326 -15151241
46700 -15151241 -16240778 -17280403 -16853966 -14512299 -11484603 -8768733 -5674898 -1582581
46692 -1582581 2044085 3322549 2821016 2578855 2778318 1907632 253088 452138 3550258
46683 3550258 6770712 6887538 4399257 2457170 2248739 1467883 -1978465 -6113838 -6482865
46674 -6482865 -1826310 3484699 4245050 770510 -1772012 -232917 3173305 5348889
46666 5348889 7066366 10717822 15402391 17570639 15978272 13184375 11994091 12458443
46658 12458443 12571228 10481168 6211553 2374542 2349451 6260023 9905042 9516404 6131940
46649 6131940 2947173 282170 -3233889 -6105165 -5534777 -3178474 -3823069 -7304063
46641 -7304063 -7379785 -1129644 5828564 7347423 5503351 6458001 10950498 14567850 15423767
46632 15423767 15501304 14979127 11315878 4964288 735304 1568543 5115332 8298276 11070825
46623 11070825 13426160 13161421 10203607 9274734 13422848 17633949 14699632 6374630
46615 6374630 2386265 7301744 14223879 14443493 8577560 3646665 2236349 288892
46607 288892 -4815372 -9434352 -8948780 -4292838 -205106 1249870 2186917 4093633 4522261
46598 4522261 338329 -7017381 -11751505 -9652273 -2440004 4570219 7926752 7934344 6393729
46589 6393729 4842816 4699309 6296945 7157511 4171443 -1095117 -2380812 3482855
46581 3482855 11590373 15262968 14938771 16133966 20013761 21794994 18955208 15258030
46573 15258030 14540304 15440215 15132804 13880043 12372073 8627957 2040434 -2702598
46565 -2702598 -935762 4770064 7970893 7634699 8489032 12369399 15022390 12869221
46557 12869221 8071375 4743055 4007401 5149537 8417711 13892461 19543510 22583782
46549 22583782 21563196 16364048 8229255 482182 -3564705 -4547510 -6029313 -8511427
46541 -8511427 -8239640 -3880479 -17381 -534171 -2495162 -1316002 1357042 1059420 -294197
46532 -294197 3996839 14379981 22911324 24402614 22986689 23606792 23103805 16203368
46524 16203368 6424471 2990797 7540117 11654405 9581320 6564659 10089489 17874606
46516 17874606 20999966 16944799 12735398 14302120 18630402 19536859 16884387 15444843
46508 15444843 16764160 17280656 14729794 12033823 12851979 15962729 16500119 11702410
46500 11702410 3815420 -1968482 -1378044 5960343 15691719 21333632 19385409 12269560
46492 12269560 5663914 3150704 4002999 5466551 5890675 5644362 6013382 7485673 8712872
46483 8712872 7526027 3785513 734410 2003686 7014893 10883760 9860143 5723833
46475 5723833 3297792 4218113 5204839 2927634 -1551306 -4911492 -6607527 -8770398
46467 -8770398 -11072336 -9185614 -531847 10738166 17611904 18120285 16367063 16181104
46459 16181104 17374448 18905187 21758625 26218353 29175246 27628189 23554528 21928967
46451 21928967 24141081 26378178 25033374 21078626 17782216 15990478 13574286 8905939
46443 8905939 3191338 -1029896 -2780055 -3256747 -3781602 -4116635 -3343840 -1505459 866845
46434 866845 4234739 9135164 13748687 14778975 11850809 8944962 9730415 13063292
46426 13063292 15055180 14224677 12257792 10579494 8828027 6696931 5087148 4953771
46418 4953771 6166684 7273959 5518688 -1378218 -11242301 -16743679 -12318698 -1709499
46410 -1709499 5171837 3941123 876216 4418646 14349416 22280280 21567186 14037355
46402 14037355 6982555 5313413 7246361 7089229 1671120 -6608352 -13150486 -15845730
46394 -15845730 -14837435 -9588092 66070 10124218 13954699 9456598 1804926 -2833027
46386 -2833027 -3923802 -5189541 -9134954 -15122642 -20765961 -23005549 -19716635 -12475793
46378 -12475793 -6000270 -2915902 -1235370 963113 1385265 -2564363 -8230257 -10314933
46370 -10314933 -7621938 -3182261 1083430 5484300 9249586 10931056 12100244 15911015
46362 15911015 21332594 23321092 19875202 14739584 11748307 10641536 10217864 11404948
46354 11404948 14601868 17433575 17829481 16389023 13419106 7163603 -1895332 -8341777
46346 -8341777 -7599146 -2248346 1463145 1767417 1850193 3326703 3912345 1916120 -938768
46337 -938768 -2392969 -2416622 -1715991 328517 4664480 10717944 16713843 21247047 23958420
46328 23958420 25162621 25198248 23868055 20321755 13560143 3329535 -8649261 -17889939
46320 -17889939 -19216594 -11886738 -1903537 3536817 3616698 2913668 3559630 3256401 1785673
46311 1785673 3408974 9570158 14526267 12870763 7183907 3184360 1330600 -675384
46303 -675384 -660562 4986160 12791729 14845344 10113602 5614368 5224544 4591152 -473114
46294 -473114 -6990239 -9499144 -6744970 -664316 6998792 14245636 18703181 20258068
46286 20258068 20526736 18660226 12133002 2786024 -3423144 -4552378 -4705672 -5669241
46278 -5669241 -3224137 4551660 12030270 14041073 13088328 13200628 12751722 9898660 9088941
46269 9088941 13875056 18011415 13086972 2074220 -4180094 -2310994 1001436 924924
46261 924924 -667976 -2570085 -6674592 -10877063 -8545241 1242438 10281356 11971917
46253 11971917 9246519 8131347 9398711 10811787 12382455 14664566 15612236 13165024
46245 13165024 8031022 1348707 -6662831 -13433764 -14185950 -8568370 -2600447 -477440
46237 -477440 890433 5072490 8722274 6545838 144761 -4037950 -3617198 -1942269
46229 -1942269 -2240138 -4389897 -6186625 -4257181 4151115 16432205 24158236 21840141
46221 21840141 13858870 7968270 4638223 -1038293 -8897704 -12758442 -10123015 -5680768
46213 -5680768 -3426500 -1599604 1872338 4483725 3461411 815073 24266 516944
46205 516944 -616216 -3193197 -3918866 -1067627 3736800 8114451 10816112 10945862 7620781
46196 7620781 1494228 -4585973 -7833668 -8474854 -9507254 -12885248 -16643748 -17179684
46188 -17179684 -14231887 -11631235 -12355910 -14843666 -15660740 -13925035 -10978392 -7366881
46180 -7366881 -3072803 135229 -146448 -3258512 -5674395 -5445274 -4027121 -2932106
46172 -2932106 -1053905 3038354 7860642 10243270 9428382 8174111 9211624 11754908
46164 11754908 12888509 12095854 12173835 14330301 14735157 9347618 1049799 -2734849 -241778
46155 -241778 1823794 -1918407 -7671137 -8479470 -4371884 -1239882 -1758280 -2998981 -2546062
46146 -2546062 -1908361 -3028521 -4951450 -4876328 -555724 7813101 16214261 19298624 17175671
46137 17175671 17108321 23999872 31620209 29349286 16537683 3435544 -2459666 -4140451
46129 -4140451 -7550208 -12820271 -16158549 -15432895 -10587904 -2572829 5108278 7345967
46121 7345967 2778626 -4677891 -11309036 -16739798 -19908303 -17133657 -7889676 1793934
46113 1793934 6235731 7433219 11178889 18202822 23539276 23406238 19095037 14806168
46105 14806168 14174341 17814750 22277272 22924820 19410940 16044417 15197977 13672912
46097 13672912 8160541 948276 -3231282 -3236676 -843427 3308511 9098863 14365630
46089 14365630 17042991 18391045 20532901 22400445 21721273 19362433 17841824 16854008
46081 16854008 14068981 9357370 4860452 2098506 2106249 6428834 14096965 19571375
46073 19571375 18331901 13275761 11014535 12936635 14752665 13992820 12560124 11802739
46065 11802739 10327489 7684115 5771919 5368490 4858756 3269678 1456546 125242
46057 125242 -97160 2850047 9838241 16778085 18099625 14179812 10711456 10530600 11160544
46048 11160544 10906846 11555675 13494870 13940172 12442814 12808178 16604667 19788755 19121239
46039 19121239 17093355 16586361 15327915 10499966 4895510 2897843 3221352 1603200
46031 1603200 -1161956 -308246 4060985 5547024 610467 -5826547 -6864442 -2405000
46023 -2405000 1984856 3279479 4335378 8611336 14513650 17329577 15785973 13861284
46015 13861284 15337698 19021975 21164919 20531430 18467474 15634586 12000032 8837245
46007 8837245 6769612 2570871 -7270792 -19440552 -25351380 -21400693 -13052661 -6733646
45999 -6733646 -2586762 1623111 4232051 2213549 -2862079 -6194350 -5625385 -2458202
45991 -2458202 1918591 6381704 8406896 6137035 1697673 -975479 -1425274 -2832254
45983 -2832254 -7022058 -11985938 -14536376 -13585843 -11092162 -11072704 -16257979 -23705651 -25537266
45974 -25537266 -17139369 -3663366 4701229 3370621 -3371521 -8659074 -9056025 -4782540
45966 -4782540 1879001 7236722 8337864 6095282 4424918 5323769 6599735 5296786
45958 5296786 1462690 -2705696 -5918699 -8372801 -9998744 -9853023 -7829213 -6114557
45950 -6114557 -7492150 -11494534 -13456688 -9285951 -843133 5649019 6765735 5027596
45942 5027596 4381269 5443967 6625212 7253315 7632278 8089946 9522269 12578293 15088115
45933 15088115 13557104 8995762 7344803 11347456 16039213 15777852 11387655 5916012
45925 5916012 -1693617 -12083660 -18954267 -15862706 -7453261 -4345889 -7019891 -4961192
45917 -4961192 5974851 15632384 14277423 6802941 4794784 10110113 14494276 12491962
45909 12491962 6816197 1542598 -3114684 -7895526 -11352546 -11892506 -10224644 -8006056
45901 -8006056 -5642380 -2754292 72960 1266175 241188 -1205494 -673745 1275922
45893 1275922 1159286 -2152499 -4278530 -762042 5878549 9256284 8900750 11181258
45885 11181258 19007664 26442926 26851575 21469295 15582880 10351935 3840469 -2445917
45877 -2445917 -3878030 1003071 8851029 15769263 19594012 18728996 12818551 4849264
45869 4849264 -591833 -1517223 1026064 5649842 10849922 13747762 12474729 9536108
45861 9536108 9182197 11663004 13973844 16061744 21146760 28405017 30533561 22382658
45853 22382658 8893807 215457 169697 3263746 2957892 -563410 -2324643 -240063
45845 -240063 1654240 -1677107 -9121148 -13403115 -9192275 137630 5883418 3801911
45837 3801911 -1777545 -4076506 -1575001 2087016 3844580 3783846 2410154 -1175670
45829 -1175670 -6624810 -10275848 -8880685 -4698452 -3363444 -5931858 -6726984 -1454122
45821 -1454122 5954329 8666407 6576275 4930875 4470698 321104 -7522033 -10204531
45813 -10204531 -1605363 11602413 17924000 15373305 10851904 7894570 3503982 -2942693
45805 -2942693 -6434038 -4944534 -4270318 -9611318 -17156170 -19000738 -13318265 -5104452
45797 -5104452 851558 3293336 2542302 -17601 -903985 2777489 9076455 12971718
45789 12971718 13099235 13634640 18291405 25179365 29441763 28921778 25002329 19368500
45781 19368500 12942793 7827318 6993678 10244961 12596949 9498955 3068771 198838
45773 198838 3958988 9733814 11330779 8215298 4263948 1707136 -45658 -746134
45765 -746134 1342293 6100632 11002529 14535015 17009234 17431552 13403942 5665504
45757 5665504 -996510 -3695694 -4923594 -7250374 -7979758 -3273552 4737149 9872218
45749 9872218 10049846 8746043 8255474 6376347 1462765 -3215017 -3073488 1829629 6830811
45740 6830811 7615277 3638984 -2241384 -6034210 -5365621 -1456868 1927281 2339869 1082605
45731 1082605 1310570 4417666 8826939 11554251 10396903 5541608 -107581 -2949143
45723 -2949143 -1994687 335890 1473845 1995964 4446889 9269914 13495274 14122770 11881807
45714 11881807 10431237 11665014 12935483 10349375 4658155 1604202 4737204 9692418
45706 9692418 8866564 1460300 -5035333 -4761296 -1145797 -1498633 -6618875 -10213256 -7897333
45697 -7897333 -2228586 2253326 5247208 9582241 15964140 21277568 21670074 16200374
45689 16200374 7925544 1847380 895830 3516452 6009093 6988054 7968732 9906124
45681 9906124 11770916 13006868 14453046 15648651 14298994 10338750 7508589 8268531
45673 8268531 9973643 9363947 8116711 9614619 12219624 11001880 5555902 966973
45665 966973 664739 3000112 5463533 7372128 7204785 2472225 -5360156 -10278800 -8859461
45656 -8859461 -4235429 -516563 2356280 5000854 4677733 -50864 -4484341 -3529445
45648 -3529445 -537 -1079545 -7590617 -12891873 -12537729 -9310654 -7527974 -7500449 -7702665
45639 -7702665 -8267551 -9665330 -10710536 -10228917 -8750815 -6732718 -2768000 4585895
45631 4585895 13892894 20892768 21745652 16975338 12500501 14661700 22618151 28282817
45623 28282817 26552280 22385855 23008842 26024274 22447906 10765658 -191999 -3974869
45615 -3974869 -4158046 -5868060 -7211253 -4652028 -893249 -575152 -2104281 -573434
45607 -573434 3869054 7126015 8592488 10729539 12334334 9289679 2361258 -2317133
45599 -2317133 -1939791 -393594 -1018012 -1605516 312063 2014264 -227339 -4443393 -4885502
45590 -4885502 342716 6883491 9186971 5882164 342324 -2514790 -177247 5519523
45582 5519523 10383807 12102045 11797023 11183146 9713837 5796770 -69357 -4793188
45574 -4793188 -5167584 -125475 8941681 18981156 26453925 29043766 27379694 25073588
45566 25073588 26044598 30917056 36301633 38268894 35942714 30641177 22783602 12665339
45558 12665339 4224930 3690275 11775848 20246988 19992653 11037477 1225652 -3513956
45550 -3513956 -3563751 -1322803 2349202 6316534 8025868 6418172 3547439 1890545
45542 1890545 2252451 5082063 10795631 17271308 20052974 17425783 13146224 11834838
45534 11834838 13419678 14377886 12894144 10353306 8821352 9390383 12258512 16128034
45526 16128034 17781945 14413434 6931872 -110453 -2265792 1329989 7644244 12288094
45518 12288094 12795313 9970845 6195285 3224046 2443759 5654211 12765078 19290598
45510 19290598 19878304 15198387 11807224 13706924 17651815 18952266 18039770 17813575
45502 17813575 17807548 15602900 12019192 10093331 9817738 8353768 5054548 2033949 -88101
45493 -88101 -2731229 -5552999 -6581710 -6705011 -9254276 -13732102 -14823437 -10204041 -4990063
45484 -4990063 -4928351 -8652858 -10821062 -10361738 -10851383 -13742865 -15825054 -13977150 -9130772
45475 -9130772 -4465105 -1795231 -568797 964011 3974948 7499905 9077572 8225646
45467 8225646 8355819 12963040 20256912 24289931 22035037 16966345 14459597 15649721
45459 15649721 17530671 17709912 16798441 16159183 15096024 11412277 4583579 -2370615
45451 -2370615 -4970835 -1528683 5215812 11016630 13679623 12906087 8311006 371597
45443 371597 -6904799 -7688541 -609892 8526127 12333022 9273480 4207702 2809196
45435 2809196 7052535 14825777 21496163 22405054 16505146 8014951 2608645 1627541
45427 1627541 1726457 189854 -1838716 -2080434 -489628 1697574 4262628 7229756 9024672
45418 9024672 7631604 3267154 -1592553 -4500674 -4286241 -927958 4138164 7997714
45410 7997714 8134441 4404216 -1512276 -7739408 -12332636 -13381030 -11067903 -8449119
45402 -8449119 -7679619 -6467876 -1347167 6298717 11473944 12968881 14833270 18809309
45394 18809309 20033314 13847025 3431257 -3827914 -5555834 -5382743 -5896078 -5692077
45386 -5692077 -3872292 -2631435 -3213979 -2704487 2286196 10400692 16329176 16194879 10971862
45377 10971862 5376587 4095719 7800237 11878512 10359224 2244515 -7030919 -11249226
45369 -11249226 -9152812 -3713084 2134912 6817122 8862838 7674435 5600090 6487245
45361 6487245 11438588 18009469 24028874 29648064 34419956 35221711 30025364 22328059
45353 22328059 18357027 19624770 21196339 18467476 13151720 10476062 12100763 14609444
45345 14609444 14746860 13476577 13822237 16409409 18656251 17776174 13573005 8633111
45337 8633111 6398823 8429189 12661776 14869728 12876068 8934018 6671374 6041715
45329 6041715 3434522 -2380419 -6631967 -3442042 6201678 14231056 14356387 9078257
45321 9078257 6079869 9196183 15528750 20650748 23101298 22927415 19436796 13165994
45313 13165994 7793451 6634720 8164376 8208310 5960758 4268839 4132977 3320183 1555111
45304 1555111 2324604 6555435 8682506 3737072 -4335519 -7234602 -4331332 -3726735
45296 -3726735 -9713779 -15311787 -11832258 -1977226 2955379 -1556239 -6887370 -3072692
45288 -3072692 7342189 12425788 6748420 -1503287 -1511567 6471413 12967995 12441587 8505331
45279 8505331 5692197 2797946 -1791662 -3510687 3044375 14185759 19343234 13913102
45271 13913102 4403433 -948553 -1724283 -2548266 -4910319 -6239952 -5287957 -4112673
45263 -4112673 -4632135 -6109367 -6596023 -4944153 -865665 5512694 13232687 20090554
45255 20090554 23330588 21499149 16382879 12698575 14309335 20329618 26208670 28818786
45247 28818786 28714521 27103478 23342926 17125016 10768785 6703640 4123767 974899
45239 974899 -1605837 -94692 5778349 10918543 9782532 2083562 -7360877 -13511778
45231 -13511778 -14947201 -13418200 -10738629 -6979087 -2055338 1923067 2011789 -1204709
45223 -1204709 -2695501 1640717 9736302 15418731 15099306 10610187 5976239 3558086
45215 3558086 3438512 4468479 4979723 3603428 302262 -3445850 -5321853 -3161820
45207 -3161820 3231180 10389342 13116268 10052041 5878435 5664778 8462591 9581444
45199 9581444 7917979 6644761 6663716 4503366 -1239372 -5758360 -3844371 2973665
45191 2973665 8814026 11191090 12535376 14764608 16283897 15155435 12456340 11194067
45183 11194067 13406593 19018560 26067617 31252744 31582702 26730237 19355287 12407331
45175 12407331 6409057 -113787 -7837264 -14946937 -18487711 -17241024 -13011899 -9010911
45167 -9010911 -7256639 -7729475 -9361896 -10788299 -10284972 -6484402 -15832 6407582
45159 6407582 10471577 12307496 13204046 12919914 9832828 4029635 -1298507 -2948617
45151 -2948617 -1627986 -1025523 -2631704 -3532063 -1031185 2285641 1329255 -4057377 -8380935
45142 -8380935 -8352981 -7385533 -9591588 -13062954 -13174362 -9538105 -4589057 2261299 12466819
45133 12466819 21485129 21975701 15108316 10819340 13614356 15708192 9553801 464506
45125 464506 -738563 6773532 13909149 14870249 12053249 8368418 2833081 -4530135
45117 -4530135 -9970843 -10838818 -8616813 -5350371 -1230792 2923848 5227639 6331188
45109 6331188 9001539 12380164 11489064 5013705 -1085207 -1145790 2958898 5826854 6124579
45100 6124579 5898498 5348029 3367768 1696835 3528761 8124925 10739540 8322903
45092 8322903 2547853 -2860206 -5333737 -4093147 14823 4931134 9089559 12528726
45084 12528726 15274801 15767791 12669035 7332081 2675139 292612 2469 997524
45076 997524 2013708 2034307 2428304 6079378 12157816 14642530 9662134 1858965 -1202947
45067 -1202947 694936 1161211 -2472165 -5715399 -4978923 -3168007 -4177460 -6188823
45059 -6188823 -4405644 1949607 8822566 12208260 11185312 6953577 1234848 -4204705
45051 -4204705 -7568059 -7159160 -2470218 3849027 6542572 2883166 -3426527 -6484025
45043 -6484025 -5691264 -5226344 -6432647 -5938786 -2449065 228693 -343685 -955128 1207561
45034 1207561 2936654 361125 -3935478 -4874696 -3035953 -2567565 -3028430 -457544 3898531
45025 3898531 3343182 -4274726 -12740897 -16128000 -15674752 -14911725 -13083849 -7819870 -684165
45016 -684165 4688963 7863537 10839725 13608072 14455911 13724603 13466329 13748543 12681040
45007 12681040 9979826 7400778 5738836 4556642 4840569 8195969 12643318 13167282
44999 13167282 8480673 3977591 5255559 11269801 16972245 20467473 23520058 26131252
44991 26131252 25262658 19634878 12120882 6207169 3092305 3125758 6328959 9688753
44983 9688753 8061708 1126046 -4080552 -2048323 2574343 1020680 -6360651 -9813177
44975 -9813177 -3976529 4788519 7847969 5312926 3200852 4051303 5785894 6998335
44967 6998335 7548497 5355221 -1526477 -9679995 -12570546 -8923655 -4052598 -1463731
44959 -1463731 1827686 8707354 15060160 14210738 6383293 -899471 -1869039 1737653
44951 1737653 4907228 6060360 6982896 7692876 4994153 -2554709 -10428446 -11638705
44943 -11638705 -4479147 5293545 10635210 9822277 6121592 2977853 1378969 687995
44935 687995 6882 -917536 -1053853 730402 3025787 2331675 -2231068 -6750698 -7310295
44926 -7310295 -4824895 -2413625 -441058 2022411 3133261 772928 -2253433 -1274448
44918 -1274448 2410899 2925171 -564505 -2406351 -306296 618004 -2814987 -5158221
44910 -5158221 -351297 8697798 14529725 15360188 14819830 14322008 11955247 7417824 2478157
44901 2478157 -2338623 -6650975 -7563795 -3608224 276758 -1934296 -7713310 -8291157
44893 -8291157 -917349 7730406 11409073 11016236 9583561 7202134 4209786 3643517
44885 3643517 6285785 7763973 4864643 979221 911276 3408980 3349480 -977603 -6878725
44876 -6878725 -11447223 -12747352 -8789383 327653 10351475 16646716 18894443 18858258
44868 18858258 15766209 8665878 1739296 1255362 6844372 11206848 9789889 5818548
44860 5818548 3765019 2696637 -348397 -3829829 -2981670 3464181 11163492 14817009
44852 14817009 13133742 9247989 7245020 8066648 8710757 6378338 2896626 2641664
44844 2641664 6022364 8555777 7806325 7298609 10450820 14130647 13029564 8451808
44836 8451808 7126827 11351129 15671112 14710144 9594676 4376844 303637 -2981648
44828 -2981648 -3674612 547863 8306342 15199879 18155436 16925444 12545060 6942342
44820 6942342 2980166 2028598 2245243 1799656 2378928 5990875 9595474 7728553 479273
44811 479273 -6204480 -9154068 -11586023 -15839600 -17953495 -13714087 -6074074 -1450333
44803 -1450333 -1149604 -1519724 -866258 -882683 -1951665 -2388306 -2620982 -4967967 -8088144
44794 -8088144 -6608062 1270737 9680457 11707017 7567113 3275602 2993074 5637405
44786 5637405 8185602 9583117 11019646 13826540 17856122 21979500 26065260 31290362
44778 31290362 37130725 39281710 33567625 22185701 13149614 12332302 18094292 24432305
44770 24432305 26877453 24375745 18432350 12378859 9201033 8399347 7288876 6478245
44762 6478245 10066193 17655476 20645126 11899800 -3354152 -12521535 -10947347 -5979589
44754 -5979589 -4781204 -4563095 1343592 12334685 20815873 22007328 18684750 15829299
44746 15829299 14291700 11539387 6596564 1822916 -179125 138237 20134 -1976059
44738 -1976059 -4193287 -4100911 -1611792 528442 -541782 -5024588 -9948896 -11103819
44730 -11103819 -6298758 2475914 10576920 14922695 15970125 15107365 11771968 4855501
44722 4855501 -4208702 -12033419 -16482682 -17155022 -13306339 -4443218 6482165 13747346
44714 13747346 14597962 11980842 9583778 6653131 938526 -5079571 -5733219 -509506
44706 -509506 3738232 1591707 -3307417 -3522817 1124306 2964345 -2556098 -10443686
44698 -10443686 -13453912 -11760692 -10888797 -12431333 -12454146 -9011660 -5634691 -5291543 -5395871
44689 -5395871 -2242962 2589282 4272277 1802357 -576653 1247727 7273158 14685656
44681 14685656 20427438 21916591 17591634 8401440 -1774770 -8118406 -7901466 -2492971
44673 -2492971 3191624 4258459 -92952 -6272693 -10031408 -9376189 -4098038 4903830
44665 4903830 14654339 21021188 22600292 21791836 20425080 17024000 10836252 5513230
44657 5513230 4947840 7666717 9600106 10562225 13062615 16000201 15348192 11126456 7892116
44648 7892116 7338687 6167516 3193685 2794367 7945864 14600967 17105352 15646243
44640 15646243 14215598 14205535 14538445 15957534 20249988 25839981 28359276 25974616
44632 25974616 21322979 18056478 17765825 20092020 23419961 25168571 23346935 18578986
44624 18578986 13954465 12838128 16617646 23208839 27666912 26665145 23188018 23773142
44616 23773142 29452057 33018195 28360326 19057565 13110041 11718194 9275981 3702747
44608 3702747 193582 3062702 9366235 13693955 15263414 16627083 18164482 17973638
44600 17973638 15991700 14338630 13383259 10586757 4556405 -1594587 -2713672 2830748
44592 2830748 11097257 16235758 15476084 10110902 2620079 -5343571 -11921752 -14270170
44584 -14270170 -10816731 -3562229 3660266 8970942 12945858 15643776 15246885 10521528
44576 10521528 3360127 -2246209 -3550538 -1123869 1950356 2699813 387208 -3669896
44568 -3669896 -7939122 -11573189 -13588061 -12661608 -8675573 -3319095 1934177 7277371
44560 7277371 12618500 15555727 13693638 8547911 4628635 4171456 4855052 3656811
44552 3656811 1175440 404322 1898644 2139643 -2267594 -9582896 -14019227 -12711403
44544 -12711403 -9815584 -11299181 -16765276 -20153061 -18713762 -16603735 -17437592 -18029173
44536 -18029173 -13869227 -7282018 -4356359 -5469834 -4997316 -340431 4644560 6277572
44528 6277572 5608191 4331085 1163997 -4689577 -10435491 -13279102 -13846171 -12889360 -8018729
44519 -8018729 2012400 12102704 14754314 8789711 444176 -4101106 -4208376 -3014053
44511 -3014053 -3322096 -5761655 -8644553 -9180493 -6675859 -4470097 -6582348 -12541374
44503 -12541374 -18038435 -20805490 -22700470 -24896975 -24467168 -18721433 -10949044 -8040329
44495 -8040329 -12351272 -18981123 -22029222 -20948097 -18999912 -17663675 -15552834 -12082252
44487 -12082252 -8909408 -7051770 -5311797 -2932903 -1426843 -1737326 -1532459 2039906
44479 2039906 8068126 13075038 15819113 18085970 20886845 22715354 22040876 19226869
44471 19226869 15542664 12250245 10591601 10238003 7950347 1085770 -7030776 -8863660
44463 -8863660 -1315242 10481392 19627583 24465775 27036785 28038126 26741871 23595327
44455 23595327 19341773 13090828 4603405 -2714909 -4519330 -751693 4464099 7297121
44447 7297121 6048990 180061 -8492900 -14257127 -11849687 -3559686 1704824 -1580529
44439 -1580529 -9008279 -11529045 -5265800 5790148 15083743 19002529 17710782 13085774
44431 13085774 7196830 2238059 448742 2740886 7365263 11285132 13469178 15437656
44423 15437656 17773270 18226289 15331913 12026911 12459664 16010260 17951315 16035791
44415 16035791 12804103 10585436 8092287 4227428 2123715 5800910 13961673 20422492
44407 20422492 21032007 17993746 16655591 19486912 24174952 26900331 26353197 24327526
44399 24327526 23161841 23591297 25109329 27120409 28772750 28625597 26030051 22562082
44391 22562082 20664379 20851138 21345159 20169361 16278274 9240329 87889 -7303890
44383 -7303890 -8220324 -1904267 7079206 13366724 15420575 14821991 12866503 9883003
44375 9883003 7020421 6391668 8810758 12244334 13019491 8855897 1443091 -3938907
44367 -3938907 -2697816 4352074 11530210 14242417 13065803 10944326 8378069 4036879
44359 4036879 -866821 -2365870 1194942 6559913 9664609 10400535 11312182 13031678
44351 13031678 13648024 12227375 10343502 9509600 9151130 8156662 6844160 6178226 6326758
44342 6326758 7297862 9811719 13894735 17424416 17835222 14928798 10663212 6834471
44334 6834471 4442727 4275685 5847339 6522050 4458296 2084220 3579003 8945453
44326 8945453 14155792 17578882 21821879 27431281 29467817 24146572 15640058 11717964
44318 11717964 14181374 17699602 17324259 13514169 10088472 10432412 15602400 23336247
44310 23336247 28850213 28777434 24090812 17723367 11072433 5257648 3293870 6617380
44302 6617380 10762722 9493719 3221263 -1379573 -703896 1384783 -312678 -5927655
44294 -5927655 -11818119 -14623718 -12458880 -5616201 1962014 4944284 2365695 -1091891
44286 -1091891 -634410 4344692 11774732 18815611 21254583 15693655 4999438 -2131165
44278 -2131165 -2067 8444701 16826445 22460884 25614594 25651562 22195799 17711879
44270 17711879 14967204 13363038 10616429 6270939 1091478 -4639016 -9617501 -11036478
44262 -11036478 -8417697 -4972373 -2263581 2663565 10929523 16840132 14852921 8199990
44254 8199990 4136951 3120827 8964 -5365874 -6945190 -2394643 3245223 5804669
44246 5804669 7149208 9294640 9420895 4728533 -2117512 -6277543 -6304964 -3349529 2037145
44237 2037145 8988916 14729763 17116130 17132320 16593553 15357794 13024646 11243921 11733716
44228 11733716 13569702 14683209 14566002 13501400 10860038 6541401 2733933 1758283
44220 1758283 2970377 3912204 3844868 4128405 5474815 6630934 5909192 3003766 -676436
44211 -676436 -2948416 -2476785 167746 3381099 6233777 8559089 9991931 10464379 11176832
44202 11176832 13145228 15223366 15900526 16508530 19403747 23014728 22747766 17896742
44194 17896742 13474087 12936755 12874524 8215419 6998 -5615890 -4819513 433157 5179196
44185 5179196 5511898 1128022 -4011600 -4616175 748012 8612586 15332992 19944766
44177 19944766 21079726 15566805 3943546 -6173612 -7405031 -1505721 3790024 5173417
44169 5173417 5651221 7061894 7159286 5396389 5942637 12021173 20876980 27088794 28364473
44160 28364473 25978602 21880150 17718873 15205408 15385853 18022162 22110725 25807280
44152 25807280 26071337 20914114 12697945 6808018 6054918 8511838 11503191 14784249
44144 14784249 18293093 19771245 17295098 12396914 8216910 5800508 4391408 4275673
44136 4275673 6991344 13007873 20654950 26911455 28550651 24092854 16106699 9920051
44128 9920051 7997503 7050088 3135461 -1861232 -2316252 3006231 8923889 11186541
44120 11186541 12406445 17836329 27041912 33255391 31493362 24866836 21008565 23120124
44112 23120124 26833442 26638881 23109281 20917233 20574114 16594813 6019606 -4967205
44104 -4967205 -7442082 -1308590 4585470 4283947 1597113 2940121 7894562 11099426
44096 11099426 10655675 9515499 9491339 9117292 8213734 9769017 14893913 19433544 18741292
44087 18741292 13662206 8735844 5987074 3674345 313533 -3436566 -6965728 -10662797
44079 -10662797 -13758172 -13692003 -9155397 -2433163 2453444 3341959 1479163 412628
44071 412628 3108891 8781257 12992405 12821968 11288907 13594263 19139892 21670672
44063 21670672 18842947 16728861 20913083 27003887 25797948 16225915 6924941 4530213
44055 4530213 6258459 6190030 3768130 2376353 3134660 4688932 7254291 12104058 17228619
44046 17228619 17800196 12278343 4975096 647380 -1332188 -5132910 -11988825 -18075368
44038 -18075368 -18935292 -14146230 -7048663 -1377585 878699 -431676 -3938239 -7218587
44030 -7218587 -8040045 -5315372 1330044 11706467 23352583 30932607 30310498 23608143
44022 23608143 17499170 15515906 14823145 12098815 9177186 9472467 11362187 10064709
44014 10064709 5626088 3978869 8489639 14464383 14899376 9317633 3798357 3066002
44006 3066002 5166491 4498877 -1076071 -7009697 -6498440 1524096 10012756 11245764
43998 11245764 5888217 1808105 3840221 8536967 10790879 11762997 16247313 24150046
43990 24150046 29300826 27110986 19909791 13466444 10604452 9586591 7154515 1857091
43982 1857091 -4654260 -8776260 -8177670 -4265281 -359494 2808849 7957534 16557669
43974 16557669 25205038 29028104 27909243 26519722 27717559 28703937 25723506 20646732
43966 20646732 19511639 24421304 30236545 31309400 29127561 29852897 34886186 37910486
43958 37910486 33105784 23361799 16953348 16992102 17775482 12559848 2179862 -6198239
43950 -6198239 -7378784 -2701783 3120624 6928031 8126426 7283831 5825362 6048327
43942 6048327 9327936 14413734 18823508 21422857 22111109 19825498 13475789 4892488
43934 4892488 -1966775 -5512852 -7662121 -9783777 -10853914 -11191916 -13998785 -19776375
43926 -19776375 -22668537 -17320974 -7408511 -1787619 -2769342 -3869288 306605 7709702
43918 7709702 14044690 18612629 21756259 21432717 17024274 13291748 15332847 20999816
43910 20999816 22873553 17430900 8623207 2439433 1120190 3008431 5315372 6213336
43902 6213336 5868900 5794946 6285779 5387770 2043824 -916546 498137 6103958 11449569
43893 11449569 13212146 12544714 12714565 15192348 18461266 19413150 15982475 9617460
43885 9617460 4621298 3585756 4400309 3822866 2830455 5102194 10370666 13285257 10553785
43876 10553785 6101365 6325528 11707920 15976333 13658045 6483722 1269297 2131414
43868 2131414 6094686 7097624 3449478 -586649 -832149 1568029 2438961 185683
43860 185683 -2959167 -3881029 -794923 5786678 11882487 11854248 4815535 -2397646 -2742309
43851 -2742309 1844294 3609855 384457 -2434793 -1919107 -2615258 -8433339 -15586225
43843 -15586225 -18306468 -17113923 -16185415 -15842611 -13321200 -9083915 -6893460 -8297844
43835 -8297844 -11570881 -15501724 -19858572 -22529695 -20760443 -15514767 -10479304 -6284628
43827 -6284628 133627 9507385 17715711 21095609 20929342 20543947 20557291 19162688 15315656
43818 15315656 9913806 5176844 3767023 6693329 11208050 12833186 10377307 6718767
43810 6718767 3908936 708039 -3308411 -4761668 -1002993 4682395 6421595 3462685
43802 3462685 932590 2914609 7874659 11550375 11948158 10620917 10615343 13669044 18186238
43793 18186238 20000365 16583194 10286117 5716870 4278240 3602153 2325864 2454479
43785 2454479 5902187 11251106 15597921 17620154 17170743 14000763 9296483 6753169
43777 6753169 8988629 13602379 15900265 15320760 15685337 18368881 19110547 14288845 7628927
43768 7628927 6632714 12916081 19921556 21182801 17616491 14410731 13138320 10659215
43760 10659215 5469028 1182576 1661640 5113402 6181840 3328223 1016307 3625829
43752 3625829 9614229 13699985 13588574 12244847 13546298 17564501 20907331 20706157
43744 20706157 17418212 14037710 13110788 14565925 16265629 16326884 14444447 11241088
43736 11241088 7609427 5174692 5861688 9592346 13537277 15374619 16218995 18017611
43728 18017611 19067030 15711989 8821671 4571847 6739055 11413531 12290236 8840193
43720 8840193 5725770 5638373 6800458 7407739 8554526 11395208 14175386 13945125 9908322
43711 9908322 4083620 -109721 624098 7455528 17441402 24574708 24439704 17970349
43703 17970349 10301450 6336256 7511425 11871085 16465632 19888492 22837238 26338267
43695 26338267 30043167 32867769 34604671 35791385 36457737 36228868 35205033 33378947
43687 33378947 29789402 24061493 18358232 15670547 16285659 18123227 20363779 23951090
43679 23951090 28207776 30192578 28703746 26095150 24441284 22409582 17878205 11476969
43671 11476969 5497240 1186175 -1004614 -537724 1771220 3461635 3677343 4441379
43663 4441379 6396710 6227248 1902388 -2139705 126783 7613790 13344819 13971741
43655 13971741 13029132 14359959 17429827 20515333 23678071 26235316 25405975 20392991
43647 20392991 14651329 11327885 9275684 6326886 3597333 3092298 3310004 1120758
43639 1120758 -3057795 -5210862 -2182996 6144223 17661406 28306014 33275910 31412837
43631 31412837 27047291 24019270 19767416 10213201 -1007901 -4985759 9734 5434706
43623 5434706 4559598 1177298 1911048 5847999 8255509 10058488 15382065 21708886
43615 21708886 21353209 13424028 6182160 5026432 5464319 1895004 -3233973 -4454369
43607 -4454369 -2076705 633218 5083532 14335167 24223744 25718898 17160562 7486584
43599 7486584 5213885 9521029 14389716 16487527 15941369 13547066 10802846 9826131
43591 9826131 10274825 8926337 4774383 1560193 2472215 5423818 6784298 6571032 5940869
43582 5940869 2698509 -5162212 -13084391 -13219665 -4593467 4904751 8022681 5903389
43574 5903389 4972360 9154265 16694219 22425545 21861540 14621516 4755257 -2978058
43566 -2978058 -6682061 -6519731 -2740230 2812099 5692278 3871516 2383815 7621904
43558 7621904 17323914 22123585 17892966 10461721 6260157 4785811 3778076 5350957
43550 5350957 11174046 16303097 14808383 9064936 6702810 9523429 12104009 11382150
43542 11382150 10795181 12966002 14321649 10949376 5941347 6133510 12739043 19199426
43534 19199426 18984839 13063382 8108803 8217635 10270704 8380923 1737393 -4147213
43526 -4147213 -4168600 771864 6014276 8560068 8123454 4882654 -545534 -5560338 -6953289
43517 -6953289 -3975281 1745184 8486408 14356220 16290325 12812997 7564423 6259088
43509 6259088 9598750 12800320 12777190 11560192 11080981 9258277 4548748 563622 1752305
43500 1752305 6949238 11769242 15564691 20684229 25476191 24084473 14901738 4310383
43492 4310383 -786016 -444737 1226050 2764168 4839329 5715077 2886517 -1155945
43484 -1155945 -346086 6299688 12105667 11417216 6983585 5064486 6197270 5716122 2235602
43475 2235602 332033 3873484 10998877 17686968 22890017 27464403 30606895 30750144
43467 30750144 28787529 27137063 25814075 22382851 16396404 11295319 10278156 11707498
43459 11707498 10510049 3981732 -5144295 -11796142 -13684794 -12277799 -9272534 -4353444
43451 -4353444 2225713 6860017 5827602 1427353 1194047 8769637 18089478 19897026
43443 19897026 12990644 5684593 5927031 12742661 18292693 16236916 7022433 -3201643
43435 -3201643 -7453946 -3093542 6082981 13299414 15362239 15194377 17047330 20540721
43427 20540721 21585938 18784217 16027965 17325461 21051214 21854663 17772755 12955709
43419 12955709 12732449 17916601 24979832 30025040 30979809 27448435 20964265 15117495
43411 15117495 13223880 15447580 19494000 23781772 28050829 31109650 30704526 26658143
43403 26658143 22085364 20021866 20066202 19566028 17296099 15057596 16042002 21597426 28737078
43394 28737078 31390180 25934957 15335368 5868043 202253 -3597688 -6694348 -7183952
43386 -7183952 -4055519 727187 5931225 12791423 20491645 24005353 20298270 13663701
43378 13663701 10777449 12695268 15630866 17352210 18320926 18196912 16032932 13252977
43370 13252977 12243448 12482499 11715799 10056021 9202521 8906311 8353409 9401296 13326939
43361 13326939 15835710 11666717 3828050 1311565 6594145 12333328 12674268 10979616
43353 10979616 12559320 15700826 15104951 10238598 5142164 2372092 1420410 1390988 1680309
43344 1680309 1357906 617216 1419642 4530630 7598179 8033246 6024306 3482746 2390393
43335 2390393 4813130 10669328 14399743 9310959 -1835311 -6320507 3484994 19302765
43327 19302765 27149160 24485158 20235399 20574325 22955196 23693351 23162937 21612629
43319 21612629 16810387 9166480 3988727 4788989 7836193 6984672 1615267 -3456767
43311 -3456767 -4559658 -2773885 -1420287 -2085638 -3472123 -3169595 -68197 4917590
43303 4917590 10071684 13928993 15155653 13158434 9803814 8758064 11509546 15590605
43295 15590605 18455812 21222586 26096203 31780568 34643229 33617987 30943168 28474023
43287 28474023 25996713 22907614 19181598 15112354 12108131 12564292 16511096 19977729
43279 19977729 19767331 18119555 18809650 20408783 18430796 13114096 9175744 7724499
43271 7724499 4744562 -905790 -4294651 -2166984 1652727 2549302 2097207 3980325
43263 3980325 6688834 5966258 2420494 845074 2500014 3754325 3551230 7021312
43255 7021312 18189100 32036511 38488803 34529680 28586574 30501214 39466799 45793465
43247 45793465 43995120 38856685 36432996 34553463 27769492 18195151 13797538 16299768
43239 16299768 18390300 14911608 10008037 9573246 12430447 13971079 14137385 15954027
43231 15954027 18790797 19040315 16522248 14916740 15772756 16689746 16238775 16660248 19935684
43222 19935684 23982158 24870585 21545365 16860463 14495834 15743222 19143660 22641879
43214 22641879 25444929 27394743 27471577 24718098 20615623 18370297 19018901 20074872
43206 20074872 18955786 15967858 13054046 11723659 13275800 18446570 24942859 27737858
43198 27737858 24357635 18231538 14539723 14409450 15555955 16812897 18971961 22216668
43190 22216668 25672661 28986480 32020928 33729689 33525702 32704658 32088596 29526398
43182 29526398 22835186 14521213 10317482 12957171 19856777 26516648 29502051 26824977
43174 26824977 19242281 11797486 10674846 17090326 26415037 33845320 38332666 40420226
43166 40420226 39706373 36474511 33195062 31787751 30916479 28416503 25394439 25402982 29687381
43157 29687381 35408434 39095818 40217769 40410368 40549186 40408602 40870190 44096622 50267567
43148 50267567 56067792 58875059 61338369 68313607 78959750 85747168 83453705 76373289
43140 76373289 73862548 80415067 92478059 103468892 109492812 111594855 115108654 125991780
43132 125991780 145812607 171480120 201177321 237468044 281343957 326074680 361535942
43125 361535942 382899613 390637503 384402571 363537571 332928335 300930918 270086757
43118 270086757 236576491 200788735 170994513 152566463 140567950 129055109 121827727
43111 121827727 125779813 137060963 143280690 139549621 134100684 136044555 144847146 155648752
43103 155648752 168830235 188401603 214128382 241144088 266184802 288844296 306503726
43096 306503726 313135372 305151290 285072695 257601935 225451074 191579938 161993977
43089 161993977 141646428 128811951 117739246 106283267 96762089 89854037 83044203
43082 83044203 75966790 71471536 68962651 62451027 49353058 36191046 30143955 29027238
43074 29027238 26016800 21040130 19855821 23559097 27371261 29926641 35128290 42677144
43066 42677144 45040384 38203199 28942121 26160557 29832736 33844672 35787731 37940488
43058 37940488 40836307 41666496 38696423 33286854 27817789 24260905 23634404 24327409
43050 24327409 22643318 17707529 13753730 14349352 16644823 15521369 11795293 11461901
43042 11461901 17108647 24516549 28374441 27842708 25704114 24823168 26141984 28171359
43034 28171359 28484541 27325719 28286799 32716878 35632662 31979508 25909675 27612285
43026 27612285 39627185 52278438 56002984 53491744 54986735 64498945 75884559 81831591
43018 81831591 82370782 83861546 92527820 109851037 132199236 154029569 172864902 191966191
43010 191966191 217298555 251390149 290569238 327797525 356965974 374609500 379406714
43003 379406714 371265940 350339661 316776428 272990661 226730704 188993762 165391222
42996 165391222 150210461 132697115 109876962 89529505 78907871 74740013 68338811
42989 68338811 57671169 48809501 46031828 46034934 43326549 36942994 29698029 24152743
42981 24152743 21524669 21791839 22721644 21110484 16724021 12703571 10930442 10242665
42973 10242665 10657985 14957138 23109747 29375471 29087782 24752212 20868824 16411484
42965 16411484 8393116 -86789 -2734994 186625 2563201 2929553 6310565 13781794
42957 13781794 18141133 14117983 6502381 2853789 3044911 2068959 -182919 1322078
42949 1322078 8268468 16041948 19638093 18148787 12910657 5376063 -1778988 -4775894
42941 -4775894 -2155355 3473459 8207232 9854228 7626699 1329331 -7231843 -13763866
42933 -13763866 -15039825 -12552973 -10481274 -10143442 -8868313 -4834702 -189993 2515605
42925 2515605 4570288 8616107 13269177 14175921 10581554 6977815 6982066 8963457 9377001
42916 9377001 7130788 2685442 -3451978 -8343384 -6509747 3295612 13845110 16938766
42908 16938766 13369050 10352599 10692925 10636969 8003423 5640845 5544725 5862568 6070291
42899 6070291 9204589 15515056 19112001 15449687 8315656 4698916 5648290 7128530
42891 7128530 7832578 10554354 15792557 18696943 14278456 3660446 -6116773 -8099370
42883 -8099370 -1525648 7463234 11803496 10378148 7726417 7315691 8011763 7918222 8045696
42874 8045696 9813872 11879854 12455932 12505583 13411430 13302097 9380236 3179181 238252
42865 238252 4327655 13805114 23295769 27718962 25970757 22253990 22287934 26649847 29909237
42856 29909237 28076567 23885412 21703673 20383817 15828134 8710335 4320891 5152326
42848 5152326 8470495 11435782 14021423 16087862 15999208 13761840 11970886 11899875 11592083
42839 11592083 9447222 7044833 6719132 8501551 10918701 12905418 13765685 13143837
42831 13143837 12081322 12239610 13179067 12363194 8783572 4670204 2751497 3701571 6910041
42822 6910041 11476336 15523175 16864540 15566038 13860157 12722788 10900038 8058009
42814 8058009 5861410 4727266 3067393 1756730 5356269 15339677 25441870 28472768
42806 28472768 25722867 24603529 28157010 32330904 33372558 31886586 28345693 21034269
42798 21034269 12069580 9843681 19313098 32732254 36857652 29150144 20679666 21519259
42790 21519259 28828567 32588686 28805427 22490552 19914482 22572195 28111485 33224809
42782 33224809 35453057 35236802 36287979 41155045 46771126 47797754 44232716 41513582
42774 41513582 42319492 42810523 38984125 32586990 27843750 25827953 25380642 26608375
42766 26608375 29720798 32583392 33041263 32063466 31643187 31634175 31588682 33000352 36077510
42757 36077510 37275446 34606809 32426526 35154487 38708884 35363241 26206363 21089995
42749 21089995 25324837 33503129 38247494 38396330 36063948 31972033 27128555 23859145
42741 23859145 21869898 18082834 13135017 12478306 17595014 22074866 21067705 19012559
42733 19012559 22240647 28800598 32273183 31906404 31896867 33240298 33344703 32042884 31256346
42724 31256346 29914692 25839738 21781542 22731663 27467064 29578107 27124591 24231549
42716 24231549 22268046 17169179 8197249 2201417 4670271 11685917 15348289 13418499
42708 13418499 9443361 6582492 5671660 7283885 11694602 17558194 22895470 26343038
42700 26343038 26449512 22293551 16223031 12849908 13369176 14162521 13193959 13793768 18800224
42691 18800224 24849187 26876421 25086505 22588608 19101788 13012019 7735115 9148259
42683 9148259 16763280 23763925 26499479 27831282 29888007 30245926 28181193 28254247 32901119
42674 32901119 36565072 33129791 25699504 22501038 25027501 27039607 24937924 22215248
42666 22215248 22119779 22233134 19646934 16677304 17278399 21182200 25796318 30966316 36789394
42657 36789394 38774009 31619361 18279090 9271183 10538581 16701878 19615457 19412340
42649 19412340 22144191 29011670 34039297 32736376 27876173 24694967 24188340 23963057
42641 23963057 23143075 23122819 24412913 25330487 23530519 17300620 6555039 -5103926
42633 -5103926 -10494993 -4751331 8297089 18890061 21790988 20922673 21815354 23298112
42625 23298112 20904325 15900601 14610922 18283451 19747988 13222300 2860809 -2762350
42617 -2762350 -1497162 2078093 5153221 9471389 15518792 19725604 19587692 17290923
42609 17290923 15597021 13452066 8593825 2030352 -2995097 -4795766 -3691402 -522758
42601 -522758 2969256 4195850 2685862 1317799 2318774 4218416 5408626 7897804
42593 7897804 13556986 19050097 19553658 16137129 14089206 14720974 14755779 13760947 15359719
42584 15359719 19554269 20868063 17497098 15932898 21479962 29203450 30280581 23968705
42576 23968705 17222370 14719854 15346395 17233007 20170448 23208440 25377091 29004179
42568 29004179 36951821 45978562 48511951 42694898 35396832 32822121 33110201 31546249
42560 31546249 28422602 26976019 26838775 25174997 23022747 25149759 33170055 42907263
42552 42907263 49544771 52086478 51561866 47956021 41149423 33108247 26846260 23769066
42544 23769066 23600245 26549759 33801984 45051388 56374492 62068569 59686748 53074176
42536 53074176 49230036 51506644 56553318 58471335 55061924 49072596 44241771 41749578
42528 41749578 40446373 39061649 37522303 36533508 36024927 34141092 28925368 21862146
42520 21862146 18270736 21964030 29986792 35096134 33707052 29004761 25649061 24372262
42512 24372262 23749466 24652988 29214060 35833777 38913401 35122119 27778061 22859800
42504 22859800 21697004 20228174 15926320 12748016 16630219 27141290 37053299 40954937
42496 40954937 40875673 41262577 41922428 40173050 37514097 38074744 40707143 39290793 32730184
42487 32730184 28025663 29607390 31890034 28462434 23596080 26414244 36239434 42904253
42479 42904253 41783691 39588022 42618030 47206532 46633134 41772339 39209071 42107328
42471 42107328 47786547 52168216 52841838 49798284 46312193 46750784 50588300 51688428
42463 51688428 47121087 43289215 48513336 62324832 77615852 91239503 106109816
42456 106109816 123703011 141210399 156841457 171859869 185664390 194066194 194587450
42449 194587450 189165243 179805429 165949891 148214225 130264478 114231164 98224017
42442 98224017 81318096 67088569 58620433 53461122 47669168 42163323 40623245 43027007
42434 43027007 45811679 47303636 48556172 49273046 47266524 42444134 37648192 34583342
42426 34583342 31863286 28105776 24420807 22668893 23261443 25693026 29456396 33454020
42418 33454020 36157110 37413774 38668536 40313061 40234935 36508017 30631092 26377095
42410 26377095 25527574 26127402 25255071 22321211 18817198 15685218 12444643 8995666
42402 8995666 6755550 7079321 9576678 13062017 17170507 21634380 25021435 26274149
42394 26274149 26841930 28797332 31099830 30636657 27291145 24767017 25207799 25993806 23613589
42385 23613589 18086544 11649488 5703829 1438194 1021321 5248463 11715289 17815961
42377 17815961 23493552 28351824 28898512 23056679 15547081 13455414 16781196 18653635
42369 18653635 15641926 12514592 14519316 19627768 22292467 21972046 23322869 28413870
42361 28413870 32607074 29854570 20691363 13132626 14820446 24727794 34122520 36268516
42353 36268516 33130589 30705230 30155062 27690879 22513645 19618510 22684033 28211089
42345 28211089 30044993 27203879 23607555 21536404 19445019 16385473 14786579 16937888
42337 16937888 21013912 23136089 22496847 21733482 21873515 19822841 13168845 5577268
42329 5577268 3610824 8127191 12846721 13076085 11953631 14822188 20650861 23827182
42321 23827182 22838627 21826423 23482699 25524346 25497835 24428822 23330958 20003565
42313 20003565 12752113 4941543 2205884 5650571 10272523 10318551 5100207 -564513
42305 -564513 -1482323 2166918 5064966 3753628 1651954 4366234 11475957 17190658
42297 17190658 18714658 18844553 19422289 17811784 12406671 6585200 3635897 2062605
42289 2062605 -109104 -535221 2998057 6853098 6163858 2981864 3759616 9870114 16630559
42280 16630559 21349969 26078906 31450921 33806298 30937012 26100041 23315923 21924507
42272 21924507 18673146 12923008 7274226 4553220 5941813 10545356 15210139 16214006
42264 16214006 12891620 8913616 8922719 14310843 22336698 28213529 28124203 22084606 14593116
42255 14593116 11122802 13291982 18230179 22338810 24136641 23786912 22094684 20414913
42247 20414913 19753086 19581291 19060569 19268570 22191454 27528361 32643740 35704291 36759306
42238 36759306 36251262 35460669 37999012 46593765 57369069 61572389 55320148 44429699
42230 44429699 37286264 36011680 37329661 39002372 41555442 45405468 50018297 55172803
42222 55172803 60155735 62569048 60966931 58263370 59545375 66182463 74402593 80237760
42214 80237760 84152678 90142282 101355343 117229773 134641936 151583972 168907261
42207 168907261 187197730 202592603 208445539 202051236 187382776 170072436 152289236
42200 152289236 134104850 116797672 101797813 88291646 74794537 61799252 50601079
42193 50601079 41258975 34111813 31118456 32635110 34934647 34431882 32475702 32118622
42185 32118622 32164881 29306431 24917221 24211476 28575825 33739970 36070921 36067635 35190119
42176 35190119 34131565 34959858 39694785 45320320 45421886 38728384 30995010 26436321
42168 26436321 23066470 19465178 19691575 26268566 33593328 34952871 32606219 33927720
42160 33927720 39566865 42654626 39569445 34785018 33367274 33680622 30078857 20138850
42152 20138850 7636526 -173759 1725335 11207549 20307379 23362316 22612083 23337581
42144 23337581 25634846 25132155 20512817 15406839 12875281 12507069 13263352 14879808
42136 14879808 16007499 15240718 14450672 16623201 19961863 19388574 15057428 13612863
42128 13612863 18549487 24753882 25973738 22844966 19584075 17141360 14305858 12117736
42120 12117736 12305426 13868496 15540503 19014562 25162893 29628152 27436575 20335105
42112 20335105 14433536 11832710 9715859 6746158 4851481 4708662 4568302 4009216
42104 4009216 4314483 4766712 3087754 28362 -966525 814182 2837542 4732449 9026373
42095 9026373 15327275 19278046 19579966 20944359 26926509 34117930 36911327 34559013
42087 34559013 30227057 26126162 22701876 19899556 16544597 11367969 6855406 8079900
42079 8079900 14719235 18841602 15032746 8435573 7176421 10526908 11364791 7806064
42071 7806064 4605038 3801996 2067085 -1388100 -1635798 4270203 12160479 16714762
42063 16714762 18023314 18799184 19009697 17188501 14338352 12797010 12838068 13085203 12640961
42054 12640961 10672772 6110102 221616 -2829290 -937790 2520707 3411131 2851486
42046 2851486 4492073 7501073 7477542 4179940 2666436 4900081 5377298 -1068451 -10609940
42037 -10609940 -14362443 -9382882 -985820 5461260 9855035 13175511 13225951 8441472
42029 8441472 2682955 1371467 4181913 6319339 6586791 8791553 13884675 16161147
42021 16161147 10893634 2083731 -1821049 1818167 7723337 9887414 7499486 4172863
42013 4172863 4036256 8139923 12539029 11072875 2570481 -6173215 -7677674 -2506380
42005 -2506380 2890104 5369724 7328820 10682080 14319323 18054672 23525575 29700575
41997 29700575 32660693 31721188 30689655 30830701 28122172 20972507 15426266 17849044
41989 17849044 26243375 33627262 36720820 36318970 32297954 24458403 16705565 14244670
41981 14244670 16697963 18857010 18106315 16550327 15954780 15311313 13843756 12090121
41973 12090121 9401377 4487531 -856222 -2685810 -583783 1469354 964465 -318635
41965 -318635 -591047 -776897 -666177 3564236 14333525 27570888 36244383 37977643
41957 37977643 36429870 35593237 35041616 31355258 23275770 14552099 10651724 12337679
41949 12337679 14555388 13532915 12454755 16216726 22477840 23704645 18003237 11482175
41941 11482175 8367599 5718337 1461937 646811 7225105 14549850 12124437 -158726
41933 -158726 -11981215 -16098417 -14529403 -10773671 -3749702 7101326 16733111 19482975
41925 19482975 15898156 10657690 6529041 4379623 6404509 13746751 21514054 21871239
41917 21871239 13968816 6695579 8647989 17918789 24972798 23998898 17809260 12074964
41909 12074964 8912175 7542674 7699059 9370507 11121625 11754082 12452218 14114428
41901 14114428 13541527 6487626 -5030421 -12792383 -11761003 -5959035 -2341375 -1883768
41893 -1883768 -473178 3423726 6630572 6669300 5178017 4659517 4797813 3944917 2540547
41884 2540547 2979137 6441025 11194060 14371314 14977769 14606600 14896263 14935913 12563147
41875 12563147 8255613 5775695 7888166 13044351 17562759 19333205 17750500 12240812
41867 12240812 3890901 -2821883 -3572585 666860 5162656 8056906 11985256 18455639
41859 18455639 24363817 26048719 24013389 21344238 19579926 18558047 18663597 20414504
41851 20414504 22480172 22556167 20176749 16863731 13561458 9765065 5640239 3473329
41843 3473329 5854721 12706081 20687578 25634862 25548084 21363012 15279404 9112394
41835 9112394 4514175 3556338 7371001 14224809 20499877 24096904 25631534 25783858
41827 25783858 23127294 16122236 6479075 -1225906 -3625945 -1397623 2209795 4910925
41819 4910925 6869732 9101999 11535479 13332830 14432553 15469396 16288979 16134821
41811 16134821 15668539 16922545 20254089 23248443 24040977 23562046 22471913 18552319
41803 18552319 10815695 4237930 5333405 13161601 19634169 19581306 15809265 12816305
41795 12816305 10614452 7574993 4808404 3790540 3095293 1597642 1987311 6611111
41787 6611111 12244635 14024974 12996831 14381838 18938565 21559884 19154619 14933814
41779 14933814 13235212 14238549 15854104 17326544 18501633 18216433 15983460 13422910
41771 13422910 11851801 10066021 6669719 3304326 3198209 6907941 11321471 12982416
41763 12982416 11336680 8597657 6991039 6290808 4262294 -71206 -4178060 -4289010
41755 -4289010 226373 6317734 11364069 16072165 22271396 29218325 33808296 34265723
41747 34265723 32224050 30354218 28445725 23321591 13728804 4183704 1332076 6082498
41739 6082498 12157848 13809981 11991276 10581592 9857875 7934326 6423852 9199827
41731 9199827 15797855 21021078 21687280 19406015 16210507 12355140 9583284 11216702
41723 11216702 16491167 19580258 17485402 14684848 16185871 19787809 19948224 16679245
41715 16679245 15476005 19362193 25297344 28524359 27603904 25141547 25174014 28983767
41707 28983767 32531443 30354508 23476433 20034820 25302636 34551413 39470980 38202351
41699 38202351 34352110 29481284 23000374 17689380 18153804 23376364 26764457 24627523
41691 24627523 19645791 15294174 12032608 9982398 9978723 10325094 7691251 3352070 3492958
41682 3492958 10575215 19018177 22576549 21653562 19715845 16754218 11220798 5537675
41674 5537675 4160224 6998700 9289229 8242971 6516916 8380046 14468970 20942361
41666 20942361 22961065 19169529 13174069 9899871 10472195 12050504 12308941 11474842
41658 11474842 9932307 7441455 5726416 7715063 12028545 12347854 5752677 -1680369
41650 -1680369 -1942033 4487349 9796318 9114177 5062523 2321681 1998962 2446946 2467125
41641 2467125 1916842 698842 -1259882 -2975664 -1857543 4559106 14706305 21688434
41633 21688434 19170694 9114452 222415 -2291153 -1325277 -843575 383745 4321762
41625 4321762 8002935 7836787 6047737 6858132 8875011 7538335 3248190 513206
41617 513206 261250 -162401 -18648 4298180 11165965 13737744 10020483 6001240 5982835
41608 5982835 6501193 3715223 754529 2501490 7442702 10117039 8851265 6327041
41600 6327041 4620331 4009128 5053205 7799756 9943767 9268687 7279894 7567301 11022360
41591 11022360 14812556 15514736 11867451 5693297 1364428 2428810 7153895 9566409
41583 9566409 6761154 2753180 2763367 6240702 8702508 8531234 8311591 10280663 13649931
41574 13649931 16383852 17569154 18200115 20556811 25469540 29442118 27250189 19213044
41566 19213044 12632501 12987298 16814579 17419478 14945963 15380067 20765576 26197952
41558 26197952 27130255 24738107 22505657 21417840 20558110 19660290 19012353 18426714 17575243
41549 17575243 16292285 14274053 11741375 10088131 10201615 10755288 10323484 10471677 13944438
41540 13944438 20049644 24767321 25494849 22939380 18610090 13920401 11825362 15011376
41532 15011376 21008065 23048670 18173235 11369089 9050680 11109729 12508564 10805934
41524 10805934 8707424 9948108 15491402 23481882 30506937 32892411 28960869 20671709
41516 20671709 11837544 4521813 -1708810 -7005305 -9325171 -6312911 1495443 10321029
41508 10321029 16258949 18495475 19219529 20463733 21441505 19350538 12863439 4741215
41500 4741215 602133 4046821 12242479 17455142 14891874 8638343 7417862 14383592
41492 14383592 24136247 30532069 33431921 35442040 36287281 34947781 34301824 37611331
41484 37611331 41345334 37662228 25028745 11281926 4434726 4664280 7167538 8760088
41476 8760088 9086369 8696366 8783788 10486493 12358269 11002238 6035913 1557383 678252
41467 678252 1890379 3412605 7367123 15556880 24065902 27221146 25550394 24778507
41459 24778507 27402802 30341278 31444994 33077545 36878009 39211377 35731598 28424503
41451 28424503 24120928 26105760 30337161 30978208 27257251 22745181 19190633 14385326
41443 14385326 7161525 1648069 3344118 11491918 18429247 17512551 9801688 2026023
41435 2026023 -338841 3037548 8593609 12298360 12475755 10414808 8236848 6414321
41427 6414321 4203734 1771188 -38616 -1583720 -3438857 -3580225 1068131 9320975
41419 9320975 15377620 15612391 12835687 11829482 13514675 15818225 17354790 17305906 14264814
41410 14264814 8600336 3912516 2736265 2647803 135738 -3475176 -3886141 -185016
41402 -185016 4735894 8973576 12475958 13917505 11499811 6923460 3977307 2699685
41394 2699685 -502422 -6050643 -9300581 -7325770 -3322421 -1656437 -1990592 -1202918
41386 -1202918 1601533 4873953 7211491 7405197 3868457 -2910605 -8625800 -9057090
41378 -9057090 -5498615 -3662065 -6657776 -10853244 -9653190 -775880 10846685 17522263
41370 17522263 16015141 9863420 4532015 1803334 226876 -697567 166482 2555386
41362 2555386 4397908 5068963 6174099 8215270 9386533 9016492 9301128 11576996 13289000
41353 13289000 11159703 5811817 1004048 -607810 807986 3529877 5616822 6216728
41345 6216728 6977410 10561120 16230632 19038716 15761054 9779250 7234831 9814660
41337 9814660 14423054 18557994 22021393 23849745 22130899 17929451 15487801 16665125
41329 16665125 18378530 17794610 17110684 20038563 25593623 29149198 28872894 27237405
41321 27237405 25711271 21782867 13418774 3975629 -241007 3510578 12520843 22482233
41313 22482233 30623069 35116997 34547069 29684684 24019767 20628205 19331549 18247320
41305 18247320 17077710 17157032 18871001 20781561 21220847 19573612 16388888 13439109
41297 13439109 12971518 15153021 16628636 13634700 6811504 1258248 1287211 6263190
41289 6263190 11895453 14604549 14452824 14583023 17634033 22122088 23285226 18641679
41281 18641679 11488659 7185810 7279850 9505885 12048979 14534652 15812589 14753564
41273 14753564 13153825 13821630 15416074 13439137 7316142 2122323 1662598 4131601
41265 4131601 6673431 9609884 13018205 13614537 9672319 5928937 8478041 16309217
41257 16309217 22424955 22507391 18506003 14210603 11147950 9120040 7830240 7401503
41249 7401503 8812111 13226883 19521397 24041889 24707225 23405898 22178972 19742021
41241 19742021 15030888 11339969 12229656 15066913 13731564 7018290 -401884 -4772728
41233 -4772728 -6015208 -4134570 1335388 7397170 8672508 4553530 934054 2755643
41225 2755643 8572921 14155415 17490653 18374100 17183953 16435046 19682479 26296494
41217 26296494 31040147 31506920 31867952 35579700 38267158 32977517 20431417 9078260
41209 9078260 5591919 9109405 14232746 16077790 12663312 5952984 1223447 2825024
41201 2825024 9650765 16042237 17200764 12916296 7014720 4380730 7044246 11476776
41193 11476776 11395220 5328355 -519057 290275 6122022 10292279 11009049 13149712 19541541
41184 19541541 25555871 25197810 19416662 15010403 16508972 21729400 25026409 23165688
41176 23165688 17977037 14343754 15732117 21135240 26251299 27622419 25439333 22714484
41168 22714484 22499898 25589013 29611568 30150667 24239814 13879670 5388562 4035935
41160 4035935 9244761 15738691 19314437 20576059 22747083 27059778 31675402 34565999
41152 34565999 35386346 34064747 29896887 23763733 19449973 20285086 25383235 31345888
41144 31345888 36303713 39417008 38142072 30783734 21531565 17566355 19773634 21278607
41136 21278607 17145645 10392196 5658553 2550237 -351717 -128557 5768074 13270037
41128 13270037 16673900 16984584 18565130 20152238 17210788 11778971 10963563 15043676
41120 15043676 15936727 9801572 3041709 2425655 6693958 11996071 18312623 25020740
41112 25020740 26552450 19398089 9265788 5009430 8572150 15950563 23906055 29773081
41104 29773081 29002976 20575885 12129536 12039423 18295092 22717578 24050189 27802328
41096 27802328 33902074 34826517 27995889 20557900 18249777 17959408 15839881 14686063
41088 14686063 17102933 18333022 13549778 7348541 7858029 14387265 18738837 17256182
41080 17256182 14255720 13890348 15235713 15978242 15437720 13338662 10407120 10207331 15174865
41071 15174865 20849612 20136951 14108750 11847040 17291286 22985549 20835086 13043310
41063 13043310 6999884 4235679 1115446 -2660766 -3537062 -1027374 1510117 3175212
41055 3175212 6442587 10713896 10834493 4429365 -4025316 -9121351 -10272423 -8722456
41047 -8722456 -3482747 5044057 10790858 7446919 -2671292 -10396928 -10615954 -6902904
41039 -6902904 -4711030 -4703012 -4741133 -4244885 -3400389 -1038091 3041008 5450927 2733729
41030 2733729 -3133087 -6140721 -3351955 2191427 6127450 7669123 8627841 9598995
41022 9598995 9098188 6092701 2215753 1032301 4840206 12071174 18609542 22154216
41014 22154216 23970394 25292339 24054001 17900430 9122342 2975614 1340545 1719181
41006 1719181 2506482 4635019 6914934 5186171 -653621 -3555784 1882495 10947958
40998 10947958 14854408 13138962 13575624 19995085 26611562 26285995 19485084 12453357
40990 12453357 9906675 11802763 14708864 14557937 10242365 5480110 4606634 6177352
40982 6177352 4520075 -1480285 -5908683 -4320403 219503 3156210 5784472 11328027
40974 11328027 17168367 17449378 12165410 7642560 7896682 10647779 12431481 12862133
40966 12862133 12681341 11826857 11023115 11812194 13578730 13722829 12006344 11397487 13217020
40957 13217020 14961163 14800878 14691054 16405921 17625184 15191150 9890976 4657211
40949 4657211 -24147 -5128277 -8721017 -6772853 1287165 11095470 18353905 22797410
40941 22797410 26010909 27421869 24521118 16609470 6868537 123998 -1295546 796781
40933 796781 2997532 3951837 4711491 6003940 6823068 6191917 4816601 4033263 4130338
40924 4130338 4482829 4357613 3019686 347122 -1980004 -1462021 2100258 5994566 7888537
40915 7888537 7641777 4910910 -1735281 -10656956 -15279523 -10858914 -1553782 3921402
40907 3921402 2902874 -41891 -2306359 -7106890 -15760965 -22149222 -19906529 -11622280
40899 -11622280 -5539111 -4890791 -5568892 -3497747 836734 5524977 9967114 12958279
40891 12958279 12268793 8494865 6034827 7640813 10823460 12520546 14567180 20634013
40883 20634013 29592247 36481784 39392412 40544024 40095603 34227123 22026636 9954855
40875 9954855 5060016 5862055 4484463 -2590267 -10002210 -10696353 -4405571 3077912
40867 3077912 7292665 9258792 12258398 16434158 18314629 15767893 11592001 10183682
40859 10183682 11213502 9436210 1787357 -7808510 -12551487 -9792393 -1970724 7461413
40851 7461413 16182985 22301418 24612489 23342843 18649804 9599031 -2773899 -12957223
40843 -12957223 -15291347 -10196959 -2599740 4793797 12143671 17265297 16020441 9406606
40835 9406606 4598848 6130221 10521930 12441846 11793349 11449829 12153331 13532956 16576936
40826 16576936 20982227 23102508 20463718 15353620 10290603 3805881 -4608882 -9626087
40818 -9626087 -6691061 -458616 706717 -3220633 -5093784 -2711464 -1126763 -2299482
40810 -2299482 -1570305 2673334 4269064 -841325 -6758556 -5705289 886147 5638582
40802 5638582 6204001 6586276 9293614 12234218 13268585 12974668 12303439 11189340 10147831
40793 10147831 10203369 10455600 8267692 2925847 -2678804 -5032833 -3553693 -406190
40785 -406190 2478173 5322165 9263536 13543550 14911904 10749030 2216518 -6844593
40777 -6844593 -13371722 -15762191 -12364655 -2755414 9211726 17221244 18804969 17059469
40769 17059469 14959902 11494651 5568175 88796 -1525341 -697613 -1704062 -5397632
40761 -5397632 -8279375 -7392812 -3417350 871208 3108224 2748638 1669232 2466157 4625845
40752 4625845 4142829 -809810 -5913324 -5712527 -950437 3161839 4988435 7876936
40744 7876936 13156585 16821085 15427536 11428378 9588314 10617344 11443531 10234829
40736 10234829 8133567 6599569 5519335 3947975 1011937 -3754793 -9382307 -13021145
40728 -13021145 -12387872 -8804149 -5864032 -4491592 -1477969 5470853 12967714 14843224
40720 14843224 9452390 1800939 -1661998 1728476 10486044 20423558 25635289 22060886
40712 22060886 12732964 6237274 6719219 8624967 5487496 367829 1156936 7699678
40704 7699678 11686820 9525055 6884253 8242249 10275531 9889950 10995916 16893928
40696 16893928 22165908 19875714 12574670 8209981 8105284 7257575 4760514 5168905
40688 5168905 9365795 12280078 11374207 10399641 12352621 14699319 14310226 12054780 9843260
40679 9843260 7675721 6212085 7906180 12745165 16731915 17363462 16926330 17579060 17031335
40670 17031335 12679962 6847213 3891491 4234873 5011275 5158530 6271755 9006326
40662 9006326 11551027 11694701 8682073 3376515 -2067346 -5106794 -4422472 -646860
40654 -646860 4181358 7200707 6190089 2673312 1991546 6604571 10671151 6726610
40646 6726610 -2439245 -5476667 1967959 10592398 10635351 5240283 4278665 9658426 14438655
40637 14438655 14032279 10634624 7227111 4249495 2859056 5286922 10326773 13398879
40629 13398879 12825247 11927222 13404158 15672436 16633503 17270836 18922408 19823080 17215861
40620 17215861 11399820 5525057 2190229 1519208 1855531 1581746 817779 1379621 4414242
40611 4414242 8864717 13463329 18681789 24309581 26782806 22896741 15637027 11734339
40603 11734339 12747725 13220168 9362430 4873100 5019639 8833888 11358212 11040957
40595 11040957 10333449 10302663 9332929 7250129 6586898 8458573 10137273 8415702 3526686
40586 3526686 -1810038 -5990621 -9658877 -13693528 -17203166 -17869101 -14329607 -8233754
40578 -8233754 -3198667 -896128 1117252 6138311 13216918 17525253 16512450 13424714
40570 13424714 12837849 14329848 13346122 7873742 1323980 -1780189 -293710 4496273
40562 4496273 11447855 18862052 23482781 23519038 21565554 21220351 21637140 19425086 15798720
40553 15798720 16829677 24802636 33913752 37777021 37454480 37790876 38615084 35064314
40545 35064314 25930082 16467767 11884825 11910861 13235479 14173980 15057989 16208947 17494055
40536 17494055 18865108 20138849 20790627 20286262 18066731 13767001 8580021 5351491
40528 5351491 5382463 6278075 5688629 5962655 10869757 17762700 18263162 9095040 -2013629
40519 -2013629 -4930117 990530 7438188 8118827 5293045 5254524 10269016 16306354 17850259
40510 17850259 14215769 10549381 11700297 15940101 17476390 15323602 15511922 22041349
40502 22041349 29508745 29312884 21163730 13211333 11094900 12157740 11860881 11023559
40494 11023559 13286919 18263394 21179503 18643182 11828194 3974896 -2707166 -6923339
40486 -6923339 -7230195 -2926312 4558955 12546444 19229007 23739348 24529106 20211221
40478 20211221 13253819 10132433 14335366 20234067 18170065 6358480 -6388201 -11595537
40470 -11595537 -10586335 -9822602 -10835459 -10122471 -6792502 -3861770 -1870408 2591946
40462 2591946 10093957 15414078 14537080 10497024 8551107 8803462 7955963 6090480 6650954
40453 6650954 10195233 12791180 11431358 7451181 3442458 269 -2725859 -3038849
40445 -3038849 68582 4191711 5842037 5158279 5717605 8975390 11135809 7622159
40437 7622159 -197772 -5454092 -3901839 695209 1757210 -989543 -1553031 2647141
40429 2647141 5657638 711350 -10054358 -18142444 -19609606 -18568088 -19763572 -22698970
40421 -22698970 -24721504 -25255415 -23882218 -17985895 -6665814 5042188 10342362 8552907
40413 8552907 5106435 3965461 3929723 3009871 2304121 3228991 3874928 1477611 -2609809
40404 -2609809 -3754999 -465309 2582539 2262 -6800993 -10428475 -6879493 -1585450
40396 -1585450 -2867835 -10452751 -15046377 -10502906 -1792386 2293766 368451 -2457443
40388 -2457443 -3829664 -6091047 -9584528 -10566985 -7326879 -3051342 -457011 1825097
40380 1825097 5174353 7756241 8225652 8561939 10095842 10717426 9500863 9791492 13066991
40371 13066991 13731408 6128417 -5730582 -11906217 -8968763 -2707450 1077798 2331026
40363 2331026 2836460 2637799 2117641 2702736 3569073 1979015 -1290461 -1289049 3914768
40354 3914768 9358034 9408984 4701709 27215 -1934474 -1855141 -943238 212622 1309651
40345 1309651 2807660 5347340 7454191 6036554 826925 -3896914 -3914777 450654
40337 450654 5797302 9281629 9483828 6578964 3579163 4502699 9078656 12135168 10508076
40328 10508076 7254213 6287758 6680358 6180114 6622662 10497737 14829387 14631484 11187068
40319 11187068 10674183 14621284 17660603 15682377 10773743 6398809 2644913 -1234342
40311 -1234342 -3638087 -3138076 -1582962 -1854098 -3860442 -4476324 -573007 8163056 17810900
40302 17810900 22074215 18397723 11966388 9904122 11387801 8405834 -2100772 -12029655
40294 -12029655 -11464162 -373862 12792363 20979808 22850190 20064847 15437619 12752893
40286 12752893 13807295 15688591 14447759 10889661 9044693 9565145 9155679 6889516
40278 6889516 6336148 9641674 13419538 13105546 8693542 3737254 850611 493085 2159124
40269 2159124 4099263 3337911 -1217159 -6366419 -7608651 -3983569 1953300 7885398
40261 7885398 12879266 15646574 15076544 12829759 12225443 13514084 13066515 8656553 2853156
40252 2853156 -701209 -1694751 -1175199 2265803 10143404 18824598 21302987 15539036
40244 15539036 7746437 5481290 9711576 15585906 19032917 19989590 19963431 19196023 17164949
40235 17164949 14615781 13704994 15570632 18132954 17736431 14048235 11918446 15842770
40227 15842770 23020996 25332445 19349666 11196102 9061167 13255743 16815952 14701372
40219 14701372 9102093 5720864 7526195 12775093 17320260 18087694 15226229 11230257
40211 11230257 7929564 5443757 4578585 7788408 15227729 21566345 20480302 12285481
40203 12285481 3819163 212327 5529 -358252 -482818 2704867 9224146 14745060
40195 14745060 15537150 12967110 11760740 13986130 16080238 13210466 6096905 966540
40187 966540 1619802 4220089 2600722 -3326313 -8189303 -9053920 -8222997 -7906922 -6697471
40178 -6697471 -3132672 888686 2646613 1936714 -169878 -3341958 -6610884 -7588140
40170 -7588140 -5796474 -4681967 -7323862 -11706708 -13235588 -10710574 -6802348 -3644729
40162 -3644729 -1252852 224533 150366 -535372 -155313 164651 -2978024 -9729973 -14762074
40153 -14762074 -13013260 -6255914 -1627180 -3889336 -10549466 -14470880 -10376755 778535
40145 778535 12641625 18625379 17336533 13296279 11777682 12951916 12120444 6097626
40137 6097626 -2070810 -6442109 -5644246 -4476786 -7060861 -10831219 -10069914 -4301330
40129 -4301330 418544 -628541 -4723124 -5461941 -515869 6879258 12855531 16226533
40121 16226533 16974911 14725302 10400060 7311283 8165875 11628594 14009551 14186364
40113 14186364 14386984 15472869 14455344 9187868 3296616 2467431 6489381 9564137
40105 9564137 9280703 10112580 15053921 18465549 12471323 -1937497 -15497859 -21155229
40097 -21155229 -18894626 -11233737 -269286 9954867 14358019 12818834 10761305 11359537
40089 11359537 11613733 8873128 6390236 8114041 11713091 11829103 8076928 5040641
40081 5040641 5486948 7734397 9087396 8270025 4844048 -651478 -5988653 -8658754
40073 -8658754 -7344869 -1024739 10529947 22941783 27644866 20826827 9518579 3513797
40065 3513797 3138713 1209396 -4112006 -6280987 -1577746 4340612 5201368 3617999
40057 3617999 6323442 13428403 18260985 16696069 11649740 7985599 6751901 5762304
40049 5762304 3636168 1761438 2836490 7843904 14148504 17052943 14159038 8032738
40041 8032738 3720508 3696560 6072663 7832999 8746410 11157721 16376232 22706412 27529772
40032 27529772 29862721 29581764 25720869 18196533 10424370 6647928 6276126 4654167
40024 4654167 567517 -1405261 1566161 5282105 4997720 3442931 6800106 14938289
40016 14938289 21700911 24048827 24877180 26380854 26365172 22859355 17937078 14907447
40008 14907447 14727125 16263566 17317732 15245336 10019673 6610467 10145533 18487472
40000 18487472 24186818 24199626 22393804 21387652 17946646 9249594 -1402553 -8533122
39992 -8533122 -10240937 -7461465 -1876370 2630611 1207740 -5473740 -9994396 -7226447
39984 -7226447 -787635 3154465 4211050 5512262 7369157 8532269 10273553 13456503
39976 13456503 14351914 9393510 2004593 -1411995 -832230 -1817166 -6080451 -8918303
39968 -8918303 -6456067 -404520 5071723 7208933 5270611 1094343 -1191515 543701
39960 543701 3248125 3207482 1877057 2727383 4413094 2924590 -861557 -2287241 -911460
39951 -911460 -643592 -2173334 -2711879 -3661748 -10059605 -20248191 -24709016 -19265567 -11825860
39942 -11825860 -10828659 -13779523 -13432179 -9440392 -6399556 -4380195 645880 8755973
39934 8755973 15395203 18133951 18490760 17608871 15437424 13997632 16274473 21144946
39926 21144946 23599559 20948470 15643192 11484885 9893369 10077444 10136866 7995248
39918 7995248 3840368 1268765 3194753 7199738 8215858 5342254 2168564 443921
39910 443921 -1915790 -5235719 -5126905 1747895 11833119 18053246 17695176 14037721
39902 14037721 10814136 7976572 3647631 -1784833 -5376760 -5282507 -3171213 -1798600
39894 -1798600 -920529 2186150 7636726 11004070 8674276 3376842 1315918 4400526
39886 4400526 8479243 9547845 8594817 8965469 11275581 12885574 11348623 6909993
39878 6909993 1987578 -1167618 -2705629 -5064138 -9637677 -13674177 -12204463 -3770655
39870 -3770655 7136221 14323196 15694579 14140945 13725211 16078551 19942626 22937194
39862 22937194 23354642 20676346 15142926 7752767 827298 -2715843 -1839873 1468461
39854 1468461 4485426 6270469 6726671 4630777 -938044 -7843015 -12252458 -12708944
39846 -12708944 -10393253 -5787192 1292767 7783343 7826191 -244477 -10261979 -14450989
39838 -14450989 -11280930 -4685585 1974630 7476224 10026128 7778658 2582880 -386191
39830 -386191 1908713 7404045 12129908 14304440 14631290 14665397 15866658 18565766 21032222
39821 21032222 21212592 20034594 20817920 24143648 25681516 21662811 15106123 13215255
39813 13215255 18126445 23131835 20195433 9984390 1870422 3438846 12009268 18284330
39805 18284330 17167697 12146729 8820453 7599859 5212157 932805 -2439444 -3021330
39797 -3021330 -1517754 1711974 7552832 14979935 20373360 21835938 21428129 21074682
39789 21074682 18928467 12426018 2817315 -6107979 -12008937 -14124522 -11771905 -6329429
39781 -6329429 -2700762 -4146199 -6587089 -3004457 6576163 14618812 16222994 14264599
39773 14264599 12746671 10863554 7126726 4142613 4208685 3997725 -440257 -5748153
39765 -5748153 -4710299 3106106 10345520 12079112 11183897 11686041 12095644 8844751 2683504
39756 2683504 -2382272 -4700431 -6098861 -8216788 -10326453 -10508228 -7283331 -626626
39748 -626626 7150208 12157915 12092187 8360825 4129061 940432 -1708918 -4286090 -6083466
39739 -6083466 -5908165 -3217536 849717 3217941 1040405 -4828551 -9742098 -9871171
39731 -9871171 -5906513 -1257866 1801872 2768163 1647974 -465125 -862291 1945118
39723 1945118 5505821 6113714 3565789 485779 -2302650 -5979553 -9241972 -8039687
39715 -8039687 -1658385 4491841 4937338 663521 -3037982 -3255725 -1026699 2380306
39707 2380306 7209010 12954859 16871679 15931936 9839031 2259586 -901809 3758776
39699 3758776 12723503 17519963 13221809 3818345 -2945199 -4422112 -3677723 -2752453
39691 -2752453 -104106 4546087 7350730 4782975 -1978078 -9501364 -16399655 -22330114
39683 -22330114 -24730051 -20270661 -9436840 2952807 12070382 16259858 16202093 13041431
39675 13041431 7907474 2006181 -3404441 -6878974 -7349872 -5717998 -4753168 -5609509
39667 -5609509 -5157791 859606 11900089 22071883 26223994 24779272 21634573 19132571
39659 19132571 16893616 14585322 13388732 13850209 13722236 10003982 3612631 90233
39651 90233 3403470 9845098 11451242 6230364 1202376 2782726 7830002 8808861 5402038
39642 5402038 4683022 9607819 13703925 9876957 -247351 -9343929 -13380496 -13710806
39634 -13710806 -12380313 -9437136 -4501094 1752047 7754754 11573507 12335633 12111530
39626 12111530 14471292 19746772 23929169 23960982 21469247 19029756 15933901 11198820
39618 11198820 7941049 9998700 15724708 19934394 21260122 22823929 25882471 27808604
39610 27808604 27136422 26054772 26421734 26993453 26093759 23991565 21553458 19355082 18609717
39601 18609717 19826698 20496655 18036809 14996258 16198137 20078798 19225781 11793731
39593 11793731 5580615 6510219 9558041 7472041 3178133 5118180 13100468 18007518
39585 18007518 15623577 12095845 13196816 15543285 13058465 7124365 4717181 8546336
39577 8546336 13872013 15043848 11890624 8772296 9171738 12443043 15394315 15901150
39569 15901150 14051840 10179798 3808335 -4329853 -11110873 -14039365 -14269664 -14281267
39561 -14281267 -13784979 -11087288 -7650972 -7010811 -8497487 -6431737 2078869 11843391
39553 11843391 15218891 11110643 5467646 4178737 8331991 15518883 22498358 26335325
39545 26335325 25825570 23103999 22194887 24796565 28470082 29714919 27756369 24348168
39537 24348168 20712111 15975404 8540420 -1749229 -12618401 -19915479 -19758634 -11694853
39529 -11694853 -288891 7473696 7489519 1455882 -5344459 -8556289 -7241225 -3437875
39521 -3437875 -330752 9378 -1695957 -2745438 -1477300 1253096 3937905 6048339
39513 6048339 6750692 4299867 -968436 -5147422 -5565443 -5363028 -9027414 -14546084 -15397110
39504 -15397110 -10332489 -4986750 -2249570 2277360 11612327 20274117 21309843 16078780
39496 16078780 11156937 8930133 7607006 7873833 12266645 18962121 23239212 25099640
39488 25099640 28695966 33740076 34765064 30840559 28787911 32860287 37149807 33448747
39480 33448747 22827060 14178161 13259261 17432126 20158103 17466453 10813805 5889357
39472 5889357 7554126 14241630 18985500 17580009 13377801 11872677 13315827 14053137
39464 14053137 13013871 12590312 13792384 14683624 14182141 14042690 15761329 17918846 18271001
39455 18271001 17159153 17265504 20265367 24632687 26900400 24792899 19019038 12264818
39447 12264818 6991177 4314720 4080877 5216701 6712678 9017089 13284393 18069612
39439 18069612 18604536 11970418 1909388 -4585803 -5051592 -2959744 -1880669 -1814050
39431 -1814050 -1319597 439682 4080490 8658312 9907619 4500681 -3430299 -5548826
39423 -5548826 -480012 4423929 4883116 6152398 12983125 19947262 19211412 13461172
39415 13461172 12597211 19438159 26604220 27277254 21982651 14221188 6083080 -137156
39407 -137156 -1696273 654868 2413514 964920 -1627990 -2518451 -1382001 1195571
39399 1195571 5183778 9563592 12194274 12458717 11723133 10705760 8994060 7236772
39391 7236772 6603366 5819505 2300647 -3121785 -6165407 -4721217 -1213103 1478179
39383 1478179 3082776 4196504 5081814 7055998 11276102 15267932 14899419 10901818
39375 10901818 8570176 9299584 8055893 2401918 -1675750 1970389 9917234 13741938
39367 13741938 11614184 9113573 9766052 10928302 9541279 6869375 5915620 7376577
39359 7376577 9346774 8824364 3396570 -5980722 -13844927 -14736815 -9318368 -3501280
39351 -3501280 -1269042 -1209154 -619562 396233 689089 1085503 2977692 5410212 6157157
39342 6157157 5010839 3623607 2320314 -254012 -3401979 -2825353 4539235 14928758
39334 14928758 20061378 16135468 8503827 5812356 10919651 19255521 24647287 24458491
39326 24458491 20145406 15673607 14988652 18151960 20024891 15587416 6476362 -756646
39318 -756646 -2526902 -482711 3852842 11275951 20316313 26212826 27518588 28378561
39310 28378561 30247269 27031844 14725492 1324057 -1134716 7463120 15630931 16452430
39302 16452430 15053599 18022796 23292060 24891628 22057830 18565815 16716279 16614297
39294 16614297 18712360 22690277 25631375 25171962 23102063 22569719 23326545 23254883 23045484
39285 23045484 25244587 29547914 33402725 37059174 43346230 51623773 56690266 55896066
39277 55896066 53350140 54008767 56887536 58037717 57693612 59257099 61873981 59814036
39269 59814036 51319648 43669788 45579939 56443732 66643548 68089475 61825886 55402963
39261 55402963 55196810 61613187 69643428 73240670 70463225 64878504 61095735 59445163
39253 59445163 56883122 52615765 49749260 50560253 53127613 54356372 53723315 51844245
39245 51844245 47893785 41584430 35786352 33305363 31987319 27269557 19752306 15827105
39237 15827105 19225864 25811081 29369595 29435098 29771437 31252204 30974775 28416208 27847667
39228 27847667 32416990 38852006 41234329 38781247 36683019 39061026 43730163 44949583
39220 44949583 39489859 28805804 16895407 7718611 3602219 4182024 7073797 10598266
39212 10598266 14952159 19566984 21236335 17701234 12008443 9739243 12022482 15008539
39204 15008539 16591224 19076780 23374988 25278598 21418336 15681360 14942240 19903996
39196 19903996 24691769 25101145 23101508 22787407 25540909 30228752 35074372 37640564
39188 37640564 35063937 26314915 13759673 1720145 -6382111 -9903656 -10843706 -11321569
39180 -11321569 -10487092 -5280853 4345821 12791171 14087482 8868979 3198410 1031231
39172 1031231 940218 120136 -1821748 -3789819 -4910968 -4195387 -850215 4055995 8217482
39163 8217482 10985230 13571848 16041241 16663117 14970858 12834588 11414541 9418205
39155 9418205 5545633 578666 -3862395 -6524109 -5972669 -1614451 3874891 6160548
39147 6160548 4500017 2308022 1258567 -1323871 -6998095 -12235363 -13485566 -12763881
39139 -12763881 -13568480 -13649154 -7434343 4693898 14720480 16104832 11233314 8019952
39131 8019952 11106789 18064813 23331353 24396858 23443910 22980208 21544422 16248526
39123 16248526 8998699 6013933 9525826 13974558 13467131 9421880 6776405 5857004
39115 5857004 3464252 79816 -213689 3212446 6315395 6936625 7303000 8726796 8908601
39106 8908601 6620191 4656860 5641739 8532471 11428894 14043940 15107579 11624827
39098 11624827 4173080 -776902 1978048 9553161 15272292 17212500 18086321 19017423
39090 19017423 18983215 19488431 23920969 31335922 35684630 33031021 26073893 19952819
39082 19952819 16666249 15238734 14409169 12888222 9018401 2469173 -4691124 -9930569
39074 -9930569 -12433206 -12917653 -12657170 -12802906 -12771129 -9449098 -956341 8516185 11586725
39065 11586725 6943852 1626293 1556876 4175582 4433241 3803007 7225940 13742676 17384872
39056 17384872 16783908 16602751 18463870 17735516 12001733 6031556 4269390 4256791 2652386
39047 2652386 2581450 8294770 16043170 17863898 13167738 9402131 11022705 14365131
39039 14365131 14762276 12902100 11801105 12048138 12543875 12471666 10648422 6304690 2156218
39030 2156218 3087957 9811293 17169683 20569063 20525024 18930075 15067014 8496071 2338598
39021 2338598 25763 1289596 4216967 8265306 12277677 13109447 10115940 7651048
39013 7651048 8759218 9713502 5826719 -576167 -3883632 -3876465 -3700928 -1710436 5999511
39004 5999511 15716873 18471620 13926599 12465202 19699615 27683680 27193200 21062087
38996 21062087 17820693 17972903 15532141 9925183 7148081 9601906 12826188 13401030
38988 13401030 13323819 14585398 15196943 13456393 11670224 12370385 14008607 13592941 11408769
38979 11408769 10069636 10064553 8858414 4174779 -3359521 -10629919 -14283114 -13159709
38971 -13159709 -9239335 -5657725 -3389731 -637487 4217480 10096214 14204193 14767331
38963 14767331 12528741 10425849 11831395 17685974 24856649 28678125 27785761 25165175
38955 25165175 23891236 23653368 22635150 20723309 18541533 14826554 8091466 766730
38947 766730 -1843961 1784029 6468474 6368221 2199757 -396462 1233713 3864646
38939 3864646 3880032 2445936 3370059 8006824 14538224 20738777 24902306 25192784 21228793
38930 21228793 16088776 13610740 13373884 11560991 7483799 5351935 7505145 9749010
38922 9749010 7116080 1456092 -1366539 -223182 616725 -731447 -1110446 964041
38914 964041 1376103 -3281533 -9456210 -11138764 -8163254 -5332074 -4543011 -2731906 2072941
38905 2072941 7124406 8976021 7909183 6509520 6203748 6950652 8387876 9554089
38897 9554089 9148576 7652653 7443153 9053634 9238014 5127581 -1271313 -5552826 -6709118
38888 -6709118 -7197022 -7840050 -6461364 -2109856 2965619 6884210 10381237 13568253
38880 13568253 13632543 8883324 2992861 1580060 5318472 9603451 10776363 9572640
38872 9572640 8178118 7145098 6564755 7595678 10591126 13283816 13294921 11903119 12891058
38863 12891058 17047805 19706096 15395882 4399304 -6926132 -12590423 -12286697 -9633309
38855 -9633309 -7053627 -4620872 -2818246 -2945755 -4125034 -3248217 88091 1266122
38847 1266122 -3834538 -12595607 -18031498 -16736681 -11683066 -7298422 -4323649 28505
38839 28505 8408221 19816585 28763426 29225247 21309894 12487070 9746563 12207805
38831 12207805 14523459 15297856 17188488 19987126 19920023 16484055 13853875 13701518 12529133
38822 12529133 8771853 6550375 8380983 9682963 5837571 274586 -529123 3147791
38814 3147791 5833100 5958531 6766188 9177624 10216255 8625350 6361931 4114705
38806 4114705 737650 -2234364 -983084 4329006 8665847 9096083 7957015 7309842
38798 7309842 5277876 840659 -2081561 661314 7125303 11049138 8666742 1807207
38790 1807207 -4220134 -4539515 1370609 8368798 10383457 7277530 4368534 4712461
38782 4712461 5853421 5525335 5817534 8759849 11874780 11755495 8797483 4904211 -130752
38773 -130752 -6027581 -9153898 -6994629 -2977245 -2164478 -4429800 -6564694 -8400943
38765 -8400943 -11113952 -12036291 -8429911 -5151901 -10254512 -22056054 -28674194 -23183240
38757 -23183240 -12221601 -5906093 -5609100 -6444047 -6257109 -6152441 -5936496 -5183728 -6332745
38748 -6332745 -10804155 -13724488 -8642535 2788137 11431903 11718243 7364862 5005383
38740 5005383 6595249 10102431 13813847 16803891 17369778 14290748 9248916 5921836
38732 5921836 6410814 9414349 11914655 12187782 11091556 10437228 10398046 9481463 7240489
38723 7240489 5230340 4063717 1660152 -2906636 -5464092 -722357 9745055 17603751
38715 17603751 17261803 11914776 8290754 8598741 10311746 11112379 10462073 7943538 3852729
38706 3852729 819653 1344229 3757574 3863605 902993 -1322799 -55454 2902142
38698 2902142 4780199 6018888 8500681 11738631 13575478 13476628 12543067 11074492 8856407
38689 8856407 7552047 9766399 14950910 18816662 18324851 15349477 13517962 12885209
38681 12885209 10322711 4902189 233410 296275 4509654 8440233 8770376 6330707
38673 6330707 4554305 6077816 10664059 15215030 15822700 11282423 5032058 2143791
38665 2143791 3645756 5467428 4242233 2116733 3180828 6533156 6878613 2453907
38657 2453907 -1734181 -832609 2939840 3904784 1687495 2029764 8549741 17366265 21627265
38648 21627265 19074744 13199427 8441876 6486317 6751496 8249722 10058708 11029818
38640 11029818 10275301 8143618 6156838 5499594 5720433 5460222 4419129 3788795 4448741
38631 4448741 5659462 6149751 5517834 3649995 -40314 -5007075 -7864532 -4732158
38623 -4732158 3933971 12431411 14937584 11142801 6429795 6912613 14197826 24149942
38615 24149942 30615396 30905544 27515880 24235593 21890372 19350739 17288680 18017080
38607 18017080 21714672 25639136 27592271 27644449 26074462 22788343 19811607 20760134
38599 20760134 25566438 28756226 25830961 18990385 13620078 11464437 10674194 10323961
38591 10323961 10505441 9377677 4998066 -319171 -2266288 -1250236 -1709752 -3847112
38583 -3847112 -1753948 7465870 17731487 21366900 18880230 16622548 17144498 17276847
38575 17276847 15013120 12887444 13347114 14898920 14853391 13092385 11152300 9798563
38567 9798563 9628322 12196575 17694035 22229766 20558527 12570955 5076018 5283974
38559 5283974 13097263 21417251 24036642 21557165 18704274 17403144 14855487 8737212
38551 8737212 2195577 1597176 9117102 18852067 21637084 14155978 2626512 -3369131
38543 -3369131 -288612 7314918 13519708 16990856 19134262 19619573 17260785 13635419
38535 13635419 11539698 10256884 6933140 3132716 4620308 12099786 17240031 12560605
38527 12560605 1951375 -4014180 -1370393 4298135 7484373 9070475 11593254 13811496
38519 13811496 13401545 11543834 11219756 12937588 15113478 17104745 19008910 19692627
$$ [...]
##END NTUPLES=NMR SPECTRUM
##END=
