##TITLE=1H_LR-724-R2-CR15
 200.13MHz, CDCl3
 8 sc
 
 19ns.26.2.2025
##JCAMPDX= 6.0         $$ Bruker NMR JCAMP-DX V2.0
##DATA TYPE= NMR FID
##DATA CLASS= NTUPLES
##ORIGIN= UXNMR, Bruker Analytische Messtechnik GmbH
##OWNER= pz
$$ XWIN-NMR		Version 3.5
$$ Wed Feb 26 16:06:55 2025 Russian Standard Time (UT+4h)  new_Human@DPX200
##.OBSERVE FREQUENCY= 200.1313
##.OBSERVE NUCLEUS= ^1H
##.DELAY= (6, 6)
##.ACQUISITION MODE= SIMULTANEOUS
##.ACQUISITION SCHEME= undefined
##.AVERAGES= 8
##.DIGITISER RES= 18
##SPECTROMETER/DATA SYSTEM= spect
##.PULSE SEQUENCE= zg30
##.SOLVENT NAME= CDCl3
##.SHIFT REFERENCE= (INTERNAL, CDCl3, 0, 14.3821)
##AUDIT TRAIL= $$ (NUMBER, WHEN, WHO, WHERE, WHAT)
$$ ##TITLE= Audit trail, XWIN-NMR		Version 3.5
$$ ##JCAMPDX= 5.01
$$ ##ORIGIN= Bruker BioSpin GmbH
$$ ##OWNER= new_Human
$$ C:/Bruker/XWIN-NMR/data/yarkov/nmr/H-C/1/audita.txt
$$ ##AUDIT TRAIL=  $$ (NUMBER, WHEN, WHO, WHERE, WHAT)
(   1,<2025-02-26 16:04:52.68 +0400>,<new_Human>,<DPX200>,
      <created by zg, POWCHK disabled, PULCHK disabled
       configuration hash MD5:
       00 E9 B6 7A A2 85 ED C7 34 08 36 98 17 FE 4E 26
       data hash MD5: 16K
       29 C0 33 FC 3B 0C C0 B4 73 D6 DD E7 F1 F2 70 14>)
$$ ##END=
$$ 
$$ hash MD5
$$ 95 CE 40 9C 15 39 96 90 97 B8 D7 41 D4 AC F5 38
##$RELAX= 
##$RELAX= 
##$RELAX= 
##$RELAX= 
##$RELAX= 
##$RELAX= 
$$ Bruker specific parameters
$$ --------------------------
##$DU= <C:/Bruker/XWIN-NMR>
##$EXPNO= 1
##$NAME= <H-C>
##$PROCNO= 1
##$TYPE= <nmr>
##$USER= <yarkov>
##$AMP= (0..31)
100 100 100 100 100 100 100 100 100 100 100 100 100 100 100 100 100 100 
100 100 100 100 100 100 100 100 100 100 100 100 100 100 
##$AQSEQ= 0
##$AQ_mod= 1
##$AUNM= <au_zg>
##$AUTOPOS= <>
##$BF1= 200.13
##$BF2= 200.13
##$BF3= 200.13
##$BF4= 200.13
##$BF5= 200.13
##$BF6= 200.13
##$BF7= 200.13
##$BF8= 200.13
##$BYTORDA= 1
##$CFDGTYP= 0
##$CFRGTYP= 5
##$CHEMSTR= <none>
##$CNST= (0..31)
1 1 145 1 1 1 1 1 1 1 1 1 1 1 1 1 1 1 1 1 1 1 1 1 1 1 1 1 1 1 1 1 
##$CPDPRG= <>
##$CPDPRG1= <>
##$CPDPRG2= <>
##$CPDPRG3= <>
##$CPDPRG4= <mlev>
##$CPDPRG5= <mlev>
##$CPDPRG6= <mlev>
##$CPDPRG7= <mlev>
##$CPDPRG8= <mlev>
##$CPDPRGB= <>
##$CPDPRGT= <>
##$D= (0..31)
0 0.7 0 0 0 0 0 0 0 0 0 0.03 0 0 0 0 0 0 0 0 0 0 0 0 0 0 0 0 0 0 0 0 
##$DATE= 1740571492
##$DBL= (0..7)
120 120 120 120 120 120 120 120 
##$DBP= (0..7)
150 150 150 150 150 150 150 150 
##$DBP07= 0
##$DBPNAM0= <>
##$DBPNAM1= <>
##$DBPNAM2= <>
##$DBPNAM3= <>
##$DBPNAM4= <>
##$DBPNAM5= <>
##$DBPNAM6= <>
##$DBPNAM7= <>
##$DBPOAL= (0..7)
0.5 0.5 0.5 0.5 0.5 0.5 0.5 0.5 
##$DBPOFFS= (0..7)
0 0 0 0 0 0 0 0 
##$DE= 6
##$DECBNUC= <off>
##$DECIM= 32
##$DECNUC= <off>
##$DECSTAT= 4
##$DIGMOD= 1
##$DIGTYP= 9
##$DL= (0..7)
0 120 120 120 120 120 120 120 
##$DP= (0..7)
150 150 150 150 150 150 150 150 
##$DP07= 0
##$DPNAME0= <>
##$DPNAME1= <>
##$DPNAME2= <>
##$DPNAME3= <>
##$DPNAME4= <>
##$DPNAME5= <>
##$DPNAME6= <>
##$DPNAME7= <>
##$DPOAL= (0..7)
0.5 0.5 0.5 0.5 0.5 0.5 0.5 0.5 
##$DPOFFS= (0..7)
0 0 0 0 0 0 0 0 
##$DQDMODE= 0
$$ [...]
##$SUBNAM0= <"">
##$SUBNAM1= <"">
##$SUBNAM2= <"">
##$SUBNAM3= <"">
##$SUBNAM4= <"">
##$SUBNAM5= <"">
##$SUBNAM6= <"">
##$SUBNAM7= <"">
##$SUBNAM8= <"">
##$SUBNAM9= <"">
##$SW= 18.0517328524113
##$SWIBOX= (0..15)
0 0 2 0 0 0 0 0 0 0 0 0 0 0 0 0 
##$SW_h= 3612.71676300578
##$TD= 16384
##$TD0= 1
##$TE= 0
##$TE2= 300
##$TE3= 300
##$TEG= 300
##$TL= (0..7)
0 120 120 120 120 120 120 120 
##$TP= (0..7)
150 150 150 150 150 150 150 150 
##$TP07= 0
##$TPNAME0= <>
##$TPNAME1= <>
##$TPNAME2= <>
##$TPNAME3= <>
##$TPNAME4= <>
##$TPNAME5= <>
##$TPNAME6= <>
##$TPNAME7= <>
##$TPOAL= (0..7)
0.5 0.5 0.5 0.5 0.5 0.5 0.5 0.5 
##$TPOFFS= (0..7)
0 0 0 0 0 0 0 0 
##$TUNHIN= 0
##$TUNHOUT= 0
##$TUNXOUT= 0
##$USERA1= <user>
##$USERA2= <user>
##$USERA3= <user>
##$USERA4= <user>
##$USERA5= <user>
##$V9= 5
##$VALIST= <valist>
##$VCLIST= <CCCCCCCCCCCCCCC>
##$VD= 0
##$VDLIST= <DDDDDDDDDDDDDDD>
##$VPLIST= <PPPPPPPPPPPPPPP>
##$VTLIST= <TTTTTTTTTTTTTTT>
##$WBST= 1024
##$WBSW= 4
##$XGAIN= (0..3)
0 0 0 0 
##$XL= 0
##$YL= 0
##$YMAX_a= 785734
##$YMIN_a= -903448
##$ZGOPTNS= <>
##$ZL1= 120
##$ZL2= 120
##$ZL3= 120
##$ZL4= 120
##$ABSF1= 10
##$ABSF2= 0
##$ABSG= 5
##$ABSL= 3
##$ALPHA= 0
##$AQORDER= 0
##$ASSFAC= 0
##$ASSFACI= 0
##$ASSFACX= 0
##$ASSWID= 0
##$AUNMP= <proc_1d>
##$AZFE= 0.1
##$AZFW= 0.1
##$BCFW= 1
##$BC_mod= 2
##$BYTORDP= 1
##$COROFFS= 0
##$CY= -3
##$DATMOD= 1
##$DC= 2
##$DFILT= <>
##$DTYPP= 0
##$F1P= 0
##$F2P= 0
##$FCOR= 0.5
##$FTSIZE= 0
##$FT_mod= 4
##$GAMMA= 1
##$GB= 0.15
##$INTBC= 1
##$INTSCL= 1
##$ISEN= 128
##$LB= 0.25
##$LEV0= 0
##$LPBIN= 0
##$MAXI= 10000
##$MC2= 0
##$MEAN= 0
##$ME_mod= 0
##$MI= 1.114404
##$NCOEF= 0
##$NC_proc= 0
##$NLEV= 6
##$NOISF1= 3.799351
##$NOISF2= 2.8
##$NSP= 1
##$NTH_PI= 0
##$NZP= 0
##$OFFSET= 14.38212
##$PC= 1
##$PHC0= -1185.74
##$PHC1= 11.39225
##$PH_mod= 1
##$PKNL= yes
##$PPARMOD= 0
##$PSCAL= 0
##$PSIGN= 0
##$REVERSE= no
##$SF= 200.129724274929
##$SI= 16384
##$SIGF1= 3
##$SIGF2= 2
##$SINO= 400
##$SIOLD= 16384
##$SREGLST= <1H.CDCl3>
##$SSB= 0
##$STSI= 0
##$STSR= 0
##$SW_p= 3205.1282051282
##$SYMM= 0
##$S_DEV= 0
##$TDeff= 0
##$TDoff= 0
##$TI= <>
##$TILT= no
##$TM1= 0
##$TM2= 0
##$TOPLEV= 0
##$USERP1= <user>
##$USERP2= <user>
##$USERP3= <user>
##$USERP4= <user>
##$USERP5= <user>
##$WDW= 1
##$XDIM= 8192
##$YMAX_p= 0
##$YMIN_p= 0
$$ End of Bruker specific parameters
$$ ---------------------------------
##NTUPLES= NMR FID
##VAR_NAME=  TIME,          FID/REAL,        FID/IMAG
##SYMBOL=    X,             R,               I
##VAR_TYPE=  INDEPENDENT,   DEPENDENT,       DEPENDENT
##VAR_FORM=  AFFN,          ASDF,            ASDF
##VAR_DIM=   8192,          8192,            8192
##UNITS=     SECONDS,       ARBITRARY UNITS, ARBITRARY UNITS
##FACTOR=    0.0002768,     1,               1
##FIRST=     0,             0,               0
##LAST=      2.2672688,     0,               0
##MIN=       0,             -903448,         0
##MAX=       2.2672688,     785734,          0
$$ Real data points
##PAGE= N=1
##DATA TABLE= (X++(R..R)), XYDATA
$$ plain form
0 0 0 0 0 0 0 0 0 0 0 0 0 -8 0 0 8 -8 8 -8 8 -16 20 -21 24 -28 32 -37 44 -45 53 -63 73 -81 89 -101 113 -127
36 -127 141 -155 174 -192 215 -234 256 -287 316 -346 382 -418 463 -511 560 -615 682 -757 841
55 841 -937 1050 -1186 1350 -1550 1800 -2127 2570 -3192 4125 -5638 8395 -14427 32743 -196172
70 -196172 -903448 -147937 246512 -278664 156873 785734 2632 -568370 60910 64436
80 64436 -461572 162993 692228 -176414 -515013 285135 170907 -505808 10380 502664
90 502664 -165319 -290743 374377 84847 -482442 58983 328827 -321709 -136841 622395
100 622395 169547 -494415 -15667 175716 -411469 -138108 574163 183675 -284956 115326
110 115326 25943 -560920 -118866 542667 75451 -248339 271152 136673 -500028 -145563
$$ packed form
0@%%%%%%%%%%%qQ%Qj6J6j6J6k4L6m1M5n2O0o9Q1q9R8j16J36j54J70j90K14k40
36a27K68k96L29l66M07m49M90n43O03o62P28q00Q81r74J071j175J297j439J598
55H41j778J987k236K536k900L350l927M697n762P317r763J4033k2822M7170k28915
70a96172p07276P55511L94449n25176M35537O28861p83102n71002O29280L526
80F4436n26008O24565N29235q68642l38599Q00148j14228o76715N16188M92284
90E02664o67983j25424O65120k89530n67289N41425K69844o50536J84868P59236
100F22395m52848o63962M78748J91383n87185K73361P12271l90488m68631M00282
110A15326q9383n86863M42054O61533m67216l23790N19491j34479o36701L54465
$$ plain form
120 -145563 390847 2681 -139897 322294 76303 -439879 -33291 294019 -180003 -153113
130 -153113 401003 119011 -403946 -53741 188336 -214897 -104888 372220 101415 -248281
140 -248281 81369 113302 -315167 -95601 357625 52462 -207568 160652 150018 -276806
150 -276806 -110225 214375 -61511 -176745 185654 121088 -211885 -2141 186208 -153963
160 -153963 -179721 216739 126678 -177954 24517 152823 -155590 -129961 206540 94173
170 94173 -121745 69566 75633 -235498 -129453 191412 56599 -99240 113612 91048 -197917
181 -197917 -101695 129087 -12509 -81481 138264 87293 -142855 -16141 136297 -50923
191 -50923 -99590 101808 43226 -125812 12365 108821 -69038 -76678 92033 12521 -107055
$$ packed form
120a45563N36410l88166j42578M62191k45991n16182M06588L27310m74022K6890
130a53113N54116k81992n22957L50205K42077m03233J10009M77108k70805l49696
140b48281L29650L1933m28469K19566M53226l05163k60030L68220j0634m26824
150b76806J66581L24600k75886j15234L62399o4566l32973K09744J88349l40171
160a53963k5758L96460r0061l04632K02471J28306l08413K5629L36501j12367
170I4173k15918J91311O067l11131J06045L20865j34813j55839K12852k2564k88965
181a97917R6222K30782j41596o8972K19745n0971k30148J26714J52438j87220
191e0923m8667K01398n8582j69038J38177R6456j77859p640J68711p9512j19576
$$ plain form
202 -107055 35804 85256 -84374 -63094 83907 9788 -59003 77526 83350 -76655 -47713
213 -47713 55973 -26801 -58825 73779 63470 -64074 -21891 44637 -47138 -63184 50112
224 50112 29151 -56321 8130 55014 -33088 -34417 54773 17260 -48328 18227 49457 -26250
236 -26250 -20402 40507 -1033 -37924 21538 23066 -44671 -21732 29246 -14518 -38205 22038
248 22038 29479 -19154 -5081 20063 -13161 -15425 26859 14589 -14253 17237 31442 -15194
260 -15194 -23468 11960 3402 -22184 -4655 7128 -11466 -7139 8321 -7656 -13898 9078 7676
273 7676 -12299 958 21041 6390 -5308 8999 11774 -696 463 3407 -5897 -5734 1091 -6431
287 -6431 -11526 -260 2247 -9903 -9341 2496 3282 -1272 1802 4738 3887 5589 5826 1656 3542
$$ packed form
202a07055J42859M9452j69630K1280J47001p4119o8791J36529N824j60005K8942
213d7713J03686q2774l2024J32604j0309j27544M2183O6528r1775j6046J13296
224E0112k0961q5472O4451M6884q8102j329Q9190l7513o5588O6555L1230p5707
236b6250N848O0909m1540l6891N9462J528o7737K2939N0978m3764k3687O0243
248B2038P441m8633J4073K5144l3224k264M2284j2270k8842L1490J4205m6636
260a5194q274L5428q558k5586J7529J1783j8594M327J5460j5977o242K2976j402
273G676j9975J3257K0083j4651j1698J4307K775j2470J159K944r304J63O825p522
287f431n095J1266K507j2150N62J1837P86m554L074K936q51J702K37m170J886
$$ plain form
302 3542 8488 4250 -2469 -1864 -284 -3976 -6919 -6179 -5083 -3475 -2176 -2575 -2229 501 1492 -625
318 -625 -633 2600 4806 5660 6578 5963 4633 3090 484 -2471 -3866 -3512 -2977 -3856 -3069 -1884 -2739 -3561
336 -3561 -3828 -3378 -2790 222 3214 4026 4385 7389 7089 1809 -495 1892 1637 151 1332 673 -2113
353 -2113 -1403 -1312 -7863 -9449 -2941 -2541 -7269 -1346 8092 6947 3369 4680 455 -3961 1013 3762
369 3762 -683 5545 15953 6286 -8344 -3883 -295 -11835 -13097 -3092 -3796 -3917 7462 6724 -4362
384 -4362 1873 7691 -9236 -13221 9550 13806 -1825 4032 15673 4299 -1658 6562 -5060 -20604
398 -20604 -7820 -1186 -15762 -2556 26456 12192 -15444 -5264 997 -18066 -9921 15821 9286
411 9286 3680 22748 13043 -17669 -4392 16805 -9421 -21104 9694 9463 -18570 -5937 13843
$$ packed form
302C542M946m238o719O05J580l692k943P40J096J608J299l99L46K730R91k117
318f25qL233K206Q54R18o15j330j543k606k955j395L54N35q79P87J185q55q22
336c561k67M50N88L012K992Q12L59L004l00n280k304K387k55j486J181o59k786
353b113P10R1o551j586O508M00m728N923R438j145l578J311m225m416M974K749
369C762m445O228J0408r667j4630M461L588j1540j262J0005p04j21J1379p38j1086
384d362O235N818j6927l985K2771M256j5631N857J1641j1374n957Q220j1622j5544
398b0604J2784O634j4576J3206K9012j4264k7636J0180O261j9063Q145K5742o535
411I286n606J9068r705l0712J3277K1197k6226j1683L0798k31k8033J2633J9780
$$ plain form
424 13843 -6535 -8235 16215 -1781 -28623 -1227 16575 -11190 -2689 36920 18843 -17328
436 -17328 -35 7072 -23091 -11808 23592 4051 -13995 16211 11572 -31260 -16495 18113
448 18113 -10148 -25670 18190 24475 -11819 712 19415 -17423 -22370 25347 20800 -14421 7848
461 7848 20288 -27416 -28936 26891 22956 -14518 -278 759 -42429 -25554 33821 24645 -5176
474 -5176 17047 9673 -42213 -27649 27378 17021 -4175 23822 18028 -25129 -8782 23522 -10787
487 -10787 -31486 7492 11804 -19555 2290 29647 -6707 -27110 4144 4434 -16322 11544 27110
500 27110 -14226 -23691 17132 18299 -2848 17318 23298 -22119 -37719 -7229 -1716 -3289 26216
513 26216 30005 -10814 -21010 -3063 -16720 -26630 8496 27957 8188 5027 16907 168 -18120
$$ packed form
424A3843k0378j700K4450j7996k6842K7396J7802k7765Q501L9609j8077l6171
436a7328J7293P107l0163J1283L5400j9541j8046L0206m639m2832J4765L4608
448A8113k8261j5522M3860O285l6294J2531J8703l6838m947M7717m547l5221K2269
461G848J2440m7704j520N5827l935l7474J4240J037m3188J6875N9375r176k9821
474e176K2223p374n1886J4564N5027j0357k1196K7997n794m3157J6347L2304l4309
487a0787k0699L8978M312l1359K1845K7357l6354k0403L1254K90k0756K7866J5566
500B7110m1336r465M0823J167k1147K0166N980m5417j5600L0490N513j573K9505
513B6216L789m0819j0196J7947j3657r910L5126J9461j9769l161J1880j6739j8288
$$ plain form
526 -18120 -6279 3031 -1005 10506 17822 -6619 -24808 -8805 5868 3252 7574 13002 -5034
539 -5034 -27282 -23884 -2768 16061 26153 23161 4857 -14131 -14661 -4759 -954 1143 11286 14271
553 14271 344 -5664 4550 -723 -22922 -22264 -1646 6760 13093 23913 8048 -24219 -22671
566 -22671 -794 2654 13289 36220 15992 -30195 -26154 4414 4567 8219 30051 9033 -35642
579 -35642 -28214 -2446 -8177 6301 41238 17251 -30668 -16443 5599 -17389 -10063 33328 21066
592 21066 -12750 8971 19532 -20392 -18787 15919 -6483 -28516 17606 33252 -14733 -16087
604 -16087 14820 -14808 -33650 18027 30433 -15817 -6766 21324 -15339 -25797 33856 34824 -19542
617 -19542 -7294 16773 -28812 -34233 30002 28699 -16768 6742 22023 -35096 -38737 20849 10252
$$ packed form
526a8120J1841R310m036J1511P316k4441j8189J6003J4673k616M322N428j8036
539e034k2248L398K1116J8829J0092k992j8304j8988n30R902L805K097J0143K985
553A4271j3927o008J0214n273k2199O58K0618Q406O333J0820j5865l2267J548
566b2671K1877L448J0635K2931k0228m6187M041L0568J53L652K1832k1018m4675
579c5642P428K5768n731J4478L4937k3987m7919J4225K2042k2988P326M3391j2262
592B1066l3816K1721J0561l9924J605L4706k2402k2033M6122J5646m7985j354
604a6087L0907k9628j8842N1677J2406m6250R051K8090l6663j0458N9653R68n4366
617a9542J2248K4067m5585n421O4235j303m5467K3510J5281n7119l641N9586j0597
$$ plain form
630 10252 -25114 20112 39152 -21583 -23475 27920 1753 -31921 18179 31974 -24750 -13179
642 -13179 33603 -6155 -35708 20014 24489 -33920 -13783 29698 -13795 -34738 24467 24468 -24956
655 -24956 4969 36273 -20011 -34824 24735 16792 -26907 13554 41676 -17919 -30188 20344
667 20344 -479 -38407 10352 33138 -21661 -17634 31205 -2129 -37819 13452 29577 -23080
679 -23080 -8999 36129 -2909 -31476 19748 24842 -24441 -2274 32587 -16099 -37670 16803
691 16803 16027 -27742 2786 34477 -14917 -30537 17254 7878 -27726 9829 34337 -13295 -17397
704 -17397 27397 6950 -29120 7314 25832 -18964 -16118 23810 608 -26951 8770 17026
716 17026 -23538 -10699 25825 -2158 -24925 11945 16389 -18355 -2274 27856 -372 -17741
$$ packed form
630A0252l5366M5226J9040o0735j892N1395k6167l3674N0100J3795n6724J1571
642a3179M6782l9758k9553N5722M475n8409K0137M3481m3493k0943N9205Jm9424
655b4956K9925L1304n6284j4813N9559p943m3699M0461K8122n9595j2269N0532
667B0344k0823l7928M8759K2786n4799M027M8839l3334l5690N1271J6125n2657
679b3080J4081M5128l9038k8567N1224N094m9283K2167L4861m8686k1571N4473
691A6803p76m3769L0528L1691m9394j5620M7791r376l5604L7555K4508m7632m102
704a7397M4794k0447l6070L6434J8518m4796K846L9928k3202k7559L5721Q256
716A7026m0564J2839L6524k7983k2767L6870M444l4744J6081L0130k8228j7369
$$ plain form
728 -17741 12468 8627 -20983 406 23572 -6889 -18332 11496 4000 -22507 -977 18495
740 18495 -7870 -12664 12630 3309 -15965 5840 16769 -8442 -6873 16918 4023 -13519 5733
753 5733 12040 -10932 -8139 10306 -1403 -12419 4680 5559 -12631 -4715 10950 -1590 -9540
766 -9540 6358 6864 -7492 -1 11662 791 -3966 7006 3657 -8014 -257 6734 -3762 -6470
780 -6470 3202 162 -8191 -1047 3110 -4195 -3465 4602 1626 -3617 2567 5719 -817 -381 5389 2473
796 2473 -1307 2795 2626 -3244 -2756 161 -3486 -5250 -439 1171 -1825 -1084 1761 -100 -1393 16
812 16 31 -1093 1774 4098 2599 2891 4701 2117 -1990 -2606 -2301 -3321 -3329 -1389 -31 763 1693 145
830 145 -2470 -2252 -1626 -2408 -1633 1945 4622 4199 4255 3639 1351 -710 -2450 -4079 -3819 -442 1510 258
$$ packed form
728a7741L0209l841k9610K1389K3166l0461j1443K9828p496k6507K1530J9472
740A8495k6365m794K5294r321j9274K1805J0929k5211J569K3791j2895j7542J9252
753E733O307k2972K793J8445j1709j1016J7099Q79j8190P916J5665j2540p950
766i540J5898N06j4356P491J1663j0871m757J0972l349j1671P757O991j0496k708
780f470R672l040q353P144M157p305P30Q067k976n243O184L152o536M36N770k916
796B473l780M102j69n870M88K917l647j764M811J610k996P41K845j861j293J409
812A6J5j124K867K324j499K92J810k584m107o16L05j020qJ940J358P94R30j548
830A45k615K18O26p82P75L578K677m23N6o16k288k061j740j629K60L377J952j252
$$ plain form
848 258 1023 2272 -242 -4243 -4255 -2937 -2860 -683 2864 3510 4220 5714 3245 -1562 -1109 85 -2748
865 -2748 -3305 2353 3203 36 681 1694 -3133 -5617 -2670 -3329 -4504 1917 5681 740 1049 5478
881 5478 1411 -3922 137 3117 -1741 -700 5854 2206 -2286 1978 248 -8172 -4958 2250 -2489
896 -2489 -4629 4811 5226 -3992 -924 4972 -2037 -4796 4076 3355 -2384 4906 9445 -2198 -4668
911 -4668 4064 -2133 -11739 -2069 5837 -3015 -1641 8244 954 -8806 21 1909 -8739 -1695 11308
926 11308 2399 -3639 9577 8571 -7623 -4115 5672 -5225 -9096 5728 4383 -7293 2275 8915
940 8915 -6529 -8757 6093 -1374 -14435 835 12138 -37 1376 14449 2479 -11764 -31
953 -31 3111 -10736 -1431 14009 448 -9220 7836 5819 -14599 -6901 7059 -5749 -8712 10758
$$ packed form
848B58P65J249k514m001j2J318P7K177L547O46P10J494k469m807M53J194k833
865b748n57N658Q50l167O45J013m827k484K947o59j175O421L764m941L09M429
881E478m067n333M059K980m858J041O554l648m492M264j730q420L214P208m739
896b489k140R440M15r218L068N896p009k759Q872p21n739P290M539j1643k470
911d668Q732o197r606R670P906q852J374R885p290r760Q827J888j0648P044J3003
926A1308q909o038J3216j006j6194L508R787j0897l871J4824j345j1676R568O640
940H915j5444k228J4850p467j3061J5270J1303j2175J413J3073j1970j4243J1733
953c1L142j3847R305J5440j3561r668J7056k017k0418P698J3960j2808k963J9470
$$ plain form
967 10758 7234 -8927 3324 11904 -7307 -6412 13741 2519 -15359 1760 11166 -6665 -2971
980 -2971 15435 203 -15584 -464 890 -16706 -1745 20162 2785 -8915 9793 3840 -19277
993 -19277 -4024 16742 165 -5247 14674 4630 -16827 317 12474 -10031 -9264 14124 530
1006 530 -18377 3687 12712 -11452 -6633 16576 618 -14890 7341 8810 -15622 -1987 21367
1019 21367 1852 -9445 13575 4765 -25462 -8338 15433 -3740 -6782 19624 7080 -22759
1031 -22759 -6027 9012 -12908 -5686 24480 7416 -18044 4563 12567 -15279 -5733 24052
1043 24052 3890 -19253 3737 6847 -18021 -2603 23490 -332 -15388 10089 3035 -26434
1055 -26434 -4761 22519 -1005 -9628 19076 10578 -20210 -3747 12901 -11438 -8198 22970
$$ packed form
967A0758l524j6161J2251Q580j9211Q95K0153j1222j7878J7119R406j7831L694
980b971J8406j5232j5787J5120J354j7596J4961K1907j7377j1700J8708n953k3117
993a9277J5253K0766j6577n412J9921j0044k1457J7144J2157k2505P67K3388j3594
1006E30j8907K2064R025k4164M819K3209j5958j5508K2231J469k4432J3635K3354
1019B1367j9515j1297K3020q810l0227J7124K3771j9173l042K6406j2544k9839
1031b2759J6732J5039k1920P222L0166j7064k5460K2607Q004k7846R546K9785
1043B4052k0162k3143K2990L110k4868J5418K6093k3822j5056K5477p054k9469
1055b6434K1673K7280k3524q623K8704q498l0788J6463J6648k4339L240L1168
$$ plain form
1067 22970 7488 -18918 4333 13502 -20064 -15003 19789 5328 -17304 6227 11155 -18233
1079 -18233 -7037 21121 563 -12589 16380 10498 -25319 -9074 21258 -491 -10637 19105
1091 19105 11307 -23766 -10600 9024 -11831 -8142 25651 10223 -21809 -1038 12853 -16515
1103 -16515 -12977 23773 11398 -16012 4108 12871 -13999 -7094 19519 -172 -17509 9959
1115 9959 12042 -20933 -9610 19892 -887 -16985 10709 13126 -15123 -6004 12664 -8544 -11994
1128 -11994 19883 13924 -14605 636 15532 -14106 -19318 14371 12460 -11360 2166 11191 -14313
1141 -14313 -13902 13712 3444 -13645 8438 13922 -15458 -11230 17973 5825 -13505 6271 12468
1154 12468 -10652 -5692 12932 -2586 -13155 8568 8309 -14387 -2428 16222 -5143 -17963
$$ packed form
1067B2970j5482k6406K3251R169l3566N061L4792j4461k2632K3531M928k9388
1079a8233J1196K8158k0558j3152K8969n882l5817J6245L0332k1749j0146K9742
1091A9105p798l5073J3166J9624k0855L689L3793j5428l2032K0771J3891k9368
1103a6515L538L6750j2375k7410K0120Q763k6870O905K6613j9691j7337K7468
1115I959K083l2975J1323K9502k0779j6098K7694K417k8249R119J8668k1208l450
1128a1994L1877n959k8529J5241J4896k9638n212L3689j911k3820J3526R025k5504
1141a4313M11K7614j0268j7089K2083N484k9380M228K9203j2148j9330J9776O197
1154A2468k3120M960J8624j5518j0569K1723k59k2696J1959J8650k1365j2820
$$ plain form
1166 -17963 5573 9572 -8646 60 13289 -3723 -10313 7587 4324 -9392 5309 14803 -7239
1179 -7239 -12466 7947 4552 -11397 -33 9517 -5060 -7692 6049 551 -8557 4304 8203
1192 8203 -8521 -5205 11856 3270 -8562 3273 8362 -5576 -4776 7041 849 -5611 3372 2067
1206 2067 -9178 -2239 8495 -1601 -7661 3912 4306 -6994 -3297 6725 1616 -1610 4614 2197
1220 2197 -4806 998 5244 -3299 -3936 5157 1963 -6907 -2158 3535 -1396 -3075 2214 375 -3436
1235 -3436 794 2271 -2650 -1056 5118 1851 -3055 1972 4225 -1177 -2243 1190 -312 -2916 360
1250 360 902 -2115 -627 1600 -1649 -3174 924 1432 -2201 -820 2235 1084 168 2747 2452 209
1266 209 213 282 -2489 -2478 866 727 -928 -254 1050 -895 -2322 -1127 -734 -1368 -209 717 628 1492 2779
$$ packed form
1166a7963K3536L999j8218Q706J3229j7012o590J7900l263j3716J4701R494k2042
1179g239n227K0413l395j5949J1364R550j4577k632J3741n498r108J2861L899
1192H203j6724L316J7061q586j1832J1835N089j3938Q00J1817o192o460Q983j305
1206B067j1245O939J0734j0096o060J1573L94j1300L697J0022n109l226O224k417
1220B197p003N804M246q543o37R093l194q870M749N693m931j679N289j839l811
1235c436M230J477m921J594O174l267m906N027K253n402j066L433j502k604L276
1250C60N42l017J488K227l249j525M098N08l633J381L055j151r16K579k95k243
1266B09MO9k771J1L344j39j655O74J304j945j427J195L93o34J159R26q9Q64J287
$$ plain form
1285 2779 1636 -194 309 148 -928 -1178 -21 566 28 630 100 -976 -1485 -1323 -1761 -1807 -349 701
1303 701 1023 1355 1967 1350 309 176 -175 -188 112 681 814 674 89 -125 -939 -1863 -1309 -1222 -1157 56
1323 56 748 740 665 137 128 278 299 276 433 1071 1482 963 336 45 -598 -1701 -1920 -1139 -593 -243 406 23
1345 23 -125 -129 -706 -1070 -627 487 1315 1259 1991 1745 1066 137 -946 -1277 -1257 -715 -289 -130 914 1223 -158
1366 -158 -1717 -1561 -954 -1346 -990 763 1977 2015 2176 1365 498 226 -88 -1936 -1770 508 1439 508 146
1385 146 1031 -219 -2645 -2780 -2307 -1772 167 1910 1182 1428 2977 1300 -1512 -1193 805 61 -1111
1402 -1111 997 2164 1230 628 -209 -2327 -2562 -869 -1802 -2583 1267 3419 511 -1414 1086 1442 -1010
1419 -1010 -1098 -29 -199 854 2953 1456 -75 1828 616 -4794 -4675 544 946 -1666 608 2272
$$ packed form
1285B779j143j830N03j61j076k50J157N87n38O02n30j076n09J62m38m6J458J050
1303G01L22L32O12o17j041j33l51j3L00N69J33j40n85k14q14r24N54Q7O5J213
1323E6O92qp5n28rJ50K1k3J57O38M11n19o27k91o43j103k19P81N46L50O49l83
1345B3j48mn77l64M43J114Q28n6P32k46o79r29j083l31K0N42M26J59J044L09j381
1366a58j559J56O07l92L56J753J214L8J61q11q67k72l14j848J66K278R31r31l62
1385A46Q85j250k426j35M73N35J939J743p28K46J549j677k812L19J998p44j172
1402a111K108J167r34o02q37k118k35J693r33p81L850K152k908j925K500L56k452
1419a010q8J069j70J053K099j497j531J903j212n410J19N219M02k612K274J664
$$ plain form
1435 2272 53 -864 198 -1368 -1887 2244 2045 -1559 952 5264 1525 -3138 70 1301 -2763 -2834
1451 -2834 620 -488 -576 2474 524 -3652 -599 2577 -2649 -4213 1987 3932 -531 672 4483
1466 4483 1351 -1869 111 -1653 -4073 985 4020 -1506 -1860 3513 592 -5757 -2564 1793 -1636
1481 -1636 -1637 3290 2400 -1006 2186 2333 -3318 -1449 4848 658 -4400 935 3588 -2087 -2006 3421 407
1498 407 -4182 -501 -639 -4660 -651 5317 1211 -2465 3243 2907 -5055 -2995 3255 1190 -804 3839
1514 3839 2723 -3614 -973 2083 -3266 -3939 2807 1778 -4636 -571 3988 -579 -2769 2485 1053
1529 1053 -3160 982 3624 -1731 -1745 4046 1732 -2843 1765 3368 -3647 -5026 223 -424 -1586 4203
1545 4203 4571 -2745 -3961 -310 -2848 -3070 4620 6694 -325 -1769 939 -1728 -2485 3771 4108 -1707
$$ packed form
1435B272k219r17J062j566n19M131j99l604K511M312l739m663L208J231m064p1
1451b834L454j108q8L050j950m176L053L176n226j564O200J945m463J203L811
1466D483l132l220J980j764k420N058L035n526l54N373k921o349L193M357l429
1481a636jM927q90l406L192J47n651J869O297m190n058N335K653n675Q1N427l014
1498D07m589L681j38m021M009N968m106l676N708l36p962K060O250k065j994M643
1514C839j116o337K641L056n349o73O746j029o414M065M559m567k190N254j432
1529A053m213M142K642n355j4N791k314m575M608J603p015j379N249o47j162N789
1545D203L68p316j216L651k538k22P690K074p019j444K708k667p57O256L37n815
$$ plain form
1561 -1707 -1971 -468 -3232 -3070 4161 4133 -2102 -2640 -712 -3439 -2404 3602 3332 -287 996 1943 -1307
1578 -1307 -1368 2307 303 -3524 -828 2695 1307 291 953 -2448 -4825 -1319 1428 743 1814 2484
1594 2484 -1961 -4389 -492 2891 3139 2854 1657 -2090 -3602 -949 582 1534 3264 2207 -2559 -4205
1610 -4205 -2339 -395 197 1736 1560 218 -715 -1171 -1820 125 2406 1934 329 563 1162 -677 -1202
1627 -1202 -815 -178 606 1680 -295 -1518 -297 -32 -2483 -1593 1538 1250 -144 173 350 -783 778
1644 778 1589 -71 274 2648 457 -3242 -1582 736 -445 -167 2215 857 -1931 -1846 -1931 -2430 590
1661 590 3806 1419 -1396 425 715 -1730 -132 3431 1480 -1060 -404 -732 -2067 706 2129 -1292
1677 -1292 -2287 666 162 -2671 -718 2139 -200 -1914 805 1468 415 1650 1563 -1821 -1517 2053
$$ packed form
1561a707k64J503k764J62P231k8o235n38J928k727J035O006k70l619J283R47l250
1578a307o1L675k004l827K696L523j388j016O62l401k377L506K747o85J071O70
1594B484m445k428L897L383K48k85j197l747j512K653J531R52J730j057m766j646
1610d205J866J944N92J539j76j342r33m56o49J945K281m72j605K34N99j839n25
1627a202L87O37P84J074j975j223J221K65k451Q90L131k88j394L17J77j133J561
1644G78Q11j660L45K374k191l699J660K318j181K78K382j358k788Q5q5m99L020
1661E90L216k387k815J821K90k445J598L563j951k540O56l28j335K773J423l421
1677a292r95K953n04k833J953K857k339j714K719O63j053J235q7l384L04L570
$$ plain form
1693 2053 894 -1967 323 1468 -1996 -2255 1056 1070 -497 269 -459 -3308 -1070 2240 942 -165
1709 -165 2289 2142 -1643 -870 1861 348 -1074 550 11 -1440 774 1744 -971 -1856 152 -572 -2724
1726 -2724 -509 1955 421 -486 1317 629 -385 1056 1214 -1713 -727 1519 208 -1048 1424 1764
1742 1764 -1249 -1579 -482 -1354 -1380 551 337 -788 916 1704 -344 -1026 835 1070 -873 32 1380
1759 1380 176 605 846 -483 -1808 -159 -29 -1926 -1104 928 457 -1214 268 493 -671 -519 613
1776 613 -102 163 1401 1198 206 289 1267 -397 -1848 -246 25 -713 -168 632 -377 -706 -203 -893 -1643
1795 -1643 -136 827 -4 576 1823 1332 -27 21 198 -711 -503 25 178 22 733 474 -831 -733 -641
1814 -641 -1210 -1597 0 540 414 969 1402 563 73 124 -50 -173 -91 723 640 413 851 -29 -896 -1191 -891
$$ packed form
1693B053j159k861K290J145l464k59L311J4j567P66p28k849K238L310j298j107
1709a65K454j47l785P73K731j513j422J624n39j451K214R70k715q85K008p24k152
1726b724K215K464j534r07J803o88j014J441J58k927R86K246j311j256K472L40
1742A764l013l30J097q72k6J931k14j125J704P88k048o82J861K35j943R05J348
1759A380j204M29K41j329j325J649J30j897Q22K032m71j671J482K25j164J52J132
1776F13p15K65J238k03r92Q3R78j664j451J602K71p38N45Q00j009l29N03o90p50
1795a643J507R63q31N80J247m91j359M8J77r09K08N28J53j56P11k59j305R8R2
1814f41n69l87J597N40j26N55M33q39m90N1j74j23Q2Q14q3k27M38q80q67k95L00
$$ plain form
1835 -891 -1182 -1037 -33 551 68 1023 704 13 -36 -359 -179 -90 563 988 811 696 561 -82 -862 -1525
1855 -1525 -1041 -913 -591 319 667 65 300 71 -671 -425 217 115 -17 783 1733 1014 294 305 -712 -734
1875 -734 -624 -338 -497 126 777 -69 -455 78 -263 -1005 -1139 494 279 656 1335 764 436 592 287 -955
1895 -955 -864 376 94 -642 232 1138 -64 -1232 -511 -571 -1427 -383 617 38 857 2226 734 -861
1913 -861 319 316 -931 -804 1075 838 -246 380 395 -1108 -593 299 -1448 -1993 255 742 -841 443
1931 443 2188 459 -951 269 472 -836 286 1541 349 -51 1643 125 -2547 -886 392 -1663
1947 -1663 -1438 1241 1028 -918 274 732 -1864 -1018 1515 486 -1039 1614 1844 -1066 -864 1806
1963 1806 36 -1790 289 455 -2326 -847 2022 191 -1153 1097 255 -3278 -1128 2198 261
$$ packed form
1835h91k91J45J004N84m83R55l19o91m9l23J80Q9O53M25j77j15j35o43p80o63
1855a525M84J28L22R10L48o02K35k29p42K46O42j02j32Q00R50p19p20J1j017k2
1875g34J10K86j59O23O51q46l86N33l41p42j34J633k15L77O79n71l28J56l05j242
1895i55R1J240k82p36Q74R06j202j168P21o0q56J044J000n79Q19J369j492j595
1913h61J180lj247J27J879k37j084O26J5j503N15Q92j747n45K248M87j583J284
1931D43J745j729j410J220K03j308J122J255j192m00J694j518k672J661J278k055
1947a663K25K679k13j946J192M58k596Q46K533j029j525K653K30k910K02K670
1963A806j770j826K079J66k781J479K869j831j344K250q42l533K150L326j937
$$ plain form
1978 261 -365 2728 1474 -1585 -168 1963 -1162 -1937 1196 540 -1889 1006 2427 -1362 -2248 789
1994 789 -428 -2435 935 2294 -1124 -1152 2285 764 -905 2104 1889 -2084 -2032 1266 -162 -1279
2010 -1279 2436 2076 -2483 -1805 846 -1625 -2700 1481 2156 -1172 75 1985 -1098 -2009 1958 1527
2026 1527 -1707 414 2727 -1301 -2303 2020 874 -2135 217 2136 -1794 -2900 726 -232 -1693
2041 -1693 1618 2849 -1502 -1963 1768 426 -1982 1442 2736 -1297 -757 2314 -97 -2475 416
2056 416 477 -2543 -368 3172 -99 -2892 -20 76 -2723 6 3578 1099 -1426 522 -430 -2235
2072 -2235 1353 3602 -62 -2062 589 -294 -2477 359 2743 -306 -2186 192 -464 -1937 827
2087 827 1930 -1333 -892 2151 763 -1082 1359 1617 -1865 -2094 1510 1493 -182 1180 179 -3411
$$ packed form
1978B61o26L093j254l059J417K131l125p75L133o56k429K895J421l789q86L037
1994G89j217k007L370J359l418k8L437j521j669L009k15l973N2L298j428j117
2010a279L715l60m559O78K651k471j075M181O75l328J247J910l083r11L967m31
2026A527l234K121K313m028j002M323j146l009K352J919l930j106L626r58j461
2041a693L311J231m351m61L731j342k408L424J294m033N40L071k411k378K891
2056D16O1l020K175L540l271k793K872R6k799K729L572k479k525J948r52j805
2072b235L588K249l664k000K651q83k183K836K384l049j880K378o56j473K764
2087H27J103l263M41L043j388j845K441K58l482k29L604j7j675J362j001l590
$$ plain form
2103 -3411 -1778 1280 36 -804 1592 714 -2764 -1305 1626 900 52 1605 448 -1491 -101 1269
2119 1269 -519 -315 1580 493 -2000 -265 993 -972 -2017 92 351 -570 1258 1380 -616 -1005
2135 -1005 525 -140 -540 1695 2106 -619 -1311 173 -127 -474 686 1219 -1076 -873 -403 -1295 -1371 758
2153 758 937 -114 394 1364 -163 -1257 -111 591 65 287 1103 117 -532 -110 -422 -1014 17 645
2171 645 -276 -1261 -402 -185 -465 350 1535 990 49 5 -829 -837 268 1007 649 953 725 -344 -1579 -1162
2191 -1162 35 -111 -29 476 187 -37 -343 -550 -444 41 493 817 550 628 309 -170 -238 418 727 334
2211 334 -633 -631 -800 -226 -92 374 583 105 -360 -849 -747 -108 898 894 893 1129 588 -543 -774 10 293
2232 293 -124 406 289 -62 -84 -79 -589 -858 -180 285 -275 -161 648 423 -23 329 940 133 -175 -236 -375
$$ packed form
2103c411J633L058j244q40K396q78l478J459K931p26q48J553j157j939J390J370
2119A269j788K04J895j087k493J735J258j965j045K109K59r21J828J22j996l89
2135a005J530o65m00K235M11k725o92J484l00l47J160N33k295K03M70q92p6K129
2153G58J79j051N08R70j527j094J146P02n26K22Q16r86o49M22l12n92J031O28
2171F45r21r85Q59K17k80Q15J185n45r41m4q34qJ105P39l58L04k28j069j235M17
2191a162J197j46Q2N05k89k24l06k07J06M85M52L24k67P8l19m79o8O56L09l93
2211C34r67Kj69N74J34M66K09m78m65m89J02O39J006mjK36n41j131k31P84K83
2232B93m17N30j17l51k2Nn10k69O78M65n60J14Q09k25m46L52O11q07l08o1j39
$$ plain form
2253 -375 -69 350 691 448 60 -215 -913 -1508 -901 218 -61 44 775 360 -139 48 -183 -301 -55 391
2273 391 497 369 1093 914 -308 -480 -165 -425 -873 -79 68 -214 -49 431 -46 -127 233 -299 -706 -292
2293 -292 842 1002 404 628 607 -366 -501 -450 -551 -161 261 53 -74 -88 417 -546 -438 -288 -518 -385 4
2314 4 784 655 419 374 -119 -286 81 -453 -482 -264 392 201 -16 17 -208 -898 -901 -191 -218 -34 486 574 216
2337 216 418 472 -12 -407 -24 -117 160 253 611 318 -142 -401 -420 -649 -419 -106 -10 -73 84 627 340 318
2359 318 -100 -238 -147 210 379 594 410 275 -173 -456 -570 -314 -645 -611 -221 166 -49 72 103 -77 42
2380 42 -247 -319 212 552 425 428 110 269 -66 -378 -348 -180 -138 197 161 40 -169 -40 -364 -573 -7 244
2402 244 91 132 417 179 301 461 -205 -262 -280 53 98 -159 226 71 -317 -264 -43 -522 -817 -326 -219 -154
$$ packed form
2253c75L06M19L41k43l88k75o98n95O07J119k79J05P31m15m99J87k31j18K46M46
2273C91J06j28P24j79j222j72L15k60m48P94J47k82J65M80m77q1L60n32m07M14
2293b92J134J60n98K24k1r73j35N1j01L90M22k08j27j4N05r63J08J50k30J33L89
2314DP80j29k36m5m93j67L67n34k9K18O56j91k17L3k25o90lP10k7J84N20Q8l58
2337B16K02N4m84l95L83r3K77R3L58k93m60k59j9k29K30L13R6o3J57N43k87k2
2359C18m18j38R1L57J69K15j84j35m48k83j14K56l31L4L90L87k15J21L1j80J19
2380D2k89p2N31L40j27Ll18J59l35l12L0J68M2L35l6j21k09J29l24k09N66K51
2402B44j53M1K85k38J22J60o66n7j8L33M5k57L85j55l88N3K21m79k95M91J07O5
$$ plain form
2424 -154 343 784 43 541 497 -337 -904 -106 506 197 200 343 -112 -633 -258 -415 -668 25 404 -220 -480
2445 -480 179 744 -219 93 558 16 -430 57 176 -375 473 424 5 -124 305 -360 -1390 -387 284 -43
2465 -43 -69 666 427 -701 -283 117 -361 279 1641 518 -458 291 307 -670 -703 658 163 -764 90 28
2485 28 -1113 -339 720 -318 -247 727 221 -1266 -401 1006 227 10 1076 716 -800 -133 191 -550
2503 -550 -291 1134 665 -1042 -362 -28 -1348 -957 936 889 -142 458 395 -975 -411 974 358 -347
2521 -347 1193 683 -1084 -997 427 57 -643 424 643 -787 -976 -73 -752 -651 1360 1511 -420 66
2539 66 1025 -686 -1349 827 1364 182 44 269 -1202 -1194 452 239 -704 582 840 -724 -1454 277
2557 277 218 -531 741 1385 -168 -381 273 -499 -890 855 1485 -100 -157 405 -558 -1658 -359 839
$$ packed form
2424a54M97M41p41M98m4q34n67P98O12l09LJ43m55n21L75j57k53O93L79o24k60
2445d80O59N65r63L12M65n42m46M87J19n51Q48m9m19j29M29o65j030J003O71l27
2465d3k6P35k39j128M18M00m78O40J362j123r76P49J6r77l3J361m95r27Q54o2
2485B8j141P74J059j038P1R74n06j487Q65J407p79k17J066l60j516O67L24p41
2503e50K59J425m69j707O80L34j320L91J893m7j031O00o3j370N64J385o16p05
2521c47J540n10j767Q7J424l70p00J067K19j430j89R03o79J01K011J51j931M86
2539F6R59j711o63K176N37j182j38K25j471QJ646k13r43J286K58j564p30J731
2557B77n9p49J272O44j553k13O54p72l91J745O30j585n7N62r63j100J299J198
$$ plain form
2575 839 204 9 685 -469 -741 -28 690 -288 661 1399 -196 -1037 -175 584 -317 414 1071 257 -501
2594 -501 -179 -621 -865 -269 854 18 -133 727 157 -1074 -642 153 222 700 882 400 -337 -437 -300 -309
2614 -309 124 1024 321 -463 -814 -321 -493 -385 419 319 -463 -194 -82 -344 -1 615 486 90 673 564
2634 564 -242 -529 -165 -25 -248 83 772 54 -470 -517 -902 -738 340 983 529 -149 -454 -303 -559 662
2654 662 1103 466 -200 -410 -736 -553 -85 768 -121 -738 -114 -755 -417 -124 264 -57 -79 421 316 -109
2674 -109 110 -95 -565 -482 226 1073 721 176 179 -1074 -1037 6 444 437 213 -320 -991 -668 414 690 315
2695 315 273 115 -809 -616 66 932 317 292 263 -820 -643 72 -165 -674 133 508 -192 -375 235 -507 -692
2716 -692 70 329 261 323 728 33 -714 3 392 -250 -116 531 -325 -709 -82 241 -137 -39 281 -545 -382
$$ packed form
2575H39o35j95O76j154k72P13P18r78R49P38j595q41Q62P59r01P31O57q14p58
2594e01L22m42k44N96J123q36j51Q60n70j231M32P95O9M78J82m82p37j00J37r
2614c09M33R00p03p84l51M93j72J08Q04j00p82K69J12k62L43O16j29l96N83j09
2634E64q06k87L64J40k23L31O89p18n24m7l85J64J078O43m54o78l05J51k56J221
2654F62M41o37o66k10l26J83M68Q53q89o17O24o41L38K93L88l21k2N00j05m25
2674a09K19k05m70Q3P08Q47l52n45Lj253L7J043M38pk24n33o71L23J082K76l75
2695C15m2j58r24J93O82Q66o15k5k9j083J77P15k37n09Q07L75p00j83O10p42j85
2716f92P62K59o8O2M05o95p47P17L89o42J34O47q56l84O27L23l78R8L20q26J63
$$ plain form
2737 -382 126 -35 -147 -25 682 417 -172 136 -228 -719 -180 313 -56 -74 551 -114 -593 -504 26 -134 21
2758 21 222 16 -152 316 322 307 -22 280 -232 -487 392 378 224 -68 310 -433 -552 48 -279 -672 -215 320
2780 320 142 -151 409 442 -240 -275 -42 -89 22 442 89 -222 116 113 -437 -395 -45 66 -416 -213 136 -27
2802 -27 -93 474 -226 -337 -108 24 -1 87 706 293 53 53 157 -258 86 -160 -185 -47 -76 -191 117 -112 -206
2825 -206 -201 -156 -70 460 6 253 380 79 -292 17 -21 -285 -79 -214 214 66 237 50 -515 -155 43 -152
2847 -152 -48 296 265 227 -24 376 31 20 21 -172 -145 115 211 21 187 78 -227 -30 -585 -416 47 -224
2869 -224 80 58 43 229 117 -175 -195 236 59 -122 272 234 306 378 48 -31 -93 -143 -154 -157 -106 -108 118 19 216
2894 216 105 81 -120 -86 47 -10 128 207 -77 243 -188 88 -4 -86 -24 -34 -270 110 135 243 180 52 -117
$$ packed form
2737c82N08j61j12J22P07k65n89L08l64m91N39M93l69j8O25o65m79Q9N30j60J55
2758B1K01k06j68M68Oj5l29L02n12k55Q79j4j54k92L78p43j19O00l27l93M57N35
2780C20j78k93N60L3o82l5K33m7J11M20l53l11L38ln50M2L50J11m82K03L49j63
2802b7o6N67p00j11K29J32k5Q8O19m13k40%J04m15L44k46k5J38k9j15L08k29r4
2825b06NM5Q6N30m54K47J27l01l71L09l8k64K06j35M28j48J71j87n65L60J98j95
2847a52J04L44l1l8k51M00l45j1Jj93K7K60R6j90J66j09l05J97n55J69M63k71
2869b24L04k2j5J86j12k92k0M31j77j81L94l8P2P2l30p9o2n0j1lN1kK26r9J97
2894B16j11k4k01L4J33n7J38P9k84L20m31K76r2q2O2j0k36L80K5J08o3j28j69
$$ plain form
2917 -117 -134 153 -172 -165 402 219 62 -245 -75 -256 -104 52 -126 36 -77 -231 -142 -262 51 -211 98
2938 98 86 -229 250 342 427 370 -20 -63 -85 46 42 120 62 -148 -143 2 -283 -103 -88 -358 34 134 197 0 43
2963 43 -216 130 38 59 323 -37 123 273 6 -281 -38 263 -83 -163 30 -222 -225 -85 -317 395 126 322
2985 322 115 -84 -55 -5 -66 255 407 292 -490 -297 335 0 -88 198 113 -23 -70 52 -380 -432 80 179 -29
3008 -29 7 295 39 -115 182 586 214 313 95 -293 -155 64 -133 -157 153 291 -313 -180 3 -90 -155 177
3030 177 547 245 89 172 -35 -263 228 400 -24 2 208 -230 -371 -158 113 -24 177 262 -426 -328 -127
3051 -127 -93 -210 202 309 -17 -469 165 -129 124 324 26 -122 -283 114 133 -269 -142 348 -136 -234 522
3072 522 322 -279 -140 257 -164 183 725 259 -318 -212 -218 -373 36 1006 154 -653 -97 -143 -645 -231 761
$$ packed form
2917a17j7K87l25PN67j83j57l07J70j81J52J56j78J62j13j54Q9j20L13k62L09
2938I8j2l15M79R2Q5n7l90m3k2J31mP8n8k10NJ45k85J80J5k70L92J00O3j97M3
2963D3k59L46r2K1K64l60J60J50k67k87K43L01l46q0J93k52lJ40k32P12k69J96
2985C22k07j99K9N0o1L21J52j15p82J93O32l35q8K86q5j36m7J22m32n2N12R9k08
3008b9L6K88k56j54K97M04l72R9k18l88J38K19j97k4L10J38o04J33J83r3o5L32
3030A77L70l02j56Q3k07k28M91J72m24K6K06m38j41K13K71j37K01Q5o88R8K01
3051a27L4j17M12J07l26m52O34k94K53K00k98j48j61L97J9m02J27M90m84r8P56
3072E22k00o01J39L97m21L47N42m66n77J06oj55M09R70q52q07N56m6n02M14R92
$$ plain form
3093 761 -81 -551 24 -299 -690 -164 721 14 -356 106 -76 -409 380 489 -10 -106 297 -54 -641 126
3113 126 191 -696 304 480 206 -362 185 60 -734 254 839 94 -143 585 217 -530 -100 253 -198 -345
3133 -345 295 200 -550 158 515 -54 -220 386 -8 -752 -26 425 102 -31 832 287 -111 220 -58 -413
3153 -413 -161 675 263 -179 32 16 -578 -634 462 141 130 225 -185 -563 375 603 261 -274 387 156 -569
3174 -569 -66 552 -140 -175 146 -114 -509 -97 472 -410 -427 612 3 -172 54 304 -227 -368 23 -411
3194 -411 -134 306 395 -458 -248 52 -168 -215 39 176 -544 -83 181 80 155 300 355 -420 -333 420 -282 127
3216 127 612 135 -361 -158 61 -213 32 163 85 -213 -32 238 -169 -167 207 -82 -275 133 153 119 196 151
3238 151 173 -130 295 -202 -89 -22 52 -102 -280 355 -211 -393 155 153 -168 -20 252 269 40 -40 118 142 65
$$ packed form
3093G61q42m70N75l23l91N26Q85p07l70M62j82l33P89J09m99r6M03l51n87P67
3113A26O5q87J000J76k74n68N47j25p94R88N85p45k37P28l68p47M30L53m51j47
3133c45O40r5p50P08L57n69j66O06l94p44P26M51l23j33Q63n45l98L31k78l55
3153d13K52Q36m12m42K11j6n94n6J096l21j1R5m10l78R38K28l42n35O61k31p25
3174e69N03O18o92l5L21k60l95M12N69q82j7J039o09j75K26K50n31j41L91m34
3194d11K77M40Q9q53K10L00k20m7K54J37p20M61K64j01P5J45N5p75Q7P53p02M09
3216A27M85m77m96K03K19k74K45J31p8k98J81K70m07KL74k89j93M08K0l4P7m5
3238A51K2l03M25m97J13O7P4j54j78O35n66j82N48kl21J48K72J7k29q0J58K4p7
$$ plain form
3261 65 -9 -307 155 -30 181 -23 -169 21 -287 -97 -28 49 -122 -43 -21 -62 81 196 154 391 107 -78 -227
3284 -227 464 -74 161 -62 -87 88 -165 -94 -201 -332 -454 24 435 -75 -142 291 -50 -245 -114 -110 118 154
3306 154 -9 31 12 -27 -191 -2 -126 -133 -97 -78 29 1 -160 78 11 -67 -150 -34 -232 178 373 140 -51 94
3330 94 329 93 -269 123 -13 -4 -104 175 -272 102 182 -178 -230 -109 132 -232 10 272 286 236 -71 112
3352 112 24 189 -244 -692 167 367 -25 -2 -185 -20 88 29 -71 44 -141 13 80 76 76 253 181 -25 52
3375 52 91 -329 42 256 -115 -199 -50 -210 -211 -285 -135 90 -153 -17 91 51 212 -50 -227 147 -55 -42 -27
3398 -27 10 -6 -164 -49 23 -218 -159 114 351 155 26 -55 -32 -111 44 142 -46 6 120 -196 -201 83 13 -85 -232
3423 -232 21 35 183 93 -18 -452 220 196 -348 -89 221 -174 -20 -75 119 -72 95 137 -94 -279 317 -155
$$ packed form
3261F5p4k98M62j85K11k04j46J90l08J90O9P7j71P9K2m1J43J15m2K37k84j85j49
3284b27O91n38K35k23k5J75k53P1j07j31j22M78M11n10o7M33l41j95J31MK28L6
3306A54j63M0j9l9j64J89j24pL6J9J07k8j61K38o7p8q3J16j98M10J95k33j91J45
3330I4K35k36l62L92j36Rj00K79m47L74Q0l60n2J21K41l64K42K62J4n0l07J83
3352A12q8J65m33m48Q59K00l92K3j83J65J08n9j00J15j85J54O7m%J77p2k06P7
3375E2L9m20L71K14l71q4J49j60jp4J50K25k43J36J08m0J61k62j77L74k02J3J5
3398b7L7j6j58J15P2k41N9K73K37j96j29q1K3p9J55R8j88N2J14l16nK84p0r8j47
3423b32K53J4J48r0j11m34O72k4n44K59L10l95J54n5J94j91J67M2k31j85N96m72
$$ plain form
3445 -155 20 -174 57 -219 224 65 -61 19 340 256 -349 -63 360 69 -180 263 168 -214 13 140 -263
3466 -263 -124 -164 -14 -86 216 18 -7 -130 255 102 -343 131 189 -217 102 23 20 -47 -96 -92 -272 -87 173 79
3490 79 -84 -16 71 -344 -244 368 83 -107 617 123 -331 132 265 -182 -162 15 48 -369 7 224 -416 -201
3512 -201 288 -133 -332 74 -110 -362 7 29 -58 -371 433 385 -51 107 200 38 -404 442 112 -134 -120 305
3534 305 -12 -373 1 278 -453 -124 231 -201 -76 238 72 -165 238 378 -497 -319 372 226 -454 245
3554 245 133 -519 -269 135 -354 -678 119 369 -574 -161 545 90 -352 133 345 -588 -169 222 229 -143 107
3575 107 207 -416 -44 167 -164 -310 400 -20 -375 41 267 -356 11 322 38 -410 22 455 -638 -76
3595 -76 288 19 -685 17 117 -309 7 615 -121 -339 182 202 -280 4 303 -147 -136 658 -136 -402 101
$$ packed form
3445a55J75j94K31k76M43j59j26Q0L21q4o05K86M23k91k49M43r5l82K27J27m03
3466b63J39m0J50p2L02j98k5j23L85j53m45M74N8m06L19p9lo7m9Mj80J85K60r4
3490G9j63O8Q7m15J00O12k85j90P24m94m54M63J33m47K0J77L3m17L76K17o40K15
3512b01M89m21j99M06j84k52L69K2q7l13Q04m8m36J58R3j62m42Q46l30k46J4M25
3534C05l17l61L74K77p31L29L55m32J25L14j66k37M03J40q75J78O91j46o80O99
3554B45j12o52K50M04m89l24P97K50r43M13P06m55m42M85K12r33M19L91Pl72K50
3575A07J00o23L72K11l31j46P10m20l55M16K26o23L67L11k84m48M32M33j093N62
3595g6L64k69p04P02J00m26L16O08p36k18N21K0m82K84K99m50J1P94p94k66N03
$$ plain form
3616 101 218 -67 -231 593 142 -519 -65 217 -350 -125 346 -94 -692 -183 518 -283 -163 598 98 -175
3636 -175 112 235 -376 80 437 269 -315 265 158 -34 -347 226 48 -396 314 -74 -195 -21 354 -234
3656 -234 30 270 -7 -331 11 236 -166 -7 312 -15 -434 71 -77 -513 29 137 -393 -37 224 111
3676 111 -481 -71 215 -46 -136 -71 -59 -431 238 303 -311 -219 214 -58 -82 478 408 -200 -126 469 182 -316 302
3699 302 167 -156 26 496 23 255 494 -241 -415 -145 429 255 -113 35 -171 -233 189 -137 -273 -225 107
3720 107 -15 -124 131 71 126 291 217 -157 -482 -68 35 -168 -285 244 -199 -130 146 27 -104 -101 66 -252
3742 -252 12 231 348 6 272 227 30 -146 248 92 -85 -81 5 -75 144 271 21 -277 101 2 -76 36
3764 36 146 -173 -85 167 43 -270 -15 222 -237 3 85 96 -144 0 82 44 -348 200 -64 -401 135 111
$$ packed form
3616A01J17k85j64Q24m51o61M54K82n67K25M71m40n98N09P01q01J20P61n00k73
3636a75K87J23o11M56L57j68n84N80j07j92l13N73j78m44P10l88j21J74L75n88
3656b34K64K40k77l24L42K25m02J59L19l27m19N05j48m36N42J08n30L56K61j13
3676A11n92M10K86k61r0O5J2l72O69O5o14R2M33k72k4N60p0o08P4N95k87m98O18
3699C02j35l23J82M70m73K32K39p35j74K70N74j74l68J48k06o2M22l26j36M8L32
3720A07j22j09K55o0N5J65p4l74l25M14J03k03j17N29m43O9K76j19j31LJ67l18
3742b52K64K19J17l42K66m5j97j76L94j56j77MQ6q0K19J27k50k98L78r9p8J12
3764C6J10l19Q8K52j24l13K55K37m59K40Q2J1k40J44Q2l8l92N48k64l37N36k4
$$ plain form
3786 111 -425 -116 188 226 79 28 234 -114 39 9 -157 191 -193 -258 -182 36 114 42 -508 136 399 -148
3808 -148 -93 216 41 -44 178 228 93 388 98 180 -46 252 -28 97 14 152 -204 -7 187 44 -116 20
3830 20 -208 -229 -32 -173 -214 212 -3 247 33 209 -106 175 202 38 157 18 228 97 164 -133 108 111
3852 111 351 27 6 130 151 159 69 -222 -280 30 -76 -13 115 -149 -202 143 76 -124 182 -84 -112 1 29 -94
3876 -94 231 167 328 344 -70 126 -37 -40 47 -28 -1 146 -256 -152 177 -48 75 36 21 228 -105 -56 239 -71
3900 -71 6 149 83 36 -9 -212 -119 90 -14 -5 -171 -74 -148 -132 147 -71 3 -109 151 -98 28 170 255 -12
3924 -12 48 -99 55 90 -198 -183 289 -50 -13 214 70 -65 -284 -87 -304 -72 209 -59 -78 23 -18 -121
3946 -121 29 -86 102 19 -29 103 -98 -52 82 86 44 -28 62 -177 24 79 -68 -54 1 29 -150 -142 -121 87 -236
$$ packed form
3786A11n36L09L04L8j47n1K06l48J53l0j66L48l84o5P6K18P8p2n50O44K63n47
3808a48N5L09j75q5K22N0j35K95k90Q2k26K98k80J25q3J38l56J97J94j43j60J36
3830B0k28k1J97j41m1M26k15K50k14J76l15K81K7j64J19j39K10j31O7k97K41L
3852A11K40l24k1J24K1Qr0k91n8L10j06O3J28k64n3L45o7k00L06k66k8J13K8j23
3876i4L25o4J61J6m14J96j63lQ7p5K7J47m02J04L29k25J23l9j5K07l33M9K95l10
3900g1P7J43o6m7m5k03R3K09j04Rj66R7p4J6K79k18P4j12K60k49J26J42Q5k67
3924a2O0j47J54L5k88J5M72l39L7K27j44j35k19J97k17K32K81k68j9J01m1j03
3946a21J50j15J88q3m8J32k01M6J34Mm2p2R0k39K01N5j47J4N5K8j79QK1K08l23
$$ plain form
3971 -236 300 149 182 8 29 -215 -171 64 79 31 -89 178 -160 108 -66 242 7 8 -167 30 197 1
3993 1 144 68 0 -68 -188 -178 -44 -348 230 -20 181 265 102 45 -367 -198 91 78 102 48 156 262 -54 -23
4017 -23 126 -81 -262 -267 53 29 -235 205 -74 -304 -22 -133 -297 -155 56 110 -264 -91 247 103 171 -1
4039 -1 75 -5 61 116 63 82 97 -206 -73 60 114 -103 -321 -174 -70 -134 316 89 -65 56 44 -82 -172 -15
4063 -15 42 -166 146 -40 -36 -253 150 -52 -38 -103 -195 227 -33 68 186 20 72 54 -15 -224 17 42 187 259
4087 259 131 8 -237 114 64 210 18 -91 74 92 -38 -65 -238 -124 135 89 -197 55 72 -129 -199 103
4109 103 -124 70 -76 -107 -24 137 -30 -187 -85 23 -76 -219 -95 34 190 -127 77 261 12 157 130
4130 130 -84 20 238 100 -268 286 -3 -315 355 252 -169 -132 -46 -166 -277 -78 194 -7 0 -73 48 -196
$$ packed form
3971b36N36j51L3j74K1k44M4K35J5m8j20K67l38K68j74L08k35Jj75J97J67j96
3993AJ43p6o8o8j20J0J34l04N78k50K01Q4j63n7m12J69K89j3K4n4J08J06l16L1
4017b3J49k07j81nL20k4k64M40k79k30K82j11j64J42K11N4l74J73L38j44O8j72
4039aP6q0O6N5n3J9J5l03J33J33N4k17k18J47J04o4M50k27j54J21j2j26r0J57
4063a5N7k08L12j86Mk17M03k02J4o5r2M22k60J01J18j66N2j8o9k09K41K5J45P2
4087B59j28j23k45L51n0J46j92j09J65J8j30k7j73J14K59m6k86K52J7k01p0L02
4109A03k27J94j46l1Q3J61j67j57J02J08r9j43J24J29J56l17K04J84k49J45k7
4130A30k14J04K18j38l68N54k89l12O70j03m21L7Q6j20j11J99K72k01Pp3J21k44
$$ plain form
4152 -196 -24 73 79 120 103 -156 -121 5 206 -74 4 -3 -344 -42 58 152 -206 154 301 -222 34 -151 -12
4175 -12 -40 324 -105 -187 63 84 32 -99 -231 -121 39 -52 310 143 -48 -73 316 -138 61 219 -45 -72 197
4198 197 173 -266 -308 159 49 -74 218 144 98 60 142 211 232 -42 40 34 -199 -127 173 107 -73 216 -73 -198
4222 -198 108 55 -315 176 258 -311 241 -48 -158 4 156 110 65 283 47 -166 -203 123 24 -59 14 248 144
4245 144 78 -210 -57 -83 96 -42 373 -122 -10 67 180 -103 71 -126 302 229 -34 110 -271 152 -196
4266 -196 186 178 -127 -101 -163 68 27 138 92 -174 -145 14 3 23 246 190 -35 87 173 116 -67 -72 -17 -220 -57
4291 -57 214 -18 -136 -8 212 -28 167 44 60 0 -121 -137 -19 77 37 -323 -221 68 -24 -266 37 -8 -19
4314 -19 192 194 39 89 -256 88 -266 116 -51 -43 -59 -86 21 -217 -136 145 -143 -159 231 148 13 -10 -174 17
$$ packed form
4152a96J72R7OM1j7k59L5J26K01k80P8pl41L02J00R4l58L60J47n23K56j85J39
4175a2k8L64m29q2K50K1n2j31j32J10J60r1L62j67j91k5L89m54J99J58k64k7K69
4198A97k4m39m2M67j10j23K92p4m6l8Q2O9K1k74Q2ok33P2L00o6j80K89k89j25
4222a98L06n3l70M91Q2n69N52k89j10J62J52m6m5K18k36k13l7L26r9q3P3K34j04
4245A44o6k88J53k6J79j38M15m95J12P7J13k83J74j97M28p3k63J44l81M23l48
4266a96L82ql05K6o2K31m1J11m6k66K9J59j1K0K23n6k25J22Q6n7j83nN5k03J63
4291e7K71k32j18J28K20k40J95j23J6o0j21j6J18R6m0l60J02K89r2k42L03m5j1
4314a9K11Kj55N0l45L44l54L82j67Qj6k7J07k38Q1K81k88j6L90q3j35k3j64J91
$$ plain form
4338 17 29 273 37 59 244 -114 197 8 191 -73 188 66 -117 46 -145 47 -113 -241 156 232 21
4359 21 -185 96 301 -37 181 -53 -160 -57 141 -110 106 325 58 39 149 -115 -32 -36 -104 250 34 -41
4381 -41 57 -171 -116 271 141 54 167 -16 65 241 322 -105 -233 -169 112 107 22 222 -6 -11 -126 -35 -119 -15 174
4406 174 6 -152 -34 -24 32 -15 183 -340 48 -11 -301 -103 -27 -160 -52 -196 -39 -341 -299 -4 -39 38 134
4429 134 332 -99 5 -136 -58 -59 109 131 -157 -113 -140 70 -54 232 -59 -239 18 92 160 -305 314 -6 -55
4452 -55 -37 33 -17 88 -29 -73 -8 189 131 -122 238 -213 -8 -264 -174 40 158 -215 -56 -266 -59 -189 216
4475 216 -204 109 218 -142 -57 35 45 -197 -177 259 166 -40 194 175 -150 143 111 -463 -140 13 209 -135
4497 -135 -202 244 -32 160 312 131 -42 -109 176 244 -28 405 354 -284 39 270 -211 -216 2 103 -210 352
$$ packed form
4338A7J2K44k36K2J85l58L11j89J83k64K61j22j83J63j91J92j60j28L97P6k11
4359B1k06K81K05l38K18k34j07J03J98k51K16K19k67j9J10k64Q3mo8L54k16p5
4381d1R8k28N5L87j30q7J13j83Q1J76Q1m27j28O4K81nq5K00k28nj15R1q4J04J89
4406A74j68j58J18J0N6m7J98n23L88n9k90J98P6j33J08j44J57l02M2K95l5P7R6
4429A34J98m31J04j41P8jJ68K2k88M4k7K10j24K86k91j80K57P4O8m65O19l20m9
4452e5J8P0n0J05j17m4O5J97n8k53L60m51K05k56R0K14J18l73J59k10K07j30M05
4475B16m20L13J09l60Q5R2J0k42K0M36r3k06K34j9l25K93l2n74L23J53J96l44
4497a35o7M46k76J92J52j81j73o7K85O8k72M33n1o38L23K31m81nK18J01l13N62
$$ plain form
4519 352 410 60 -397 91 190 10 134 134 -33 -123 151 -213 -182 -10 226 -119 6 391 -274 -102 343 123
4541 123 -11 326 -116 -114 44 405 234 4 208 50 -38 -175 273 90 -52 162 117 -91 -478 415 373 21
4563 21 79 187 -200 -45 400 143 54 276 331 -153 -202 330 -241 -408 219 262 -276 -102 204 -334 -548 -8
4585 -8 94 -337 122 538 -251 -477 380 154 -305 149 249 -265 32 206 96 -409 92 456 -246 -215 181
4606 181 -175 -366 221 148 -276 28 676 -143 -372 106 -47 -339 71 251 -194 -262 66 -30 -506 12 336
4627 336 -252 -231 313 -56 -184 180 204 -20 -162 306 -7 -198 -1 263 -317 -64 -24 -126 -262 -157 -18
4648 -18 -315 112 214 140 -472 86 88 -466 34 220 77 -321 -39 181 -114 10 259 -88 -220 255 102
4669 102 -201 134 102 38 -192 474 200 -387 187 146 -359 69 249 50 -183 -65 84 -366 -307 270 18
$$ packed form
4519C52N8l50m57M88R9j80J24%j67r0K74l64L1J72K36l45J25L85o65J72M45k20
4541A23j34L37m42KJ58L61j71k30K04j58q8j37M48j83j42K14m5k08l87Q93m2l52
4563B1N8J08l87J55M45k57q9K22N5m84m9N32n71j67O27M3n38J74L06n38k14N40
4585hJ02m31M59M16p89k26Q57k26m59M54J00n14K97J74j10n05N01L64p02L1L96
4606A81l56j91N87p3m24L04O48q19k29M78j53k92M10J80m45o8L28r6m76N18L24
4627C36n88K1N44l69j28L64K4k24j42M68l13j91J97K64n80K53M0j02j36J05J39
4648a8k97M27J02p4o12N58Kn54N00J86j43l98K82K20k95J24K49l47j32M75j53
4669A02l03L35l2o4k30O66k74n87N74m1n05M28J80j99k33J18J49m50N9N77k52
$$ plain form
4690 18 -128 -279 -270 -385 -95 -30 86 133 138 211 -388 -241 441 45 -15 -27 -113 -147 114 209 -106 -195 -112 46 -83
4715 -83 -244 217 -283 63 72 12 140 57 450 6 193 263 257 -106 213 82 -117 -234 -32 -277 -367 -7 -147
4738 -147 51 23 113 -128 -218 -5 90 24 -15 270 -25 -89 -42 67 120 26 -137 20 122 -127 -135 -49 225 -86
4762 -86 15 -164 -94 50 -140 -166 -86 117 -207 20 1 -96 28 -38 -83 257 159 102 139 158 -117 -261 -183 140
4786 140 -168 -93 -64 139 -155 -134 117 -172 -83 149 -142 -22 -45 72 99 -324 14 -85 -18 7 -100 52 -112
4809 -112 56 100 31 -33 -205 240 17 -65 26 79 33 61 -293 -190 -59 -161 -60 -2 -22 19 34 136 -175 -282
4833 -282 -131 -12 97 -187 -53 36 -132 -182 -6 22 -57 -173 27 149 -131 -128 274 -97 -29 -207 -167 48 -42
4856 -42 32 -189 158 228 292 55 66 -16 100 114 211 -158 32 89 -78 72 240 -28 -180 -141 -127 -6 -224 151
$$ packed form
4690A8j46j51Rj15K90O5J16M7NP3n99J47O82l96o0j2q6l4K61R5l15q9Q3J58j29
4715h3j61M61n00L46Ro0J28q3L93m44J87P0ol63L19j31j99j17K02k45r0L60j40
4738a47J98k8R0k41r0K13R5o6l9K85k95o4M7J09N3r4j63J57J02k49qQ6K74l11
4762h6J01j79P0J44j90k6Q0K03l24K27j9r7J24o6m5L40r8n7L7J9k75j44P8L23
4786A40l08P5K9K03k94K1K51k89Q9K32k91J20k3J17K7m23L38r9O7K5j07J52j64
4809a12J68M4o9o4j72M45k23q2R1N3m6K8l54J03J31j02J01N8k0M1J5J02l11j07
4833b82J51J19J09k84J34Q9j68n0J76K8p9j16K00J22k80LM02l71O8j78M0K15r0
4856d2P4k21L47P0O4k37J1q2J16J4R7l69J90N7j67J50J68k68j52L9J4J21k18L75
$$ plain form
4880 151 -153 -173 -20 -8 282 140 -65 116 202 -209 36 127 -156 -300 -241 -65 -98 27 150 96 -36 92
4902 92 158 -79 -39 -72 -142 -174 184 -79 37 -29 -42 131 75 -409 -99 100 -193 89 -134 -149 208 201 88 -169
4926 -169 -42 119 132 5 256 20 8 -93 127 24 -61 -63 -153 -302 -79 249 -54 132 119 399 212 208 10
4949 10 -262 -365 265 139 90 -9 390 55 29 27 -169 -17 -86 173 -138 -55 101 76 81 -61 -110 -226 -171 296
4973 296 -126 -142 -82 97 -35 -178 -67 145 68 -131 145 -107 121 64 -190 -275 -192 17 -18 74 -87 -154 -24
4996 -24 -92 84 -352 5 -81 -50 -240 -32 -128 -298 -99 -45 -190 -56 180 -22 128 117 67 136 38 208 -122
5019 -122 -87 -128 35 -251 -114 77 95 213 8 -152 -284 -65 57 -197 275 77 137 141 90 -175 -234 -106 326
5042 326 -76 -144 384 -20 -280 72 22 97 -275 10 151 -390 169 221 121 37 88 60 -179 35 -89 95
$$ packed form
4880A51l04k0J53J2K90j42k05J81Q6m11K45R1k83j44N9J76l3J25J23n4j32J28
4902I2O6k37M0l3p0l2L58k63J16o6j3J73n6m84L10J99k93K82k23j5L57pj13k57
4926a69J27J61J3j27K51k36j2j01K20j03q5kr0j49K23L28l03J86j3K80j87mj98
4949A0k72j03O30j26m9r9L99l35k6kj96J52o9K59l11Q3J56k5Nj42m9j16N5M67
4973B96m22j6O0J79j32j43J11K12p7j99K76k52K28n7k54q5Q3K09l5R2j61o7J30
4996b4o8J76m36L57q6L1j90K08r6j70J99N4j45J34K36k02J50j1n0O9r8J70l30
5019a22L5m1J63k86J37J91J8J18k05j60j32K19J22k54M72j98O0Mn1k65n9J28M32
5042C26m02o8N28m04k60L52n0P5l72K85J41n41N59N2j00q4N1k8k39K14j24J84
$$ plain form
5064 95 15 247 132 -42 7 -139 -167 -28 251 -91 -348 257 32 -583 -7 293 232 105 411 -421 -216 130
5086 130 142 -76 166 73 -130 -547 -188 233 -399 -63 172 -2 -243 -113 142 -342 60 155 -81 95 295
5107 295 186 -93 -135 138 -137 7 161 151 -64 19 48 -200 -98 -127 32 -59 -46 -25 -156 -41 237 89 45
5130 45 -103 244 20 -15 419 -152 -190 -114 212 -344 -39 134 -167 -136 281 335 -252 -61 136 -401 246 285
5152 285 410 -135 59 20 -156 246 153 173 -321 59 64 -229 -464 -93 -22 -307 299 230 -213 71 83 -186 -222
5175 -222 220 328 -68 -67 -30 -272 -332 27 321 -23 -152 189 -48 -206 345 -137 211 420 329 -34 52 173
5197 173 155 139 197 253 -217 -123 111 28 -336 -164 122 85 -199 58 -243 -267 -97 151 -207 358 390 121 -212
5220 -212 -54 244 -236 267 219 97 94 264 -149 -336 -146 132 124 -19 -160 125 -239 -102 49 -135 -201 344
$$ packed form
5064I5q0K32j15j74M9j46k8J39K79l42k57O05k25o15N76L00o1j27L06q32K05L46
5086A30J2k18K42r3k03m17L59M21o32L36K35j74k41J30K55m84M02R5k36J76K00
5107B95j09k79m2K73k75J44J54j0k15Q3K9k48J02k9J59r1J3K1j31J15K78j48m4
5130D5j48L47k24l5M34n71l8P6L26n56L05J73l01L1M17N4n87J91J97n37O47L9
5152B85J25n45J94l9j76M02r3K0m94L80Nk93k35L71P1k85O06o9m43K84J2k69l6
5175b22M42J08l96JL7k42o0L59K94l44j29L41k37j58N51m82L48K09r1l63Q6J21
5197A73j8j6N8N6m70R4K34q3l64J72K86l7k84K57l01k4J70K48l58N65L2k69l33
5220b12J58K98m80N03m8j22lJ70m13j87J90K78qj43j41K85l64J37J51j84o6N45
$$ plain form
5242 344 238 -232 197 31 -313 -57 14 -138 -151 -47 105 -73 -42 53 109 34 -227 -78 -261 46 356 260
5264 260 -111 -218 -58 -129 -8 342 -129 102 0 -13 -351 137 -26 -81 -190 -71 -86 -194 -30 50 -106 67
5286 67 356 237 87 -200 -206 -11 -264 248 -170 -82 306 -108 -17 106 187 -166 -13 -112 -125 50 8 -87 -47 139
5310 139 32 254 -39 -33 280 167 131 141 39 -149 113 14 8 105 12 -164 58 -68 -231 211 186 207 125 -157
5334 -157 -201 -224 -100 13 278 103 -71 -6 -261 -150 -294 48 7 62 -120 145 -231 -56 -42 26 -66 141 200
5357 200 112 196 -96 -97 -53 66 -249 -227 -97 -13 -167 11 74 -49 -26 137 220 -215 -125 468 63 -113 156 73
5381 73 144 -302 -253 -161 -170 7 141 -43 235 -46 -4 -229 22 218 109 115 107 107 71 -172 -78 132 -35 -171 -48
5406 -48 259 50 240 69 -21 -66 -126 126 -414 -91 -100 199 230 62 81 241 21 -64 109 82 -101 172 -72
$$ packed form
5242C44j06m70M29j66l44K56P1j52j3J04J52j78L1R5N6p5k61J49j83L07L10r6
5264B60l71j07J60p1J21L50m71K31j02j3l38M88j63n5j09J19j5j08J64Q0j56J73
5286F7K89j19j50k87oJ95k53N12m18Q8L88m14R1J23Q1l53J53r9j3J75m2r5M0J86
5310A39j07K22k93OL13j13l6J0j02j88K62r9oR7r3j76K22j26j63M42k5K1q2k82
5334a57m4k3J24J13K65j75j74O5k55J11j44L42m1N5j82K65l76J75J4O8r2K07N9
5357B00q8Q4k92jM4J19l15K2J30Q4j54J78O3j23K3J63Q3m35R0N93m05j76K69q3
5381G3P1m46M9R2rJ77J34j84K78k81M2k25K51J96j09Oq%l6k43R4K10j67j36J23
5406d8L07k09J90j71r0m5o0K52n40L23rK99L1j68J9J60k20q5J73k7j83K73k44
$$ plain form
5429 -72 -17 149 6 128 -122 1 -90 326 168 -106 322 -24 170 311 382 198 270 132 225 280 -37 179
5451 179 -307 32 -176 -50 184 296 -1 173 102 -129 -16 -107 59 114 -178 -166 -122 -72 -314 -102 69 108
5473 108 63 -140 -131 -212 95 -18 102 55 -23 -142 -48 15 4 -206 128 -132 80 52 -96 -195 185 7 -231 177
5497 177 -118 48 -422 -20 3 -157 -75 161 -66 -122 60 -170 -69 -58 29 -218 -91 -60 -336 86 -139 -68
5519 -68 -102 -174 333 127 -379 226 131 45 -84 217 40 -161 241 192 29 38 14 124 188 234 205 108 -310 -28
5543 -28 42 148 -73 36 164 -85 1 -5 130 184 134 -178 148 82 69 -89 0 -137 -5 -85 -216 -268 6 39
5567 39 110 19 223 -51 -208 -45 283 192 -7 -102 173 -120 98 416 -164 137 126 368 -175 -228 116 68 -501
5590 -501 -12 128 -193 69 -135 -259 -247 66 -31 -230 136 199 159 -61 71 -111 -165 18 27 53 -56 200 194
$$ packed form
5429g2N5J66j43J22k50J23r1M16j58k74M28l46J94J41P1j84P2j38R3N5l17K16
5451A79m86L39k08J26K34J12k97J74p1k31J13r1J66N5k92J2M4N0k42K12J71L9
5473A08m5k03Rq1L07j13J20m7p8j19R4O3j1k10L34k60K12k8j48r9L80j78k38M08
5497A77k95J66m70M02K3j60Q2K36k27n6J82k30J01J1Q7k47J27L1k76M22k25P1
5519f8l4p2N07k06n06O05r5q6j29L01j77k01M02m9j63Rk4J10O4M6k9r7m18K82
5543b8P0J06k21J09J28k49Q6oJ35N4n0l12L26o6j3j58Q9j37J32q0j31n2K74L3
5567C9P1r1K04k74j57J63L28r1j99r5K75k93K18L18n80L01j1K42n43n3L44m8n69
5590e01M89J40l21K62k04j24J2L13r7j99L66O3m0k20J32j82n4J83RK6j09K56o
$$ plain form
5613 194 -172 70 424 -175 -145 112 104 241 266 67 -58 151 43 -162 -15 143 -41 -63 -102 -272 -272 -180 -115
5636 -115 -81 -22 147 -274 36 94 67 71 5 155 23 -126 132 190 68 112 7 -57 192 274 253 123 97 23 38
5661 38 116 23 56 -198 82 134 425 76 160 60 -144 -46 119 184 16 135 189 -124 -42 230 -130 -66 154 -36
5685 -36 -422 -17 197 264 -159 -20 266 88 -119 144 215 -19 110 -81 -175 -132 -28 200 -56 42 13 -277
5707 -277 -158 354 133 12 257 128 23 -209 -22 -101 -102 -25 -303 -113 -377 43 -123 -134 47 41 -81 92
5729 92 -123 15 -160 29 -82 206 202 208 -12 -73 153 96 102 136 -104 -81 59 5 141 122 146 -308 -9 381 224
5754 224 101 -148 -6 4 -188 -49 75 -88 54 -150 8 -27 -304 -23 65 -98 8 386 55 47 120 10
5776 10 58 232 -170 15 188 217 104 -68 184 203 143 73 133 27 -98 98 -91 192 41 -22 -7 36 205
$$ packed form
5613A94l66K42L54n99L0K57qJ37K5j99j25K09j08k05J47J58j84k2l9j70%R2O5
5636a15L4N9J69m21L10N8k7Mo6J50j32j49K58N8j22M4j05o4K49Q2k1j30k6p4J5
5661C8P8r3L3k54K80N2K91l49Q4j00k04R8J65O5j68J19N4l13Q2K72l60O4K20j90
5685c6l86M05K14O7m23J39K86j78k07K63P1k34J29j91r4M3J04K28k56R8k9k90
5707b77J19N12k21j21K45j29j05k32J87p9jP7k78J90k64M20j66j1J81oj22J73
5729I2k15J38j75J89j11K88mOk20o1K26n7OL4k40K3J40n4J36j9K4m54K99L90j57
5754B24j23k49J42J0j92J39J24j63J42k04J58l5k77K81Q8j63J06L78l31qP3j10
5776A0M8J74m02J85J73K9j13j72K52J9o0p0O0j06j25J96j89K83j51o3J5M3J69
$$ plain form
5799 205 -50 -14 -3 44 35 43 79 -137 -67 193 191 -59 -79 -267 -78 -31 51 138 -329 -165 167 -116 -21 26 125 24
5825 24 10 190 -59 174 185 -34 82 172 81 -78 -115 -214 -272 -421 -49 27 -67 8 86 -40 -28 -3 -7 333 105
5850 105 64 -350 -317 162 -152 -290 -15 -201 -91 113 -252 34 -5 -195 -165 64 -151 60 -46 -130 129 -203
5872 -203 66 -81 38 -136 -10 -69 85 154 -83 130 257 263 42 3 -21 -23 357 -219 -205 138 -59 -2 -87 -177
5896 -177 42 -52 24 140 -21 29 -113 61 -47 -44 -119 -38 -102 -9 -78 51 -242 -122 -310 210 -84 -130 170 -57
5920 -57 120 101 190 -70 -82 24 -49 -8 -60 -155 -219 -270 63 70 304 59 88 -98 116 127 186 -259 -110 -149 -92 -211
5946 -211 -181 156 106 -183 137 -109 -72 -76 -53 201 155 -141 -188 81 -224 199 254 25 186 112 -199 1 229
5969 229 -235 115 81 -171 -205 -181 205 -271 369 289 -97 7 63 -27 145 -131 191 145 51 50 -191 35 -88
$$ packed form
5799B05k55L6J1M7rQL6k16P0K60kk50k0j88J89M7Q2Q7m67J64L32k83R5M7R9j01
5825B4j4J80k49K33J1k19J16R0r1j59l7r9n8j49L72P6r4P5P8j26J2K5mL40k28
5850A05m1m14L3M79l14j38K75j86J10K04l65K86l9j90L0K29k15K11j06q4K59l32
5872b03K69j47J19j74J26n9J54O9k37K13J27Ok21l9k4kL80n76J4L43j97N7q5r0
5896a77K19r4P6J16j61N0j42J74j08Lp5Q1o4R3o9J29k93J20j88N20k94m6L00k27
5920e7J77j9Q9k60j2J06p3M1n2r5o4n1L33PK34k45K9j86K14J1N9m45J49l9N7j19
5946b11L0L37n0k89L20k46L7mK3K54m6k96m7K69l05M23N5k29J61p4l11K00K28
5969B29m64L50l4k52l4K4L86m76O40q0l86J04N6r0J72k76L22m6r4jk41K26j23
$$ plain form
5992 -88 32 -322 56 118 14 0 -13 153 -185 -108 14 -55 46 236 289 267 -3 -112 12 176 -10 133 46
6015 46 44 -241 -144 -20 -31 -247 -123 280 -160 -3 -202 32 54 111 -44 76 -52 -293 39 105 -17 355 335
6038 335 -132 -71 278 -205 28 73 180 40 95 56 56 -143 -69 230 -107 129 -282 -70 -211 75 123 -272 10
6061 10 -205 -96 74 -163 -151 9 95 -73 -110 -41 125 -189 -204 58 -157 -54 0 5 384 -33 126 66 83 -202
6085 -202 47 -100 -383 30 -37 265 309 -110 -151 110 -101 133 292 -20 57 -17 -259 234 -250 -47 294 -80
6107 -80 81 -173 -69 -93 -262 -57 -90 83 -270 -48 70 -93 -202 176 -304 -217 199 -281 -266 -86 164 -72
6129 -72 178 228 -42 -153 35 112 -87 56 278 -114 -164 97 88 67 -27 -239 -49 50 67 -160 309 2 -117
6152 -117 -201 -238 122 153 -67 -181 97 -150 -21 -64 -13 35 -42 50 -164 130 -234 -95 -233 -10 165 100 -23
$$ packed form
5992h8J20l54L78O2j04j4j3J66l38P7J22o9J01J90N3k2k70j09J24J64j86J43q7
6015D6kk85R7J24j1k16J24M03m40J57j99K34K2N7j55J20j28k41L32O6j22L72k0
6038C35m67O1L49m83K33M5J07j40N5l9%j99P4K99l37K36m11K12j41K86M8l95K82
6061A0k15J09J70k37J2J60Q6j68l7O9J66l14j5K62k15J03N4NL79m17J59o0J7k85
6085b02K49j47k83M13o7L02M4m19m1K61k11K34J59l12P7p4k42M93m84K03L41l74
6107h0J61k54J04k4j69K05l3J73l53K22J18j63j09L78m80Q7M16m80J5J80K50k36
6129g2K50N0k70j11J88P7j99J43K22l92n0K61rk1r4k12J90R9J7k27M69l07j19
6152a17q4l7L60L1k20j14K78k47J29m3N1M8p7R2k14K94l64J39j38K23J75o5j23
$$ plain form
6175 -23 -96 -49 -70 -60 280 -172 -141 -168 74 209 -61 -138 4 -332 187 -39 -181 -146 -16 -80 -159 -59 45 -123
6199 -123 -13 101 33 -237 -204 -169 -79 190 -85 219 -112 30 -228 -117 -55 201 -244 -110 145 294 -65 -19
6221 -19 49 50 350 131 -1 -256 131 -378 66 119 173 100 -228 286 -73 -52 214 3 -60 -33 154 -289 -40
6244 -40 160 -11 20 -74 349 -239 83 84 112 -150 -276 215 -64 -193 -77 -234 91 -186 -106 -131 -103 107 183
6267 183 43 -13 156 -78 -44 -7 22 -103 15 -308 -120 163 33 122 -274 -23 -83 64 -105 160 -23 -210
6289 -210 115 50 -197 -45 24 16 7 -114 13 45 -81 -27 140 -279 35 -16 -109 -11 -80 -157 -125 186 -22 70 114
6314 114 65 -108 223 330 -212 -86 216 -38 -53 -71 128 229 90 -244 -306 223 254 160 79 95 231 354 10
6337 10 -202 45 15 -137 0 -101 -40 -117 144 -146 40 243 200 231 -77 83 153 110 -101 -15 150 -213 150
$$ packed form
6175b3p3M7k1J0L40m52L1k7K42J35k70p7J42l36N19k26j42L5J30o4p9J00J04j68
6199a23J10J14o8k70L3L5R0K69k75L04l31J42k58J11O2K56m45J34K55J49l59M6
6221a9O8JL00k19j32k55L87n09M44N3N4p3l28N14l59K1K66k11o3K7J87m43K49
6244d0K00j71L1r4M23n88L22JK8k62j26M91k79j29J16j57L25k77Q0k5K8K10P6
6267A83j40n6J69k34L4L7K9j25J18l23J88K83j30Q9l96K51o0J47j69K65j83j87
6289b10L25o5k47J52O9qrj21J27L2j26N4J67m19L14n1r3R8o9p7L2L11k08R2M4
6314A14m9j73L31J07n42J26L02k54j5j8J99J01j39l34o2N29L1r4q1J6J36J23l44
6337A0k12K47l0j52J37j01O1p7K61k90J86K03m3L1l08J60P0m3k11Q6J65l63L63
$$ plain form
6360 150 -161 66 -190 -76 -17 -125 96 -194 45 30 73 -177 145 35 -9 -79 174 156 -23 -80 -73 118 -294
6383 -294 278 -43 -8 -169 -94 94 22 198 -11 65 113 -94 -246 314 88 144 -37 -281 49 -209 -13 38
6405 38 -58 -26 -100 64 75 -38 -67 42 -85 -108 2 87 -271 -19 84 -281 -168 -194 -63 47 -48 9 -143 -204
6429 -204 99 48 104 -42 -114 -170 -150 18 -281 -165 -79 -199 69 208 105 -231 135 -100 86 27 -175 172
6451 172 -74 -142 -66 16 183 -3 19 -42 150 59 -30 22 -169 7 -135 36 -175 126 18 22 -215 310 -21
6474 -21 25 -152 -21 175 -37 -61 177 -91 -252 -15 86 -24 -24 70 -79 137 -233 -99 287 -44 219 88
6496 88 -29 -126 -176 2 137 38 -42 -115 89 -329 -141 84 58 100 -30 32 -274 -183 -232 6 225 122 311 114
6520 114 16 4 142 -372 22 123 115 55 214 -121 -52 84 -214 64 -266 18 -125 120 -9 242 -264 -15
$$ packed form
6360A50l11K27k56J14N9j08K21k90K39j5M3k50L22j10m4p0K53j8j79n7PJ91m12
6383b94N72l21L5j61P5J88p2J76k09P6M8k07j52N60k26N6j81k44L30k58J96N1
6405C8r6L2p4J64J1j13k9J09j27k3J10Q5l58K52J03l65J13k6J31J10r5N7j52o1
6429b04L03n1N6j46p2n6K0J68k99J16Q6j20K68J39j03l36L66k35J86n9k02L47
6451A72k46o8P6Q2J67j86K2o1J92r1q9N2j91J76j42J71k11L01j08Mk37N25l31
6474b1M6j77J31J96k12k4K38k68j61K37J01j10%R4j49K16l70J34L86l31K63j31
6496H8j17r7n0J78J35r9q0p3K04m18J88K25k6M2j30O2l06R1m9K38K19j03J89j97
6520A14r8j2J38n14L94J01qo0J59l35O9J36k98K78l30K84j43K45j29K51n06K49
$$ plain form
6542 -15 -153 -260 -77 -14 -28 -8 176 -185 -2 135 222 -56 20 122 175 212 -36 -27 70 -49 -201 54 -155 73
6566 73 56 -111 -431 -87 49 -45 -93 3 -21 -78 15 -110 -239 -4 106 -98 -129 89 89 -171 108 184 -317 -195
6590 -195 124 -135 -89 -121 -81 -171 30 72 185 -79 189 190 -190 203 322 -43 65 57 227 -78 -117 -25 -313 123
6614 123 -57 -90 -63 -9 485 -107 -100 229 -53 -200 7 -7 -160 -10 90 150 325 210 39 -39 -128 156 -55
6637 -55 -238 101 -3 140 -141 136 25 -82 308 -158 -258 -39 32 -188 -184 42 -145 -411 113 128 -288 -11
6659 -11 179 -285 -237 253 -88 -202 36 182 -173 81 365 91 111 -298 -95 59 -163 3 160 -174 -165 -211
6681 -211 -171 -68 119 -140 -57 99 -29 -191 -142 161 -32 -239 220 203 -365 -262 151 10 -126 161 -145
6702 -145 87 -288 4 77 -281 84 -97 -97 163 303 -25 -47 85 19 133 335 112 -44 187 -21 143 -75
$$ packed form
6542a5j38j07J83O3j4K0J84l61J83J37Q7k78P6J02N3L7k48RR7j19j52K55k09K28
6566G3j7j67l20L44J36r4m8R6k4n7R3j25j29K35J10k04l1K18%k60K79P6n01J22
6590a95L19k59M6l2M0r0K01M2J13k64K68Jl80L93J19l65J08qJ70l05l9R2k88M36
6614A23j80l3K7N4M94n92PL29k82j47K07j4j53J50J00O0J75j15j71p8q9K84k11
6637e5j83L39j04J43k81K77j11j07L90m66j00K19P1k20MK26j87k66N24J5m16K77
6659a1J90m64M8M90l41j14K38J46l55K54K84k74K0m09K03J54k22J66J57l34Rm6
6681b11M0J03J87k59Q3J56j28j62M9L03j93k07M59j7n68J03M13j41j36K87l06
6702a45K32l75K92P3l58L65j81%K60J40l28k2J32o6J14K02k23j56K31k08J64k18
$$ plain form
6724 -75 22 146 25 -9 125 150 221 -3 239 -126 -185 93 -330 19 74 173 -116 -107 38 322 -319 -86 -60 10
6748 10 -296 -129 135 161 10 136 233 74 -5 -98 79 -17 20 -98 -206 -176 93 -248 192 311 -21 -8 -117
6771 -117 -115 -335 254 -226 4 -269 27 -99 -92 201 211 101 23 -9 -126 -109 180 59 33 -72 138 -215 64
6794 64 -197 -89 -169 -5 146 -117 57 100 -232 304 58 157 51 -69 170 44 30 -140 160 84 152 -45
6816 -45 -208 -180 -87 -174 -144 -39 94 -63 148 -80 41 -194 187 -214 -170 68 4 -200 -59 -4 -84 -264 -64
6839 -64 -329 -225 -123 76 39 -237 297 41 -133 75 125 -36 143 123 -272 -96 -62 205 58 -49 238 104
6861 104 -50 76 -19 -54 -185 155 -316 -118 308 -205 12 31 134 -114 -264 -171 64 96 60 56 -123 160 137
6884 137 93 -308 -108 286 151 197 -88 -135 509 11 169 57 185 -12 -122 151 -224 63 -4 39 31 52 -35
$$ packed form
6724g5R7J24j21l4J34K5P1k24K42l65n9K78m23L49N5R9k89RJ45K84o41K33K6P0
6748A0l06J67K64K6j51J26R7j59p9r3J77r6L7j18j08L0K69l41M40J19l32J3j09
6771a17Kk20N89m80K30k73K96j26PK93J0j10p8l2j17J7K89j21k6j05K10l53K79
6794F4k61J08q0J64J51k63J74M3l32N36k46R9j06j20K39j26j4j70L00p6O8j97
6816d5j63K8R3q7L0J05J33j57K11k28J21k35L81m01M4K38o4k04J41N5q0j80K00
6839f4k65J04J02J99l7k76N34k56j74K08N0j61J79k0l95J76L4K67j47j07K87j34
6861A04j54J26r5l5j31L40m71J98M26n13K17J9J03k48j50R3K35L2l6mj79K83k3
6884A37m4m01K00L94j35M6k85m7O44m98J58j12J28j97j10K73l75K87o7M3qK1q7
$$ plain form
6907 -35 342 -149 141 188 63 129 -143 32 -124 -216 -252 53 -107 -113 -383 344 -245 -10 -163 -97 -136 -156 -217 37
6931 37 -190 179 293 -243 20 102 70 -127 56 84 259 -80 -54 100 96 -164 -106 -177 -62 104 -48 198 -80
6954 -80 10 -28 -227 102 114 3 -154 34 151 -47 -26 -64 1 -388 76 -189 -80 3 110 -203 -157 -80 116
6977 116 29 -135 111 22 337 -82 64 87 -97 -395 29 -56 -39 -197 -205 246 -9 52 198 -147 -25 -123 0
7000 0 -32 -85 207 117 -289 62 186 -3 43 86 42 -65 -166 -64 73 210 -12 206 122 63 -187 -144 108 22
7024 22 -79 262 257 52 232 137 -70 179 -175 97 162 76 -123 -47 -56 66 -92 -18 97 53 206 -197 -95 55
7048 55 167 -120 8 -111 68 46 9 -168 5 63 45 -54 -100 251 20 -281 128 195 -154 192 -18 -130 9
7071 9 -249 -74 -248 125 274 64 -173 23 28 195 -237 90 -176 9 205 36 -142 -151 -76 53 -55 173
$$ packed form
6907c5L77m91K90M7j25O6k72J75j56r2l6L05j60ok70P27n89K35j53O6l9k0o1K54
6931C7k27L69J14n36K63Q2l2j97J83K8J75l39K6J54mk60N8p1J15J66j52K46k78
6954h0R0l8j99L29J2j11j57J88J17j98K1l8O5l89M64k65J09Q3J07l13M6P7J96
6977A16q7j64K46q9L15m19J46K3j84k98M24q5J7j58qM51k55O1J46l45J22r8J23
7000@l2n3K92r0m06L51J24j89M6M3m4j07j01J02J37J37k22K18q4n9k50M3K52q6
7024B2j01L41nk05J80r5k07K49l54K72O5q6j99P6rJ22j58P4J15m4J53m03J02J50
7048E5J12k87J28j19J79k2l7j77J73N8j8r9m6L51k31l01M09O7l49L46k10j12J39
7071Ik58J75j74L73J49k10k37J96NJ67m32L27k66J85J96j69j78rP5J29j08K28
$$ plain form
7093 173 210 40 70 -83 -166 -190 96 -43 352 118 -153 -221 -34 12 103 -50 43 -26 119 46 128 168 -224 108
7117 108 216 3 189 155 249 -150 -100 -73 1 -217 -205 138 -159 -29 -165 51 -41 -240 -75 52 87 -103 -113
7140 -113 -151 -11 50 -139 -152 -114 54 -61 -46 67 -19 159 -112 53 -191 -49 -159 -84 -55 145 133 19 -41
7163 -41 44 56 67 214 88 -140 107 196 16 -44 117 -27 -179 17 -95 191 337 162 -134 -345 -232 288
7185 288 -2 42 -60 -49 -29 36 136 51 59 -97 54 52 303 65 60 195 -84 112 224 -42 -50 76 50 -34 139
7210 139 -10 -95 -171 -151 -89 -55 267 95 89 -140 21 -78 156 -190 179 23 -84 229 -188 -147 39 -54 -146 -50
7234 -50 103 -5 -86 -207 -38 -181 -114 185 -120 65 142 195 165 -185 68 121 130 -206 296 178 -58 78 -109
7257 -109 51 174 46 128 111 -22 -91 -78 220 -35 130 -244 73 -196 28 60 -94 -33 107 -91 3 195
$$ packed form
7093A73L7j70L0j53q3k4K86j39L95k34k71o8J87M6R1j53R3o9J45p3Q2M0l92L32
7117A08J08k13J86l4R4l99N0K7P4k18J2L43k97J30j36K16r2j99J65J27L5j90j0
7140a13l8J40O1j89j3L8J68j15J5J13q6J78k71J65k44J42j10P5K9K00j2j14o0
7163d1Q5J2J1J47j26k28K47Q9j80o0J61j44j52J96j12K86J46j75k96k11J13N20
7185B88k90M4j02J1K0O5J00q5Qj56J51kK51k38nJ35k79J96J12k66qJ26k6q4J73
7210A39j49q5p6K0O2L4L22j72ok29J61r9K34l46L69j56j07L13m17M1J86r3r2R6
7234e0J53j08q1j21J69j43O7K99l05J85P7N3l0l50K53N3Rl36N02j18k36J36j87
7257a09J60J23j28Q2j7j33o9J3K98k55J65l74L17k69K24L2j54O1J40j98R4J92
$$ plain form
7279 195 134 101 124 -177 130 82 -149 -69 -105 98 -22 -87 -176 64 -115 218 198 103 -66 196 264 137 -7 29
7303 29 -158 -157 -134 95 160 105 46 112 87 -320 26 -70 -5 -26 348 286 -178 132 -24 -217 -379 -304 11 37 -95
7328 -95 255 220 17 44 -58 191 -163 -37 -13 37 392 -108 95 -32 271 248 -31 173 -57 -238 66 235
7350 235 11 -22 72 -294 17 193 -44 13 238 16 121 134 131 -138 -166 -80 -207 -101 -107 -135 -182 -267 124 -67
7374 -67 -40 141 44 -165 154 -22 -20 -110 -47 86 121 33 236 50 63 84 158 -264 131 -48 201 226 171 -103 -216
7399 -216 -108 134 141 71 -65 120 -227 233 89 -18 -3 -43 89 -331 -290 -51 -58 192 49 40 8 -36 -240 155
7423 155 -96 130 -14 -12 230 166 108 64 100 -52 -251 177 75 67 187 -160 -23 -292 -131 97 -215 -113 102
7446 102 3 96 -105 127 29 102 118 224 -184 90 115 -75 69 76 -66 -201 -193 -48 -57 213 218 121 49 198 -51
$$ packed form
7279A95o1l3K3l01L07m8k31Q0l6K03j20o5q9K40j79L33k0r5j69K62O8j27j44L6
7303B9j87JK3K29O5n5n9O6k5m07L46r6O5k1L74o2m64L10j56j93j62P5L15K6j32
7328i5L50l5k03K7j02K49l54J26K4N0L55n00K03j27L03k3k79K04k30j81L04J69
7350B35k24l3R4l66L11J76k37N7K25k22J05J3lk69k8Q6j27J06ok8m7q5L91j91
7374f7K7J81r7k09L19j76Kr0O3J33L5q8K03j86J3K1P4m22L95j79K49K5n5k74j13
7399b16J08K42Pp0j36J85l47M60j44j07J5m0J32m20M1K39pK50j43rl2m4k04L95
7423A55k51K26j44KK42o4n8m4L6j52j99M28j02qJ20l47J37k69J61K28l12J02K15
7446A02r9R3k01K32r8P3J6J06m08K74K5j90J44Pj42j35QJ45rK70Nr7p2J49k49
$$ plain form
7471 -51 5 -153 -21 115 -159 -19 31 141 -189 -115 -2 -59 -25 112 -283 -92 -120 -21 51 -28 -35 -179 231 72
7495 72 -80 -71 186 -12 -230 141 -175 12 47 16 -65 100 152 69 49 8 49 -54 -28 -145 168 77 378 -49
7519 -49 -14 -233 -291 -19 -206 28 107 23 88 -277 -20 61 -80 95 130 -75 -102 -143 28 311 26 -41 -145 -127
7543 -127 105 -43 215 -54 -35 141 220 -217 87 75 119 -124 60 -98 -24 132 152 -154 -216 312 -46 -60 -186
7566 -186 -116 123 66 -139 31 -23 195 144 97 -155 -168 -123 -36 322 -62 196 122 50 284 -21 -247 102 -455
7589 -455 -125 192 -73 -108 220 1 109 -44 -52 80 -154 159 -64 293 -132 25 266 -17 -33 -218 85
7610 85 -240 30 97 168 73 62 -60 360 62 310 -155 -41 315 3 -57 -1 13 21 -45 -234 67 22 131 -109
7634 -109 -4 20 -26 -19 -316 -86 217 101 -185 193 0 -331 48 111 94 109 16 -221 22 -105 93 -30 -15
$$ packed form
7471e1N6j58J32J36k74J40N0J10l30P4J13n7L4J37l95J91k8R9P2p9pj44M10j59
7495G2j52RK57j98k18L71l16J87L5l1q1J65N2q3k0m1M1j03K6j17L13r1L01m27
7519d9L5k19n8K72j87K34P9q4O5l65K57Q1j41J75L5k05k7m1J71K83k85o7j04J8
7543a27K32j48K58k69J9J76P9m37L04j2M4k43J84j58P4J56K0l06o2N28l58j4j26
7566a86P0K39n7k05J70n4K18n1m7k52j3M5Q7L58l84K58p4p2K34l05k26L49n57
7589d55L30L17k65l5L28k19J08j53qJ32k34L13k23L57m25J57K41k83j6j85L03
7610H5l25K70O7P1r5j1j22M20k98K48m65J14L56l12o0N6J4Qo6j89L01m5J09k40
7634a09J05K4m6Pk97K30L03j16k86L78j93l31L79O3j7J5r3k37K43j27J98j23J5
$$ plain form
7657 -15 -117 -85 -88 -115 -106 -27 129 -205 -46 66 92 -290 -57 -133 362 152 -205 -9 -150 -148 54 -114 237 -165
7681 -165 -191 -258 16 -164 -189 266 -23 -93 18 -313 -83 -7 -144 171 76 221 9 0 -84 -126 153 -65 -258
7704 -258 -50 31 141 26 -218 45 -3 -203 120 60 18 -38 -53 -85 21 -13 160 -212 -72 164 -91 -227 89
7727 89 -51 -15 70 -237 -112 206 231 56 34 -1 -211 -234 30 -253 76 34 -225 -152 288 -371 188 -173 -347
7750 -347 103 -174 98 33 -148 -74 85 -231 -25 -11 -126 37 30 -81 48 -248 -13 -80 -182 -51 -207 -222
7772 -222 -64 98 -35 304 82 -66 156 -137 93 2 -25 232 -153 136 -542 -102 42 -229 356 -63 -4
7793 -4 88 112 -66 -186 150 -60 12 -78 -252 81 199 202 -16 60 246 -234 41 232 -18 -166 -130 -52 21 -118
7817 -118 0 4 -136 488 105 -94 -122 39 75 44 -155 58 97 137 110 129 122 2 -148 -66 102 -79 58 -203
$$ packed form
7657a5j02L2lk7RP9J56l34J59J12K6l82K33p6M95k10l57J96j41KK02j68L51m02
7681a65k6o7K74j80k5M55k89p0J11l31K30P6j37L15r5J45k12rq4m2K79k18j93
7704b58K08Q1J10j15k44K63m8k00L23o0m2n6j5l2J06l4J73l72J40K36k55j36L16
7727H9j40L6Q5l07J25L18K5j75k2l5k10k3K64k83L29m2k59P3M40o59N59l61j74
7750c47M50k77K72o5j81P4J59l16K06J4j15J63pj11J29k96K35o7j02J31j56j5
7772b22J58J62j33L39k22j48K22k93K30r1k7K57l85K89o78M40J44k71N85m19N9
7793dR2K4j78j20L36k10P2r0j74L33J18Lk18P6J86m80K75J91k50j48L6P8P3j39
7817a18J18Mj40O24l83j99k8J61L6l1j99K13L9M0k7J9pj20j50Q2J68j81J37k61
$$ plain form
7841 -203 -30 273 140 -218 -320 0 -6 102 71 137 83 261 39 -33 -30 -93 66 -51 249 -294 -220 -119 49
7864 49 102 -132 -47 161 -14 -53 -105 -42 99 -134 237 21 -253 -219 -112 159 41 3 -123 241 -163 -47 3
7887 3 3 58 -137 -133 -180 -122 61 -24 247 -12 173 -322 381 307 145 10 -78 -1 -192 -175 141 256 -26 -44 -245
7912 -245 105 41 19 -27 112 -203 -112 26 16 178 -43 135 159 251 7 -87 38 -30 -71 -125 -297 -29 13 -174
7936 -174 -96 -190 -356 -10 79 5 25 -24 -149 -66 -8 -134 -36 159 217 181 229 -202 140 59 -208 -170 206 -131 -41
7961 -41 -15 -4 156 -260 -309 -131 97 75 -187 23 -48 58 -103 -131 -128 -140 142 50 41 -172 37 14 96 2 76 217
7987 217 191 -57 154 -87 -43 18 -79 27 43 -14 -89 -159 43 -82 -41 105 -204 69 37 -81 -90 -55 -18 80 -184
8012 -184 253 168 -39 15 -43 -169 154 -217 116 -138 -123 23 6 -104 -56 -88 97 139 -277 70 -200 -237 -32
$$ packed form
7841b03J73L03j33l58j02L20oJ08l1O6n4J78k22p2Lo3J59j17L00n43P4J01J68
7864D9N3k34Q5K08j75l9n2O3J41k33L71k16k74L4J07K71j18l8j26L64m04J16N0
7887C%N5j95Mm7N8J83q5K71k59J85m95P03p4j62j35q8P7j91J7L16J15k82j8k01
7912b45L50o4k2m6J39l15R1J38j0J62k21J78K4R2k44r4J25o8m1n4j72K68M2j87
7936a74P8r4j66L46Q9p4K0m9j25Q3N8j26R8J95N8l6M8m31L42q1k67L8L76l37R0
7961d1K6J1J60m16m9J78K28k2k62K10p1J06j61k8Lj2K82r2rk13K09k3Q2r4P4J41
7987B17k6k48K11k41M4O1r7J06J6n7p5p0K02j25M1J46l09K73l2j18rL5L7R8k64
8012a84M37q5k07N4n8j26L23l71L33k54J5J46j7j10M8l2J85M2m16L47k70l7K05
$$ plain form
8035 -32 -11 159 -54 -67 -20 -132 -253 101 -269 24 74 18 -174 -130 103 338 63 -93 -88 -153 -49 107 -131
8058 -131 137 -14 106 -90 7 169 84 -378 -179 -151 149 24 64 40 142 171 -19 372 -74 177 -144 -135 114
8081 114 -224 -89 77 9 44 -125 -108 -142 205 -203 88 165 124 114 -31 -46 88 -233 -95 -35 152 211 -202
8104 -202 -87 -1 -24 -197 339 -165 46 -174 134 -160 -184 97 192 78 0 45 -301 -42 -327 253 64 -29
8126 -29 128 -172 79 -111 43 -130 -93 -73 -50 157 198 487 -150 50 93 -73 106 -97 143 50 -257 161
8148 161 203 177 169 -78 -106 -116 -116 -55 -197 134 -44 -95 35 -69 333 62 97 -67 39 7 161 -204 169 110
8172 110 -175 12 -153 -174 -112 -375 -209 -7 50 -75 18 -302 54 420 -64 43 241 139 -12
$$ packed form
8035c2K1J70k13j3M7j12j21L54l70K93N0n6j92M4K33K35k75j56No5J04J56k38
8058a31K68j51J20j96R7J62q5m62J99K8L00j25M0k4J02K9j90L91m46K51l21RK49
8081A14l38J35J66o8L5j69J7l4L47m08K91P7m1j0j45j5J34l21J38O0J87N9m13
8104b02J15Q6k3j73N36n04K11k20L08k94k4K81R5j14p8M5l46K59k85N80j89r3
8126b9J57l00K51j90J54j73L7K0K3K07M1K89o37K00M3j66J79k03K40r3l07M18
8148A61M2k6qk47k8j0%O1j42L31j78n1J30j04M02k71L5j64J06l2J54l65L73n9
8172A10k85J87j65k1O2k63J66K02N7j25R3l20L56L66m84J07J98j02j51
8191a2
$$ Imaginary data points
##PAGE= N=2
##DATA TABLE= (X++(I..I)), XYDATA
$$ plain form
0 0 0 0 0 0 0 0 4 -8 8 -8 8 -16 24 -24 32 -40 56 -65 80 -96 113 -137 161 -192 225 -264 305 -353 407 -466
30 -466 535 -610 694 -784 883 -999 1121 -1253 1401 -1564 1742 -1937 2145 -2376 2629 -2904
46 -2904 3207 -3534 3894 -4291 4727 -5207 5738 -6330 6998 -7746 8598 -9576 10713 -12054
60 -12054 13662 -15629 18110 -21344 25748 -32131 42248 -60788 105811 -449363 -218567
71 -218567 660965 -46919 69513 564707 -79885 -778744 -8846 300003 -222576 98246
81 98246 652324 -167834 -626587 209837 348261 -407492 -59701 528139 -87643 -428239
91 -428239 254985 156863 -468167 -28778 428185 -173175 -208425 500391 148174 -609809
101 -609809 -127462 334445 -173922 -100953 571955 194496 -459263 -84750 109403 -372667
$$ packed form
0@%%%%%%Mj2J6j6J6k4M0m8N6p2R6j21J45j76K09k50K98l53M17m89N69o58P60q73
30d66J001j145J304j478J667j882K120k374K654k965L306l679M082m521N005n533
46b904O111o741P428q185R018r934J0945j2068J3328j4744J6344j8174K0289k2767
60a2054K5716k9291L3739l9454M7092n7879P4379j03036J66599n55174K30796
71b18567Q79532p07884J16432M95194o44592o98859P69898L08849n22579L20822
81I8246N54078q20158m58753Q36424J38424p55753L47791N87840o15782l40596
91d28239O83224r8122o25030M39389M56963o01360l5250P08816l52217p57983
101f09809M82347M61907n08367P2969O72908l77459o53759L74513J94153m82070
$$ plain form
111 -372667 -58838 607705 131413 -407690 67073 147480 -436340 -152820 480334 107175
121 107175 -250739 168227 96869 -409641 -56702 398938 -42749 -199937 312268 128849
131 128849 -440683 -112640 294977 -75771 -131364 317239 99323 -348207 -46767 156732
141 156732 -213939 -93093 375292 102672 -276843 55377 173632 -235079 -133367 264508
151 264508 41993 -183110 141696 156040 -214809 -79899 186985 -93136 -195407 189456
161 189456 155575 -209722 -61664 161341 -95629 -135835 204528 130936 -162768 -16082
171 -16082 93740 -158794 -93256 243716 118273 -139038 22838 75364 -187816 -118336 161892
182 161892 47969 -103136 79877 81504 -154302 -60525 141339 -15720 -114302 89101 84089
$$ packed form
111c72667L13829O66543m76292n39103M74763Q0407n83820K83520O33154l73159
121A07175l57914M18966p1358n06510L52939M55640m41687j57188N12205j83419
131A28849n69532L28043M07617l70748n5593M48603k17916m47530L01440K03499
141A56732l70671J20846M68385k72620l79515L32220J18255m08711J01712L97875
151B64508k22515k25103L24806J4344l70849J34910K66884k80121j02271L84863
161A89456l3881l65297J48058K23005k56970m0206L40363p3592k93704J46686
171a6082J09822k52534O5538L36972j25443k57311J61876N2526k63180O9480K80228
182A61892j13923j51105J83013J627k35806R3777K01864j57059r8582K03403n012
$$ plain form
193 84089 -106421 -4460 129725 -37095 -93280 83253 42296 -108564 4545 89224 -72891
204 -72891 -85117 81400 34952 -74856 33305 68514 -85781 -69710 72004 21179 -43320
215 -43320 68893 74689 -66440 -44539 53303 -15433 -56090 51297 46265 -59338 -18240 47522
227 47522 -32229 -55458 38718 22766 -53980 3092 54562 -17498 -29274 41748 17097 -33302
239 -33302 18488 36647 -30481 -21325 38416 1981 -37775 14416 27615 -30194 -27131 11448
251 11448 -10945 -21578 20532 17635 -17798 5218 27425 -12514 -22744 20602 20877 -10760 1892
264 1892 18564 -2903 -8886 6551 -5671 -18223 1476 4340 -17408 -8995 13081 -431 -15102
277 -15102 2040 11188 -1004 163 8968 3221 1783 9847 4863 -3389 4502 6562 -7487 -9320
$$ packed form
193H4089j90510J01961J34185j66820n6185J76533m0957j50860J13109Q4679j62115
204g2891j2226J66517m6448j09808J08161L5209j54295J6071J41714n0825o4499
215d3320J12213N796j41129K1901R7842o8736m0657J07387n032j05603M1098O5762
227D7522p9751k3229R4176j5952p6746N7072N1470p2060j1776P1022k4651n0399
239c3302N1790J8159o7128R156N9741l6435l9756N2191J3199n7809L063L8579
251A1448k2393j0633M2110k897l5433K3016K2207l9939j0230M3346K75l1637J2652
264A892J6672k1467n983J5437j2222j2552J9699K864k1748Q413K2076j3512j4671
277a5102J7142R148j2192J167Q805n747j438Q064m984q252P891K060j4049j833
$$ plain form
291 -9320 2110 972 -7959 -7103 -3665 -4856 -3608 -821 -1756 1534 8109 5940 403 2859 6615
306 6615 4011 1536 2801 4115 3458 1755 -1876 -4724 -4995 -5511 -8516 -8281 -3646 -580 233 1676
322 1676 1953 1685 1524 1807 2141 3110 5900 6984 5632 3852 2609 -707 -4158 -5774 -6015 -6102 -4039
339 -4039 -1860 -2108 -2754 -1131 -1132 -4060 -3194 2689 5863 5802 7238 7424 4178 3059 2348 -3167 -5278 286
357 286 1058 -5095 -3029 3808 -303 -8248 -7153 -6969 -8190 -676 6388 4173 7601 15529 6395 -8151
373 -8151 -2701 5680 -2687 -5066 6211 6442 106 4263 1626 -12084 -10067 -2279 -12727 -15686 7934
388 7934 15069 -2369 -369 13940 3940 -6279 3115 -302 -12039 1427 14527 1594 3660
401 3660 23305 4852 -28039 -18394 -1154 -13747 -9119 17147 11544 -4614 7333 4798 -21566
$$ packed form
291i320J1430j138q931Q56L438j191J248K787r35L290O575k169n537K456L756
306F615k604k475J265J314o57j703l631k848k71n16l005K35M635L066Q13J443
322A676K77k68j61K83L34R69K790J084j352j780j243l316l451j616k41q7K063
339d039K179k48o46J623jk928Q66N883L174o1J436J86l246j119p11n515k111N564
357B86P72o153K066O837m111p945J095J84j221P514P064k215L428P928r134j4546
373h151N450Q381q367k379J1277K31o336M157k637j3710K017P788j0448k959K3620
388G934P135j7438K000J4309j0000j0219R394l417j1737J3466J3100j2933K066
401C660J9645j8453l2891R645J7240j2593M628K6266n603j6158J1947k535k6364
$$ plain form
414 -21566 -8817 19699 1748 -13888 15875 21641 -9778 -4446 18298 -1188 -14678 6290
426 6290 -3006 -29451 -4902 20189 -5775 -9674 24709 9449 -30684 -12322 12049 -8946 -3050
439 -3050 32529 16579 -13254 9077 13389 -26559 -16873 22861 1540 -23587 13215 23033 -20576
452 -20576 -18461 9589 -14054 -23272 23131 25703 -16820 -3952 20295 -14601 -20014 34109 31953
465 31953 -19229 -13595 4665 -24083 -12847 41889 26927 -23324 -12270 -3373 -39970 -23807
477 -23807 37592 28075 -10850 7401 13348 -24459 -13134 26650 2050 -24608 14166 27640
489 27640 -10001 -2992 23809 -9752 -36021 -777 11096 -13742 1312 20275 -15156 -26898
501 -26898 17964 25308 -6756 1867 13711 -22015 -31430 11813 26592 11485 21601 18666 -24191
$$ packed form
414b1566J2749K8516j7951j5636K9763N766l1419N332K2744j9486j3490K0968
426F290r296k6445K4549K5091k5964l899L4383j5260m0133J8362K4371k0995N896
439c050L5579j5950k9833K2331M312l9948R686L9734k1321k5127L6802R818m3609
452b0576K115K8050k3643r218M6403K572m2523J2868K4247l4896n413N4123k156
465C1953n1182N634J8260k8748J1236N4736j4962n0251J1054Q897l6597J6163
477b3807O1399r517l8925J8251N947l7807J1325L9784k4600k6658L8774J3474
489B7640l7641P009K6801l3561k6269L5244J1873k4838J5054J8963l5431j1742
501b6898M4862P344l2064Q623J1844l5726r415M3243J4779j5107J0116k935m2857
$$ plain form
514 -24191 -34852 -5280 -4466 -14288 13845 30056 511 -13651 132 -7434 -21483 -3017 14869
527 14869 8663 10175 14267 -6469 -20210 1321 18831 9141 2011 1843 -13138 -27854 -13966
540 -13966 12104 22710 16587 2032 -16514 -26130 -14733 4240 11498 10387 13982 12869 -1539
553 -1539 -8688 1402 577 -15180 -10031 13202 17839 8749 5987 -9921 -34504 -23504 9264 15288
567 15288 10818 19163 239 -36846 -22904 20861 22890 9462 17848 1056 -36206 -21417 18102
580 18102 14927 8901 26574 1120 -45866 -27152 11908 -2819 -6553 29181 18433 -22893 -6990
593 -6990 15428 -15882 -18855 22010 12210 -16370 18009 36065 -16118 -28246 10648 -3258 -27268
606 -27268 15563 31497 -19920 -23242 14686 -6688 -23890 27100 32987 -26898 -22451 17729 -8874
$$ packed form
514b4191j0661K9572Q14r822K8133J6211k9545j4162J3783p566j4049J8466J7886
527A4869o206J512M092k0736j3741K1531J7510r690p130j68j4981j4716J3888
540a3966K6070J0606o123j4555j8546r616J1397J8973P258j111L595j113j4408
553a539p149J0090q25j5757N149K3233M637r090k762j5908k4583J1000L2768O024
567A5288m470Q345j8924l7085J3942M3765K029j3428Q386j6792l7262J4789L9519
580A8102l175o026J7673k5454m6986J8714L9060j4727l734L5734j0748m1326J5903
593f990K2418l1310k973M0865r800k8580L4379J8056n2183j2128L8894j3906k4010
606b7268M2831J5934n1417l322L7928k1374j7202N0990N887n9885M447M0180k6603
$$ plain form
619 -8874 -20276 37886 39854 -20001 -11850 16188 -26653 -35889 27620 25817 -22942 4155 30154
632 30154 -26073 -37615 21805 11870 -29659 11235 36809 -18585 -20373 32667 6386 -32945
644 -32945 15770 32714 -27132 -20590 31009 -2163 -34836 18397 28618 -27936 -13841 27385
656 27385 -16755 -39024 23324 29281 -22485 2773 38517 -15174 -36175 20935 16952 -27228
668 -27228 8951 38790 -16392 -28120 23818 3903 -39248 5228 32853 -20647 -21514 29018
680 29018 2567 -34730 13231 31691 -19804 -11389 31434 -5360 -34332 19571 30783 -20525
692 -20525 -5779 30900 -12766 -37989 12465 16762 -25173 274 31189 -13361 -28331 20004
704 20004 12807 -28164 2838 31386 -10505 -18513 25224 10922 -24334 5320 22643 -17278
$$ packed form
619h874j1402N8162J968n9855Q151K8038m2841r236O3509j803m8759K7097K5999
632C0154n6227j1542N9420r935m1529M0894K5574n5394j788N3040k6281l9331
644c2945M8715J6944n9846O542N1599l3172l2673N3233J0221n6554J4095M1226
656B7385m4140k2269O2348N957n1766K5258L5744n3691k1001N7110l983m4180
668b7228L6179K9839n5182j1728N1938j9915m3151M4476K7625n3500q67N0532
680B9018k6451l7297M7961J8460n1495Q415M2823l6794k8972N3903J1212n1308
692b0525J4746L6679m3666k5223N0454M297m1935K5447L0915m4550j4970M8335
704B0004p197m0971L1002K8548m1891q008M3737j4302l5256K9654J7323l9921
$$ plain form
716 -17278 -15414 23292 1367 -29418 3766 18577 -17385 -10664 23275 371 -23416 7430
728 7430 14793 -14721 -704 26626 -941 -19493 11064 12185 -17214 -2510 20714 -5081 -18531
741 -18531 7497 4873 -17775 -595 15348 -8374 -12659 13038 6297 -14381 3164 15766 -5606
754 -5606 -7236 14013 5661 -9976 3733 8858 -9952 -7023 10130 -881 -13198 1319 6024
767 6024 -8861 -4594 9411 336 -7570 4368 5678 -5477 763 10305 1003 -4818 5363 4106
781 4106 -5914 -990 4776 -3084 -5668 2153 115 -6962 -1881 2867 -3213 -2861 3935 2899 -1351
796 -1351 2697 3997 -936 -1011 3632 1072 -1477 2626 3512 -1146 -2361 -138 -2391 -5087 -3124 -1766
812 -1766 -2395 404 2988 1511 685 2075 733 -2281 -1146 1928 2011 2036 3574 3635 1881 -35 -2648
$$ packed form
716a7278J864L8706k1925l0785L3184J4811l5962O721L3939k2904k3787L0846
728G430P363k9514J4017K7330k7567j8552L0557J121k9399J4704K3224k5795j3450
741a8531K6028k624k2648J7180J5943k3722m285K5697o741k0678J7545J2602k1372
754e606j630K1249q352j5637J3709N125j8810K929J7153j1011j2317J4517M705
767F024j4885M267J4005r075p906J1938J310j1155O240R542r302n821J0181j257
781D106j0020M924N766p860k584P821k038p077N081M748o080L52O796j036m250
796a351M048J300m933p5M643k560k549M103Q86m658j215K223k253k696J963J358
812a766o29K799K584j477q26J390j342l014J135L074Q3K5J538O1j754j916k613
$$ plain form
829 -2648 -4767 -4522 -3091 -2557 -1543 1602 3244 1451 -212 -722 -1366 -1952 -973 118 2045 4826 6044
846 6044 3189 1507 700 -2074 -5738 -4426 -1799 -1360 -30 2255 1689 -178 -157 -1846 -5133 -2614
862 -2614 1580 1066 1150 5904 6656 1727 400 1366 -2699 -4887 -1297 -407 -1803 1745 3973 -2285 -4391
879 -4391 69 -1848 -6455 -1376 4450 1176 719 6597 4131 -2173 1093 1781 -4980 -2325 5882 1692
895 1692 -3788 2857 3122 -7226 -6087 1716 -3177 -6512 2684 5145 -2226 2444 7931 -2158 -6167
910 -6167 3812 2217 -6812 1893 11175 956 -3257 5158 -628 -12265 -3726 2853 -6303 -2325 10367
925 10367 2620 -7388 3858 6239 -8771 -6126 7854 1094 -4910 8789 9927 -4475 -352
938 -352 8044 -5966 -11186 3878 1055 -12224 409 13777 -380 -6072 6726 -758 -14944
$$ packed form
829b648k119K45J431N34J014L145J642j793j663n10o44n86R79J091J927K781J218
846F044k855j682q07k774l664J312K627M39J330K285n66j867K1j689l287K519
862b614M194n14Q4M754P52m929j327R66m065k188L590Q90j396L548K228o258k106
879d391M460j917m607N079N826l274m57N878k466o304L266O88o761K655Q207m190
895A692n480O645K65j0348J139P803m893l335R196K461p371M670N487j0089m009
910f167R979j595r029Q705R282j0219m213Q415n786j1637Q539O579r156L978J2692
925A0367p747j0008J1246K381j5010K645J3980o760o004J3699J138j4402M123
938c52Q396j4010n220J5064k823j3279J2633J3368j4157n692J2798p484j4186
$$ plain form
951 -14944 -1600 8452 -3231 906 16330 4024 -10031 4559 7112 -12795 -8069 10150 202
964 202 -8531 7456 6801 -11783 -3698 8922 -6689 -10126 10083 4952 -13426 1555 16300 -1690
978 -1690 -4779 13419 2019 -16901 -1118 7929 -8448 -469 19365 1632 -17329 63 2837
991 2837 -17596 -4750 19481 3672 -9694 8455 5286 -15629 -867 16622 -3761 -9366 13687
1004 13687 5594 -16893 1384 15543 -8840 -11605 12804 1638 -18649 1281 11196 -11676
1016 -11676 -4454 20507 3515 -15095 6169 6983 -19803 -4951 24028 5795 -8679 12867
1028 12867 5432 -25065 -9698 14089 -4105 -7257 19202 6079 -23867 -3669 14307 -9815
1040 -9815 -8437 22192 6419 -21520 308 14765 -8943 -2258 23538 1939 -21169 2770
$$ packed form
951a4944J3344J0052j1683M137J5424j2306j4055J4590K553j9907M726J8219r948
964B02q733J5987o55j8584Q085J2620j5611l437K0209n131j8378J4981J4745j7990
978a690l089J8198j1400j8920J5783R047j6377P979J9834j7733j8961J7392K774
991B837k0433J2846K4231j5809j3366J8149l169k0915J4762J7489k0383n605K3053
1004A3687q093k2487J8277J4159k4383k765K4409j1166k0287J9930R915k2872
1016a1676P222K4961j6992j8610K1264Q14k6786J4852K8979j8233j4474K1546
1028A2867p435l0497J5367K3787j8194l152K6459j3123k9946K0198J7976k4122
1040i815J378L0629j5773k7939K1828J4457k3708O685K5796k1599k3108K3939
$$ plain form
1052 2770 6908 -20672 -4662 25682 2151 -17309 8967 7817 -22673 -8543 17252 -2382
1064 -2382 -8212 20739 10500 -20458 -1423 16481 -12115 -13924 21693 10943 -19669 -957
1076 -957 12656 -14542 -10457 19523 3217 -18249 6361 10637 -22071 -9431 26222 7583 -13417
1089 -13417 11855 11307 -23389 -12235 17385 1292 -6373 21023 8750 -26877 -9489 14873
1101 14873 -9859 -13931 21136 12479 -20495 -3988 14210 -9094 -9074 19434 5470 -17728 6142
1114 6142 16028 -15358 -10568 21656 4780 -19167 5433 13527 -16132 -12175 12867 -1872 -12439
1127 -12439 15454 14152 -17544 -7559 14604 -7690 -16605 17538 19289 -11182 -4571 11294 -9447
1140 -9447 -14055 13994 8948 -14515 1091 12466 -13971 -14093 16761 8504 -15923 411 13337
$$ packed form
1052B770M138k7580J6010L0344k3531j9460K6276j150l0490J4130K5795j9634
1064b382n830K8951j0239l0958J9035J7904k8596j809L5617j0750l0612J8712
1076i57J3613k7198M085K9980j6306k1466K4610M276l2708J2640L5653j8639k1000
1089a3417K5272n48l4696J1154K9620j6093p665K7396j2273l5627J7388K4362
1101A4873k4732m072L5067q657l2974J6507J8198k3304K0K8508j3964k3198K3870
1114F142R886l1386M790L2224j6876k3947K4600Q094k9659L957K5042j4739j0567
1127a2439K7893j302l1696R985K2163k2294q915L4143J751l0471O611J5865k0741
1140i447m608K8049n046k3463J5606J1375k6437j22L0854q257k4427J6334J2926
$$ plain form
1153 13337 -8320 -8839 13644 3191 -11931 7214 12564 -10819 -5206 14775 -2185 -18707 4192
1166 4192 13419 -8098 -5595 10031 -3522 -13359 5239 7801 -8137 1758 13687 -5628 -13476
1179 -13476 8815 10253 -8405 -1224 11346 -2613 -9526 5009 2919 -8827 959 7186 -7957
1192 -7957 -7449 9847 3652 -10816 -312 9178 -4095 -5728 7713 4126 -4861 2486 4775 -5695
1206 -5695 -1682 9517 23 -9290 1571 4836 -6911 -4900 6229 2100 -4790 1217 1749 -4717
1220 -4717 65 6128 -804 -3659 5183 4348 -5219 -1300 5861 612 -3638 1165 860 -4133 -1090
1235 -1090 1465 -2782 -2378 3627 1168 -4079 359 4366 -1186 -2867 2102 2101 -774 1855 2866 -557
1251 -557 -390 1612 -1365 -3624 70 1076 -2901 -2554 1560 495 -1186 960 1658 -1256 -960 241
$$ packed form
1153A3337k1657n19K2483j0453j5122J9145N350k3383N613J9981j6960j6522K2899
1166D192R227k1517K503J5626j3553r837J8598K562j5938R895J1929j9315p848
1179a3476K2291J438j8658P181J2570j3959o913J4535k090j1746R786O227j5143
1192g957N08J7296o195j4468J0504R490j3273j633J3441l587q987P347K289j0470
1206e695M013J1199r494r313J0861L265j1747K011J1129m129o890O007N32o466
1220d717M782O063o932k855Q842q35r567L919P161n249m250M803l05m993L043
1235a090K555m247M04O005k459n247M438M007n552j681M969jk875K629J011l423
1251e57J67K002k977k259L694J006l977L47M114j065j681K146O98k914K96J201
$$ plain form
1267 241 -839 61 3380 3176 226 619 887 -1029 -2626 -1117 -407 -1502 -570 472 -185 -136 463 -436
1285 -436 -2059 -975 66 287 379 1945 2137 1707 1147 598 -821 -1317 -828 -1075 -887 122 615 -16
1303 -16 -618 -765 -1184 -1633 -1142 -252 445 926 1574 1614 1278 795 574 -459 -235 -383 84 -107 254 263 -159
1324 -159 -1075 -1445 -1354 -1003 -504 45 420 781 988 1149 508 305 148 -59 290 730 1357 1211 174 -432
1344 -432 -1092 -1363 -1515 -1626 -1223 -52 883 610 556 280 -312 -929 -586 236 871 1519 2017 1423 1379 951
1364 951 -922 -2248 -2193 -1016 -733 -524 1038 1343 139 -474 -957 -1374 -1090 -65 -423 368 2871 3351
1382 3351 1289 164 846 -831 -2705 -1941 -557 -45 1040 1426 167 -753 48 -957 -3485 -1738
1398 -1738 1206 1302 190 2372 3387 1377 41 -750 -1945 -1470 811 354 -609 1455 2606 -910
$$ packed form
1267B41j080R00L319k04k950L93K68j916j597J509P10j095R32J042o57M9N99q99
1285d36j623J084J041K21R2J566J92m30n60n49j419m96M89k47J88J009M93o31
1303a6o02j47m19m49M91Q90O97M81O48M0l36m83k21j033K24j48M67j91L61Rm22
1324a59r16l70R1L51M99N49L75L61K07J61o41k03j57k07L49M40O27j46j037o06
1344d32o60k71j52j11M03J171R35k73n4k76n92o17L43Q22O35O48M98n94m4m28
1364I51j873j326N5J177K83K09J562L05j204o13m83m17K84J025l58P91K503M80
1382C351k062j125O82j677j874P64J384N12J085L86j259r20Q01j005k528J747
1398a738K944R6j112K182J015k010j336p91j195M75K281m57r63K064J151l516
$$ plain form
1414 -910 -3423 -742 52 -2662 -2301 676 925 1161 2783 1125 -980 794 472 -2946 -2440 3182 3396
1431 3396 -318 -84 1787 -1394 -3257 -1536 -1738 -1800 1531 2272 -1600 -219 3794 327 -4000 -443
1447 -443 3100 -659 -1110 2708 2233 317 1329 268 -4184 -1536 1757 -2015 -4350 1952 4278 -1623
1463 -1623 -1368 2630 10 -3534 -354 409 -1191 3020 5769 -13 -2446 2472 714 -5798 -2540
1478 -2540 3283 64 -2085 2043 1456 -3093 -1048 920 -3256 -2165 4629 1994 -3851 1379 5150
1493 5150 -692 -1929 3475 1249 -4154 -1203 1486 -2598 -297 5175 308 -4791 -160 1161 -5020
1508 -5020 -3187 4580 2900 -1060 2493 2669 -3090 -1795 3455 -492 -2550 3958 3363 -3697 -1565
1523 -1565 3677 -942 -4399 831 1119 -3412 -313 3604 -1375 -2078 3683 2592 -3254 857 3621
$$ packed form
1414i10k513K681P94k714L61K977K49K36J622j658k105J774l22l418N06N622K14
1431C396l714K34J871l181j863J721k02o2L331P41l872J381M013l467m327L557
1447d43L543l759m51L818m75j916J012j061m452K648L293l772k335O302K326n901
1463a623K55L998k620l544L180P63j600M211K749n782k433M918j758o512L258
1478b540N823l219k149M128n87m549K045J968m176J091O794k635n845N230L771
1493E150n842j237N404k226n403K951K689m084K301N472m867n099M631J321o181
1508e020J833P767j680l960L553J76n759J295N250l947k058O508n95p060K132
1523a565N242m619l457N230K88m531L099L917m979p03N761j091n846M111K764
$$ plain form
1538 3621 -2728 -4121 3203 3315 -214 2684 2916 -4904 -5844 -399 -284 -1570 3934 4956 -2982 -4901
1554 -4901 -51 -86 -1283 3858 4266 -2105 -2881 1288 23 -195 4898 3918 -3731 -4286 -681 -1174 -1270
1571 -1270 3382 2750 -2375 -1677 592 -1758 -1971 2405 1180 -2249 845 4550 1724 -629 364 -1616
1587 -1616 -3279 762 3506 767 -155 -191 -3599 -4607 -8 3808 2337 692 -843 -2892 -2941 1029
1603 1029 3114 2490 2632 792 -2731 -3670 238 1897 1661 968 413 -2115 -2641 -1923 -1429 287 2036
1620 2036 1221 -1055 -555 336 -714 -624 684 1334 1675 1811 -179 -1284 -238 419 -1672 -1081 1601
1637 1601 746 -1190 -1530 -773 -941 64 1264 -245 13 1849 424 -2542 -271 2725 1663 362
1653 362 1806 630 -2616 -2134 -722 -770 1085 2870 -418 -3883 -1376 612 -1343 -284 3174 1441
$$ packed form
1538C621o349j393P324J12l529K898K32p820r40N445J15j286N504J022p938j919
1554d901M850l5j197N141M08o371p76M169j265k18N093r80p649n55L605m93r6
1571a270M652o32n125O98K269k350k13M376j225l429L094L705k826k353R93j980
1587a616j663M041K744k739r22l6l408j008M599L816j471j645j535k049m9L970
1603A029K085o24J42j840l523r39L908J659k36o93n55k528n26P18M94J716J749
1620B036q15k276N00Q91j050R0J308O50L41J36j990j105J046O57k091N91K682
1637A601q55j936l40P57j68J005J200j509K58J836j425k966K271K996j062j301
1653C62J444j176l246M82J412m8J855J785l288l465K507J988j955J059L458j733
$$ plain form
1669 1441 -2145 -769 829 67 1021 2672 -516 -2108 787 907 -2068 -943 1698 -633 -2543 116
1685 116 1245 -527 -2 620 -2244 -1247 2554 1858 -1337 557 2409 -649 -1389 1753 2279 -950 -1040
1702 -1040 -1008 -2776 -959 2381 787 -1661 388 783 -2567 -1617 1822 1370 -210 680 1217 -241 1230
1719 1230 2322 -771 -2084 386 36 -2074 51 2235 122 -1531 -372 -513 -1738 -63 326 -1288
1735 -1288 -503 2027 1588 -290 1283 1904 -872 -2173 472 146 -348 812 772 -998 -482 456 -1497
1752 -1497 -2323 253 1011 -992 -179 1654 960 2 770 366 -710 616 1168 -512 -199 1722 584
1769 584 -1405 -756 167 -1002 -1283 -34 -131 -354 612 713 -508 -33 1101 -191 -866 1062 1523 917
1787 917 427 868 -242 -1180 -457 -844 -1030 -156 610 76 -237 768 17 -1174 -639 316 141 199 1400
$$ packed form
1669A441l586J376J598p62R54J651l188j592K895J20k975J125K641k331j910K659
1685A16J129j772N25O22k864R97L801o96l195J894J852l058p40L142N26l229r0
1702a040L2j768J817L340j594k448K049L95l350R50L439m52j580Q90N37j458J471
1719A230J092l093j313K470l50k110K125K184k113j653J159j41j225J675L89j614
1735a288P85K530m39j878J573O21k776j301K645l26m94J160m0j770N16R38j953
1752a497q26K576P58k003Q13J833o94r58P68m04j076J326N52j680L13J921j138
1769E84j989O49R23j169k81J249r7k23R66J01j221M75J134j292o75J928M61o06
1787I17m90M41j110r38P23l87j86Q74P66n34l13J005p51j191N35R55j75N8J201
$$ plain form
1806 1400 1281 894 737 569 -672 -1177 -491 -171 -1119 8 788 346 -235 -108 -559 -1131 -661 -461 -195
1825 -195 427 1390 1411 726 517 228 -737 -716 -282 -80 -89 697 583 -10 -522 -442 -1085 -1264 -644 -110 297 765
1847 765 1213 899 125 447 258 -633 -454 167 236 703 922 571 -444 -981 -680 -1329 -965 -286 106 43
1867 43 632 1267 170 -348 -231 -127 -345 555 873 661 1073 1257 -298 -917 -516 -478 -1235 -1322 435 127
1887 127 116 327 272 -534 -347 -55 -493 -164 1140 1298 322 864 1487 194 -1267 -805 -555 -1003 -148 695
1907 695 -271 -40 899 -476 -1606 -233 683 -334 -170 1764 1491 177 583 447 -805 -404 735
1924 735 -370 -1293 727 1292 -850 -853 1280 -611 -2219 -439 649 -617 290 1847 618 -363 1212
1941 1212 444 -1924 -253 1597 -73 -612 1815 1119 -1801 -1173 64 -1458 -1477 1252 500 -1212 570
$$ packed form
1806A400j19l87j57j68j241n05O86L20r48J127P80m42n81J27m51n72M70K00K66
1825a95O22R63K1o85k09k89r65K1M34K02rP86j14n93n12Q0o43j79O20N34M07M68
1847G65M48l14p74L22j89q91J79O21O9M67K19l51j015n37L01o49L64O79L92o3
1867D3N89O35j097n18J17J04k18R00L18k12M12J84j555o19M01L8p57q7J757l08
1887A27j1K11n5q06J87K92m38L29J304J58r76N42O23j293j461M62K50m48Q55Q43
1907F95r66K31R39j375j130J373R16j017J64J934k73j314M06j36j252M01J139
1924G35j105r23K020N65k142lK133j891j608J780J088j266R07J557j229r81J575
1941A212p68k368J671J850j670n39K427o96k920O28J237j522j9K729p52j712J782
$$ plain form
1958 570 1600 -1433 -1126 1947 967 -1599 381 1502 -872 -1 2502 726 -1692 -419 -10 -2843
1974 -2843 -1490 2389 766 -1357 1150 1176 -2337 -983 1777 -293 -1752 2031 1815 -798 766 2686
1990 2686 -1129 -2557 872 709 -1997 329 1944 -1389 -2270 1366 846 -1820 120 1505 -2237 -1503
2006 -1503 2450 1672 -518 1975 2380 -2198 -2533 1509 -204 -2195 1848 2471 -1713 -1537 1384 -1309
2022 -1309 -2794 1486 1791 -1682 -198 2441 -566 -2032 2076 2395 -1337 94 2181 -1391 -2883
2037 -2883 1278 1237 -1625 404 2050 -2194 -2917 1109 651 -2090 793 2843 -907 -1181 2107 665
2053 665 -2067 776 1958 -1290 -337 3308 57 -3370 -393 863 -1667 -164 2951 9 -3155
2068 -3155 -625 289 -1113 1301 3701 -354 -2546 294 862 -1445 861 3091 -335 -2426 -178
$$ packed form
1958E70J030l033L07L073r80k566J980J121k374Q71K503j776k418J273M09k833
1974b843J353L879j623k123K507K6l513J354K760k070j459L783k16k613J564J920
1990B686l815j428L429j63k706K326J615l333q81L636n20k666J940J385l742P34
2006a503L953p78k190K493M05m578l35M042j713j991M043O23m184J76K921k693
2022a309j485M280L05l473J484K639l007j466M108L19l732J431K087l572j492
2037b883M161m1k862K029J646m244p23M026m58k741K883K050l750k74L288j442
2053F65k732K843J182l248R53L645l251l427K977J256k530J503L115k942l164
2068c155K530R14j402K414K400m055k192K840N68k307K306K230l426k091K248
$$ plain form
2083 -178 164 -1638 335 1944 -1404 -1723 1683 756 -2201 -199 1370 -1497 -1367 2709 2557 -191
2099 -191 217 128 -2381 -1043 2370 1255 -956 537 242 -2825 -2093 1946 1207 -1063 14 85 -1628
2116 -1628 -377 1923 505 -374 1521 1135 -1647 -72 2001 -533 -1652 246 1032 -551 195 539
2132 539 -1484 -2134 261 345 -760 993 1466 -875 -1680 652 1107 148 881 1002 -658 -1155 -28 -330
2150 -330 -704 712 993 -1106 -917 135 -463 -1606 -259 935 481 769 1115 327 -569 166 391 -37
2168 -37 512 1159 -273 -1448 -396 235 -782 230 658 -286 -991 -1030 -695 -575 686 1498 987 404 471
2187 471 -115 -903 -216 1056 731 498 114 152 -840 -905 -714 -384 194 380 77 -257 -398 -188 -54 132
2207 132 640 910 179 -230 -36 -240 453 446 716 192 -425 -878 -1135 -631 -20 778 492 -256 10 -85 -528
$$ packed form
2083a78L42j802J973J609l348l19L406r27k957K002J569k867J30M076j52k748
2099a91M08q9k509J338L413j115k211J493k95l067P32M039p39k270J077P1j713
2116a628J251K300j418q79J895l86k782J575K073k534j119J898P86j583P46L44
2132E39k023o50K395Q4j105J753M73k341q05K332M55r59P33J21j660m97J127l02
2150c30l74J416K81k099J89J052n98j143J347J194m54K88L46p88q96P35K25m28
2168c7N49O47j432j175J052O31j017J012M28r44p05l9L35J20J261Q12n11n83O7
2187D71n86p88O87J272l25k33l84L8r92o5J91L30N78J86l03l34j41K10J34J86
2207A32N08K70p31m09J94k04O93pK70n24o17m53k57N04O11P98k86p48K66r5m43
$$ plain form
2228 -528 -585 525 865 663 295 495 -229 -87 -249 -479 -342 195 392 -352 -474 86 -108 -552 -577 256
2248 256 -385 -508 -84 204 197 946 997 242 -173 -45 -407 -526 -150 855 467 -74 111 -412 -1126 -808 -431
2269 -431 -403 -159 144 392 241 943 255 -381 -153 453 210 -20 328 544 159 -175 -173 -588 -776 -318 -297
2290 -297 -857 -58 541 422 -91 44 37 -174 -292 332 340 377 815 684 154 136 34 -431 -735 -382 39 -73
2312 -73 83 147 218 -154 -70 -393 -425 -144 400 152 256 775 588 172 -246 -288 -191 -698 -474 268 -27 289
2334 289 117 -489 -471 -178 -427 -89 14 730 765 575 381 367 -290 -289 -277 -190 93 -24 186 -44 285 -199
2356 -199 -443 -595 -574 -198 -359 61 432 554 469 228 178 -302 135 161 312 86 52 152 -84 -156 -325 -524
2378 -524 -400 -336 -225 -55 33 347 98 -120 366 115 -328 145 404 458 791 696 -146 -286 -78 -373 -385 -156
$$ packed form
2228e28n7J110L40k02l68K00p24J42j62k30J37N37J97p44j22N60j94m44k5Q33
2248B56o41j23M24K88pP49N1p55m15J28l62j19L76J005l88n41J85n23p14L18L77
2269d31K8K44L03K48j51P02o88o36K28O06k43k30L48K16l85l34Km15j88M58K1
2290b97n60P99N99j19n13J35pk11j18O24QL7M38j31n30j8j02m65l04L53M21j12
2312g3J56O4P1l72Q4l23l2K81N44k48J04N19j87m16m18m2R7n07K24P42k95L16
2334B89j72o06J8K93k49L38J03P16L5j90j94j4o57JJ2Q7K83j17K10k30L29m84
2356a99k44j52K1L76j61M20L71J22q5k41n0m80M37K6J51k26l4J00k36p2j69j99
2378e24J24O4J11J70Q8L14k49k18M86k51m43M73K59N4L33r5q42j40K08k95j2K29
$$ [...]
8191b0
##END NTUPLES=NMR FID
##END=
