##TITLE=1H_LR-724-R2-CR14
 200.13MHz, CDCl3
 8 sc
 
 19ns.26.2.2025
##JCAMPDX= 6.0         $$ Bruker NMR JCAMP-DX V2.0
##DATA TYPE= NMR FID
##DATA CLASS= NTUPLES
##ORIGIN= UXNMR, Bruker Analytische Messtechnik GmbH
##OWNER= pz
$$ XWIN-NMR		Version 3.5
$$ Wed Feb 26 16:18:19 2025 Russian Standard Time (UT+4h)  new_Human@DPX200
##.OBSERVE FREQUENCY= 200.1313
##.OBSERVE NUCLEUS= ^1H
##.DELAY= (6, 6)
##.ACQUISITION MODE= SIMULTANEOUS
##.ACQUISITION SCHEME= undefined
##.AVERAGES= 8
##.DIGITISER RES= 18
##SPECTROMETER/DATA SYSTEM= spect
##.PULSE SEQUENCE= zg30
##.SOLVENT NAME= CDCl3
##.SHIFT REFERENCE= (INTERNAL, CDCl3, 0, 14.3821)
##AUDIT TRAIL= $$ (NUMBER, WHEN, WHO, WHERE, WHAT)
$$ ##TITLE= Audit trail, XWIN-NMR		Version 3.5
$$ ##JCAMPDX= 5.01
$$ ##ORIGIN= Bruker BioSpin GmbH
$$ ##OWNER= new_Human
$$ C:/Bruker/XWIN-NMR/data/yarkov/nmr/H-C/1/audita.txt
$$ ##AUDIT TRAIL=  $$ (NUMBER, WHEN, WHO, WHERE, WHAT)
(   1,<2025-02-26 16:16:22.90 +0400>,<new_Human>,<DPX200>,
      <created by zg, POWCHK disabled, PULCHK disabled
       configuration hash MD5:
       00 E9 B6 7A A2 85 ED C7 34 08 36 98 17 FE 4E 26
       data hash MD5: 16K
       09 F8 EB A9 27 94 EC 38 3B C6 6E 10 48 9D 0E 4C>)
$$ ##END=
$$ 
$$ hash MD5
$$ D0 01 1C 13 27 BA EE 75 74 E2 5F BD D4 C8 76 F8
##$RELAX= 
##$RELAX= 
##$RELAX= 
##$RELAX= 
##$RELAX= 
##$RELAX= 
$$ Bruker specific parameters
$$ --------------------------
##$DU= <C:/Bruker/XWIN-NMR>
##$EXPNO= 1
##$NAME= <H-C>
##$PROCNO= 1
##$TYPE= <nmr>
##$USER= <yarkov>
##$AMP= (0..31)
100 100 100 100 100 100 100 100 100 100 100 100 100 100 100 100 100 100 
100 100 100 100 100 100 100 100 100 100 100 100 100 100 
##$AQSEQ= 0
##$AQ_mod= 1
##$AUNM= <au_zg>
##$AUTOPOS= <>
##$BF1= 200.13
##$BF2= 200.13
##$BF3= 200.13
##$BF4= 200.13
##$BF5= 200.13
##$BF6= 200.13
##$BF7= 200.13
##$BF8= 200.13
##$BYTORDA= 1
##$CFDGTYP= 0
##$CFRGTYP= 5
##$CHEMSTR= <none>
##$CNST= (0..31)
1 1 145 1 1 1 1 1 1 1 1 1 1 1 1 1 1 1 1 1 1 1 1 1 1 1 1 1 1 1 1 1 
##$CPDPRG= <>
##$CPDPRG1= <>
##$CPDPRG2= <>
##$CPDPRG3= <>
##$CPDPRG4= <mlev>
##$CPDPRG5= <mlev>
##$CPDPRG6= <mlev>
##$CPDPRG7= <mlev>
##$CPDPRG8= <mlev>
##$CPDPRGB= <>
##$CPDPRGT= <>
##$D= (0..31)
0 0.7 0 0 0 0 0 0 0 0 0 0.03 0 0 0 0 0 0 0 0 0 0 0 0 0 0 0 0 0 0 0 0 
##$DATE= 1740572182
##$DBL= (0..7)
120 120 120 120 120 120 120 120 
##$DBP= (0..7)
150 150 150 150 150 150 150 150 
##$DBP07= 0
##$DBPNAM0= <>
##$DBPNAM1= <>
##$DBPNAM2= <>
##$DBPNAM3= <>
##$DBPNAM4= <>
##$DBPNAM5= <>
##$DBPNAM6= <>
##$DBPNAM7= <>
##$DBPOAL= (0..7)
0.5 0.5 0.5 0.5 0.5 0.5 0.5 0.5 
##$DBPOFFS= (0..7)
0 0 0 0 0 0 0 0 
##$DE= 6
##$DECBNUC= <off>
##$DECIM= 32
##$DECNUC= <off>
##$DECSTAT= 4
##$DIGMOD= 1
##$DIGTYP= 9
##$DL= (0..7)
0 120 120 120 120 120 120 120 
##$DP= (0..7)
150 150 150 150 150 150 150 150 
##$DP07= 0
##$DPNAME0= <>
##$DPNAME1= <>
##$DPNAME2= <>
##$DPNAME3= <>
##$DPNAME4= <>
##$DPNAME5= <>
##$DPNAME6= <>
##$DPNAME7= <>
##$DPOAL= (0..7)
0.5 0.5 0.5 0.5 0.5 0.5 0.5 0.5 
##$DPOFFS= (0..7)
0 0 0 0 0 0 0 0 
##$DQDMODE= 0
$$ [...]
##$SUBNAM0= <"">
##$SUBNAM1= <"">
##$SUBNAM2= <"">
##$SUBNAM3= <"">
##$SUBNAM4= <"">
##$SUBNAM5= <"">
##$SUBNAM6= <"">
##$SUBNAM7= <"">
##$SUBNAM8= <"">
##$SUBNAM9= <"">
##$SW= 18.0517328524113
##$SWIBOX= (0..15)
0 0 2 0 0 0 0 0 0 0 0 0 0 0 0 0 
##$SW_h= 3612.71676300578
##$TD= 16384
##$TD0= 1
##$TE= 0
##$TE2= 300
##$TE3= 300
##$TEG= 300
##$TL= (0..7)
0 120 120 120 120 120 120 120 
##$TP= (0..7)
150 150 150 150 150 150 150 150 
##$TP07= 0
##$TPNAME0= <>
##$TPNAME1= <>
##$TPNAME2= <>
##$TPNAME3= <>
##$TPNAME4= <>
##$TPNAME5= <>
##$TPNAME6= <>
##$TPNAME7= <>
##$TPOAL= (0..7)
0.5 0.5 0.5 0.5 0.5 0.5 0.5 0.5 
##$TPOFFS= (0..7)
0 0 0 0 0 0 0 0 
##$TUNHIN= 0
##$TUNHOUT= 0
##$TUNXOUT= 0
##$USERA1= <user>
##$USERA2= <user>
##$USERA3= <user>
##$USERA4= <user>
##$USERA5= <user>
##$V9= 5
##$VALIST= <valist>
##$VCLIST= <CCCCCCCCCCCCCCC>
##$VD= 0
##$VDLIST= <DDDDDDDDDDDDDDD>
##$VPLIST= <PPPPPPPPPPPPPPP>
##$VTLIST= <TTTTTTTTTTTTTTT>
##$WBST= 1024
##$WBSW= 4
##$XGAIN= (0..3)
0 0 0 0 
##$XL= 0
##$YL= 0
##$YMAX_a= 890947
##$YMIN_a= -1000576
##$ZGOPTNS= <>
##$ZL1= 120
##$ZL2= 120
##$ZL3= 120
##$ZL4= 120
##$ABSF1= 10
##$ABSF2= 0
##$ABSG= 5
##$ABSL= 3
##$ALPHA= 0
##$AQORDER= 0
##$ASSFAC= 0
##$ASSFACI= 0
##$ASSFACX= 0
##$ASSWID= 0
##$AUNMP= <proc_1d>
##$AZFE= 0.1
##$AZFW= 0.1
##$BCFW= 1
##$BC_mod= 2
##$BYTORDP= 1
##$COROFFS= 0
##$CY= -3
##$DATMOD= 1
##$DC= 2
##$DFILT= <>
##$DTYPP= 0
##$F1P= 0
##$F2P= 0
##$FCOR= 0.5
##$FTSIZE= 0
##$FT_mod= 4
##$GAMMA= 1
##$GB= 0.15
##$INTBC= 1
##$INTSCL= 1
##$ISEN= 128
##$LB= 0.25
##$LEV0= 0
##$LPBIN= 0
##$MAXI= 10000
##$MC2= 0
##$MEAN= 0
##$ME_mod= 0
##$MI= 1.114404
##$NCOEF= 0
##$NC_proc= 0
##$NLEV= 6
##$NOISF1= 3.799351
##$NOISF2= 2.8
##$NSP= 1
##$NTH_PI= 0
##$NZP= 0
##$OFFSET= 14.38212
##$PC= 1
##$PHC0= -1188.829
##$PHC1= 13.59225
##$PH_mod= 1
##$PKNL= yes
##$PPARMOD= 0
##$PSCAL= 0
##$PSIGN= 0
##$REVERSE= no
##$SF= 200.129724274929
##$SI= 16384
##$SIGF1= 3
##$SIGF2= 2
##$SINO= 400
##$SIOLD= 16384
##$SREGLST= <1H.CDCl3>
##$SSB= 0
##$STSI= 0
##$STSR= 0
##$SW_p= 3205.1282051282
##$SYMM= 0
##$S_DEV= 0
##$TDeff= 0
##$TDoff= 0
##$TI= <>
##$TILT= no
##$TM1= 0
##$TM2= 0
##$TOPLEV= 0
##$USERP1= <user>
##$USERP2= <user>
##$USERP3= <user>
##$USERP4= <user>
##$USERP5= <user>
##$WDW= 1
##$XDIM= 8192
##$YMAX_p= 0
##$YMIN_p= 0
$$ End of Bruker specific parameters
$$ ---------------------------------
##NTUPLES= NMR FID
##VAR_NAME=  TIME,          FID/REAL,        FID/IMAG
##SYMBOL=    X,             R,               I
##VAR_TYPE=  INDEPENDENT,   DEPENDENT,       DEPENDENT
##VAR_FORM=  AFFN,          ASDF,            ASDF
##VAR_DIM=   8192,          8192,            8192
##UNITS=     SECONDS,       ARBITRARY UNITS, ARBITRARY UNITS
##FACTOR=    0.0002768,     1,               1
##FIRST=     0,             0,               0
##LAST=      2.2672688,     0,               0
##MIN=       0,             -1000576,        0
##MAX=       2.2672688,     890947,          0
$$ Real data points
##PAGE= N=1
##DATA TABLE= (X++(R..R)), XYDATA
$$ [...]
2152b22n1L80j75l28k90Q54Q94L63J96m38j309j078k45P64P85L89L28k70j727
2171a180RJ196o19j55J098Rj368N90J410k24k82Q85m75j725O85M74r03k48J427
2190F04L8j415R10N50j598o50J258J8o37J510R61j320n61Q31n8j102J505O09k035
2209e82p01J925o18j121K013L09k288l4J000n16m18J672R17k316L02J283j075
2226b48k59J858K67j698l78J702j581m14J073J86j629R77R28r87o80J056l30j378
2244a535J217J403o55n35J128o51o67P91N96j269m93J219q64p90J328M54j234
2261e57m4P05p31k69P47J59l44M78J175p11o76J009m63q30m1P48l00r8M45k15
2281A87r76J04O17j75m09O50p5k45N64M76j66l87J98k76l19M65Nk31J91J78m20
$$ plain form
2152 -222 -273 107 -68 -396 -686 168 1062 1425 1621 1183 -126 -1204 -1449 -685 100 489 817 547 -1180
2171 -1180 -1171 25 -594 -749 349 358 -1010 -420 990 766 484 1369 894 -831 -146 328 -575 -823 604
2190 604 642 -773 137 687 -911 -1561 -303 -285 -922 588 1549 229 -332 499 441 -661 844 1453 -582
2209 -582 -1283 642 24 -1097 916 1225 -1063 -1097 -97 -613 -1031 641 1558 -758 -456 827 -248
2226 -248 -507 1351 1618 -80 -458 1244 -337 -751 322 508 -1121 -144 784 -203 -883 173 -157 -1535
2244 -1535 -318 1085 430 -105 1023 372 -295 496 1092 -177 -670 549 -315 -1105 223 677 -557
2261 -557 -601 104 -627 -896 -149 10 -334 144 1319 608 -68 941 478 -352 -393 355 55 -43 402 187
2281 187 -789 -685 -68 -243 -652 -2 -77 -322 242 718 552 165 363 87 -232 233 238 7 198 376 -44
2302d4l85J08j37Mj56L02J66J86K30M3j87M43n23k66O26J54l88L44j55l54O1j52
2324h0k40j52k01O12o1j63M32J1j87k06R8j97L84K07O7j1J79L40o34j50J38l07
2346a21n61M93j07J98J04j72K9J76J24j32k34M7K58M28l5K24k00n54J03P9j82
2367c5j95J74r0n13N95J50j94j19l64J67q6P34n6j51L9O97j41j71J04k65n49j69
2389d38P26k90n47L78m25K14R01m73k51k05L40m48J26Q76K41l38j59N15Q7k70
2409E60l64n49m65N20L90m83j64N90O5m83K34O24m57p07M14J61j8J124O3q79J85
2430C61P07r19q76M89L05j254J050P54m29q48R65o52o06R60O39j520K27J747l37
2449G63r05Q70M70j720j30J443r84o46J129j9j145J084J079j188j237J041k54
$$ plain form
2302 -44 -429 -321 -458 -454 -610 -308 -142 44 274 317 130 573 50 -216 410 564 176 520 365 11 72 -80
2324 -80 -320 -472 -673 -61 -122 -285 147 158 -29 -235 -137 -334 50 257 324 313 492 832 198 48 186 -121
2346 -121 -682 -189 -296 -98 6 -166 -137 39 163 31 -203 -156 102 530 495 719 519 -35 68 147 -35
2367 -35 -230 -56 -146 -659 -64 86 -108 -227 -591 -424 -510 224 168 17 56 753 612 441 545 280 -269 -438
2389 -438 288 -2 -549 -171 -596 -382 519 46 -205 -410 -70 -518 -392 484 725 387 228 743 830 560
2409 560 196 -353 -818 -298 92 -391 -555 35 100 -383 -149 475 18 -689 -275 -114 -132 992 1055 176 361
2430 361 1068 149 -727 -238 67 -1187 -137 617 188 -660 305 -347 -953 7 646 -874 -647 1100 763
2449 763 -142 728 1198 -522 -652 791 -193 -839 290 271 -874 210 1289 101 -1136 -95 -349
2466c49j132J268J063r74QJ467r50j651J724R10k265j15K091r36j424J291R75
2483A001j910M74J734j945j534K355L27j730J151K242k258j074K174K76k633J287
2499f3J571k618l08K804p29k566K161J091k836Q0K846j406k445K699J298k363
2515g84N00L241k522k487K912P84l751J367L266k876j841M075m67l941J882K746
2531B104l373q03L778j163l452L103L068l687p90L898k058l529L228K001l843
2546a518L64L859k187l147L385Q07m507J479L969k236k838M127P2m208J926L846
2562C193l125j560L375o14m411K526L330l661n03M112j511m430K638J918l565
2577b288L84M715j709l643L144J135m016J303M400k682k772L103M30l977J627
$$ plain form
2466 -349 -1481 -213 850 -124 -116 1351 401 -1250 474 1384 -881 -996 1095 159 -1265 26 1001
2483 1001 -909 -435 1299 -646 -2180 175 502 -1228 -77 2165 -93 -1167 1007 1283 -1350 -63
2499 -63 1508 -1110 -1418 1386 657 -1909 252 1343 -1493 -1413 1433 27 -2418 281 1579 -784
2515 -784 -284 2957 435 -2052 860 1644 -2107 -740 2526 -350 -2191 1884 1417 -2524 -642 2104
2531 2104 -1269 -2072 1706 543 -2909 194 3262 -425 -1215 2683 625 -2904 324 2325 -1518
2546 -1518 -1154 2705 518 -2629 756 1563 -2944 -1465 2504 268 -2570 1557 1629 -2579 -653 3193
2562 3193 68 -1492 1883 1269 -3142 -616 2714 -947 -1450 2662 1151 -3279 -641 1277 -2288
2577 -2288 -1904 2811 1102 -2541 603 1738 -2278 -975 3425 743 -2029 1074 1504 -2473 -846
2592h46L529k770j768L841p94l814J624K770k922p76M400p70l136J948J162l552
2608a874j5M215j275k400K244N81l943R24L765j741j871K989q40l450J544L014
2624A867k088p48L433j168l400J837J742k659m76M280j485k464J897P26l359L47
2640a718L086j151j769K789j38l367J050K912j848p54L074j172l206J427K378
2655A593k272K39K663j314k556J577J196k256j75K684j604j175K157P78l178M34
2671a209K519j818k35K581l21k997O35J499j668M26K994j071l354J119J097j725
2687a528P19L215j364k540J503L55j813J443K353j511j860J509N3j985J566J514
2703A629j973r18J989l76j923J502R38j992k33K452k82j918J821m8j991K68K389
$$ plain form
2592 -846 2683 -87 -1855 1986 1192 -2622 -998 1772 -1150 -1926 2474 1704 -1432 516 1678 -1874
2608 -1874 -1889 2326 1051 -1349 895 1476 -2467 -1543 2222 481 -1390 1599 759 -2691 -1147 1867
2624 1867 -221 -969 2464 1296 -2104 -267 1475 -1184 -1660 2620 1135 -1329 568 1294 -2065 -1718
2640 -1718 1368 217 -1552 1237 1099 -2268 -1218 1694 -154 -908 2166 994 -2212 -785 1593
2655 1593 -679 -440 2223 909 -1647 -70 1126 -1130 -1305 1379 -225 -1400 757 1535 -1643 -1209
2671 -1209 1310 -508 -743 1838 1517 -1480 -845 654 -1014 -588 2406 1335 -2019 -900 197 -1528
2687 -1528 -809 2406 1042 -1498 5 360 -1453 -10 2343 832 -1028 481 534 -1451 115 1629
2703 1629 -344 -1262 727 351 -1572 -70 868 -1124 -1357 1095 813 -1105 716 668 -1323 -1055 1334
2720A334o38j357J512j93k283P00J771o87r23J486k79k190J196J669j569m17J713
2737H45o78j168J078J038j622j36J718m53j370J020N64j799K03J361m28q97J417
2754F93k18j840K77J701n80m59J117k26r42M72J063j070l58P46l58q90J070R45
2772A143j385l22Q54j16r43O37L95r44K54Q88j36j96O82j70o73k01M62l84l41
2791d96Q97J86j160O92M8k48l37M86qq17O12L19l3j57L28K49k46n8m4r0K9J00
2813B52k69k53N84r2o49N56r5k47k14N58J64l73k1P1k3K30K73j40k52j6k0k24
2835b00oL97k78j62J05J29K03j67j22K1k55L17q2k11L54J97J00k38n6n0n1M6K1
2858A2j69M05l0o2j71L80l71j70k03o5R7k4N25K81m1k31L18l90Q2j01j21m85K07
$$ plain form
2720 1334 696 -661 851 658 -1625 -925 846 159 -764 722 443 -1747 -551 1118 -451 -868 845
2737 845 167 -1001 77 1115 -507 -643 1075 622 -748 272 836 -963 -760 601 173 -724 693
2754 693 475 -1365 -1088 613 33 -426 691 465 -477 -5 1058 -12 -370 376 18 -872 198 1143
2772 1143 -242 -564 290 174 -769 -132 263 -681 -427 461 325 129 811 641 -32 -233 229 -155 -496
2791 -496 401 587 -573 119 167 -81 -418 68 60 -757 -145 174 141 -16 312 561 315 257 213 123 152 252
2813 252 -17 -270 314 222 -427 129 34 -213 -427 131 295 -78 -99 -28 -51 179 452 312 60 44 24 -200
2835 -200 -206 191 -87 -249 -144 -15 188 21 -101 -80 -335 -18 -100 -311 43 240 340 102 46 -4 -55 -9 12
2858 12 -157 248 218 156 -15 365 -6 -176 -379 -444 -347 -371 154 435 394 163 481 91 173 72 -49 -534 -327
2881c27K19M65J26j78l50k53J11j66j49J26M46l9R7L31q8k20m16L78j7m04M59
2902A51J19l50J95J09L05m25k50q0k11k22Q06j63M5K68J87m59o3L57l94J39Q3
2923A47N9n8M91l25m10l0J58K42n80j25K59l04K94O52k41j49K88j06k73k26L96
2944A59K5l29J17N89k79l73K70l43l75Q37j30o75r1P51m57L3R13k83o15M3O48
2965D35o42k45Q33k32k74M60J93n66l35N77l06k66j5O47p62K36O84l09k75O10
2985D48K69j044p1O44n48l3L56N34o34k14O21n09l47P58k0o05J83O34m72l61M66
3006E5K33m25K54L74p07j41M54K18k70L40L71q30o93P89r0p55Q78L97n20J9M0
3027in5l14P53K43l21k75L2l91j49L01O89j2n24Mk02p43N44N45l97J45P57m26
$$ plain form
2881 -327 -108 357 483 305 -45 -298 -187 -353 -502 -376 70 31 128 459 371 151 -265 113 96 -308 151
2902 151 270 -80 115 224 529 104 -146 -226 -437 -659 147 -16 29 297 484 25 -38 319 -75 64 147
2923 147 206 148 639 314 -96 -126 32 274 -306 -431 -172 -476 -182 470 229 80 368 262 -11 -237 159
2944 159 184 -145 -28 561 282 -91 179 -164 -539 298 168 -507 -598 153 -304 -271 642 359 -256 -213 435
2965 435 -207 -452 381 149 -125 335 528 -38 -373 204 -102 -368 -383 264 -498 -262 422 113 -162 448
2985 448 717 -327 -398 246 -302 -335 21 555 -79 -293 328 -181 -528 230 210 -395 -212 422 -50 -411 55
3006 55 288 -137 117 491 -216 -357 97 315 45 385 756 -74 -767 22 -68 -823 55 452 -68 -49 -9
3027 -9 -64 -378 375 618 297 22 54 -337 -486 -185 504 492 -32 -28 -230 -973 -429 116 -281 -136 621 195
3049A95q52L99K03j15K70O40m28m74j25L67l26M35K81j88k28q4k61k55R0P06o8
3070A82l76N18J77o33j83J49R6L37M18k92k31J7n92K0P4J115k69n05p1o59K53
3091d55K83L55J89J03m75j13j30Q4L43J65l29K42j44l40J91k16J42R1M23k36l93
3112b20J42j30j0K71P0K09k24K4k96p1Q2N33j96j92K1J8l62J41K93%j7LQk72M8
3137a27J39k43p9P24j78l12J58J62l26r4P49k91j83J95j90r81L85Q30j14m45N42
3158C21l54n89L5R10P6j04J8k35q33L46J010m87l38M97M5q78L12O82p79M6N62
3179B63j61q24P45K48n53J61M57l36R5K83j03o13k52P60k14n0P67l4q57k75M82
3200a1k34l59P65M2l77j41L40j58l33R57K8j092N07M27p55K4N65L51o42L96j4
$$ plain form
3049 195 -657 -258 -55 -170 100 740 312 -162 -287 80 -246 189 470 282 54 -30 -291 -546 -456 250 182
3070 182 -194 324 501 -132 -315 -166 -70 267 685 393 162 179 -413 -393 -319 796 527 22 -49 -708 -455
3091 -455 -172 183 372 475 0 -113 -243 -159 184 349 20 262 118 -222 -31 -247 -105 -14 409 173 -220
3112 -220 -78 -208 -218 53 123 332 108 132 -164 -235 -153 380 184 -8 13 31 -331 -190 103 103 86 89 97 -175 -127
3137 -127 12 -231 -310 414 236 -76 82 244 -82 -176 573 282 99 294 104 -877 -492 338 224 -221 321
3158 321 -33 -622 -587 323 399 295 313 78 -755 -409 601 114 -224 273 318 -560 -248 434 -345 -299 263
3179 263 102 -722 23 271 -282 -121 336 0 95 378 275 -338 -590 170 -44 -94 673 639 -218 -493 -11
3200 -11 -245 -604 161 203 -174 -315 25 -133 -466 491 519 -573 -66 361 -394 -370 195 546 -96 300 286
3221B86p56j23O80n9o58P87N99r94J38M45Ro19N10J55p15J16N84k49n15M14K28
3242B63o37J01K76l12q0O70k15l82L33L36l56j58M89m89j94M22L82n90j59N99
3262B99r0m52N04L01r09ML00J69m12L98J39j90n3J76j56j78M25P3m53k47M00j56
3284a08N9R5L70n13J53J89o60O7K08L36m25L56J28j74j21L96l62l33L51N8K21
3305B91j74J63j75k92J38j0j0m03M79j75K10j59L36k00J81l27J21M0J92q5j75
3326c4J59J96l79Q0Q9j66m3M0j5j19l2L07r1R3J4K38k83k45J94l96L59Q2k1l3
3350fJ45J9k77o7J26l49l9L32k41L76J93j71O2j00J94k74m5P8r5J77j7K09j69
3373F1Q8k07N6j8j46Mj22R6L61p5k59L00J65k20j20M51k41m53K44L68k05j55J4
$$ plain form
3221 286 -470 -593 87 28 -630 157 756 -238 -100 345 354 -265 245 400 -315 -199 385 136 -379 35 263
3242 263 -374 -273 3 -309 -389 281 66 -316 17 353 -3 -161 328 -161 -355 67 449 -141 -300 299
3262 299 209 -243 261 562 -347 -343 -43 126 -286 112 251 61 8 184 28 -150 275 348 -105 -352 48 -108
3284 -108 -49 46 416 -97 56 245 -415 -348 -140 196 -229 127 255 81 -40 356 -6 -339 12 70 291
3305 291 117 280 105 -187 -49 -59 -69 -472 7 -168 42 -117 219 19 200 -127 -6 34 226 141 -34
3326 -34 125 321 -58 22 111 -55 -98 -58 -73 -192 -224 83 -8 85 99 337 54 -191 3 -393 -34 48 27 -6
3350 -6 139 158 -119 -186 -60 -409 -448 -116 -357 19 212 41 103 3 197 -77 -122 -44 -139 38 21 230 61
3373 61 149 -58 -2 -20 -166 -162 -284 -188 173 98 -161 139 304 84 -36 415 174 -279 -35 333 128 -27 -13
3396a3K63l99j19L76l44j07L15J81n06K60J53k57L5L01l67q0K50L54m17J92J56
3417B27j7k86K31m00m6J00L37l04mK09J62k51J16L3r5k39J90J58J03j27K65l20
3439D2p3K26p7m55K92J60n59R5K83Q7m93N75J3m20k9O14j77k42M01k00k01K16
3461G8k23p3r7L30J96p48O45Pk29M2L63k02n35M83M66o74O3M35k47m41N56K05
3483D00m63K51k08j48l05N87n5m80M86q4n04L56L95m5m95M41K73n46j69M84J31
3504C02n86O64J17p44J1N81l27l26O05k2o71L67M60p63m36J155j5p21K99N49q01
3525c02m7M80k4n50N58N30j180J8Q33l80p12J123Lp51P3O26l94l19R06k5q60N66
3547A72N11j147M0J000j01j007O98N15j066k7R50m49n36N56P27j249j0R43o12
$$ plain form
3396 -13 250 -149 -268 108 -236 -343 -28 153 -353 -93 60 -197 -162 139 -228 -308 -58 296 -121 71 227
3417 227 210 -76 155 -245 -291 -191 146 -158 -162 47 209 -42 74 107 12 -227 -37 121 224 97 362 42
3439 42 -31 195 118 -337 -45 115 -444 -349 -66 21 -472 103 116 -304 -333 281 104 -138 263 63 -138 78
3461 78 -145 -218 -315 15 211 -537 108 115 -114 -72 291 89 -446 37 503 -171 -108 327 80 -361 195 400
3483 400 -63 188 -20 -168 -473 114 59 -421 65 -19 -523 -167 228 183 -312 129 402 -144 -313 171 302
3504 302 -284 380 497 -247 -236 345 18 -308 297 275 -396 -29 431 -332 -768 387 372 -349 -50 499 -302
3525 -302 -349 131 107 -443 115 645 -535 -517 316 -64 -776 347 350 -401 -328 298 -96 -415 491 466 -394 172
3547 172 683 -464 -424 576 475 -532 166 681 -385 -412 538 89 -447 109 836 -413 -423 520 -92
3566i2p17J189L10j102J43R07o88q48J472p8j146L88J137j383l47J416k64r97
3584g00N68P29r13m91J440m7j367R51Q44j606j28J699n71j325Q95P55j480J75
3602e72J369q67q60J353P6j191P62J157j327o53J029L05j086L74J035q66q37J141
3620C42K5r23M67P29j065n4J012l11q42R49N31r71j46R91p46q48J134J04q65J27
3640c60Q68l57q05R11M1q54K31R70p99m36R40j55p16O51Q66j081k71N70k40n58
3660e84N38N48p23J26N13m54l49N23K55q73J39Q38m36l43O62J42p80J49M26n01
3680a84k85O15J1m24N30K95q95K24J35j79l34L90L61q35K99P63m52k14O50k45
3700B26o54M35L09m66j36L75J74m86N05n7n28j87Q28m37k06M95Q6n43K95M55n50
$$ plain form
3566 -92 -809 380 690 -412 -269 638 -50 -898 574 496 -650 -262 875 -508 -855 561 297 -700
3584 -700 -132 597 -316 -807 633 586 -781 170 1014 -592 -720 979 408 -917 -22 733 -747 -572
3602 -572 797 -70 -930 423 499 -692 70 1227 -100 -753 276 581 -505 -131 904 38 -799 342
3620 342 367 -556 -89 640 -425 -479 533 222 -620 329 860 -111 -257 734 -12 -860 274 378 -487 -360
3640 -360 508 151 -654 257 298 -556 -325 645 -154 -590 350 195 -521 130 996 -85 -356 214 -26 -584
3660 -584 -46 502 -221 -95 418 -36 -385 138 393 -480 -341 497 61 -282 380 522 -258 -109 317 -184
3680 -184 -469 146 157 -267 263 558 -337 -113 22 -157 -491 -101 260 -575 -276 487 35 -179 471 226
3700 226 -428 7 316 -150 -286 89 263 -223 282 225 -303 -490 338 -99 -305 190 276 -267 28 483 -67
3721f7P6K38ln75L54k1n8p2L75Q4l35J21Q6l36j44L55m8m69O21K67m17q6L97m86
3745a43q9N65j22m02P8N81n06k70P13j20p88O10k3k38n6L10j74n4K03K88l26k9
3767HJ19J74m86L87K98l04r0Q6Pn11L19K41l48J6J32j51j72K70K60m71K94qj6
3790E4l33O38q1j52j49K20j66j18J04j36R3j73J09j81J30L80k01Q2k73J92N7j47
3812e1L32q9j67j55K37j97L62L1m03q8n1q2L88j68L58l83p4l7K53K2n9rj6N1M5
3837E0j46K1K48k37N7K5J07p0k62K58LK21m32K02J31k01K8k81L01l1Q5n7J9L54
3861C93m07Q4n6j7j46J45j89M9L47j88j01J21n3M5J41l40N5K30j47J04j2L2j17
3884b7J39k89K86R1j68J47k76r6L29j82J96r2l27M24r8J19n0l2l0R6R5j83J33
$$ plain form
3721 -67 9 247 244 -331 23 2 -56 -128 247 331 -4 117 203 -133 -277 78 30 -439 182 449 32 -54 343 -143
3745 -143 -232 333 211 -191 -113 468 -38 -308 405 285 -503 107 84 -154 -210 100 -74 -128 75 363 37 8
3767 8 127 301 -185 202 500 196 106 192 199 -312 7 248 -100 -84 48 -103 -275 -5 255 -216 78 70 54
3790 54 -279 359 278 126 -23 197 31 -87 17 -119 -26 -199 -90 -271 -141 239 38 120 -153 39 96 -51
3812 -51 281 192 25 -130 107 -90 272 303 -100 -188 -239 -321 67 -101 257 -126 -200 -237 16 38 -21 -30 -46 5 50
3837 50 -96 -75 173 -64 -7 18 125 55 -207 51 54 275 -157 45 176 -25 3 -278 23 -8 77 20 39 393
3861 393 -14 70 14 -3 -149 -4 -193 -144 203 15 -86 35 -18 27 168 -172 -117 113 -34 70 58 90 -27
3884 -27 112 -177 109 200 32 179 -97 -193 136 -46 150 58 -269 155 57 176 126 94 64 160 255 72 205
3907B05o86N59n7k43J15J22j56o6M27k36Oj56K49j15K79M7k29K08N4k96K57k94
3929fj74P7J2m4L5p6j38L51r3L4N3J46k35k49M31J47l7l55K73k51K2K51j33O8
3953A09j74P6j82R0j6J40j37l60O79l32j75M78J45m07L97K29o37j30K80J17j60
3974C0k37K75j93l3K61j35L2Q9K0k99K18M95m43m6J15K57o04K00J26L2k19M8K33
3997B22m69J28M63m60o2J20K49m39K60K59n34r8L91K80j29j17J15k64j62O48k28
4018A73k30J89Q6m43R1M88k17o65N98J65n39j8P45k59o39M43M54p09K78N44o08
4039g3n32P09J57n24J68K51m40k22M46K57q44N47O50k64o17Q11J0p96J73P04n94
4060b3m23P74k48k81K25N34p96j4P21m75o82N09M67q27K61R98m34n63N01M9m88
$$ plain form
3907 205 -481 78 21 -222 -107 15 -141 -207 220 -16 -10 -166 83 -32 247 294 65 273 327 31 288 -6
3929 -6 -180 -103 -91 -135 -100 -176 -314 37 -56 -22 31 177 -58 -307 124 271 234 -121 152 -99 -77 174 41 109
3953 109 -65 11 -171 -81 -97 43 -94 -454 225 -107 -282 196 341 -66 331 560 -77 -207 73 190 30
3974 30 -207 68 -125 -158 103 -32 0 89 109 -190 28 523 80 34 149 406 -198 2 128 160 -59 -11 222
3997 222 -247 -119 344 -116 -178 -58 191 -248 12 271 -263 -361 30 310 181 64 179 -85 -247 401 173
4018 173 -57 132 218 -225 -134 354 137 -528 70 235 -304 -322 423 164 -475 -32 422 -287 -9 535 -73
4039 -73 -605 104 261 -263 -95 156 -284 -506 -60 197 -647 -100 550 286 -331 480 490 -306 -133 571 -23
4060 -23 -446 328 80 -201 24 558 -238 -252 469 -6 -688 -179 288 -539 -278 720 286 -277 224 273 -215
4081b15k2P43n94k30N48K30j019J65P39n71J53N54qp50R0P96m80l45P37k40q03
4102e22M06N09n77r9N56j4m58J80K65m79k23N66L0o22O58M28q81O8N12j46l02
4123a45N04p4m61q8P06m03m06Q12m1p46K82L65n89k31Q96m22m2J09N13m95l70
4144c26P36j63o23P44k34o29K50Q23p40j48O25r0n36J9N71n36j1M14K0m50L02
4165A8L12j90m17N58k60n13O62J76n39j50P80l19l26M7N99p20J14N98n77k68R34
4186E19k61l26k5M26l05m42O33np13M50O48j007L80N02k59m66J63O99j299K56
4206d32R26l36j29J34K00o29J52L84k91n64J121j25o76J46L74o55p3P73M7o41
4226b94J88M40p48K34L33J04m34K73K64o64N2Q96n95o88Q42J48n87k71M66J41
$$ plain form
4081 -215 -237 506 -88 -318 230 460 -559 -394 345 -226 -73 481 473 -277 -187 609 129 -216 521 281 -522
4102 -522 -116 393 -184 -283 273 259 -199 -19 246 -233 -456 110 140 -482 176 604 -277 -209 303 157 -145
4123 -145 359 285 -176 -264 442 39 -367 445 404 -342 -60 305 -284 -515 381 -41 -83 26 539 44 -326
4144 -326 410 247 -376 368 134 -495 -245 578 -162 -310 315 225 -311 -292 279 -257 -268 146 166 -284 18
4165 18 330 140 -277 281 21 -492 170 346 -193 -343 437 118 -208 -161 438 -282 -168 430 -147 -415 519
4186 519 258 -68 -93 333 28 -414 219 214 -499 -49 599 -408 -28 474 215 -251 -88 611 -688 -432
4206 -432 494 158 29 163 363 -266 -114 270 -21 -585 536 411 -265 -119 255 -400 -473 300 347 -294
4226 -294 -106 334 -414 -180 153 257 -177 96 360 -304 -252 644 49 -639 203 351 -236 -507 -41 100
4246A00o53O92J75l56m9M79m44J07K21j55k79J42L85l74k13O97l55m91L58M90
4266D77o11pP5O3l37K70J38k83L68K39m85Q9K29J99l12M0r0n8j88M55Jm21r3O47
4290D05l33m55N47j61l74K04K92j29j62P2L38m63L68j8j84l19N78j26j49k5J74
4311H0k59L1P2K8rK65j59j22K4J61M1l04L66j75k39k1L86q4l20J93L77k51K4n1
4335E4n2k26K73j40o0J54K11o08K19L79j07m0J14m5l21N59m28j04L8K46k24j84
4357b92K86Q5qj27J83J18k61J33k32J55M7Oj3l3j36j7k58K61K78k61L48l37K06
4380A31k94K54k38K24j21L8K17l17K68j58J3q6J20Q6j32L2k20K71K1j27j94J73
4402c9L28k52j12Q8j24J9N9M3O1p3K32L3M6n26K34j03k08L50J69j38k29L30k90
$$ plain form
4246 100 -553 139 314 -42 -91 388 -56 51 272 117 -162 -20 365 -9 -222 475 120 -371 -13 477
4266 477 -134 -141 -66 -3 -340 -70 68 -215 153 392 -93 -4 225 424 112 152 62 4 -184 271 272 -149 -242 405
4290 405 72 -383 164 3 -371 -167 125 -4 -166 -94 244 -219 149 131 -53 -372 206 80 -69 -94 80
4311 80 -179 -148 -76 -48 -57 208 49 -73 -49 112 153 -151 215 40 -199 -220 166 82 -238 -45 332 81 105 54
4335 54 2 -224 49 -91 -151 3 214 -394 -175 204 97 57 171 126 -195 364 -64 -168 -130 116 -108 -292
4357 -292 -6 79 71 -56 127 245 -16 117 -115 40 87 93 80 47 -89 -106 -364 -103 175 -86 262 -75 131
4380 131 -163 91 -147 77 -44 -6 211 -106 162 4 17 -69 51 137 5 37 -183 88 109 -18 -212 -39
4402 -39 289 37 -75 13 -111 -92 -33 10 71 -2 230 263 309 -217 17 -86 -294 56 225 87 -142 188 -102
4425a02j04J61J74k21n7L12j14k29J19N3M7q7K70m21P4J66J8n14O23j29j06Q1
4447A4K56l00k44L53k30p8J11K90K9j46l97N86k99k76N09j46n9mj9m4j85L64j81
4470i6j58L67J15k50j95L80J56o65M83j29k06M3L42n60J18K73J31m94M77k83Q5
4491f6k97K45J78n60M21n8j7P0L64l59j25O59k96l73J24J02o2j96J33J64J0j34
4513g3K98m11J76K0k0k31J78L58l53P5lQ0j09K84p9k10n3Q1l2l38J79L91j66j73
4537a31K12j28n56N82R5O6j44K13j58k51K86K7k25J86J34m05M4L37n5j94j4K30
4559A51l0k82J37n40M24J55j3r9J73J07r6j75L26j95k27J62K14k70mk0K13m96
4581c85J17N93p00J69r1L75M5L53q0l52j20K46l18j81M21J65l87L19K19n55j42
$$ plain form
4425 -102 -206 -45 129 -92 -149 163 49 -180 -61 -8 39 -48 222 -199 -125 41 59 -455 168 39 -67 14
4447 14 270 -30 -274 79 -151 -229 -118 172 201 55 -342 244 -55 -331 178 32 -27 -31 -50 -94 -279 85 -96
4470 -96 -254 113 228 -22 -217 163 319 -346 137 8 -198 -155 187 -373 -255 18 149 -345 132 -151 -66
4491 -66 -363 -118 60 -500 -79 -137 -154 -84 280 -79 -204 455 159 -214 -90 12 -50 -246 -113 51 61 -73
4513 -73 225 -186 -10 10 -10 -241 -63 295 -58 17 14 94 -15 269 190 -20 -73 8 -24 -362 -183 208 42 -131
4537 -131 81 -47 -603 -21 74 140 -4 209 51 -200 86 113 -112 74 208 -197 -153 184 129 -65 -79 151
4559 151 121 -161 -24 -564 -140 15 2 -97 76 183 87 -88 238 43 -184 -22 192 -78 -82 -102 111 -385
4581 -385 -268 325 -375 -206 -297 78 123 476 396 44 -76 170 -148 -329 92 257 -130 189 408 -147 -289
4602b89L42L4j37O4j60j12j43N88j04jl13M48k24k51M99j31j56L11O9p41L06J27
4624B6j35k27R5K74l03n8N48n3l20M06j34k98K35j6L9j73M6K45mn77N86Q0m95
4647b13K96p4L1j01J50k33K27O0j51J32J11p9k83M3P6k38M09k01J97k63n8L06
4669A44O2k86j95K39J1m34N16p9j21j4m3M8K56j12J05j47J28p7p9m22M78j40n7
4692b19J96j57M08k24k88K34J07O7j84K0j50K69M4j82j59N42l18k53L51J40l89
4713a45J85K46l11L1j45K99m8N3J4k55K5R3j21K00k85M05l80r1K76M7k53J6O6
4736g8J52o4l85J58J00J3M60m40J13K53k26l2K12j16p6q9j99M8J62M9k5k9k40
4759b79L84ok74R4K0j39j48L52L15m96L31l24J97k64N30j95qj65J56j59k48K29
$$ plain form
4602 -289 53 87 -50 14 -146 -258 -401 187 83 82 -231 217 -7 -258 241 110 -46 265 334 -407 -101 26
4624 26 -109 -336 -241 33 -270 -328 220 167 -153 253 119 -179 56 40 79 -94 -48 197 193 -384 202 282 -213
4647 -213 83 9 40 -61 89 -144 83 143 -8 124 235 156 -127 -84 -8 -246 163 -38 159 -104 -162 144
4669 144 206 -80 -275 -36 -25 -459 57 -22 -143 -157 -200 -152 104 -8 97 -50 78 1 -78 -500 -22 -162 -219
4692 -219 -23 -180 228 4 -284 -50 57 124 -60 -40 -190 79 123 -59 -218 324 6 -247 104 244 -145
4713 -145 40 286 -25 6 -139 160 112 165 179 -76 -51 42 -79 121 -164 241 -139 -230 46 93 -160 -144 -78
4736 -78 74 10 -375 -217 -117 -104 356 -84 29 282 56 24 236 120 44 -45 -244 -196 -34 15 -10 -39 -279
4759 -279 105 99 -175 -81 -61 -200 -348 4 319 -177 154 -170 27 -237 293 98 90 -75 81 -78 -326 -97
4781i7O3l8J78r0J63J14l54Mj93K84j7L83m04ql8o5O4k7q0o2K38k04J77j80Q7
4806a02M0j36K73j54j21Q6K12K27k83M40l91O2Q4l69L76m83J87KM0k01j8J42j8
4829a05J71k52K45l5J3P9n7j47K04J09k70J62k55L5l2K76l00K19j04O7J9O3k22
4852a17J12R3j87J98j85J2K84j98J19q1j78J70J2j14l4J49l52J48J99n19L58R2
4874a9J5Q1m2K5r3L7J03m3R7o6l86L23k2O4k61L35j6Pk57N4N2j17J52k58n7K72
4900b0j52L10k70L21q4k39J91q7k24R9r2L24O7j12P3j24J59j81k4M0K37l17K93
4923A88j15Q3m8l20K46K08j51k66J09k15O28k68m8o9k1J83q4k64L61k26j51J93
4945d7k48L28m4J68Q1k48l6M1K07k10j98N36k99K00k55j13q4J93J22L6o7o7k03
$$ plain form
4781 -97 -34 -72 106 16 179 293 -61 -57 -250 34 17 400 -4 -12 -50 -115 -51 -78 -158 -220 18 -186 -9 -189 -102
4806 -102 -62 -198 75 -79 -200 -114 98 325 42 482 91 153 237 -132 244 -239 -52 -50 -10 -211 -229 -87 -105
4829 -105 66 -186 59 24 37 116 59 -88 116 225 -45 117 -138 -103 -135 141 -159 60 -44 23 42 105 -117
4852 -117 -5 88 -99 99 -86 -74 210 12 131 50 -128 42 54 -60 -94 55 -297 -149 50 -469 -111 -19
4874 -19 -4 77 35 60 -33 4 107 64 161 95 -291 32 10 74 -187 148 132 139 -118 -64 -12 -129 23 -235 -292 -20
4900 -20 -172 138 -132 189 105 -134 57 -30 -254 -155 -247 77 144 32 105 -19 140 -41 -65 -25 212 -105 188
4923 188 73 156 108 -212 34 242 91 -175 -66 -281 347 79 31 -38 -59 124 40 -224 137 -89 -240 -47
4945 -47 -295 33 -11 157 238 -10 -46 -5 202 -8 -206 330 31 231 -24 -137 -221 -28 94 130 63 -4 -207
4968b07J87K65j24N9k72Q4J38P5m7m0j70L6q9J63J04k91j7K70L3q0n2k42J34Q0
4992cj1j11L14k74R6j2k05L1L67O1l22N09l25k90J96P7m54L63M8l05k3N27k74
5015b0j4J71j42O2kJ84o7l56J17J57l07Q0R9J14l41m0M02n5Ko5Ml0J35M66l59
5040A95j78j20K14j31K70k75k59J44K37k56K93J06k64m4N3P4K17l79R1K36l66
5061a42J70K73k59j15L15j81r0n8L28n46m1K57K4o3j8K70m41L73J07n8j95J7M6
5084b7j36K60l5o9j57J14L16p04O75P7m21o7Q3O7m5O7M53n47p9M75j53J9M8J10
5108C24m34J85j01O0k85L66j09j19J53K48l62j61M20Q9j11J6j67j05o1M22l20
5129e2k24K16O4Jj19K32L3j39j6O8j35r7K04L5k48J18N0r1J33J61r1l64K46K71
$$ plain form
4968 -207 -20 245 121 180 -92 -8 130 205 158 118 -52 -16 -105 58 162 -129 -146 124 157 77 25 -217 -83 -3
4992 -3 -14 -125 189 -85 11 -1 -206 -175 192 253 -69 440 115 -175 21 98 -356 7 55 -250 -273 254 -20
5015 -20 -34 137 -5 57 55 239 172 -184 -67 90 -217 -137 -38 76 -265 -305 97 42 44 -21 -17 -47 88 554 195
5040 195 17 -103 111 -20 250 -25 -284 -140 97 -159 134 240 -24 -68 -15 59 276 -103 -12 224 -142
5061 -142 28 301 42 -73 242 61 -29 -87 241 -305 -346 -89 -65 -128 -146 124 -317 56 163 105 -90 -73 -27
5084 -27 -163 97 62 -7 -164 -50 266 -438 237 314 -107 -174 -91 -24 -69 -2 451 -96 -175 300 147 166 214 324
5108 324 -110 75 -26 34 -251 115 6 -113 40 288 -74 -235 185 274 163 179 12 -93 -154 268 -52
5129 -52 -276 -60 4 5 -114 118 151 12 -4 64 -71 -168 36 71 -177 -59 -9 -100 33 194 103 -261 -15 256
5153B56j62l76P54n92k06K79M6j20J73P5j32k06J89p4j57M33k16L02l58K46J42
5174B96j17l33M38k87J17J36jk42p3J02k57L88k17K10m45J67R8P6L0q4K03j98
5196Gj46L41j79N1L19m06J85j16k35j21R4J56O7N9j29K30k13P0j11Q8N4N7OJ45
5220B73k49k03P0Q2M63n53j19K00L8N5m6L3j72K35Q1J7j71M5l5j88M36j39l89
5243b36J52J78j17l61L78J40j72j10K91k88k43M35J18j38M5J51j3l46l7M67m70
5264a76M7M48k14m48M07p8k78L06j81N3J52l0q9o3J91j4qR0J68l1k12n9P5%jj
5290E4L11m13k4L56k43j05J57k01m2K76m13J67L53J0j61j95J2K74m1k56n0J81
5312GJ90k97K24k95L57l96J5K37J7L5o1RR4n8p1P0O5L8j88N5k71M06r6k21L65
$$ plain form
5153 256 94 -282 472 -120 -326 -47 -1 -121 52 127 -5 -211 -22 -96 -253 180 -36 266 -92 154 296
5174 296 179 -154 284 -3 114 250 249 7 -66 36 -221 167 -50 160 -285 -118 -20 56 86 2 205 7
5196 7 -139 202 23 74 393 -13 172 56 -179 -300 -206 -50 17 76 -53 177 -36 34 -77 11 65 122 128 273
5220 273 24 -179 -109 -27 436 -117 -236 -36 2 57 11 44 -128 107 188 205 34 79 44 -144 292 153 -236
5243 -236 -84 94 -23 -384 -6 134 -38 -148 143 -145 -388 47 165 27 72 223 210 -136 -173 294 -176
5264 -176 -129 319 105 -343 64 -14 -292 14 -167 -114 38 8 -81 -144 47 33 25 115 283 252 40 -19 56 56 55 54
5290 54 365 -48 -72 284 41 -64 93 -108 -150 126 -287 -120 233 243 82 -113 -101 173 132 -124 -174 7
5312 7 197 -100 124 -171 186 -210 -195 42 59 94 33 42 136 78 7 77 142 180 -8 47 -224 182 86 -135 230
5337B30j34o0j41l5o5J95L84k02k90K45K8l08J27R5M7j02O7O3k44Q6j22J24O6
5360E4j70J83K05k78l63J46j18Q7L83n1qJ03j23j08j08L54L45o45K18L5k83j67
5382c09K32J40R4m03L48k00J07k2j00j40K41l5K05k13m9p2M28k96M01j91q8J56
5404B34j73j26j54L79k34J29rk8r0jm9j03L11jp3O1J08l42Q2J51o9R1p8Kj05J14
5430B7K4m0K23l51M1L07K13n73m9K35M02j0n65O7l7J82j64N0P8O3p7J80l65KM46
5455C09n31J95M6O6J32j85P1l7M8q4K78l97K60l9j41J6K98l69j37J71p2L8J1m8
5479a01J88p3r3K40m24K19K4r6K35k12J85j73J44j31m9K60k64K49k93K11J25l24
5501a53J79K14m4Q4j54j33j9J52J23l47j27n0L46j35j16J15p3K54k06K05m8r2
$$ plain form
5337 230 96 36 -105 -140 -205 -10 374 172 -118 127 155 -153 -26 69 116 14 81 144 -100 -14 -136 -12 54
5360 54 -116 67 272 -6 -369 -223 -341 -254 129 78 70 173 50 -58 -166 188 533 -112 106 141 -142 -309
5382 -309 -77 63 157 -246 102 -98 9 -13 -113 -253 -12 -47 158 -55 -104 -176 252 -44 357 166 78 234
5404 234 61 -65 -219 160 -74 55 46 18 -72 -73 -122 -225 86 85 12 73 181 -161 -79 72 3 94 16 18 -87 27
5430 27 51 11 234 -117 -76 231 444 -129 -178 57 459 449 -116 -49 -86 96 -68 -18 60 123 46 226 -139 -137 309
5455 309 -222 -27 19 85 217 32 103 66 114 30 308 -89 171 132 -9 7 305 -64 -201 -30 -102 -64 -53 -101
5479 -101 87 14 -79 161 -263 -44 -20 -116 119 -93 92 -81 63 -68 -117 143 -121 128 -165 46 171 -153
5501 -153 26 240 196 280 126 -7 -26 126 249 -98 -225 -275 71 -64 -180 -65 -138 116 -90 115 67 -25
5523b5j05j62K24K18l5k77J70m7J68k41J20k10q8M23l30J26k15L04J78j55n4J20
5545A07m8l2pP9j30J6j31M9K46j86J61j69j16J48j79J7K66j18J69m26L52j79K28
5568A17j21L2j32m7J35j89J61O22o42K9q9J68l57K22O2J15J3j36N4L3O9j97Q3
5591Em33N09M5r0R5j90K9Q0L4j18R1J14j35k31R2L46j35k50J87j05p2L06j43K9
5615F0l2Q1R3l93L60j64j38k8J79j48O4J95J62k04k28J72J63j07l84M72m54K33
5637d6J30j5k52K37o6k32N42kl28k67K68j34N6L25j29k20K66k06P5p1J86j23j29
5660a35J47K08l44J90q5kj55N3pn3J33J86k32M5j6J97k90R8K5J72l14K68K2k2
5684H9l7nk83J19l1O6K74j90K12j44j68J75j87j50L10J90j96k46M34k83m8J81
$$ plain form
5523 -25 -130 -292 -68 150 115 -162 8 -39 129 -112 8 -202 -290 133 -197 -71 -286 18 196 41 -13 107
5545 107 59 27 20 99 -31 -15 -146 -97 149 -37 124 -45 -161 -13 -192 -175 91 -27 142 -284 68 -111 117
5568 117 -4 28 -104 -151 -16 -205 -44 578 -64 -35 -124 44 -313 -91 -29 86 99 -37 17 50 119 -78 5
5591 5 -428 81 126 36 131 -59 -30 50 84 -34 57 171 36 -195 -103 243 108 -142 45 -60 -132 174 31 60
5615 60 28 109 202 -191 169 5 -133 -161 18 -130 -66 129 291 87 -141 31 194 87 -297 175 -279 -46
5637 -46 84 69 -183 54 -12 -244 298 296 -32 -299 -31 -165 -109 216 87 -133 133 -73 2 -69 117 -6 -135
5660 -135 12 220 -124 66 -19 -21 -176 -123 -130 -183 -50 136 -96 -51 -67 130 -160 -62 -37 135 -179 89 111 89
5684 89 52 47 -236 -117 -148 -82 192 2 214 70 -98 77 -110 -260 50 240 44 -202 232 -51 -99 82
5706H2J32l53J86l2J01j03P7m67R9L79m05J57P5J74j05j02o7J32J64J33q9j50
5728A8n2m9J86K1j54J89j15Q3j11j29k3%n3M08l30l8J95O9r6k03K57KN4j9k4l29
5754b43J44N3Q9J10Q2k80J16k07J51k28J43J49k33J5J18K27l76M4k0L89L0k10
5776F3J0k25L36k36K74k66K58j3j41Q1k46J08j65J86lJ23K02j80k07p4J71Ol1
5799C1pj96o0L50K4rm6l38L85N7j48j84j31L50L2o3k97J99L86l95K24j52j94M27
5823B45m11J6j39L81r8j66J59J09m5o9J16l20L82j40J83j71J73m33J97j68K7K80
5845A08k03j95K86o9p4J71o5J49l92J12L82k08R6j08Q5j06J91m75K69j2N4j17
5867a21J71j12J21j91J54P0l01N61l85l5K8J40j69K50k1q7l5k0n4kN2R3j34J52
$$ plain form
5706 82 214 -139 47 15 116 13 90 -377 -278 101 -304 -147 -72 102 -3 -105 -172 -40 124 257 168 18
5728 18 -34 -83 103 124 -30 159 44 127 16 -113 -136 -136 -189 219 -111 -149 46 115 19 -184 73 75 129 110 86 -243
5754 -243 -99 -46 43 153 235 -45 71 -136 15 -213 -70 79 -154 -139 -21 206 -170 -126 -146 243 273 63
5776 63 73 -152 184 -52 222 -44 214 201 60 141 -105 3 -162 24 21 144 346 166 -41 -115 56 62 31
5799 31 24 -172 -232 118 142 133 87 -251 134 191 43 -141 -272 78 110 47 -250 -51 335 -60 164 12 -182 245
5823 245 -166 -150 -289 92 -6 -172 -13 96 51 -18 98 -222 160 20 203 32 205 -228 -31 -199 -172 108
5845 108 -95 -290 -4 -73 -147 24 -41 108 -284 -172 210 2 98 -10 75 -31 160 -315 -46 -58 -4 -121
5867 -121 50 -62 59 -132 22 92 -209 352 -33 -68 -40 100 -69 181 160 73 38 18 -36 -38 14 107 -27 125
5891A25l21K26n2n8J24p3M5j2J35k7j50K76l01K78l36K40k05J20k70M09j07r5
5913b9j8K3l5J25j01nj84K03J18l56Q5J24OJ96j5J62k18J50k23k85L95k17J32
5936C3k12Q3J14L8j67R3j75N8oM48m23K0j4K29q3KJ16LN2k06j91L5L05Rj08j59
5962a06J47k82K36k06M88O7k74K09l34k63M33k83L60p4j78k0L14ml45K69j48j3
5984gM7J92j44P6k98K39O0l04J40q7J09R7k27r3L87N7j91J28k21J50k25J20Lj62
6008a54J4j8J06K44j7K0k22J7j4k70L03%R7P9l06Q0j20l1J5L06l69L45l24L23
6032A04N7n50O05l52K08K30j74j59j05K54r4j66K0n5J79J8n5J56p6R5k81J52k46
6055b35K30K30k42j3M22n21K02m3qm6K01r4m1K5k22K45p7J93k18j1K85k26q1k29
$$ plain form
5891 125 -196 30 -22 -80 44 -29 16 4 139 112 -38 238 -63 215 -121 119 -86 34 -236 173 66 -29
5913 -29 -47 -24 -59 66 -35 -40 -224 -21 97 -259 -174 -50 -44 152 137 299 81 231 8 -277 118 -99 33
5936 33 -179 -96 18 56 -111 -18 -193 -135 -141 307 -116 -96 -110 119 36 38 154 157 209 3 -188 -153 152 161 53 -106
5962 -106 41 -241 -5 -211 277 344 70 279 -55 -318 115 -168 192 118 -60 -80 234 230 -115 154 6 -7
5984 -7 40 232 88 164 -134 105 165 -139 1 -86 23 120 -107 -200 187 244 53 181 -40 110 -115 5 8 -154
6008 -154 -140 -158 -52 192 175 195 -27 -10 -24 -294 9 9 106 185 -121 -41 -161 -192 -177 129 -240 105 -219 104
6032 104 161 -389 216 -136 72 302 128 -31 -136 118 24 -142 -122 -177 2 20 -35 121 45 140 -141 11 -235
6055 -235 -5 225 -17 -30 392 -129 73 30 22 -24 177 83 42 67 -155 90 13 206 -12 -23 262 36 -45 -274
6079b74M65k44K34Q1j40n7R5j4j30J28k63R1L4l9j07r3R1K12j57l82M07J76j92
6102g8L86j8k54M0n7L01k60l07M36k57K39k23N2j63K31l43o3K72J18J20n00L80
6124E2o9k82Q7K47J32nM2l26j66L92j40P4j71P7k37M02j3j10j65K64p3LJ0j29
6148a04O1J3L9J12l52L76l80M76m51r8N03k69k2k36K33r9o5R4K01p1N5K27l57
6171a14J92K0k74L2R4Lp7J69p7L95n08j54J90M2K67K06l44k74M80n21K91J10J20
6194B68j69k22L33l62Q6L7M4po5K50k99J1K48Q9m58L26m03L72j75N6K46j67J95
6217B34k15k11J55J64q7j41J56J00k88p0L87N5k86j73K55k0j90J98l22L62Q2k83
6239a38J56MJ2l45M08p2J97l11l6J78Q4l97K29j84j42N18j60L9k67J70K09j42
$$ plain form
6079 -274 191 -53 181 262 122 65 160 146 16 144 -119 -28 6 -33 -140 -233 -142 70 -87 -469 -62 114 -78
6102 -78 308 290 36 76 19 320 60 -247 189 -68 171 -52 0 -163 68 -275 -338 -66 52 172 -328 52
6124 52 -17 -299 -212 35 167 162 204 -122 -288 104 -36 38 -133 -56 -293 109 96 -14 -179 85 12 15 25 -104
6148 -104 -43 -30 9 121 -231 145 -235 241 -210 -308 195 -74 -96 -332 -99 -198 -263 -169 32 -39 16 243 -114
6171 -114 78 98 -176 -144 -50 -47 -124 45 -32 363 -145 -299 -109 -67 200 406 62 -212 268 -253 38 148 268
6194 268 99 -123 210 -152 -66 -29 15 8 -57 193 -106 -95 153 242 -216 110 -293 79 -96 -40 206 39 234
6217 234 19 -192 -37 127 40 -101 55 155 -133 -203 184 239 -47 -220 35 15 -175 23 -299 63 145 -138
6239 -138 18 22 34 -311 97 25 222 -89 -125 53 137 -260 -31 -215 -357 161 1 40 -227 -57 152 10
6261A0Q0p7M26m46L5o4m3J39J64j42Jk09L34m07RL25n8k03J42L8K9k42Q2N49j84
6286B88k13k52J86j05N9J77N0l7mj59o8Q9j67O7N1K25m16K68j54J38J7J60j33
6309F7M6o3j31M0M0k40M34O3r1j07J7k2j62L0O2j60J74K96n12J95M4M3r7L32j24
6334A74J59k79l97J22N4J64k19K38j17J21k8J00j74J47l0K6J04p1p5L33j07o8
6356A77k60KM5j97K67J07k99M7k63O38l19n2L63j06p9m5J49r2j41K72l46M26l51
6379e7R8p3M7K3k37L54J4M2l18J96l88L60j08r0K11o9J48r8J22j01K29j06k70
6402g1q7J38r6J02L6j52K75k71J87l53R6J57Q0J11m9J5L7k18j41K34J05j65P4
6425D4n9MJ63l19J4K34M7k85K2N6J86j89J62O2k63P9J2M18l95L1j92L12m0j43
$$ plain form
6261 10 90 13 439 -7 28 -36 -79 60 224 82 83 -126 208 -199 -190 135 77 -126 16 54 83 -159 -77 472 288
6286 288 75 -177 9 -96 -37 140 190 153 149 -10 -78 11 -156 -89 -38 187 -229 39 -115 23 40 200 67
6309 67 113 50 -81 -41 -1 -241 193 256 165 58 75 53 -109 -79 -17 -177 -3 293 -219 -24 20 63 -34 298 174
6334 174 333 54 -343 -221 -167 -3 -222 16 -101 20 -8 92 -82 65 35 61 165 94 19 352 245 177
6356 177 -83 -81 -36 -233 34 141 -158 -111 -374 264 -55 -107 256 150 71 26 175 83 -58 214 -132 294 -57
6379 -57 41 -32 15 38 -199 155 169 211 -107 89 -299 61 -47 -137 74 5 153 55 177 76 305 199 -71
6402 -71 -158 -20 -116 -14 22 -130 145 -126 61 -292 -196 -39 41 152 103 118 155 -63 -204 30 135 -30 44
6425 44 -15 -11 152 -167 -153 81 128 -157 -135 -79 107 -82 80 142 -121 -42 -30 388 -7 24 -168 144 104 -39
6449c9k46K72J70l45L88k77J62l30n1L13M02n62qK84Q4k04J50p4%l55K27j1M44
6472C94n21Q9J21m9J5N1j19J63j24J33l0J00l6j40n8J05k51J99J6j37K08k04j
6495g6K1J58j56J07j47K06o9Ok86M40m85L27J56o9j58k2K95l66Q7J58k55J73k50
6518b05K3K53k61J03N6K9J5j85J67Q9j28J9j4R3k5JO5N5j7k21K02J85m33P1J30
6543F7Q1n23M78l57J20mm0J00J44J19j23K72n9j57J01k14j40K43k54K92j94k02
6565b50J5L97k04r4J07j75o8Q3M31k22J90k75OK48m8m5j97J32K7r8Q6l8q9Q8k6
6590a9o0P5K32O2j61J01l21R2K04n3O3j03L2J8j23j90J72m8J98l02j11L0K7L1
6614a54R8PJ60n2J41l35J17J40k40L20p6K9j85p5K63m72L42j7j49J16K65m82J70
$$ plain form
6449 -39 -285 -13 157 -188 200 -77 85 -245 -296 17 419 -143 -151 133 217 13 163 89 89 -266 -39 -50 394
6472 394 -127 -38 83 34 49 100 -19 144 20 153 123 223 187 47 -11 94 -157 42 58 -79 129 -75 -76
6495 -76 -55 103 -53 54 -93 113 44 50 -236 204 -281 46 202 133 -25 -47 248 -118 -31 127 -128 45 -205
6518 -205 -182 71 -190 -87 -31 -2 13 -172 -5 84 -44 -25 -39 54 29 30 95 150 133 -88 114 299 -134 -63 67
6543 67 148 -375 103 -254 -134 -138 -178 -78 66 185 62 334 275 118 219 5 -135 108 -146 146 -48 -250
6565 -250 -235 162 -42 -136 -29 -204 -272 -189 242 20 210 -65 -59 189 141 96 -101 31 58 -40 46 8 -81 7 -19
6590 -19 -79 -4 228 290 129 230 -91 1 205 152 215 112 144 162 39 -151 21 -27 171 -131 -242 -212 -185 -154
6614 -154 -56 -49 111 59 200 -135 -18 122 -118 202 126 155 -30 -105 158 -314 28 11 -138 -22 243 -239 -69
6637f9N0N2K3mP6k38N0R7JR9j96J96j95K91P1l19L7K3L1k4j47K09R5j59J82m0
6663A92k57q5K93j10J87k79j79K48M3j00K73k93K16l05J47J12K0K9m92K11O4K22
6685A57k15M12k39q3j90J05j07J50J81j01p2J65j97l3k4K47j60J49j54J68k46
6706h7k61L55q3k0R6N5k1O1k31J52j40N3J00J44k27j49P1P7K72l86Q3PK65q4k0
6731H2K07j1l14J76k82J35R8K60j31l5K32o42l1L77l1k81K48O7p7l04M55k24Q6
6754F0q4j60L52j90p7K03j44J88l34K92K3o4p9j48P7M04n61M38p3r3j4R9r7P7
6778I5j44P3J46k13pK48J02l48n7K50O2l5k36R3k38O6J42k09J23j27L37L6j20
6801C9q1l6j11M54j40o81P68m74J26J36j24O2K30k97J62k16K91j22k4Q7Mm3j85
$$ plain form
6637 -69 -19 33 56 52 128 -110 -60 37 38 137 -59 137 -58 233 304 -15 22 45 76 52 -95 114 209 50 232 192
6663 192 -65 -150 143 33 220 -59 -238 10 53 -47 226 -67 149 -156 -9 103 123 152 -340 -129 -65 157
6685 157 -58 354 115 32 -158 -53 -160 -10 171 70 -2 163 -34 -67 -91 156 -4 145 -9 159 -87
6706 -87 -348 7 -76 -96 0 55 34 95 -136 16 -124 -71 29 173 -54 -203 -132 -55 217 -169 -86 -79 186 102 82
6731 82 289 278 -36 140 -142 -7 91 351 220 185 417 -225 -256 121 90 -191 57 124 47 -257 198 -26 60
6754 60 -24 -184 168 -22 -99 104 -40 148 -186 106 129 65 -14 -162 -85 319 -242 196 123 30 16 115 18 95
6778 95 -49 24 170 -43 -50 198 300 -48 -105 145 207 172 -64 29 -209 -143 -1 -210 -87 -214 123 159 39
6801 39 -42 -78 -189 265 125 -556 212 -262 -136 0 -124 -62 168 -129 33 -183 108 -14 -38 49 53 10 -175
6824a75L59J43m38K04k57J70K00j43jJ31l19k13L82l4L25l75j37L67k59N0M1j04
6846h3L98m92J58Q4O2m61K34N8n7n1K03O9m0L1j45j21L47o2m0r5J55r2J9KM1k02
6872h0K71n5k42J99N6j54m49J12J07K14n0J37k24kQM88p5j90J90m44M27m71L19
6895I2j92q7L9J11J34k73M17k45MJ5o0J44j84K28r5K7k68L86p0k62L25j38k52
6918b04J59J26k88J22r2K2j23L65m50M14J09k8k5k03K21m04M98k49P4L30m11M9
6940A2j06J41m2j19j08K95k49o9M21p1j20J60k3j81j8k6j03M84m32k6Q5M8o2N1
6964e8n5L81j09l76J08M7L3R0J85l54k8P2K17j41m5k0L5j9K28j10k20Q7l8m1J
6989a30k4J07N6L1M5l12K22j04K23Q0k52n2l20N36O0l60L38j86K6M2L3j35J61
$$ plain form
6824 -175 184 327 -111 93 -164 6 206 63 62 193 -126 -339 43 9 334 -41 -178 189 -70 -20 21 -83
6846 -83 315 -177 -19 65 127 -334 -100 -42 -99 -150 53 122 82 113 -32 -153 194 132 92 -3 152 60 79 81 122 -80
6872 -80 191 136 -106 93 149 -5 -454 -342 -235 -21 -71 66 -158 -160 -152 336 261 71 261 -183 244 -227 92
6895 92 -100 -187 -148 -37 97 -176 241 -4 0 15 -45 99 -85 143 48 75 -193 193 123 -139 186 48 -204
6918 -204 -45 81 -207 -85 -177 -155 -278 87 -363 51 160 132 107 -96 125 -279 219 -30 44 374 -37 12
6940 12 -94 47 5 -114 -222 73 -176 -245 176 105 -15 145 122 -59 -77 -103 -206 278 -154 -180 -95 -47 -109 -58
6964 -58 -113 268 159 -217 -109 -62 -29 61 246 -108 -136 -64 153 12 -33 -53 -18 -37 191 81 -139 -52 -90 -131 -130
6989 -130 -154 -47 9 40 85 -227 -5 -109 114 194 -58 -110 -430 106 166 -194 144 -42 -16 26 59 -76 85
7012H5j34J20j55p6M9n3K97k27K44j62k34J31j67J25P7P1k09J05M5l4L3k3O7K97
7036B72k72q8N0K9j8l48J87M5J97k86M41j81J17k02K91k26J7%l4j35K4k0J72l7
7060eJ39k25K30o0r0j8p8J65j12P1K34j99R2rr3r8j03l9K54K03l24k5K35k47M10
7085C08m00N3K60m09L34k32J25n0R8j50n1K55j43mj98K01m5P3m52M76j2O0k09
7108a12L31p0j0K0k18j30J78K19n06N42k30o0J21m1J90r3r0n6l6M1Qm0k25J45
7132a22M33m89J90j26K81j87p3M11j08j88NO1j46k46L39r5r7mJ15O2Nk9N8J3j34
7157g1o1J85K11l58K10j5l56L05Q8n5j65L8J04J10l15j02M7K17P7q5K22k04J7
7180D4J92j44k06M54l01l75M09k65J66k23J23J15l5P5j92J27j2J82j71q3J92j97
$$ plain form
7012 85 -49 71 -84 -160 -111 -164 133 -94 150 -12 -246 -115 -282 -157 -80 -9 -218 -113 -68 -102 -69 -92 -25 272
7036 272 0 -88 -38 -9 -27 -375 -188 -143 54 -232 209 28 145 -57 234 8 25 25 -9 -144 -120 -140 32 -5
7060 -5 134 -91 139 79 -11 -29 -107 58 -54 17 251 52 144 135 42 -56 -159 -198 56 259 -65 -90 145 -102 308
7085 308 -92 -39 221 -188 146 -86 39 -11 87 -63 -114 141 -2 -6 -204 -3 -48 25 -427 49 37 97 -112
7108 -112 219 149 139 159 -59 -189 -11 208 -298 244 14 -46 75 34 224 131 41 -15 -51 -10 -2 -42 -267 -122
7132 -122 311 -178 12 -114 167 -20 -93 318 210 22 27 88 -58 -304 35 -60 -157 -161 -46 16 21 -8 50 63 -71
7157 -71 -132 53 264 -94 116 101 -255 50 138 83 -82 -44 60 170 -145 -247 -200 17 94 9 231 27 44
7180 44 236 92 -114 340 39 -336 73 -192 -26 -249 -126 -11 -46 29 -163 -36 -48 134 -37 -120 72 -125
7202a25J85k7J44n4k20N3J41j17j3L9j55M13j20l33Q7j12K62J14j91j19R1M7J53
7225A43k41M68m10O4k78L27k66J03r8J02O2k03K00o2J41m2k07K66k35K93o5j88
7247a26M08k57K7K02m73P6K72j66K9Q2q8j09L40p5N6k41K9J45k51L84k32P8n1
7270E9j43K37l08J84J88j92L4k61J32k6k51K75m7l2J87o3r8J79k08L49j35j36
7292g6n1R0j72L42k42qJ50K56k06o8k66N80j66j99l7P5k5k1j00J78K66n94K67
7315b7Q5j09K16J02k47j30J07K3l04L31j46j24K46j83J03L15j7l46M2j6p2L45
7337A94j90J21r5k67L57o7r4K1%Q9J90m09J16j00J44l9r0j4K83J7j41O2p0kK33
7362B49l17j98M36k22J58j73N4o9m1R4j4q8K5R4Nj5R3m7J25k14J61p5L22j60p5
$$ plain form
7202 -125 60 33 177 123 -97 -44 97 -20 -33 6 -149 264 144 -189 -102 -214 48 162 -29 -148 -57 -10 143
7225 143 -98 370 -40 24 -254 73 -193 -90 -188 -86 -24 -227 -27 -89 52 10 -197 69 -166 127 62 -126
7247 -126 282 25 52 254 -219 -143 129 -37 -8 74 -14 -123 217 142 198 -43 -14 131 -120 264 32 110 59
7270 59 -84 153 -155 29 217 25 59 -202 -70 -96 -347 -72 -119 -151 36 -27 -125 54 -154 195 60 -76
7292 -76 -127 -37 -209 133 -109 -117 33 289 83 15 -251 329 163 -36 -73 2 -23 -44 -144 34 300 -294 -27
7315 -27 58 -51 165 267 20 -110 -3 20 -284 47 -99 -223 23 -160 -57 258 241 -105 -63 -79 -151 194
7337 194 4 125 30 -237 120 53 -41 -20 -20 69 259 -150 -34 -134 10 -29 -119 -133 150 167 26 88 18 16 249
7362 249 -68 -266 170 -52 106 -67 -13 -82 -123 -29 -43 -131 -106 -12 -7 -22 71 24 149 -65 96 21 343 183 108
7387A08Ql64L20j9r7J44j25K9K8l9o6L18j27m18K37K8P5q9K15j41O5m9J10r3l3
7412B5j99P5l3j90L70o3K72k24J78P6k44J06J60q1n67M04M1j18J08P2o3j27R7
7435G5K7k58L93l7m6l81L40q4N7n8o6k28J65p8K89M4J08k67J56l04K74j72J76
7458A25k8o3l4o5P7K82l09Q5K2N9j19M7J44j61j88J2J03J7J48j05j71J62J15j19
7482C6l03N3J69jlJ42J18m00J71q2K03l15J12J77k22J56L0l33L21j2j17p8Q5J5
7506g8J92Rk98J23k24k8L57J70j09k14O6K85l49L85k24j45J03N3r9L3r3K41j91
7529c5j36O0o1R1N4K26m9j67M9q5J79k45J59J09l18K29J11k86J53J25q5p5n2N0
7553Ak0j6J25Q2j65J13K04l33J47j65K18k59K65j39j44K9K08k02J28J22j76J77
$$ plain form
7387 108 116 -248 72 53 -44 100 -25 4 32 -7 -73 245 118 -300 -63 -35 40 -49 166 25 90 41 151 58 25
7412 25 -174 -99 -132 -322 48 -15 257 33 211 287 43 149 309 228 -339 65 106 -12 96 168 105 -22 75
7435 75 102 -156 237 200 154 -227 113 29 86 28 -38 -266 -101 -179 110 154 262 -5 151 -153 121 -51 125
7458 125 97 34 0 -65 12 294 -15 70 92 151 32 79 223 62 -126 -114 -11 6 154 49 -122 40 155 36
7482 36 -267 -214 -45 -46 -49 93 211 -189 -18 -100 103 -212 -100 77 -145 11 41 -292 29 17 -100 -178 -93 -78
7506 -78 114 123 -175 -52 -276 -304 53 223 114 -100 -34 251 -98 287 63 -82 21 74 -25 8 -85 156 -35
7529 -35 -171 -111 -172 -81 -27 199 150 -17 32 -53 126 -119 40 149 -169 60 171 -115 38 163 78 3 -49 1
7553 1 -19 -35 90 172 7 120 324 -9 138 -27 191 -68 197 58 -86 -57 151 -51 77 199 23 200
7575B00m56J92K62l89O8P5P5L7l19K64j83L29Om0J0K9j76l1j10p4Q1K4L39r6J25
7600B42l30J61j82J80pn3k15L41k79n3N26l43J25k58K28o8K0k43J50K39m39R0
7622a68p7K44J76n10L63J42q8J33m59K21m6J11m22N68j16n9N9O4k09N0j80M04
7644B01n41M79r4j14L19K9l56R4j2K8p9L1J9j8k79M03m3j27Q9m6O5j7J26m32K43
7669c2j11K22k73L16k88K11k97O4O3L63j45R8k62J43j10q0J62k8l8L58m69j01
7691b34J40J59j60J57k37N2J61P8j63j55K48j93j90L51J87j32K5kj7j51J74j38
7713d0j80N19l03q3M2o8o2N17k10J98n07J13R3k11K59J90m32K81k3k68N56p94
7735d13N19q7j08J36K8M7j27O9j3K8l7k61J87Q1N6r3k20J76J8p0K29k58K87j64
$$ plain form
7575 200 -256 -64 198 -191 -123 -48 27 64 -255 9 -174 155 161 121 131 160 -16 -47 -157 -231 -150 -126 213 117 242
7600 242 -88 73 -109 71 64 11 -204 137 -142 -195 331 -12 113 -145 83 15 35 -208 -58 181 -258 -168
7622 -168 -245 -1 175 -335 28 170 82 215 -244 -23 -69 42 -380 188 72 13 72 136 -73 -23 -203 201
7644 201 -340 139 45 -69 250 279 -77 17 5 33 -46 -15 4 -14 -293 110 67 -60 29 -17 48 31 157 -275 -32
7669 -32 -143 79 -194 122 -166 45 -252 -188 -125 238 93 191 -71 72 -38 -118 44 16 -22 336 -133 -234
7691 -234 -94 65 -95 62 -175 -123 38 116 -47 -202 46 -147 -337 14 201 69 94 92 75 -76 98 -40
7713 -40 -220 299 -4 -87 -45 -113 -175 342 132 330 -177 -64 29 -182 77 267 -165 116 93 -175 381 -413
7735 -413 106 19 -89 47 75 122 -5 64 51 79 42 -219 -32 49 105 12 -208 -32 -14 -84 145 -113 174 10
7759A0kj0j93q6N07q7j14J18j50K5n7q4J65q8r0L55k01l6k37L46j52L8j54K48
7783G1r0O1J03o7M3n1l35M29k14LJ98J20l57qK23J22K8l96J78P5q8K1K61l15k6
7808a1K00o05N02qj00k7o2m3J41nj2j24n9m2K62l44M03J2k5N3k39O0R2r4K91k20
7834dk8J9k32N66m38K01k62J49n0j5J65k10L38k35M0L62k44k03J64n15K22K48
7856C8lp2J43j32K17P7n39L37j91n1l2J22P4n7j02J80o5J86j29j02J12J94j64
7879D1j33k5Q3K33k05Q3j49O3j78NJ43j7Q4p5K76j24J10k71J0K0P9J7j2J21m32
7904b53K42m6k3J97L3j91P4P2k4M6k79M40m71J69nK08j52J65L4l64J35K8p9L33
7928B89j25p9N4j41J0L96k88l80K62l6K2j13k0Q7L37j60p5K2L6M5j1j58nJ2J03
$$ plain form
7759 10 8 -2 -195 -281 226 139 25 143 -7 18 -39 -123 42 -46 -136 219 18 -18 -255 91 -61 -23 -177 71
7783 71 -19 42 145 78 121 70 -265 164 -50 -47 151 271 -86 -94 129 251 279 -117 61 136 48 69 330 15 -11
7808 -11 189 -416 86 78 -22 -49 -111 -154 -13 -18 -30 -154 -213 -255 7 -337 66 78 53 106 -133 -73 19 -75 216 -4
7834 -4 -32 -13 -245 321 -117 84 -178 -29 -79 -94 71 -139 199 -36 4 366 122 -81 83 -432 -210 38
7856 38 35 -37 106 -26 191 268 -271 66 -125 -176 -208 -86 -12 -69 -171 9 -56 130 1 -101 11 205 41
7879 41 -92 -117 -34 199 -6 77 -72 -9 -187 -182 -39 -56 28 -47 229 105 215 -56 -46 -26 53 70 58 179 -253
7904 -253 -11 -57 -80 117 150 -41 33 105 81 127 -152 288 -183 -14 -19 189 37 202 236 -128 7 35 -44 289
7928 289 164 85 139 -2 8 404 116 -264 -2 -38 -16 -129 -149 -62 275 115 40 62 98 143 132 -26 -31 -19 84
7953H4j76K2j77J90J80l89N16k23m8j52K72k21q9K26j15K58j74J56l27K69j78
7974i6p4K20j28J94k61m8K67q5R2j59O9j68J25P3n4O3L4J2j35L32k39J59l02K35
7998A26k27K52j20J27n5k9j71j6j49J87j14K91k95ML5N4K43j56k34L23k03j1r1
8021b29N0K16n1j68L19k2k60K73j78j64K82M0k17J65j09K14j09mj13L94l55K01
8043A75k96J43NJ24l87R6k1L26j38M08m30Q9j28k44N02m55K96l06L44j01j70J40
8065b8J54j75J13J13J64l32j79J45J2K56q4k07k8N6J20j12K65k12N6j44o1K8J82
8088A02O0k16r1Q2M8j20L15m5l2j16L7J9PJ41j81K22j88R4l81K19O3k56K72lJ7
8113F9m1k31J41j75K17J89o5j13k39Q6M76k58oJ8p2k53N38l65J50k77K56k50M58
$$ plain form
7953 84 -92 -70 -247 -57 123 -266 250 27 -21 -173 99 -122 -211 15 -100 158 -16 140 -187 82 -96
7974 -96 -170 50 -78 116 -145 -193 74 -11 81 -78 -9 -177 -52 21 -33 30 64 76 -59 273 34 193 -109 126
7998 126 -101 151 31 158 103 74 -97 -113 -262 -75 -189 102 -193 -189 -154 -100 143 -13 -247 76 -127 -138 -229
8021 -229 -179 37 -14 -182 137 115 -145 128 -50 -214 68 108 -109 56 -53 161 52 48 -65 329 -26 175
8043 175 -121 22 27 151 -236 -140 -161 165 27 435 5 94 -34 -278 224 -231 65 -241 103 2 -168 -28
8065 -28 126 -49 64 177 341 9 -170 -25 -13 243 159 -48 -76 -20 100 -12 253 41 97 -47 -108 -80 102
8088 102 162 -54 -145 -63 -15 -135 180 135 103 -13 24 43 50 191 10 232 44 138 -243 -24 39 -217 55 52 69
8113 69 28 -203 -62 -237 -20 169 104 -9 -248 -162 314 56 50 68 -4 -257 281 -84 66 -211 45 -205 253
8136B53k14l04K50J81j63J21m7n3j50q8K48l0J18R5j17L02l09KJ98n70K78k34
8158b33J6L08k66J00J23J45k10J5K52k84K07j4k11j62K58j04J74o8l7k65K04j04
8180a56j71L65k86K94p6j73L12r7J64k14M4
$$ plain form
8136 253 39 -265 -15 166 3 124 77 24 -126 -214 34 4 122 217 100 402 93 95 293 -277 1 -233
8158 -233 -217 91 -175 -75 48 193 -17 -2 250 -34 173 159 -52 -214 44 -60 114 46 9 -256 -52 -156
8180 -156 -327 38 -248 46 -30 -203 109 12 176 -38 6
8191F
$$ Imaginary data points
##PAGE= N=2
##DATA TABLE= (X++(I..I)), XYDATA
0@%%%%%%Qj6J6j6J6k4M0n6O5q1J04j28J60j92K32k80L30l87M57n37O26p28Q40
29D49r62J101j260J434j625J836k071K332k614K922l264L639m048M493m978N510
45B894o092O726p416Q175r010R926j0935J2050j3287J4673j6233J7995k0007K2334
59A1793k5061K8307l2243L7137m3424N1826o3690Q1830j13304J82971o00297K43360
71b40795R60573p90697J61702N53475p60505p64946R21171L49197o42061L17459
81F4573O18860q81080m67458R34577J19778q38572M04715O20527p10116l39146
91d73342P78291j48905p11406N10082N23017o53400l2367P60748l94708p96163
101f38153N28839M45670n71456J17672P30207m20602o54657M44178J70474n58350
$$ plain form
0 0 0 0 0 0 0 0 8 -8 8 -8 8 -16 24 -32 33 -48 56 -72 88 -104 128 -152 178 -209 248 -289 337 -391 449
29 449 -513 588 -672 762 -863 973 -1098 1234 -1380 1542 -1722 1917 -2131 2362 -2616 2894
45 2894 -3198 3528 -3888 4287 -4723 5203 -5732 6318 -6969 7704 -8529 9466 -10541 11793
59 11793 -13268 15039 -17204 19933 -23491 28335 -35355 46475 -66829 116142 -484155 -240795
71 -240795 719778 -70919 90783 644258 -116247 -881193 39978 389175 -252886 64573
81 64573 683433 -197647 -665105 269472 389250 -449322 -44607 575920 -134196 -473342
91 -473342 304949 156044 -555362 -45280 477737 -175663 -208030 552718 158010 -638153
101 -638153 -109314 336356 -235100 -117428 612779 192177 -462480 -18302 152172 -406178
111d06178L20807O76230n08566n10632N23486N0390n88786L37537O06496m37163
121F3621l20300M58126j16576n13269L85371M20050m54060q3985N22822k34959
131A26841n40371L41041L09487l93352L7662M52889k65689l96080L22861J29760
141A25049l52044J97180M09191l39686l16373L39814M8562l38845K00201L14875
151B87924k93759j55227L10924o7274k96841K13081J68061l21453q128L60010
161A97318j13077k71547K11073J04432k78416O6395K93536j60001j93586K02773
171E8900K211k42727J67987K61356k09097j49618J91648o8906k34464J74876J97888
182A50054j77766l2834J93538j22488j92684J91896J17077j99314K0933J93452
$$ plain form
111 -406178 -85371 590859 82293 -428339 95147 145537 -443249 -105712 500784 63621
121 63621 -256679 201447 84871 -428398 -43027 377023 -77037 -161022 361800 126841
131 126841 -413530 -72489 236998 -156354 -118692 334197 68508 -327572 -4711 125049
141 125049 -226995 -29815 379376 39690 -276683 63131 111693 -227152 -26951 287924
151 287924 -5835 -161062 149862 82588 -214253 -1172 166889 -154564 -162692 197318
161 197318 84241 -187306 23767 128199 -150217 -83822 209714 49713 -143873 58900
171 58900 61111 -181616 -13629 247727 38630 -110988 80660 11754 -222710 -47834 150054
182 150054 -27712 -60546 132992 10504 -182180 9716 126793 -72521 -51588 141864
192A41864j29267j42795J84291N2764j80574N9890J39493j56899q8940J73300
202E3127j4768j69763J06075J37551j37022m1958J54445n7471j53534J07908R8052
213H2642j17011J3291J39755q6424j25428J09910N0328j26730K8017J18192r1146
224d604q8438J09328J9444j09374N2674R7754q8973m9209J07124r914j03040N8648
236h580P8868p6841k1336Q8106l1283q3083N6422M3498p7635l050P3918l8323
248F81o0489N9692K9565o1996J2097N9276l6280l6154N2028P911n3075K0733M8472
261D2461l1399k5520L6768m435m3132J6219K7159k9753r931L0722r868k6354K2555
274d508J6360k6818j691K9788l429j6603J5814R949j8479O35J5088r394j1004
$$ plain form
192 141864 12597 -130198 54093 106857 -73717 -13827 125666 -31233 -120173 53127
202 53127 38359 -131404 -25329 112222 -24800 -66758 87687 30216 -123318 -15410 82642
213 82642 -34369 -21078 118677 32253 -93175 16735 67063 -59667 -31650 86542 -4604
224 -4604 -93042 16286 35730 -73644 -20970 76784 -12189 -61398 45726 35812 -67228 -8580
236 -8580 70288 -6553 -27889 60217 28934 -54149 2273 45771 -31864 -34914 39004 681
248 681 -59808 -116 29449 -32547 -20450 38826 2546 -33608 18420 26331 -26744 -6011 42461
261 42461 11062 -14458 22310 17875 -25257 -9038 18121 -11632 -21563 9159 -709 -27063 -4508
274 -4508 11852 -14966 -16657 13131 9702 -6901 8913 18862 383 1018 16106 6712 -4292
287d292J0491j007j3516M643Q612j0841r125O281J091n323O239P777j576L223
301B677Q718j923n848J551J383l919K46L149O60k051j744k943m249l637m695l525
317a6150K599O090M172L718M414K138n84j621j261j397n78J937K786K769M02k265
333G169m443m580l829n006l225M43L479K331M120O158K160k214J255K662k723
348C757k993K617Q30p41L976K215n729k822J966m990q652R42K098o116K185R083
364b374J044P18R378O00q521K636N253j1137o622J4079O134p180L192M687j1592
379B95n465O119r167j1977J0208O283j0849Q380K2748n852j6009J0595M614j6391
393f468K445J1351j3722k356K7504L378k0526P885O436l2338j5108K4562J701
$$ plain form
287 -4292 6199 5192 -8324 -3681 4931 -5910 -15035 -8754 -7663 -12986 -6747 1030 -546 2677
301 2677 11395 9472 3624 5175 6558 2639 2885 6034 6694 4643 2899 -44 -4293 -7930 -12625 -16150
317 -16150 -13551 -7461 -3289 429 4843 6981 6397 4776 3515 2118 1540 3477 6263 9032 9434 7169
333 7169 2726 -1854 -5683 -10689 -13914 -13471 -9992 -7661 -3541 2617 4777 2563 3818 6480 3757
348 3757 764 3381 4211 3470 7446 9661 3932 1110 3076 -1914 -10566 -9624 -7526 -13642 -11457 -2374
364 -2374 -1330 -612 8766 9366 845 3481 8734 -2403 -9025 5054 11188 4008 7200 11887 295
379 295 -5170 949 -8218 -20195 -9987 -3704 -14553 -6173 16575 10723 -5286 5309 9923 -6468
393 -6468 -4023 7328 -6394 -8750 18754 22132 1606 9491 15927 -16411 -31519 -6957 -5256
406e256j4839K0772J5889k0412K547K2176k2797k4572K9750J4181l0680O726L3613
419B7098j6823j9385L0175L596l8245K837J4386l4834n908N2654M701l6948K0042
432C346K4037m1404j4262M2029m355l0872L0690K0418m1101K953M6524k3831l9744
445b5572L6366J2151n6058Q92M9283j9146k6755M2329O936m7794K0991M3354m3407
458f430k9907N0715L462m4713L5989M7859n0460l7540L8214l705l1598M3739K6737
471D2362o8165k5202N2180l290k4025N5035K6277o9559k5108M3281r686j8731
483b4631N1962J5695n5811L515M3928l3573l5483M3724J2874m8211R449L8896
495B2334l1281k7174M0220J1042k6756K5759K3817n1328k9496M0506Q503k1822
$$ plain form
406 -5256 -20095 677 16566 -3846 -1299 20877 -1920 -26492 3258 17439 -13241 -6515 27098
419 27098 10275 -9110 21065 24661 -13584 -10747 3639 -31195 -37103 15551 20252 -16696 3346
432 3346 27383 -14021 -28283 13746 9391 -21481 9209 29627 -11474 -8521 38003 14172 -25572
445 -25572 10794 22945 -33113 -32221 17062 -2084 -28839 13490 20426 -27368 -6377 36977 -6430
458 -6430 -36337 14378 17840 -26873 9116 56975 6515 -31025 7189 3484 -28114 15625 42362
471 42362 -25803 -51005 1175 -2115 -26140 28895 55172 -14387 -39495 3786 -5900 -24631
483 -24631 27331 43026 -12785 -9270 34658 1085 -34398 9326 22200 -26011 -16562 22334
495 22334 -8947 -36121 4099 15141 -11615 14144 37961 -13367 -42863 -2357 6146 -15676
507a5676L4398L3341l6346k8191J5357j2663k3647K7399K1181k3008J407K7301
519B0853j6069k8930J7121J5658j8560J253K3645l713j6175K570j260n319K1886
532A2960K4266j2216k6955j5231j4231n819K4664L8857J6202j9003l6685k5794
544c8985M140K3808K5096J3880p145k4353j4128Q302J3062J4612R944j9004l0403
557b1174N556K3124m750j0683Q539n074j5407J8001K4558j5803j8035M274j2309
570a9183p181M1788K9785l2014k1290J5400j2585j9685L2014K5061k9835j3790
582a1515J3240k1371j3805M3701J8599l6113J080K3364l1695k5049M3950K2451
594B6837k8399O620K1465l0593j4646L8188k697l8159J6557K3585l4905r253M3969
$$ plain form
507 -15676 18722 52063 15717 -12474 2883 -9780 -33427 -6028 15153 -7855 -6448 20853
519 20853 4784 -24146 -7025 8633 -9927 -8674 14971 11258 -4917 -2347 -3607 -8926 12960
532 12960 37226 25010 -1945 -17176 -31407 -37226 -12562 26295 42497 23494 -13191 -38985
544 -38985 -34845 -11037 14059 27939 20794 -3559 -17687 -9385 3677 18289 28233 9229 -21174
557 -21174 -15618 7506 2756 -7927 612 -4462 -19869 -1868 22690 6887 -11148 -6874 -19183
570 -19183 -26364 15424 45209 13195 -8095 7305 -5280 -24965 7049 32110 2275 -11515
582 -11515 1725 -19646 -33451 10250 28849 -7264 -6184 17180 -14515 -39564 4386 26837
594 26837 -1562 5058 26523 -4070 -18716 19472 16775 -21384 -4827 18758 -16147 -25400 18569
607A8569m857l7192K0353K2184l1698m598L1546j8753k2921M1151K1642l7179
619a753l59K6952l0266k7466L9021J5750l2527P551K2390l1527j4378L8147k693
632H842l2914K3365K4350l5905j0805L7541n721k4074K9339J7409l7388n461K4696
645A3274k2003j7419M1259J2739l7611K199K1593k9991j7045L7344P448k4596
657a2809J9139J8441l5426j1317L4452n611k3151L0240J7404l7506q300K7042
669A2598j4451j8514L0837Q174l5942M308K6156k3157j4595L5617L839l1441J5607
682i64K4423k8383j3767L0438l756k2448K7130K0216l6581j3271K4936j4108k1097
695b7232L2291J8153l2136l691K2479j8326j5682L3604J0355l0635N396K3193
$$ plain form
607 18569 13712 -23480 -3127 19057 -12641 -17239 14307 -4446 -27367 13784 35426 -1753
619 -1753 -2112 24840 -5426 -32892 6129 21879 -10648 -3097 19293 -12234 -26612 11535 8842
632 8842 -24072 -707 23643 -12262 -23067 14474 8753 -15321 14018 31427 -5961 -11422 13274
645 13274 -8729 -26148 15111 27850 -9761 -7562 14031 -15960 -33005 4339 11787 -12809
657 -12809 6330 24771 -10655 -21972 12480 6869 -16282 13958 31362 -6144 -14444 12598
669 12598 -1853 -20367 10470 18644 -17298 -12990 13166 -9991 -24586 11031 14870 -16571 -964
682 -964 23459 -4924 -18691 11747 7991 -14457 12673 32889 -3692 -16963 7973 -6135 -27232
695 -27232 5059 23212 -8924 -12615 9864 -8462 -24144 9460 19815 -10820 -5424 17769
707A7769k1479j2937L2534M370k8280Q349J6227k5133r621K7042l526k4452J5876
720c261J7134k1926m484K4175q684k0880J7510J3915j7923K035K1057j4083j7930
733a3345J8672Q826j9543K454J5650j6461j4821J7051N833j4304Q088J3242j5436
746d094q734J6945J124j3778Q921J1637j2839l794J5036j964j2042O709M504j3294
760e663k319J1455n036r206Q713O153q308J359Q369o352o772P758K997o038M201
775A311P509m483m087O018n03p786K83K768n772k001N690K98l432L610L482l567
791f62k191K391j774k010L780L886j101K245L477k189l373R9j673n267j111J853
807c620P14O66K085R22j113n4j79k673j020J942R95J653L427K759L68n94j701
$$ plain form
707 17769 -3710 -16647 15887 20257 -8023 326 16553 -8580 -18201 8841 5315 -19137 -3261
720 -3261 13873 -8053 -12537 11638 2954 -17926 -416 13499 -4424 -2389 18668 4585 -13345
733 -13345 5327 14153 -5390 -2936 12714 -3747 -18568 -1517 4316 -9988 -1900 11342 -4094
746 -4094 -12828 4117 5241 -8537 384 12021 -818 -4612 10424 8460 -3582 3127 7631 -5663
760 -5663 -7982 3473 -1563 -10769 -2056 4097 -4211 -2852 5517 -835 -7607 151 3148 -2890 1311
775 1311 8820 4337 250 6268 5765 -2021 -1738 1030 -4742 -6743 -1053 -755 -4187 -577 2905 -662
791 -662 -2853 -462 -2236 -4246 -466 3420 2319 4564 8041 5852 2479 2578 905 -4362 -5473 -3620
807 -3620 -2906 -2240 -155 767 -346 -400 -579 -3252 -4272 -2330 -1335 318 3745 6504 6872 6278 4577
824D577k425l328k033j862l86K108K968J431J37M17j616k461k247k54Q35K697
840a442L353K553K313J981j596m104l474j834k147j107J975K600J735R94M22k469
856b47j616j105k611j452L330M714J608K322K910q27l114j297k381m234lK436
872a567l76L47M400N19n336j476K147k450k030L086J011n82M967M321k727j627
888B627L788l356o107K299L408n457j599N767r5l426K936M20p558P65O910k960
904a638l859O902K158o497L995Q200m170n051M594k074q257M043N237p856k126
919f399J1046l84r136M244L633j0262j819J0577j230m840Q902L642r235K945J0061
934A1745q612r888Q489J830j1611L618J0276p216l096J2111j613j4756K583N472
$$ plain form
824 4577 2152 -1176 -3209 -5071 -5457 -3349 -381 1050 1187 1604 -12 -2473 -4720 -4974 -4139 -1442
840 -1442 1911 4464 6777 8758 7162 3058 -416 -2250 -4397 -5504 -3529 -929 806 1800 2222 -247
856 -247 -1863 -2968 -5579 -7031 -3701 1013 2621 4943 7853 7026 3912 2615 234 -4000 -4003 -1567
872 -1567 -1943 -1596 2804 3323 -2013 -3489 -1342 -3792 -5822 -2736 -1725 -2307 2660 6981 4254 2627
888 2627 6415 3059 -3048 -749 2659 -2798 -4397 1370 1275 -2151 785 1205 -6353 -5588 1322 -1638
904 -1638 -5497 1405 3563 -2934 1061 9261 5091 40 4634 2560 -5697 -1654 3583 -4273 -6399
919 -6399 4647 4263 -4873 -629 3004 -7258 -9077 1500 270 -4570 4332 7974 -1261 1684 11745
934 11745 3133 -6755 1734 3564 -8047 -4429 5847 -1369 -4465 7646 6033 -8723 -6140 -668
948f68j0601J762J9872P81j2314N680L912j3354N49J3345p459j0429J1550M094
962F720j4167M107J3099j1300r921J4227K263j5903M378J0895j0562J73K0941
975A4950k269j6935O560N999j7927p56K0523l695j3589J2069N369j9899j53J4644
989D891r767p983K1037L705k2427K636J5655j0929m692K2343M38k1863N219R474
1003G737j6419q47K3256n484j9689J3197R392k2746l366K1809n779j2849J8621
1016F833N792k3387K778J8984j2560p652K5033P62k8112M376J7574j6283p060
1029a2922K4355j103k1532J1069J0637k4080k831K6714o119j8625K0479J1227
1041A7269k6794k467K5020p748j4026J9903J773k8142N453K3102j5190j0406K6661
$$ plain form
948 -668 -11269 -9507 10365 11146 -1168 4512 8424 -4930 -4381 8964 1505 -8924 2626 6720
962 6720 -7447 -3340 9759 -1541 -11462 2765 5028 -10875 -6497 4398 -6164 -5991 14950
975 14950 12681 -4254 2306 8305 -9622 -10378 10145 6450 -7139 4930 10299 -9600 -9753 4891
989 4891 -4876 -12859 8178 11883 -10544 -7908 7747 -3182 -7874 14469 14907 -6956 -1737 7737
1003 7737 -8682 -9529 13727 8243 -11446 1751 11143 -11603 -14969 6840 1061 -11788 6833
1016 6833 12625 -10762 -7984 11000 -1560 -9212 15821 16583 -11529 -7153 10421 -5862 -12922
1029 -12922 11433 10330 -11202 -133 10504 -13576 -16407 10307 4188 -14437 6042 17269
1041 17269 -9525 -11992 13028 5280 -8746 11157 12930 -15212 -9759 13343 -1847 -12253 14408
1054A4408j181l2041O788K1923j6577o859K7073k369k3601J3039J2298k4173Q5
1067a1187L0827q635k5300J7353J1306k7170N32K8457j0545j9963J8493M068k7069
1080a8833R578K6517j8553j5921K8468M612k9204Q334K0768k1595j0633L0342
1092A3880L195k3779J0395Q743l1523m655L6811R91k3566J3945Q656l1633l968
1105b2508L3238j092j6501J7447L222l0154L328K9068j0929j5991K3582M053l1357
1118a4594J277K3667j2974j2459K3830L509k3582P839J6369k1747j0205K7434
1130H364K344k0667J3270J7479k2903j2298K0346q24j5369J5842J0524k4031n620
1143a3543K0433o438j4545J9210J0210k2834m401J8781o454j2438J5813P425j5312
$$ plain form
1054 14408 13227 -18814 -12026 9897 -6680 -13539 13534 11165 -12436 603 12901 -11272 -11187
1067 -11187 19640 11005 -14295 3058 14364 -12806 -12274 16183 5638 -14325 4168 8236 -18833
1080 -18833 -9255 17262 -1291 -17212 11256 15868 -13336 -5002 15766 -5829 -16462 13880
1092 13880 17075 -6704 3691 12434 -19089 -23744 13067 14058 -9508 4437 13093 -18540 -22508
1105 -22508 10730 9638 -6863 10584 13806 -16348 -13020 16048 5119 -10872 12710 16763 -14594
1118 -14594 -13317 10350 -2624 -15083 8747 12256 -11326 -3487 12882 -8865 -19070 8364
1130 8364 10708 -9959 3311 20790 -2113 -14411 5935 5111 -10258 5584 16108 -7923 -13543
1143 -13543 6890 452 -14093 5117 15327 -7507 -11908 6873 419 -12019 3794 11219 -4093
1156d093M153J5067j3577j4048J4196L434j4283P990J5626j2978j4045J0099L062
1169F03q018R512R500j4096q290J0806Q58o411J1524R187j3868q035Q106K56o281
1184d647O652L319r475q90Q312k527m804O414O82j0168m8R261k65k820M409N92
1200C997n463J704M561k979k416K527l150n112M502N829j756j896Q39l522l365
1215e700K909K203o94J908J567k636l5M139L56k559l86l00k229m72K321p46J77
1232a77J843m17k635J95P82k851j186L065J495n09K244J468k160M86J571k380
1248H34j711J936p01k587J178K868j088j112J358j204k905K69J863j758L90L262
1264H92O25p29K388J441l543j639R98j031j427K574J009j783K16J697j608k070
$$ plain form
1156 -4093 60 15127 1550 -12498 1698 5132 -9151 -1161 14465 1487 -12558 -2459 603
1169 603 -7415 2097 11597 -2499 -10789 17 875 -5536 5988 15175 1307 -6728 1378 1634 -4647
1184 -4647 2005 5324 -4151 -5041 3271 744 -4060 2354 3036 -7132 -7180 2081 1816 -1004 3405 3997
1200 3997 -1466 238 4799 1820 -596 1931 -1219 -6331 -1829 4000 2244 348 1187 -2335 -5700
1215 -5700 -2791 -588 -1282 626 2193 -443 -478 3661 4017 1458 1072 772 -1457 -1929 392 -354 -177
1232 -177 1666 1249 -1386 -1191 -409 -3260 -4446 -1381 114 -395 1849 3317 1157 1643 3214 834
1248 834 -877 1059 358 -2229 -1051 1817 729 -383 975 -229 -3134 -2865 -1002 -2760 -2370 892
1264 892 1517 788 3176 4617 1074 -565 433 -598 -2025 549 1558 -225 -9 1688 80 -1990
1280a990J132l55k547O25K731M19N80K236M20j573k09k00j766j010J746O3k42
1297F0Q50P38j101j399L12q87j574l00J645n0J110K257M31o50K28K00j006j312
1315d48K10l1m5P94J012n96l25l75j330r36m4J10j70L27J599J651L11p1m50j28
1335A065n95k66k71j57M08j16K74R12oj180r48j056n3J79o4J66M27J291J303N70
1355A883j85L1o16j019o62L85O60J61m5J43M06Oj228j562j098N55J61P7J193J612
1375H58L28o9M66J86m15j296p60k27Q22J880L4j040O07o17j524j159n99j33P16
1394a942O28J002R78J577n60k064J60J432p7j607L24O87N97L17K68q98r88m62
1412f28j600j003J682J575j179L1J956R07j597m09M6m58R62J905k13j043J165
$$ plain form
1280 -1990 -858 -1213 -3760 -3135 -404 15 595 2831 3251 1678 1469 1269 -497 -1507 239 302 60
1297 60 910 1648 547 -852 -540 -1427 -3001 -3301 -1656 -1706 -596 1661 2092 1442 1670 1870 864 -448
1315 -448 -238 -269 -314 480 1492 896 571 196 -1134 -2070 -2114 -2004 -2174 -1847 -248 1403 1714 1643 1193 1065
1335 1065 470 204 -67 -224 184 68 342 1254 1248 68 -880 -1936 -1989 -1810 -1874 -1708 -1281 10 1313 1883
1355 1883 1698 1729 1113 94 -568 -183 477 638 593 736 1142 1148 -80 -1642 -2740 -2185 -2024 -1947 -754 858
1375 858 1186 1117 1583 1769 1354 58 -702 -929 -107 1773 1807 767 1374 757 -767 -1926 -2525 -2658 -1942
1394 -1942 -1314 -312 666 2243 1683 -381 -221 1211 1134 -473 -149 538 1135 1452 1720 822 -166 -628
1412 -628 -2228 -3231 -1549 26 -1153 -1122 834 1741 144 -265 -219 -677 285 2190 1977 934 2099
1429B099r85l301J062K630j357k160J340M34j655Q99J120j682K25L361r29k852
1445a751K454K387l153q71M648j82m643L14J010k696J469M236k803l401K970O43
1461F31n403J251O157j445l149M290J584n211N88L520l602j607O463j74q227K168
1477b166O084m453l187O010q71p091K785N609m418q38O891k365o824O423N641
1492G230r071k779Q521j533o133O680L639r507k134P535l549m826Q919K310j1257
1507e955M11J0035l893n999R087K951j0269J394Q063o547n018J1234J328j1627
1521d805K783P699r785n161J2725K698j0186L211N632j0676l416J3859N96r218
1535d044O936O482j2894l684J2795j668r943P572N958j2032j618J1766m755q834
$$ plain form
1429 2099 1114 -2187 -1125 1505 148 -2012 -672 -238 -1893 -994 126 -1556 -1331 2030 1101 -1751
1445 -1751 703 3090 -63 -934 3714 3532 -1111 -797 213 -2483 -1014 3222 419 -2982 -12 631
1461 631 -4772 -3521 2636 1191 -1958 2332 3916 -1295 -707 2813 -789 -2396 4067 3893 -4334 -2166
1477 -2166 3918 -535 -3722 2288 1417 -5674 -2889 2720 -1698 -2536 4355 1990 -4834 1589 7230
1492 7230 -1841 -4620 3901 2368 -3765 2915 6554 -2953 -5087 2448 -1101 -5927 2992 5302 -5955
1507 -5955 -5544 4491 598 -5401 3686 6637 -3632 -2238 5825 -722 -5740 5494 6822 -4805
1521 -4805 -2022 5677 -4108 -9269 3456 6154 -4032 -821 4811 -5865 -9281 4578 5174 -4044
1535 -4044 2892 9374 -3520 -7204 5591 3923 -6020 1552 7510 -4522 -6140 5626 871 -7963
1549g963R622M565j2566R47J2362n833r107R801M362j0148L381J1456q487j0081
1563g689P771Q21r127Q267J3399r269j1603N722o57q087R718J2279q657q338O001
1578E51k020o787J1229J0279j1081p172O949k866o800R237O605r025k964P542
1592C677l732o383P757K340j0306J104J0482j760n277O127K48r362J651P945k764
1607A747k981N550k388q757L856P228l402k048M657l070p399K959M472j917J662
1622A69N210l067m615L294J225m653O50N073k244k284L467q80m117J875K572k926
1638a251J40K934l744l605M230L785j656J706J615m806k924L635R62k025L565
1653B561J061n711o31N340r76l346K222m79n381K080N664k221j779M718j515n081
$$ plain form
1549 -7963 1659 6224 -6342 -5395 6967 1134 -7973 1828 6190 -3958 -577 10879 2392 -7689
1563 -7689 82 903 -8224 43 13442 4173 -7430 -1708 -2365 -10452 -734 11545 2888 -5450 551
1578 551 -1469 -8256 2973 13252 2171 -5001 1948 -918 -7718 1519 8124 -901 -3865 3677
1592 3677 -55 -6438 1319 3659 -6647 -5543 4939 3179 -2098 4029 4277 -5085 -3434 4511 1747
1607 1747 -1234 4316 1928 -6829 -2973 4255 853 -1195 3462 392 -7007 -4048 424 -1493 169
1622 169 5379 2312 -2303 991 2216 -2437 -1787 3286 1042 -1242 2225 1345 -2772 -897 1675 -1251
1638 -1251 -1111 1823 -1921 -5526 -1296 2489 833 2539 4154 -652 -3576 59 1021 -1004 2561
1653 2561 3622 -2089 -2720 2620 1644 -1702 520 41 -5340 -3260 2404 183 -1596 3122 1607 -3474
1669c474L887M675m584l543M481j361l345N296M264o563k448M394l469l930O665
1684I45L370p120j013O071k452k828O417K134p527J77M813m770k526P671J267
1699D629o989J461N143m975l901N602m05o073L330N726m799j082O244j241o215
1714c545L772M501n688j854N541j841m218M860L761o014j485L936l298m083M795
1729h60L491m581K63M781j848l382L721J032m850M10M355k391j762M164P31m690
1745a416Q53K839l280k387L216J16k891K377K663k339r18L102p98l536J961K172
1761A734j709k77K303p74j821J256M84j817l70J726j501j597J398R98q62N56J393
1778A120n79j158Q48L31r14P28O22m07p16J216n1q69J50k13q26m68j6J98k08O55
$$ plain form
1669 -3474 413 5088 504 -3039 1442 81 -3264 2032 6296 -267 -2715 1679 -1790 -5720 945
1684 945 4315 -2805 -3818 2253 -199 -3027 3390 5524 -2003 -1826 2987 -1783 -4309 3362 4629
1699 4629 -2360 -899 4244 -731 -4632 970 565 -5508 -2178 3548 -1251 -2333 3911 2670 -3545
1714 -3545 227 4728 -960 -2814 2727 886 -3332 1528 5289 -725 -2210 1726 -1572 -5655 -860
1729 -860 2631 -1950 -1687 3094 1246 -2136 1585 2617 -2233 -1823 2532 141 -1621 2543 3274 -1416
1745 -1416 -563 2276 -1004 -3391 -175 -59 -2950 -573 2090 -249 -1167 1935 1137 -2399 -438 1734
1761 1734 25 -252 2051 1277 -544 712 1196 -621 -991 735 -766 -2363 -965 33 -829 -273 1120
1778 1120 541 -617 231 562 -352 376 998 591 -125 1091 1040 171 321 108 -718 -1186 -1202 -1004 -1212 -557
1798e57K93P6J021K08p60k80J89l1m8O74K93j00p1j61k46p91k26o38m95M15O96
1819e39k0L20O06j10m08M31k4m48j4N43L58L36M33j35j509o2O2m15n58p2L51O5
1841h09N76P40k3q36p7K4P3N25L56q9j04O81K78p06o03m64Ql31M58m9j87J50K67
1864a42n17R6O76J9r78L52J569J93n73K03j49o30L99K5o95j7M38o63l70R60L32
1885E28j188n34M98J96L07O99J26q90Q37P57q52m73Q53k45j555R69J417r16j093
1904e59m3j76o08J070N79j773J02K543n09j352J447O13j644n55K187m63r94J099
1922I64j06j698R00J640k272j759J866P74j982P72K304j701j463K165M56j610
1938g50J538J365k806j41K600n59k671J446J911k241p18J828j091k171J686J503
$$ plain form
1798 -557 -264 -188 833 1041 281 1 190 159 111 785 1078 978 907 746 500 -291 -517 -1155 -1650 -1235 -539
1819 -539 -559 -239 367 257 -151 280 256 -192 -206 337 695 1031 1464 1329 -180 -242 -180 -595 -1153 -1225 -874 -809
1841 -809 -233 507 484 -352 -429 -405 -332 193 549 460 356 1037 1315 609 6 -458 -450 -781 -323 -372 -559 -409 -142
1864 -142 -659 -563 113 132 -846 -494 1075 1268 695 898 749 119 518 543 -152 -169 269 -394 -764 196 528
1885 528 -660 -1194 -696 -500 -193 506 632 -258 579 1336 484 11 864 619 -936 33 1450 534 -559
1904 -559 -602 -778 -1386 -316 263 -1510 -1408 1135 626 -726 721 1334 -310 -865 1322 859 -135 964
1922 964 858 -840 60 1700 -572 -2331 -465 309 -1673 -901 1403 -298 -1761 404 860 -750
1938 -750 788 2153 -653 -794 1806 1247 -1424 22 1933 -308 -1026 802 -289 -2460 -774 729
1954G29k382K97K943j857j743K959J732k757m35K085j405j617K261Q10k845J180
1970d5K156k440j208K344r47l501J481L698j125q45K390j372k910K624K081k891
1986e10J69K544k075k652K937J661k110m04K055k110k235J761K62j845K511L605
2002C564k251k021J769j113k919K038L255j137r02J430j325k199K158J296k913
2017a270M8K085j412j993K034J153j703J157K257j399j908J597q53k355K085K996
2033B519j217o74J682j555l344Q14J313q79J481K370k255k733Q32J570p60K037
2049A201K655k591k997J88R09j45K787J936l140k002J371j121j133J988J271k370
2065a193n89J832J9q17J624p0k003J083K282j641j541J795k2j877J613K158j757
$$ plain form
1954 729 -1653 -1356 1587 -270 -2013 946 2678 -79 -514 1571 166 -1451 810 1620 -1225 -45
1970 -45 2111 -329 -1537 807 -140 -3641 -2160 1538 413 -432 1958 586 -2324 300 2381 -510
1986 -510 -341 2203 128 -2524 413 2074 -36 -440 1615 -495 -2730 -969 -707 -2552 -41 3564
2002 3564 1313 -708 1061 -52 -2971 -933 2322 1185 283 1713 388 -1811 347 1643 -1270
2017 -1270 -1222 863 -549 -2542 -508 645 -1058 99 2356 957 -951 646 -207 -2562 -477 2519
2033 2519 1302 628 2310 755 -2589 -1775 -462 -1341 140 2510 255 -2478 -1646 -76 -836 1201
2049 1201 3856 1265 -1732 -1544 -635 -780 2007 3943 803 -1199 172 -949 -2082 -94 1177 -1193
2065 -1193 -1782 50 69 -748 876 806 -1197 -114 2168 527 -1014 781 759 -1118 495 2653 896
2082H96j504R2r59j241K117J760j523O5J821j578j693J794J554j835j54J106p46
2099b8n79J783N23j538N45O88k297j444J290O33r28J017K181r77j010L74j031
2116g98q64J720J125q06l89J143j023j033J424J314q58j212o65j325n0J910J251
2133H64m9J75k37j186q10P68Q39l94K94N48P2K44k06l23r55O5LP1j81kj30m49
2155i79P5J405N04n40m35p06m68j68J095J184Q15n09m49m47j239K59Q72n26l46
2174f03O98m9j080K74J493o53o47P12O8j194M48J596n01m86J580m00j555K55R19
2193H75j448j141J791K08q49K81J191j430j229J958J23r82J470M23j652o10J902
2210H81Rr00J068N06k359m91J632l94q77J246N99k008k60J589m38r49K088L76
$$ plain form
2082 896 -608 -516 -1475 -2716 -599 1161 -362 -297 1524 -54 -1747 47 1601 -234 -388 718 -28
2099 -28 -607 1176 1699 161 706 1394 -903 -2347 -1057 -424 -1352 -335 1846 869 -141 233 -798
2116 -798 -1662 58 1183 377 -12 1131 108 -925 499 1813 955 -257 -922 -2247 -2297 -387 864
2133 864 815 990 753 -433 -1243 -475 364 -30 264 812 884 1128 922 599 -356 -291 -288 -217 -398 -400 -530 -979
2155 -979 -904 501 1005 465 30 -676 -1144 -1312 -217 967 1782 1273 824 377 -862 -603 269 -257 -603
2174 -603 95 46 -1034 -760 733 80 -567 145 213 -981 -533 1063 562 76 1656 1256 -299 -44 875
2193 875 -573 -1714 77 285 -564 -283 908 -522 -1751 207 330 -652 818 1241 -411 -1021 881
2210 881 890 -10 1058 1564 -795 -1286 346 -48 -925 321 920 -1088 -1348 241 -197 -1146 942 1318
2228A318j684k3J305o36o81J320M61j580J56J353j338j113J117J3j690J087J626
2245A011r59q79Q60j38q57Q32J195j234n16J339P9q91O82N20r84o72M30l10k86
2264g78O01O02r04j1J110n42j002Q29L52o00L20R14j98n08L45l87m05J8O53n85
2284a76k93M56Q9p23N01P9k7m80K09j5J57P44Q6l50J32J33k73k97M37j24l90R4
2306c1J22l58O6L2L7l68J95jR4j20N39j98J15q1L62m04J79L67m7m37L51j32k58
2329B4j94J13q13K67K17J37J33K08q5k05K29M27R3n04j4M8k72Q22R5l46k39p5
2351F6k86j40r8L30m55Q0N92J1J38j42M8k7m10M13K9J48p9M4k5O4L31o11p68K55
2375d92O2j20J52K10j85J80K78R2m25L54j98m3J04M97K6o0J5p7r8K47m13q01k55
$$ plain form
2228 1318 -366 -389 916 280 -401 919 1380 -200 -44 1309 -29 -1142 -25 -12 -1702 -615 1011
2245 1011 52 -827 33 -105 -962 -130 1065 -169 -685 654 733 -158 524 1044 60 -612 -182 -492 -778
2264 -778 -177 425 -479 -490 620 78 -924 -95 257 -343 -23 891 693 185 530 143 -262 -244 409 -176
2284 -176 -469 -13 76 -647 -146 -67 -94 -574 -365 -380 -223 521 607 257 389 522 249 -48 389 265 -125 -31
2306 -31 91 -267 -201 -169 -132 -500 -305 -306 -212 -332 207 9 124 43 405 1 180 547 500 63 414 282 24
2329 24 -170 -57 -870 -603 -386 -249 -116 92 7 -198 31 458 551 47 33 81 -191 631 726 380 141 66
2351 66 -220 -360 -458 -128 -583 -503 89 100 238 96 144 117 -293 120 149 297 218 262 237 301 632 21 -747 -492
2375 -492 -430 -550 -398 -188 -373 -193 85 177 -248 106 -92 -135 -31 466 492 432 447 370 272 519 106 -695 -950
2398i50O82k41j26N78K57m42j59R57k29m71l3Ml49R09M16%p91M60j47q46L02L71
2420A52o97m25O17M70q22J115K3r19K05N60j86p73P60P05p46M58R39j062n66M42
2440B50l87r07P33P94j391Q8J594m1j210K07Q66j108j51J386m22q09J056N33j428
2459c47Q83P89j365j377R19M36q90L90J769j183n47J067K01k386J368J143j508
2476f38l6K246m51k062J401J024j546k05J287j663j694K372P85k210R95J953j699
2493a41j744K319M24k337O27K486j733r89K934m25k805J249K145l264l37K962
2509A371j071k724K375K020k845k52K889j601k983L034J727l447O97L716k176
2524G30k472L063O68m019Q81L280k642k009L744o6l850K187L180l328j662L833
$$ plain form
2398 -950 -268 -509 -635 -57 200 -242 -401 556 327 -144 -177 -173 -522 387 803 803 12 472 325 -521 -219 152
2420 152 -545 -970 -353 117 -705 410 433 -486 -281 279 93 -680 80 785 39 497 1436 374 -192 250
2440 250 -137 -1044 -311 483 -908 -820 774 733 -477 -270 596 -512 -663 723 301 -508 548 1081 -347
2459 -347 536 1325 -40 -1417 -498 -62 -952 -562 1207 24 -523 544 745 -1641 -273 870 -638
2476 -638 -674 1572 1121 -941 460 1484 -62 -267 1020 -643 -2337 35 820 -1390 -395 1558 -141
2493 -141 -1885 434 858 -1479 -852 1634 -99 -1088 1846 1421 -1384 -135 2010 -1254 -1591 1371
2509 1371 300 -2424 -49 1971 -874 -1126 1763 162 -2821 213 1940 -1507 -810 2906 730
2524 730 -1742 1321 1989 -2030 -1149 2131 -511 -2520 1224 1158 -2692 -505 2675 -653 -2315 1518
2540A518o47l985L025L130l394r98M033j335m118K857K247m362K36M392k461l051
2556b913L400J126l842Q57M032k165l053L587K63m027K078M191l250j540L497
2571B241n11m747J859L384l154r62M287j048m369K450K347l868M62M382j895l264
2587b406K506K104l717N49M147k288k929L111O31l930R63L452k394j747L882k68
2603A666m214J342K491k758l00L878m83l642K178J297l050N47L550r43l539K507
2619E27P61l593Q59L322j565j824K335N1l529J571K685k230n48L463o06l222J398
2636a45J602k684k29L597j188k388K031L81l275R82L385j763j480J855J00k943
2652b162J218K910j621j015K170k24l091J479K198k467k89K429r17j986J657P88
$$ plain form
2540 1518 871 -3114 -89 3041 -353 -1351 2682 1347 -2771 86 2333 -2029 -1793 2599 138 -2913
2556 -2913 487 1613 -2229 -1372 2660 495 -2558 1029 1292 -2735 -657 3534 284 -1256 2241
2571 2241 1730 -3017 -1158 2226 -928 -1890 2397 1349 -3020 -570 1777 -2091 -1629 2753 858 -2406
2587 -2406 100 2204 -1513 -964 3183 895 -2034 1077 1708 -2222 -1259 2193 -201 -1948 1934 1666
2603 1666 -2548 -1206 1285 -1473 -1773 2105 1622 -2020 158 1455 -1595 -1048 2502 1559 -1980 527
2619 527 1288 -2305 -1446 1876 311 -1513 822 873 -2656 -1085 1600 -630 -1178 2285 1679 -1543 -145
2636 -145 1457 -1227 -1456 2141 953 -1435 596 977 -2298 -1316 2069 306 -1174 681 781 -2162
2652 -2162 -944 1966 345 -670 1500 1276 -1815 -336 1862 -605 -894 1535 618 -1368 289 1077
2668A077k553J36K575r01j403K017K02k969K90K609r60m85K733j281l002O29K442
2685A156j505K29K450j766k901J449J595j460L46K283j421k439K141Q32j840P85
2701f6J967j977j369K341J48k208R13J490k054k45K210j40k239R03J131j917O6
2718a046K596p61j645R97L05j656M37K398r68j450J577r1k042O21J782q28j215
2735i89J578m27j412J319Q79j388k86J458l57j199R32O34j105K7J498k67j458
2752e63P91N5j555L10J748l31j136J002K62j559N29J162p55j036J108O10j021
2769c79N52J027r87n65R80o14q64P79M41q41k91J162k10m91K80L49j169L41Q46
2788C46l51j96O00N08q91j78L60J42m43N39k81p33K99M76k72o3L60q1p87J80N18
$$ plain form
2668 1077 -1476 -1340 1235 334 -1069 948 1150 -1819 -1529 1080 120 -365 2368 1087 -1915 -1286 1156
2685 1156 -349 -120 2330 564 -2337 -888 707 -753 -407 1876 455 -1984 157 989 -851 -66
2701 -66 1901 -76 -1445 896 1044 -1164 -251 1239 -815 -1060 1150 1010 -1229 -326 805 -1112 -1046
2718 -1046 1550 789 -856 141 446 -1210 -773 1625 657 -793 784 693 -1349 -728 1054 226 -989
2735 -989 589 162 -1250 69 948 -440 -726 732 375 -824 108 742 -363 -336 1162 895 -563
2752 -563 228 283 -1272 -962 786 455 -681 321 583 -976 -447 715 -40 -1076 32 642 -379
2769 -379 173 1200 213 -352 628 14 -850 -71 370 -471 -762 400 190 -301 -21 328 -841 -500 346
2788 346 -5 -201 399 907 16 -162 198 340 -103 436 155 -578 -279 197 -75 -138 222 141 -646 -466 52
2809E2l04L76L28K2q4k43L50l48k06L57m34mK34j04j24j91L15K82n60L02J88o79
2831d75K38K56j37N6K69l9N7K7j78M11n08J95p15J17L48K55j51m1L91m03j07J64
2853C0ml78J65M78k01N07k92q0k61K96P9n15L41k32R8j05N6M75n95K39k38k85
2875d22R3L13M0j57J32K80P4j39o4M3l94K55l5J3k67L14K32r7m01L24n18k70M24
2898b27N12n48L84L5K00J66j53m18k12j43K72l32L58L21j76j88K45K55l17l41
2918c07lj05J12M76o9p8K96j24l87j15M96J43p76M11l5r6j46O13m6n12k41O36
2940A43p32R1P96j39m96L22L82j06l31K45J16n97K77K56o69K90M04n34l33J023
2960D08j54p53k11P33l2j79P99m34l04J18O54n45n93J103n20m90O44L07n66l98
$$ plain form
2809 52 -252 124 452 474 390 147 497 149 -57 300 -134 -138 96 -8 -132 -323 -8 274 -286 16 204 -475
2831 -475 -237 19 -118 -62 207 168 225 252 74 485 -23 172 -543 -426 -78 177 26 -15 376 -27 -134 30
2853 30 26 -352 -187 291 90 597 305 225 -36 260 339 -176 165 -67 31 -74 -18 457 -138 101 -137 -422
2875 -422 -329 -16 24 -133 -1 279 353 214 150 193 -201 54 19 32 -235 79 311 214 -187 137 -381 -651 -227
2898 -227 285 -263 121 156 356 522 369 -49 -261 -404 -132 -464 -106 215 39 -149 96 351 34 -307
2918 -307 -310 -415 -303 173 104 26 322 198 -189 -304 192 335 -441 -30 -65 -161 -307 306 260 -252 -493 143
2940 143 -589 -498 298 159 -337 -15 367 261 -70 175 291 -306 -29 227 -442 -152 252 -282 -615 408
2960 408 254 -499 -710 23 -9 -188 611 177 -127 -9 645 100 -493 610 90 -400 244 551 -15 -413
2980d13N56K18o57K28P4o22m5P12L19n55N35J25r44K41O60k30o16P19n5l80j38
3001b68O87m79n58R58j05n83P3M38m45l41P69K11l34M66j12n81k13M51k2k70K85
3022B7P66o90p00L16J91k70Q10M1l50o38L89M2m01O30Q17n47n91M2j38l83M34
3043b03N79l16K40p3l00n35j27P28q3J69M66l64m31j4L09n2K22J65k18j72j48
3064a58J63m06J47N70j05j64K2k53m46J67N99m1K32J06k28o27r4O10k1K48L35
3085F56j70p83p9k2K04O13k5j35n88K14kl28L62K49K58l31j94o0j52L04K38m8
3107A81JK25m19j88j30M2J12K4L29J4l82kj60K40oL82m5l74O8rj06L36K11l27
3131A7j0K24k63m37o3P68k15p6K01J17n23j0L03l56J83R71r7q60J34l91j7N72
$$ plain form
2980 -413 143 361 -296 -68 6 -616 -661 51 370 -185 350 475 -469 -228 432 202 -414 305 250 -130 -268
3001 -268 419 -60 -618 340 235 -348 -275 163 -282 -623 146 357 23 489 377 -204 -417 34 12 -258 27
3022 27 793 103 -597 -281 -90 -360 450 491 141 -497 -108 -66 -467 163 980 433 -158 -116 -254 -637 -203
3043 -203 376 60 300 227 -73 -608 -735 -7 -90 79 545 181 -250 -264 45 -7 215 380 162 -10 -158
3064 -158 5 -401 -254 316 211 47 69 -184 -630 -463 136 95 327 433 205 -422 -516 94 73 321 656
3085 656 486 -297 -376 -398 -194 419 394 259 -329 -115 -117 -445 -83 166 424 93 -101 -161 -313 -9 229 181
3107 181 182 407 -12 -200 -330 -288 -176 -152 177 191 -191 -193 -353 -113 -119 263 218 -156 -88 -97 -203 133 344 17
3131 17 7 231 -32 -469 -532 236 21 -55 146 263 -260 -270 33 -323 -140 831 734 -126 8 -383 -400 172
3153A72P10l32o27J21j52n25L50N64Ql15q7k44j62L83P88k21o84M19Rl10O4K74
3175B03n8k95L55k5o35L86N49n19p13R94l94j57K95M14o90l16J097l19j71O02
3195F03K8r20j0M05j98k38P74mj126J35O64Mn23O11j5q69M43M47k25J46L48J36
3217F16o23o6K43l93k71P01J18n18K31M62j066L94Q2K01p08M70N06o95j33R52
3237E03n4q83O54L22n87n6N05k19p37R92k05n87n3O95l72l97N60p6M0k1N0k08
3259a34o9K62L89p93M69J59n13k88M81K95n22M55O9j55m19L46j16k23M03M91n68
3280A9P7K96l17j97L42J07n48J03J14kj01J27L21m46j81L33Mr6M0K47m90J60M74
3303C86k73J48J82o37o6J92j53J14k38N64q0j67M20L2l33L6m09j1J40J60Q5J60
$$ plain form
3153 172 882 550 -77 44 -108 -633 -283 281 289 -26 -113 -357 -519 -136 652 431 -253 166 175 -135 -71 203
3175 203 145 -150 205 180 -455 -69 480 -39 -752 242 -152 -309 -14 400 -290 -606 491 172 1 603
3195 603 631 -289 -299 106 -92 -330 444 440 -686 -551 113 117 -406 205 190 -679 -236 211 -14 132 480 616
3217 616 -7 -73 170 -223 -494 207 325 -193 38 500 -566 -172 -90 111 -597 -127 379 -316 -449 503
3237 503 449 -434 220 542 -45 -101 404 185 -552 440 235 -352 -405 290 -82 -479 81 5 45 24 74 -134
3259 -134 -203 59 448 -345 124 283 -230 -518 -37 258 -264 191 260 105 -314 32 -84 -307 96 587 19
3280 19 96 392 75 -122 220 327 -221 -118 -4 -6 -107 20 341 -105 -286 47 51 -45 -5 242 -248 -88 386
3303 386 113 261 443 -194 -260 -68 -221 -107 -345 219 139 -28 392 424 91 127 -282 -293 -153 7 92 252
3325B52p7P8k9k62N1j62q4J47J04l9Pj4k19J17L59k76o3J30j50K34k0J01l37M07
3349B55j06M8Q9k66K37k38m4N6q3N53o01R1k74O7j13L35K5k10K8L14j1N3j33j44
3373g2j05J32Op8K75M0k62qM85m04l12L81m15R0L38k30K47p4L75l44%Nj36j73
3397b39K08m0l2P9N5p0j70M33j73k54L16j66j8l42M07L92l05j86M36j85k48n3
3419a55K46k35qN44l81m47L36Q6j94kL81l21q7L53J13m86K39K46l17J71j28M8
3441Bl20K25K47k01J59K67l41l55L57N1m38J10O04n30j39N87r9j58J22l5q4R2
3463A23J88j33l09L44k24j57MK07j18m53M66K52l41k97Q05k25n24P34Q2m60J36
3484A00J19q5k45O11j27q22K09N86m49k73R57l80k31O4j27l32j7P75k14k74L66
$$ plain form
3325 252 175 253 224 -38 13 -149 -233 -86 18 -21 -14 -28 -247 -130 229 -47 -110 20 -130 104 84 185 -152 255
3349 255 149 197 286 20 257 19 -25 31 -52 501 -100 -9 -283 -216 -329 6 31 -179 -151 163 152 205 72 -72
3373 -72 -177 -45 -39 -117 158 198 -64 -72 413 9 -303 78 -337 -247 91 -139 108 34 409 65 65 70 -66 -239
3397 -239 -31 -71 -103 -24 31 -39 -209 224 51 -203 113 -53 -71 -413 -6 386 81 -105 331 146 -102 -155
3419 -155 91 -144 -152 392 11 -436 -100 -14 -208 -210 171 -150 -237 116 229 -257 -18 228 -89 82 -46 2
3441 2 -318 -93 154 -47 112 379 38 -317 40 91 -347 -237 367 -163 -302 285 186 28 150 115 31 123
3463 123 311 178 -131 213 -11 -168 -164 43 -75 -528 -62 190 -151 -448 357 132 -392 342 424 -36 100
3484 100 219 134 -111 500 373 -449 -240 346 -103 -376 581 201 -30 34 -93 -425 -442 333 119 -155 211
3505B11K60o74k57P54j5o04R02o8j098K00O03m03k33J103k85o27K04M19o57j86
3525d51Q71k23o09O56L07j054M15M18k73n64P07M84j329L03O08j39n09R36j39
3544D15r77K65R12r05l23J265Q4j090J76J099j232k72J130k65j016Q52O83j551
3562g50L89R64l48q34R04J41j067J32J399q06r81J274J15j112K08J161r81n33
3580g25J226K61j405K87J103j076l29J260p9j377O15R08r78l66J511l25j208R45
3598B48L55j017k28J367l85j292P98Q51j142J83J207j026r22J132Q91j373J27
3615b26P51o94n95J041M94j038n9J107r92o97J224P7j137P81R07j110k36R60n35
3634B3r39R94N59q76r5J034n29o31M03R86j324j77J131n16q20J248N8r95K15N89
$$ plain form
3505 211 471 -203 -460 294 279 -325 577 509 -589 -389 214 -189 -422 681 396 -231 -27 392 -265 -451
3525 -451 420 197 -412 244 551 -503 -88 330 57 -507 200 684 -645 -342 266 127 -382 554 415
3544 415 -562 -297 615 -290 -613 652 736 -354 -178 921 -311 -583 547 282 -734 118 801 -750
3562 -750 -361 603 255 -579 325 466 -601 -469 930 124 -857 417 532 -580 -372 789 -192 -725
3580 -725 501 762 -643 -356 747 -329 -658 602 523 -854 -239 669 -309 -675 836 511 -697 248
3598 248 603 -414 -642 725 340 -952 -154 697 -445 -262 945 -81 -1003 129 1020 -353 -226
3615 -226 525 -169 -764 277 771 -267 -326 781 -211 -908 316 393 -744 37 944 -166 -402 558 23
3634 23 -916 78 637 -239 -334 700 171 -460 -57 929 -395 -572 559 43 -777 471 529 -466 -251 338
3654C38k63o64Q37j32o19N96M53n76l45J182m52j001P20J13m00J06O75l47n99
3673c78L94L09o50L8R86r95K37L81j5o97N56O07q09j69K61n7n70P41J59n30P8
3694a23L83j66m23L52J57m99L20M30l39k86L62J10m40L19J23n65k1O66m52j71
3714b63L18O9m82j13O83l7k79R3K10l25o1M61l39J8L35K02q34J56L13o11N35J36
3736A85O1o29L70K96n70j60N47k03l41L55L05l14l3O46l76m41M03K62n68K15J73
3757A83l14j09N08k59K8j78L70q25J59M01L15l59J88K46n09J36J52q1j03jr1J6
3779a27K13j2k26J22M5P9m6j49K08k54J06J58L0J0l4J63k42k69M43p1k03J29R7
3802A70qk80M16l79j24K3L28l3j34K22n2k93L90K8m08j23M23p3k72J58j84K31
$$ plain form
3654 338 75 -589 248 116 -503 93 546 -30 -375 807 355 -646 74 187 -213 -107 568 221 -378
3673 -378 16 325 -325 -287 699 -296 -59 322 307 -390 166 773 -36 -205 56 -1 -571 170 329 -201 -123
3694 -123 260 94 -329 23 180 -319 1 431 92 -194 168 278 -162 157 280 -285 -306 360 -92 -263
3714 -263 55 124 -358 -471 212 175 -104 -11 199 -126 -187 274 -65 -47 288 490 -344 -188 125 -486 49 185
3736 185 246 -383 -13 283 -287 -447 100 -103 -444 -89 216 -98 -131 515 139 -302 101 363 -205 10 183
3757 183 -131 -240 268 9 37 -141 229 -596 -437 -36 279 -80 108 354 -155 -19 133 52 -51 -52 -143 -127
3779 -127 86 74 -152 -30 15 94 48 -101 107 -147 -41 117 147 157 123 286 44 -225 218 147 -56 73 170
3802 170 162 -118 298 -81 -205 -182 146 113 -21 201 149 -144 246 274 -134 -257 166 93 -179 -21 -205 26
3824B6J89J08l65kJ80m10K20P6N4J78l37L5K56j51j5l4j19J16j24J17K38l00K69
3847B05l56J64o1N1o6K50k45q8J42j09J85j96J76P3J05k88qL11kj30j10l4q9j9
3871a39M43l63J23q1J8l8J78N6n8j57K17j70L14k89J7j20J94K56m15K46j40j53
3893f1k52K92Q6l74K9L00P6k1J13k8m96K91J99j05j17O6L18n75M41l14n0J36R5
3916D9O3j69j89J97J13J08k42K75l86J38Q3L7j5K41k58l5L90l09l21K29N8j85
3938a28N9L8q9k75j3N34J5k52M13Pl62J6R4l02L19M7l18M47n7q4l95J46l5J23
3962e2k94N82o5k87l0L53k46R4J67Jk45J04J67k04K09l62M45k97k80L48r5l52
3984c39O78n03J22L6N00p44k6K86o6p6L99K29m67O3L44j55n42J69L80m47K28j71
$$ plain form
3824 26 215 323 -42 -44 136 -274 -54 22 76 254 -83 -48 208 57 42 8 -111 5 -119 -2 236 -64 205
3847 205 -151 13 -48 3 -63 187 -58 -146 -4 -113 72 -124 52 125 230 -58 -66 245 243 113 3 -31 -120 -139
3871 -139 304 -59 64 -17 1 -37 141 197 139 -18 199 29 343 54 71 -49 145 401 -14 232 92 -61
3893 -61 -313 -21 65 -309 -280 20 96 75 188 160 -336 -45 154 49 -68 -2 316 -259 182 -132 -182 -46 49
3916 49 112 -57 -246 -49 64 172 -70 205 -181 -43 40 77 62 303 45 10 400 91 -230 -1 57 -128
3938 -128 -69 -31 -120 -395 -408 126 141 -111 302 309 -53 -37 57 -245 74 121 -197 250 193 109 -286 -140 -175 -52
3962 -52 -346 236 171 -116 -146 207 -39 55 222 223 -22 82 249 45 254 -108 337 40 -240 108 13 -339
3984 -339 339 -164 -42 -6 494 -250 -276 10 -56 -132 267 496 29 92 436 281 -261 -92 288 -159 69 -102
4006a02o2j70M42J81o74M36N42n31m96N90L44n53J41O21n67n27N31O9p49O97P
4027A70k62j65O13k58p04O09O34j097L55N65j42p64O63R2o04J95O03k73o11M94
4047A13N15r20M26L97n95k40L19M81j180N52P54p68k28Q73k77m83N13O59p38n25
4067c52R59l58p78K79P02o14j67P53r4j043R56K56q66r1Q95n1o86L17N80p55k5
4088a83N66p3r88O22K63n44J38N59k84k07L90r7n05R5O07m38k53P76Pr25N87K31
4110C44l24k95O47J20p73O2L60m83P1Q38m98n37M68J21m58o9O99l08l07N99K34
4131E11q16j78Q73m58j03J83J11n56L64K78q28J70L62K12l86L28K47o57J69O85
4151E11k79m34O45lo72k45Q61o04j24N51m0l93o3P46o05k40O06Oo78P74p2k81
$$ plain form
4006 -102 -164 -334 108 289 -385 51 593 62 -434 156 500 -53 88 709 142 -385 146 215 -534 163 170
4027 170 -92 -257 356 98 -606 3 637 -460 -105 460 318 -446 217 309 -295 -100 503 230 -381 113
4047 113 628 -292 134 531 -64 -304 15 496 -684 -132 622 -146 -374 499 222 -261 252 911 173 -352
4067 -352 607 249 -529 -250 452 -162 -329 424 330 -713 243 499 -367 -458 437 386 -300 17 597 -158 -183
4088 -183 383 310 -678 -56 207 -337 -199 360 76 -131 259 162 -343 -248 359 -79 -332 444 451 -474 113 344
4110 344 20 -275 372 492 -281 -219 141 -342 -271 567 69 -468 0 121 -337 -406 293 -15 -322 277 511
4131 511 -305 -483 390 -68 -171 12 123 -433 -69 209 -619 -449 -87 125 -261 67 314 -343 -174 511
4151 511 232 -202 443 440 -232 -477 384 -220 -344 207 167 -226 -289 457 -148 -388 218 224 -454 320 248 -33
4173c3l58J091m81k56J36J02p24Q7R33m87l52N25M9p38L93N82n87o0N72m01l83
4194c90M88L26m00k94O07j52o15L38M38o49k00M64J07l37K79J20m67J98P1q8j36
4215b92O35R1p62K08N37l78n30R07k75n95K84K09n7m70P38k36l46J98M92n60l31
4236e33N94N37q18K72M03m30l12N06k43k69N21M7m30j50K68J21m46L49p6n4k6
4257a69N40o04q5M53ml21j10O72n28j60M22O2q10M12N88k45m77O75l60j03K69
4278A17K66k25r7L1k61r7L35L47m28r0L75j25l46L64l1m30J99N7r9J52k2k99J25
4301a82P1L71j84k47K45j24R6J19L4pk86N21n9n85J01Jj75R5K63j43j32Q8J77
4324E8l01L67J6k0o2K61l11j25J93j4q4R5jJ48k32MK18l06j50L52j85K76l9j41
$$ plain form
4173 -33 -391 700 219 -37 99 201 -523 -436 497 10 -342 183 232 -506 -113 469 -118 -178 394 -7 -390
4194 -390 98 424 24 -270 337 185 -430 -92 346 -303 -503 -39 68 -269 10 130 -337 -139 -68 -156 -292
4215 -292 343 434 -328 -120 417 39 -491 416 141 -454 -170 39 -18 -488 250 14 -332 -134 358 -202 -533
4236 -533 61 598 -220 52 455 25 -287 219 -24 -293 228 275 -155 -305 -37 84 -362 -13 -89 -143 -169
4257 -169 371 -233 -318 135 131 -190 -300 372 -156 -316 106 168 -642 -230 358 113 -364 311 -49 -152 117
4278 117 383 158 61 92 -169 -266 69 416 -12 -102 273 148 -198 166 135 -295 -96 -39 -138 14 -8 -307 -182
4301 -182 -111 260 76 -171 74 -50 46 165 199 192 -94 427 368 -217 -116 -115 -290 -195 68 -75 -207 -119 58
4324 58 -243 124 140 120 58 319 8 -117 76 62 -22 73 72 220 -12 -8 210 -96 -246 106 -79 197 158 17
4348A7l2k8M56j49l4k25J51k45J49j31N2J05Rl01pJ71J01m14R4M38k51K7O3k60
4372b44R6J25O7m0J29j98J80j11j5L07l61P6m6j3Q9Q6k19J36n0j39L21k05m0J00
4396C1m9J67j31ql6q8J98l12J32K26l45k46O16m49J93P2Q3J35m06R3J87j53K73
4419A83j22J59k29N8J9o0L8J0l6j14L28l77j56K26k45J38L5J04M6l24L16j00P0
4442c3O5K66n07K06L15k00l66L29J4m5l59K52j98M5k8L25j98r6L48j49L0j0J54
4465A60Q1l30J35M6J4m2j17J51k51L6l30L96J11j69n5m3M90k82p3L30k22l1J66
4488A71k7j04p0J43j96j17KJ41m08L01Q5R2p2O8j0k49K92K72k64l66N81J02m38
4511g1K20R6n77J51J23K33l49N0j50K29k12L83k31mJ71K83l47q9K65R7p62M63
$$ plain form
4348 17 -15 -43 413 264 230 5 156 -89 60 -71 -19 86 95 -206 -213 -42 59 -355 -261 177 -74 -47 16 -244
4372 -244 -148 -23 44 4 133 -65 115 4 -11 296 -65 11 -35 -48 41 127 -92 44 -6 -145 176 -29 -69 31
4396 31 -18 149 18 10 -26 -114 84 -228 -96 130 -215 -461 155 -294 -101 -29 54 189 -217 -124 63 -90 183
4419 183 61 220 -9 49 68 8 46 56 20 -94 234 -143 -299 -73 -318 -180 -145 -41 5 -319 -3 -103 -33
4442 -33 32 298 -209 -3 312 112 -254 75 89 44 -315 -63 -261 -216 -244 81 -117 -213 135 -14 16 6 160
4465 160 241 -89 46 92 106 64 -53 98 -153 -117 -447 -51 60 -109 -164 -207 283 1 -72 258 36 5 171
4488 171 144 40 -30 113 -83 -200 -198 -57 -465 -164 -79 13 -59 9 -1 -250 42 314 50 -316 265 367 -71
4511 -71 149 245 -332 -181 -58 175 -174 -124 -274 -45 -257 126 -105 -109 62 345 -2 -91 174 271 -491 -28
4533b8Q2R9k78K44k9l77K62L71o63J28M66l58j1K07m7j51J50P3j77k9M93n60k36
4556c69L28O6j18p6J82O2m04K19K57j16j1J6P3k97J85j48KL78j41j20j15K92l11
4579a66n1K47J73k08l8L2r4j41K82j42j5j46J6L84j79K57j55j51L63j37k02k71
4601c42N40k92j50J51M15m57m7N01k17m65L22R6k46j3P23k97j72K94k16k09k9
4622a10K74k41k53J42O35o79J00K05K58l20J78r4k79O8K19jl92L69J78j58j35
4643c6L6l8j55R9L4O9k23L79k81k2l43P14j08j95L19q6m12K56K60l36K34N1l54
4666a38J67k1On8k01K64K9j81N9Q1o9j1L59j91k37J76P4k49J67L5j6M2J42J30
4690C59m28K79O0m45R5n6M07j88l80N83k66m4R0m8J98k16R3j54Q2N0k8k4N2ok26
$$ plain form
4533 -28 54 153 -125 119 90 -287 -25 346 -317 -189 277 -81 -92 115 68 -83 67 140 -37 -66 427 -133 -369
4556 -369 -41 25 -93 -169 13 75 -329 -110 147 31 20 36 109 -188 -3 -151 -149 229 88 -32 -147 145 -166
4579 -166 -217 30 203 -5 -43 -11 -105 -246 36 -106 -121 -267 -251 133 -46 211 56 -95 268 131 -71 -342
4601 -342 198 -94 -244 -93 322 -135 -182 319 102 -363 -41 55 -191 -204 519 222 50 344 128 -81 -110
4622 -110 164 -77 -330 -188 447 -232 -132 73 331 11 189 95 -184 -116 103 102 -290 79 257 99 -36
4643 -36 0 -38 -193 -94 -60 9 -214 165 -116 -138 -481 233 125 -70 249 163 -249 7 267 -69 165 216 -138
4666 -138 29 8 14 -44 -245 19 48 -133 -74 7 -62 -73 286 95 -142 34 108 -141 26 61 45 87 229 359
4690 359 -69 210 270 -175 -80 -136 271 83 -297 286 20 -24 66 18 216 0 93 -61 21 71 43 19 71 65 -161
4715a61J51m6K29n18j4L10J5R2K1k40j83K24M15l85j8K17r4J60k86K21N2j08N0
4738A04p6j01K1K36l49j14K88J22r6q9Q2N4j68P9kO9K04q2l58J85k26K07J01l07
4762b16K73k82K59K34j66L4l53K47q4j1M8K1M5Q3j00J12l61J32k02K10j41K85
4784F7j91J58K13l95J35J31O4l78J18J11rj37L53j45J8n8l04M77m24J83j39J84
4806C2K74m02J15k87K89l80K53L78l83l5m4K39L8l0K68l83p4K69o0Mk52p3L54
4829A10l07P6J01r3j13o7L0J89J77q5q8Q8j64K10J8n2L8O9k8j06j29kK64j8j15
4854Ck77J12Jk0J56j60m4L25j27pp2K65j5J89k17j55m8N3lMj49J32R6k06J16N8
4880A0o0r7R7k05K72j43L82j88m2J22k64K32j55K23l80J33J1L22j53l61L76k01
$$ plain form
4715 -161 -10 -56 173 -345 -359 -49 -34 58 79 -161 -344 -120 295 -90 -108 109 15 175 -111 110 162 54 104
4738 104 28 -73 -52 184 -165 -279 9 131 35 -54 28 82 -86 -7 -9 60 264 182 -176 9 -217 -10 91 -216
4762 -216 57 -225 34 268 102 136 -217 30 -54 -65 -17 4 49 132 32 144 -217 -85 -287 -77 -218 67
4784 67 -124 34 247 -148 -13 118 182 -196 -78 33 24 -113 240 95 113 55 -249 228 -196 -13 -152 32
4806 32 306 -96 19 -268 21 -359 -106 272 -111 -146 -190 49 87 57 325 -58 -132 137 77 81 -171 -244 110
4829 110 -197 -121 -20 -113 -226 -293 -263 -74 103 18 -70 18 -146 64 82 30 68 137 109 3 -126 -128 136 118 3
4854 3 -274 -162 -161 -181 -25 -185 -229 96 -31 -38 -110 155 140 329 112 -43 -91 -38 -41 -37 -186 -54 42 -164 -48 10
4880 10 -50 -147 -50 -255 17 -126 256 68 26 148 -116 116 -39 184 -196 -63 -52 270 117 -244 132 -69
4902f9J87m4j38n1K21m9M3Ok33J80N0p2J64k52P1j15P1l33L49M8j20k25K49R8
4926C6j74L49m2j30K42k11O9j05L8j50K14k83kk35L60K76m49K65k01p5J05Q6j97
4949b14J83R5k56K97j31R8O2k63M17k04k40R7K42L0n97J74o0J12J21J42l64n3
4971c12L82m3j88L09J60k47n9R1O4rj01P9j07J15j45j55K68n8Q9k88MP1o1J87
4995D6j90J24pR7K22l28J21K36l54Lk2J1L2j93K43m39L08j21M39J6m53j3M73l40
5019h9J70J81k62P9m8J46k63K2P8Pr5J80k12r5K62P7o36N58J23l42K39k53M03
5042B30m33P0L71k84j11K88l25P0J06K86m46j15L00j8j78K25J08l42k1N37l06
5063A2rJ31q6j48J26J08j61P1L4R8k14K3l21K97j88L21L3n58O46r3k77j46L03
$$ plain form
4902 -69 118 74 -64 -115 106 57 100 106 -127 53 103 31 195 -57 14 -101 -30 -363 -14 34 -86 -311 -62 36
4926 36 -138 211 169 39 281 70 139 34 72 -78 136 -147 -149 -384 -24 252 -197 68 -133 -208 -103 -17 -214
4949 -214 -31 64 -192 105 -26 72 134 -129 288 84 -156 -59 183 213 -384 -210 -270 -158 -37 105 -259 -312
4971 -312 70 27 -161 148 308 61 2 93 157 148 47 126 19 134 -11 -166 102 44 133 -155 -151 -80 -141 46
4995 46 -144 -20 -27 70 292 -36 85 321 -33 -30 -52 -41 -9 -202 41 -398 -90 -211 228 244 -209 -222 251 -89
5019 -89 81 262 0 79 31 177 -86 -64 14 21 -74 106 -106 -201 61 138 -498 60 183 -159 80 -173 230
5042 230 -203 -133 238 -46 -157 131 -194 -124 -18 268 -178 -293 7 -11 -189 36 144 -198 -219 318 12
5063 12 3 134 48 -100 26 134 -27 44 78 176 -38 -15 -336 -39 -227 94 127 -431 215 122 -155 -301 2
5086BJ32j89K12J67j22l0p7l58m4K26J87l72N4M03j70l30J72J21k22K81J66l66
5108a57j67M28J14j67j08j3J56m9p2L01k96L03j26m23pK30j71j80M74L75l93L34
5130C86k73r0k7L04j45j86J61K45n21j67M90p0l86K15K89m87K20K53p6j10Mk02
5152a73N7J49J39k25O7k1J99k85p5L12J5m38K88Q5m4K24k47J09l63K35J93n10
5174c09M31k69J15n9L79l04K1P3J36j75l2m2J19l12j2J82r7K50j60k55K37j57
5196b40K06k8L01j52j22J8m0J25o8j84M08n86R9K93j58o8K14m3J0J88p8Mk69J92
5220B2k29K8K81q1J16j73l3k0j74N65k01l08k4N11l72k63L02k05K79J11q4l29
$$ plain form
5086 2 134 -55 157 324 202 172 95 -263 -307 -81 106 -266 -212 191 21 -309 -137 -16 -238 43 209 -157
5108 -157 -324 104 218 51 -57 -70 86 37 -35 266 -30 273 147 -276 -283 -53 -224 -404 70 445 52 386
5130 386 113 23 -4 300 155 -31 130 375 -146 -313 177 107 -279 -64 225 -262 -42 211 135 25 29 -173
5152 -173 -116 33 172 -53 14 -7 192 -93 -168 144 159 -279 9 94 50 274 27 136 -227 8 201 -309
5174 -309 122 -147 -32 -91 288 -16 5 78 214 39 7 -35 84 -228 -240 -58 -155 95 -65 -320 -83 -240
5196 -240 -34 -62 239 87 -35 -17 -57 68 0 -184 224 -362 -263 30 -128 -196 18 -25 -15 173 95 99 -170 22
5220 22 -207 -179 102 21 137 -36 -69 -89 -263 302 101 -207 -231 280 -92 -355 -53 -258 21 132 48 -281
$$ [...]
8191A23
##END NTUPLES=NMR FID
##END=
