##TITLE=1H_DE-81k2_tfa
 200.13MHz, CDCl3
 8 sc
 
 19ns.26.2.2025
##JCAMPDX= 6.0         $$ Bruker NMR JCAMP-DX V2.0
##DATA TYPE= NMR FID
##DATA CLASS= NTUPLES
##ORIGIN= UXNMR, Bruker Analytische Messtechnik GmbH
##OWNER= pz
$$ XWIN-NMR		Version 3.5
$$ Wed Feb 26 16:32:44 2025 Russian Standard Time (UT+4h)  new_Human@DPX200
##.OBSERVE FREQUENCY= 200.1313
##.OBSERVE NUCLEUS= ^1H
##.DELAY= (6, 6)
##.ACQUISITION MODE= SIMULTANEOUS
##.ACQUISITION SCHEME= undefined
##.AVERAGES= 8
##.DIGITISER RES= 18
##SPECTROMETER/DATA SYSTEM= spect
##.PULSE SEQUENCE= zg30
##.SOLVENT NAME= CDCl3
##.SHIFT REFERENCE= (INTERNAL, CDCl3, 0, 14.3821)
##AUDIT TRAIL= $$ (NUMBER, WHEN, WHO, WHERE, WHAT)
$$ ##TITLE= Audit trail, XWIN-NMR		Version 3.5
$$ ##JCAMPDX= 5.01
$$ ##ORIGIN= Bruker BioSpin GmbH
$$ ##OWNER= new_Human
$$ C:/Bruker/XWIN-NMR/data/yarkov/nmr/H-C/1/audita.txt
$$ ##AUDIT TRAIL=  $$ (NUMBER, WHEN, WHO, WHERE, WHAT)
(   1,<2025-02-26 16:30:28.06 +0400>,<new_Human>,<DPX200>,
      <created by zg, POWCHK disabled, PULCHK disabled
       configuration hash MD5:
       00 E9 B6 7A A2 85 ED C7 34 08 36 98 17 FE 4E 26
       data hash MD5: 16K
       49 32 0E AC 9B 4A 04 09 4A A7 82 BF A9 6D C2 0C>)
$$ ##END=
$$ 
$$ hash MD5
$$ 86 45 7A 74 41 AB FC 6A DB D0 5C 28 E8 AD 09 16
##$RELAX= 
##$RELAX= 
##$RELAX= 
##$RELAX= 
##$RELAX= 
##$RELAX= 
$$ Bruker specific parameters
$$ --------------------------
##$DU= <C:/Bruker/XWIN-NMR>
##$EXPNO= 1
##$NAME= <H-C>
##$PROCNO= 1
##$TYPE= <nmr>
##$USER= <yarkov>
##$AMP= (0..31)
100 100 100 100 100 100 100 100 100 100 100 100 100 100 100 100 100 100 
100 100 100 100 100 100 100 100 100 100 100 100 100 100 
##$AQSEQ= 0
##$AQ_mod= 1
##$AUNM= <au_zg>
##$AUTOPOS= <>
##$BF1= 200.13
##$BF2= 200.13
##$BF3= 200.13
##$BF4= 200.13
##$BF5= 200.13
##$BF6= 200.13
##$BF7= 200.13
##$BF8= 200.13
##$BYTORDA= 1
##$CFDGTYP= 0
##$CFRGTYP= 5
##$CHEMSTR= <none>
##$CNST= (0..31)
1 1 145 1 1 1 1 1 1 1 1 1 1 1 1 1 1 1 1 1 1 1 1 1 1 1 1 1 1 1 1 1 
##$CPDPRG= <>
##$CPDPRG1= <>
##$CPDPRG2= <>
##$CPDPRG3= <>
##$CPDPRG4= <mlev>
##$CPDPRG5= <mlev>
##$CPDPRG6= <mlev>
##$CPDPRG7= <mlev>
##$CPDPRG8= <mlev>
##$CPDPRGB= <>
##$CPDPRGT= <>
##$D= (0..31)
0 0.7 0 0 0 0 0 0 0 0 0 0.03 0 0 0 0 0 0 0 0 0 0 0 0 0 0 0 0 0 0 0 0 
##$DATE= 1740573027
##$DBL= (0..7)
120 120 120 120 120 120 120 120 
##$DBP= (0..7)
150 150 150 150 150 150 150 150 
##$DBP07= 0
##$DBPNAM0= <>
##$DBPNAM1= <>
##$DBPNAM2= <>
##$DBPNAM3= <>
##$DBPNAM4= <>
##$DBPNAM5= <>
##$DBPNAM6= <>
##$DBPNAM7= <>
##$DBPOAL= (0..7)
0.5 0.5 0.5 0.5 0.5 0.5 0.5 0.5 
##$DBPOFFS= (0..7)
0 0 0 0 0 0 0 0 
##$DE= 6
##$DECBNUC= <off>
##$DECIM= 32
##$DECNUC= <off>
##$DECSTAT= 4
##$DIGMOD= 1
##$DIGTYP= 9
##$DL= (0..7)
0 120 120 120 120 120 120 120 
##$DP= (0..7)
150 150 150 150 150 150 150 150 
##$DP07= 0
##$DPNAME0= <>
##$DPNAME1= <>
##$DPNAME2= <>
##$DPNAME3= <>
##$DPNAME4= <>
##$DPNAME5= <>
##$DPNAME6= <>
##$DPNAME7= <>
##$DPOAL= (0..7)
0.5 0.5 0.5 0.5 0.5 0.5 0.5 0.5 
##$DPOFFS= (0..7)
0 0 0 0 0 0 0 0 
##$DQDMODE= 0
##$DR= 18
$$ [...]
##$SUBNAM0= <"">
##$SUBNAM1= <"">
##$SUBNAM2= <"">
##$SUBNAM3= <"">
##$SUBNAM4= <"">
##$SUBNAM5= <"">
##$SUBNAM6= <"">
##$SUBNAM7= <"">
##$SUBNAM8= <"">
##$SUBNAM9= <"">
##$SW= 18.0517328524113
##$SWIBOX= (0..15)
0 0 2 0 0 0 0 0 0 0 0 0 0 0 0 0 
##$SW_h= 3612.71676300578
##$TD= 16384
##$TD0= 1
##$TE= 0
##$TE2= 300
##$TE3= 300
##$TEG= 300
##$TL= (0..7)
0 120 120 120 120 120 120 120 
##$TP= (0..7)
150 150 150 150 150 150 150 150 
##$TP07= 0
##$TPNAME0= <>
##$TPNAME1= <>
##$TPNAME2= <>
##$TPNAME3= <>
##$TPNAME4= <>
##$TPNAME5= <>
##$TPNAME6= <>
##$TPNAME7= <>
##$TPOAL= (0..7)
0.5 0.5 0.5 0.5 0.5 0.5 0.5 0.5 
##$TPOFFS= (0..7)
0 0 0 0 0 0 0 0 
##$TUNHIN= 0
##$TUNHOUT= 0
##$TUNXOUT= 0
##$USERA1= <user>
##$USERA2= <user>
##$USERA3= <user>
##$USERA4= <user>
##$USERA5= <user>
##$V9= 5
##$VALIST= <valist>
##$VCLIST= <CCCCCCCCCCCCCCC>
##$VD= 0
##$VDLIST= <DDDDDDDDDDDDDDD>
##$VPLIST= <PPPPPPPPPPPPPPP>
##$VTLIST= <TTTTTTTTTTTTTTT>
##$WBST= 1024
##$WBSW= 4
##$XGAIN= (0..3)
0 0 0 0 
##$XL= 0
##$YL= 0
##$YMAX_a= 148952
##$YMIN_a= -148716
##$ZGOPTNS= <>
##$ZL1= 120
##$ZL2= 120
##$ZL3= 120
##$ZL4= 120
##$ABSF1= 10
##$ABSF2= 0
##$ABSG= 5
##$ABSL= 3
##$ALPHA= 0
##$AQORDER= 0
##$ASSFAC= 0
##$ASSFACI= 0
##$ASSFACX= 0
##$ASSWID= 0
##$AUNMP= <proc_1d>
##$AZFE= 0.1
##$AZFW= 0.1
##$BCFW= 1
##$BC_mod= 2
##$BYTORDP= 1
##$COROFFS= 0
##$CY= -3
##$DATMOD= 1
##$DC= 2
##$DFILT= <>
##$DTYPP= 0
##$F1P= 0
##$F2P= 0
##$FCOR= 0.5
##$FTSIZE= 0
##$FT_mod= 4
##$GAMMA= 1
##$GB= 0.15
##$INTBC= 1
##$INTSCL= 1
##$ISEN= 128
##$LB= 0.25
##$LEV0= 0
##$LPBIN= 0
##$MAXI= 10000
##$MC2= 0
##$MEAN= 0
##$ME_mod= 0
##$MI= 1.114404
##$NCOEF= 0
##$NC_proc= 0
##$NLEV= 6
##$NOISF1= 3.799351
##$NOISF2= 2.8
##$NSP= 1
##$NTH_PI= 0
##$NZP= 0
##$OFFSET= 14.38212
##$PC= 1
##$PHC0= -1183.249
##$PHC1= 8.992247
##$PH_mod= 1
##$PKNL= yes
##$PPARMOD= 0
##$PSCAL= 0
##$PSIGN= 0
##$REVERSE= no
##$SF= 200.129724274929
##$SI= 16384
##$SIGF1= 3
##$SIGF2= 2
##$SINO= 400
##$SIOLD= 16384
##$SREGLST= <1H.CDCl3>
##$SSB= 0
##$STSI= 0
##$STSR= 0
##$SW_p= 3205.1282051282
##$SYMM= 0
##$S_DEV= 0
##$TDeff= 0
##$TDoff= 0
##$TI= <>
##$TILT= no
##$TM1= 0
##$TM2= 0
##$TOPLEV= 0
##$USERP1= <user>
##$USERP2= <user>
##$USERP3= <user>
##$USERP4= <user>
##$USERP5= <user>
##$WDW= 1
##$XDIM= 8192
##$YMAX_p= 0
##$YMIN_p= 0
$$ End of Bruker specific parameters
$$ ---------------------------------
##NTUPLES= NMR FID
##VAR_NAME=  TIME,          FID/REAL,        FID/IMAG
##SYMBOL=    X,             R,               I
##VAR_TYPE=  INDEPENDENT,   DEPENDENT,       DEPENDENT
##VAR_FORM=  AFFN,          ASDF,            ASDF
##VAR_DIM=   8192,          8192,            8192
##UNITS=     SECONDS,       ARBITRARY UNITS, ARBITRARY UNITS
##FACTOR=    0.0002768,     1,               1
##FIRST=     0,             0,               0
##LAST=      2.2672688,     0,               0
##MIN=       0,             -148716,         0
##MAX=       2.2672688,     148952,          0
$$ Real data points
##PAGE= N=1
##DATA TABLE= (X++(R..R)), XYDATA
$$ plain form
0 0 0 0 0 0 0 0 0 0 0 0 0 0 0 0 0 0 0 0 0 -1 7 -8 8 -8 8 -8 14 -14 16 -19 22 -23 29 -30 37 -39 45 -50 57 -61 69
41 69 -77 86 -94 104 -116 127 -140 155 -170 188 -206 228 -252 278 -309 343 -383 429 -485 551 -632
62 -632 738 -878 1071 -1360 1831 -2743 5131 -23865 -46860 22969 23635 12597 52857 37042
76 37042 -8381 63091 84375 -37380 -45066 61274 -1495 -102918 -30315 816 -95234 -66403
88 -66403 32831 -6471 -40142 42667 66790 29432 55663 63463 11367 17530 41249 -10698 -46437
101 -46437 -21618 -27296 -50313 -34946 -24505 -25458 -1263 8241 -5186 10304 29497 15943 17598
114 17598 32544 15367 5969 25910 17407 -8205 -513 4163 -18647 -23280 -18419 -33722 -34777
127 -34777 -14687 -13831 -18635 270 15371 18410 29542 35524 26428 25767 24631 5984 -5854 -6811
$$ packed form
0@%%%%%%%%%%%%%%%%%%%jQj5J6j6J6j6K2k8L0l5M1m5N2n9O7p6Q4r5J07j18J30
41F9j46J63j80J98k20K43k67K95l25L58l94M34m80N30n87O52p26Q12r14J036j183
62f32J370j616J949k431L191m574P874k8996k2995O9829O66j1038M0260j5815
76C7042m5423P1472K1284j21755p686J06340o2769j01423P2603L1131r6050K8831
88f6403R9234l9302l3671Q2809K4123l7358K6231P800n2096O163K3719n1947l5739
101d6437K4819n678k3017J5367J0441r53K4195R504j3427J5490J9193j3554J655
114A7598J4946j7177r398J9941q503k5612P692M676k2810m633M861j5303j055
127c4777K0090Q56m804J8905J5101L039J1132N982r096o61j136j8647j1838r57
$$ plain form
141 -6811 -20846 -35036 -30710 -27093 -26213 -14208 -4348 -2221 10797 24019 20072 19376 26301 18057
155 18057 4582 7164 5904 -8633 -12757 -8564 -13067 -14984 -9397 -11556 -14223 -5327 135 -3684
169 -3684 249 9544 9691 11305 20186 21078 13361 12550 11987 1855 -6719 -9543 -17508 -26054 -23358 -18916
185 -18916 -18737 -12055 21 5460 10447 21649 26904 22217 20515 18585 8988 681 -2206 -10508 -19300
200 -19300 -18539 -16660 -18582 -14894 -7004 -5993 -3979 5699 10436 7051 9347 13524 11307 10701 14135
215 14135 9623 2275 2878 2526 -6466 -11165 -11724 -16841 -19977 -15281 -12129 -11266 -3768 5439 9372 14268
231 14268 22011 21691 17130 16457 12653 2385 -3987 -7822 -15897 -20236 -17187 -15221 -15291 -9173 -2246 658
247 658 5670 12217 12732 9848 10906 11120 6777 4200 3260 -468 -3138 -2458 -2971 -6121 -7009 -7254 -8793
$$ packed form
141f811j4035j4190M326L617Q80J2005R860K127J3018J3222l947o96O925q244
155A8057j3475K582j260j4537m124M193m503j917N587k159k667Q896N462l819
169c684L933R295J47J614Q881Q92p717q11n63j0132q574k824p965q546K696M442
185a8916J79O682J2076N439M987J1202N255m687j702j930r597q307k887q302q792
200a9300P61J879j922L688P890J011K014R678M737l385K296M177k217o06L434
215A4135m512p348O03l52q992m699n59n117l136M696L152Q63P498R207L933M896
231A4268P743l20m561o73l804j0268o372l835q075m339L049J966p0O118O927K904
247F58N012O547N15k884J058K14m343k577r40l728k670O80n13l150q88k45j539
$$ plain form
264 -8793 -9181 -7080 -5904 -4847 -750 3791 7238 11109 13669 13435 11864 10334 6392 625 -4483 -9602
280 -9602 -13699 -14473 -13037 -11622 -8970 -3641 2149 6624 9998 11945 11706 9942 7457 4915 746 -3085
296 -3085 -6079 -7375 -7219 -6048 -4950 -3459 -2083 -473 1509 2267 1835 1307 1249 1674 2053 2556 3527 2748
314 2748 2874 3331 2716 388 -1985 -4030 -6378 -7600 -7508 -6729 -5570 -3348 778 4675 8483 10222 10483
331 10483 9734 8209 4882 889 -3250 -7372 -9753 -10554 -10118 -8738 -5869 -2426 447 4179 7743 8191
347 8191 7224 6406 5443 3631 1561 -835 -2687 -3211 -3056 -3272 -3100 -2679 -3107 -3216 -2463 -2082 -2617 -1627 -596
366 -596 206 3277 5492 5636 6287 7249 6085 4124 2042 -783 -4899 -7558 -8195 -8985 -8935 -7218 -4896
383 -4896 -1907 2519 6028 7694 8885 9165 7943 6357 3918 820 -2343 -4217 -5590 -5938 -5407 -5274
$$ packed form
264h793l88K101J176J057M097M541L447L871K560k34j571j530l942n767n108n119
280i602m097p74J436J415K652N329N790M475L374J947k39j764k485k542m169l831
296c085k994j296J56J171J098J491J376J610J982P58m32n28n8M25L79N03R71p79
314B748J26M57o15k328k373k045k348j222R2P79J159K222M126L897L808J739K61
331A0483p49j525l327l993m139m122k381q01M36J380K869L443K873L732L564M48
347H191r67q18r63j812k070k396j852n24J55k16J72M21m28j09P53L81n35R90J031
366e96Q02L071K215J44O51R62j164j961k082k825m116k659o37p90N0J717K322
383d896K989M426L509J666J191K80j222j586k439l098l163j874j373l48N31J33
$$ plain form
399 -5274 -4268 -2955 -1074 -13 1028 968 1603 2502 2788 2306 3918 4105 2630 3221 4221 1819 -396
416 -396 -1111 -3288 -5883 -5485 -5197 -6893 -5762 -1695 -397 674 5260 7004 5180 6044 7326 3904
432 3904 366 98 -2552 -5558 -4278 -3463 -5716 -3925 -368 -954 -421 3488 3188 214 2270 3410
448 3410 125 -573 1372 -586 -1756 1332 1534 -1502 -110 1109 -1903 -2463 19 -1999 -3505 -862
464 -862 904 -350 1308 3949 2341 2431 3932 2533 -489 -882 -2130 -4675 -4617 -3174 -3638 -3135 -374
481 -374 1270 2171 4052 4783 4017 3678 3302 1191 -1016 -2068 -2401 -3543 -3970 -2698 -2115 -2237 -638 1189
499 1189 933 472 2072 2418 -197 763 2673 980 -139 1837 1948 -65 1492 1511 -2474 -3131 -1546
516 -1546 -3665 -5243 -2572 -2138 -3410 509 3641 1655 3953 7318 4202 2403 4362 1629 -3169
$$ packed form
399e274J006J313J881J061J041o0O35Q99K86m82J612J87j475N91J000k402k215
416c96p15k177k595L98K88j696J131M067J298J071M586J744j824Q64J282l422
432C904l538k68k650l006J280Q15k253J791L557n86N33L909l00k974K056J140
448C410l285o98J945j958j170L088K02l036J392J219l012n60K482k018j506K643
464h62J766j254J658K641j608R0J501j399l022l93j248k545N8J443m64N03K761
481c74J644R01J881P31p66l39l76k111k207j052l33j142m27J272N83j22J599J827
499A189k56m61J600L46k615R60J910j693j119J976J11k013J557J9l985o57J585
516a546k119j578K671M34j272L919L132j986K298L365l116j799J959k733m798
$$ plain form
531 -3169 -1847 -1890 -6706 -5656 -1676 -4076 -4226 1491 2377 -479 3214 4965 959 1820 4584 1163
547 1163 -1737 1629 1144 -2571 -91 2040 -2140 -3028 522 -830 -4325 -2234 -686 -2745 -1671 1322
563 1322 1396 1853 4002 3793 2826 3605 3368 535 -680 -1279 -3323 -3880 -3241 -3723 -3854 -792 600 85
581 85 1510 3406 3018 2456 2440 1735 -234 -640 -463 -1137 -1402 -1208 -926 -619 -150 301 448 -118 -436 -530
601 -530 -273 -426 -347 46 395 646 1437 1452 740 1281 759 -1160 -1546 -504 -1705 -2928 -1463 -323 -870
620 -870 729 2099 1490 2143 3071 1743 -234 954 -228 -2570 -2023 -1440 -3094 -2161 -265 -479 -23
637 -23 2698 2235 192 2005 2964 -107 -491 1557 -791 -2284 360 235 -2615 -552 969 -1687 -1437
654 -1437 1029 -677 -1871 518 674 -988 1172 2793 703 1347 3410 1781 -250 947 -272 -2977
$$ packed form
531c169J322m3m816J050L980k400j50N717Q86k856L693J751m006Q61K764l421
547A163k900L366m85l715K480K131m180q88L550j352l495K091J548k059J074K993
563A322P4M57K149k09r67P79k37k833j215n99k044n57O39m82j31L062J392n15
581H5J425J896l88n62j6p05j969m06J77o74k65J94K82L07M69M51J47n66l18r4
601e30K57j53P9L93L49K51P91J5p12N41n22j919l86J042j201j223J465J140n47
620h70J599J370o09O53R28j328j977J188j182k342N47N83j654R33J896k14M56
637b3K721m63k043J813R59l071l84K048k348j493K644j25k850K063J521k656K50
654a437K466j706j194K389J56j662K160J621k090O44K063j629k031J197j219k705
$$ plain form
670 -2977 -2273 -2002 -3501 -3413 -866 -1033 -733 1886 2653 1391 2729 3272 2283 1417 1138 -374 -1565 -856
688 -856 -1252 -2333 -1742 -674 -1543 -1184 261 -20 -555 72 343 435 992 1216 1293 1128 1816 1945 1058 481
708 481 323 -443 -1778 -2128 -2060 -2354 -2316 -1452 -1055 -65 776 1741 1787 2380 2756 1761 965 539 -32 -1295 -1519
729 -1519 -1532 -1933 -1794 -772 -984 -411 163 424 339 690 948 162 -2 713 480 -22 371 929 60 285
749 285 511 -49 -915 -307 -671 -1493 -1108 -297 -747 -213 827 933 805 1319 1538 452 152 1 -745 -1321
769 -1321 -1046 -1419 -1764 -828 225 170 541 1386 1473 1267 1208 799 -80 -218 -581 -1087 -1010 -875 -630 -776 -448
790 -448 55 53 128 551 181 495 419 610 363 454 607 335 341 478 231 -234 -291 -1057 -1371 -1560 -1266 -1364 -782
813 -782 -294 485 557 1213 2045 1892 1996 1834 699 222 -334 -779 -1595 -1891 -1882 -1662 -1439 -907 -258 347 655
$$ packed form
670b977P04K71j499Q8K547j67L00K619P67j262J338N43r89q66k79j512j191P09
688h56l96j081N91J068q69L59J445k81n35O27K71R2N57K24P7j65O88J29q87n77
708D81j58p66j335l50O8k94L8Q64L97R90Q41R65M6N93L76r95p96m26n71j263k24
729a519j3m01J39J022k12N73N74K61q5L51K58p86j64P15k33n02L93N58q69K25
749B85K26n60q66O08l64q22L85Q11m50N34J040J06j28N14K19j086l00j51p46n76
769a321K75l73l45R36J053n5L71Q45Q7k06n9m09q79j38l63n06P7J35K45j46L28
790d48N03kP5M23l70L14p6J91k47R1J53k72OJ37k47m65n7p66l14j89K94r8N82
813g82M88P79P2O56Q32j53J04j62j135m77n56m45q16k96RK20K23N32O49O05L08
$$ plain form
834 655 1014 1348 1107 1076 824 709 460 428 309 148 -414 -223 -715 -818 -811 -1236 -1250 -1102 -960 -710 -60 304
856 304 1008 1580 1511 1912 1686 1539 1077 259 -404 -1190 -1484 -1544 -1587 -1590 -1112 -854 -420 211 713 1170 1173 1459 1294
879 1294 544 522 583 -194 -292 -285 -252 -399 -242 -510 -833 -270 -550 -941 -558 -182 -135 -79 581 544 769 1336 1237
902 1237 599 654 368 -396 -672 -490 -1166 -1591 -658 -449 -977 -25 615 670 838 1385 922 305 400 -28 -784
923 -784 -490 -277 -1165 -469 -268 -373 -397 416 621 -129 573 717 38 97 238 71 -387 394 400 -99 52 132
945 132 -311 -615 -24 -826 -763 -309 -290 -302 362 876 538 915 1158 628 355 336 -122 -947 -598 -886 -1591 -1192
967 -1192 -890 -619 -97 654 516 808 1217 1056 790 549 501 65 93 -306 -641 -439 -484 -888 -482 -239 -486
988 -486 -392 -112 3 -306 511 734 436 995 1231 697 315 992 279 -176 -261 -366 -1482 -1178 -1080 -1347 -970
$$ packed form
834F55L59L34k41l1k52j15k49l2j19j61n62J91m92j03Pm25j4J48J42K50O50L64
856C04P04N72o9M01k26j47m62q18o63p86k94o0m3lM78K58M34O31N02M57LK86j65
879A294p50k2O1p77r8PL3j47J57k68l23N63k80l91L83L76M7N6O60l7K25N67r9
902A237o38N5k86p64k76J82o76m25R33K09n28R52O40N5J68N47m63o17R5m28p56
923g84K94K13q88O96K01j05k4Q13K05p50P02J44o79N9J41j67m58P81Om99J51Q0
945A32m43l04N91q02O3M54J9j2O64N14l38L77K43n30k73j9m58q25L49k88p05L99
967a192L02K71N22P51j38K92M09j61k66k41m8m36K8l99l35K02m5m04M06K43k47
988d86R4K80J15l09Q17K23k98N59K36n34l82O77p13m55q5j05j116L04R8k67L77
$$ plain form
1009 -970 -179 -252 -237 832 1200 541 1317 1542 339 12 867 -195 -984 -104 -402 -1259 -963 293 -713
1028 -713 -697 124 -47 -257 422 665 186 266 798 433 125 792 1096 23 91 -88 -661 -853 -113 -735 -1079
1049 -1079 -481 -164 -287 223 775 603 699 1064 440 97 518 -395 -531 -401 -371 -1062 -362 -199 -207 -232 1
1070 1 137 112 263 362 241 -22 -109 -24 -201 -117 -243 83 -38 -184 -12 -219 -295 -131 76 -252 -101 247 62
1093 62 301 817 571 2 493 43 -166 -395 -306 -649 -1003 -392 -183 -210 210 467 98 576 930 705 583
1114 583 306 124 -800 -149 -262 -864 -608 -291 -524 -531 335 156 -403 498 812 93 1 871 376 -229 557
1135 557 263 -189 146 422 -644 -719 -456 -476 -1065 -517 -567 -762 -278 339 513 480 1156 602 656 697 456 -190
1157 -190 -667 46 -516 -961 -648 -529 -876 -443 -164 -188 276 238 511 335 301 391 415 264 430 77 -5 -34
$$ packed form
1009i70P91p3J5J069L68o59P76K25j203l27Q55j062p89Q80k98q57K96J256j006
1028g13J6Q21j71k10O79K43m79Q0N32l65l08O67L04j073O8j79n73j92P40o22l44
1049a079N98L17j23N10N52j72R6L65o24l43M21r13j36J30L0o91P00J63qk5K33
1070AJ36k5J51R9j21k63q7Q5j77Q4j26L26j21j46J72k07p6J64K07l28J51L48j85
1093F2K39N16k46n69M91m50k09k29Q9l43l54O11K09k7M20K57l69M78L54k25j22
1114E83k77j82r24O51j13o02K56L17k33pQ66j79n59R01L14p19r2Q70m95o05P86
1135E57k94m52L35K76j066p5K63k0n89N48n0j95M84O17J74l3O76n54N4M1k41o46
1157a90m77P13n62m45L13J19l47M33K79k4M64l8K73j76l4R0K4j51J66l53q2k9
$$ plain form
1179 -34 39 -271 -208 -97 -320 -603 -44 -504 -273 -211 215 282 420 757 1117 514 688 382 361 -400 -284 -564
1201 -564 -719 -711 -508 -245 -358 -50 -24 145 617 646 269 207 244 -105 -74 308 -249 -215 3 -58 -299 -21 307
1224 307 -7 24 23 -254 -152 29 -190 -19 156 233 129 43 262 -94 -18 -171 245 -371 -296 -300 74 -244 101
1247 101 159 45 225 572 347 -44 110 -71 -427 -107 -319 -547 -234 -256 -181 -241 133 337 192 649 628 443
1269 443 -139 125 187 68 -74 -369 -374 -353 87 -172 -103 -52 -63 -395 87 192 62 122 315 387 353 485 446 284
1293 284 64 -134 -282 -463 -482 -315 -841 -479 -387 76 -120 100 587 705 346 442 116 252 194 52 -292
1314 -292 -202 -62 -387 -255 -323 -205 -337 -213 140 -36 16 208 -32 114 355 448 282 225 498 329 132 -190
1336 -190 -115 -241 -283 -191 -919 -486 -61 -167 204 441 328 228 718 499 272 179 343 -278 -126 -101 -347 -327
$$ packed form
1179c4P3l10O3J11k23k83N59m60K31O2M26O7J38L37L60o03J74l06k1p61J16k80
1201e64j55QK03K63j13L08K6J69M72K9l77o2L7l49L1L82n57L4K18o1k41K78L28
1224C07l14L1jk77J02J81k19J71J75P7j04q6K19l56P6j53M16o16P5mL74l18L45
1247A01N8j14J80L47k25l91J54j81l56L20k12k28L13k2P5o0L74K04j45M57k1j85
1269D43n82K64O2j19j42k95nK1M40k59O9N1j1l32M82J05j30O0J93P2l4J32l9j62
1293B84k20j98j48j81j9J67n26L62R2M63j96K20M87J18l59R6l26J36n8j42l44
1314b92R0J40l25J32o8J18j32J24L53j76N2J92k40J46K41R3j66n7K73j69j97l22
1336a90P5j26m2R2p28M33M25j06L71K37j13j00M90k19k27r3J64o21J52K5k46K0
$$ plain form
1358 -327 63 -32 -217 -141 -120 -29 -222 137 -381 469 86 -218 164 409 25 107 195 -29 -53 79 338 194
1380 194 -225 -583 -17 -285 118 -154 -186 306 235 -73 72 -182 109 -157 -28 -129 -319 -250 -83 -53 -128 203
1402 203 -36 157 345 401 112 102 219 -210 -243 -346 -508 -513 -122 -98 58 167 -36 289 79 314 164 275
1424 275 183 86 165 -67 192 -26 -68 -96 -120 -13 -228 -231 -78 -305 -167 -219 -30 154 337 194 499 619 274
1447 274 110 -59 206 37 -140 -464 -503 -319 -325 -102 -174 138 34 209 295 338 363 339 -64 171 -230 -111 15
1470 15 -16 -179 -3 382 -249 -315 -3 -199 -256 -177 56 -261 -137 547 222 143 613 382 255 224 -6 -237
1492 -237 -229 -65 -390 -226 98 -153 -27 -113 74 -4 203 407 216 -210 0 269 -213 197 181 -132 -309 154
1514 154 -159 -388 229 72 -474 7 -17 -315 11 -71 26 159 164 312 24 115 -241 128 -38 57 -79 -185
$$ packed form
1358c27L90r5j85P6K1R1j93L59n18Q50l83l04L82K45l84Q2Q8k24k4J32K59j44
1380A94m19l58N66k68M03k72l2M92p1l08J45k54K91k66J29j01j90O9J67L0p5L31
1402B03k39J93J88N6k89j0J17m29l3j03j62nL91K4J56J09k03L25k10K35j50J11
1424B75r2r7P9k32K59k18m2k8k4J07k15lJ53k27J38n2J89J84J83j43L05J20l45
1447B74j64j69K65j69j77l24l9J84oK23p2L12j04J75Q6M3K5k4m03K35m01J19J26
1470A5l1j63J76L85o31o6L12j96n7P9K33l17J24O84l25p9M70k31j27l1k30k31
1492b37QJ64l25J64L24k51J26q6J87p8K07K04j91m26K10K69m82M10j6l13j77M63
1514A54l13k29O17j57n46M81k4k98L26q2R7J33NJ48k88R1l56L69j66R5j36j06
$$ plain form
1536 -185 33 224 223 -45 -17 -93 155 172 457 236 -30 41 -158 -318 -171 -188 22 -25 -157 130 137 63 481 52
1560 52 -312 -43 -77 -6 -41 -186 -404 -165 37 -177 -6 90 85 6 -102 63 37 32 97 -73 -142 61 293 13
1584 13 166 39 -289 170 -123 -341 -234 -345 -59 -197 -208 9 -223 -117 297 202 117 342 383 -65 73 40
1606 40 -65 -353 -33 -274 -1 -20 72 10 -59 208 -154 121 70 317 -247 215 384 127 78 239 144 -80 -154
1629 -154 43 -286 -27 -364 -555 -314 -18 -79 140 280 182 -54 150 115 55 306 111 316 -134 -17 -3 -333
1651 -333 -390 77 -25 -73 156 137 -118 7 -79 131 -154 -77 296 36 -62 -57 146 171 105 60 -78 44 104 -138
1675 -138 -323 -285 -363 -78 166 -39 -16 -28 -115 143 -126 164 -8 -31 -62 74 -238 177 6 372 -170 -109 -41
1698 -41 92 -60 -243 -77 -215 -11 146 -316 234 -15 -107 77 433 -9 -324 7 116 -171 -147 66 -184
$$ packed form
1536a85K18J91jk68K8p6K48J7K85k21k66P1j99j60J47j7K10m7j32K87Pp4M18m29
1560E2l64K69l4P1l5j45k18K39K02k14J71R6np9j08J65k6nO5j70o9K03K32k80
1584A3J53j27l28M59k93k18J07j11K86j38j1K17k32J06M14r5q5K25M1m48J38l3
1606D0j05k88L20k41K73j9R2o2o9K67l62K75n1K47n64M62J69k57m9J61r5k24p4
1629a54J97l29K59l37j91K41K96o1K19J40r8k36K04l5o0K51j95K05m50J17J4l30
1651c33n7M67j02m8K29j9k55J25q6K10k85P7L73k60r8NK03K5o6m5j38J22O0k42
1675a38j85L8p8K85K44k05K3j2q7K58k69K90j72k3l1J36l12M15j71L66n42O1O8
1698d1J33j52j83J66j38K04J57m62N50k49r2J84L56m42l15L31J09k87K4K13k50
$$ plain form
1719 -184 -91 311 125 -87 256 -36 52 21 69 91 -92 -223 319 27 -361 115 -131 306 179 62 -249 4
1741 4 67 -66 -116 -181 -11 -108 -393 -282 -5 95 58 -65 174 32 163 150 98 37 -53 267 -71 164 -241 338
1765 338 60 -162 -110 181 152 -186 -96 -31 -3 -32 -65 105 81 243 503 127 302 199 -262 -11 -30 -182 -127
1788 -127 177 -78 -61 75 60 -196 192 166 146 87 97 -75 -128 -75 -163 -6 -182 39 -129 137 49 123 -152 -69
1812 -69 -45 -119 -157 46 -182 266 140 74 162 113 116 -68 -21 0 -154 -64 -376 -59 -30 -15 178 -165 156 60 199
1837 199 104 -155 209 198 92 155 -203 -143 -155 -237 341 -123 155 -95 146 155 55 -125 -5 -316 -159 69 -37
1860 -37 -124 190 68 38 -36 36 179 43 45 -67 24 104 331 130 63 148 78 28 -39 -318 219 128 -10 136 -231
1885 -231 -194 -205 -144 88 -150 -34 116 147 130 322 174 311 -256 103 -162 -122 -146 -30 -81 -164 42 -246 -249 49
$$ packed form
1719a84R3M02j86k12L43k92Q8l1M8K2j83j31N42k92l88M76k46M37j27j17l11K53
1741DO3j33n0o5J70r7k85J11K77J00l7j23K39j42J31j3n2o1r0L20l38K35m05N79
1765C38k78k22N2K91k9l38R0O5K8k9l3J70k4J62K60l76J75j03m61K51j9j52N5
1788a27L04k55J7J36j5k56L88k6k0n9J0j72n3N3q8J57j76K21j68K66q8P4k75Q3
1812f9K4p4l8K03k28M48j26o6Q8m9Lj84M7K1j54R0l12L17K9J5J93l43L21r6J39
1837A99r5k59L64j1j06O3l58O0j2q2N78m64K78k50K41Rj00j80J20l11J57K28j06
1860c7q7L14j22l0p4P2J43j36Kj12R1Q0K27k01o7Q5p0n0o7k79N37r1j38J46l67
1885b31L7j1O1K32k38J16J50L1j7J92j48J37n67L59k65M0k4J16n1q3K06k88lK98
$$ plain form
1909 49 -152 -81 55 -270 39 337 190 15 224 149 66 102 204 52 -112 -142 -391 -564 -64 -36 126 -68
1931 -68 -314 231 75 145 -41 -11 121 2 -220 48 -339 -144 -58 -74 15 19 -87 -34 76 120 41 -84 -32 -69
1955 -69 120 52 66 107 -4 13 38 -140 -261 120 -94 -43 -37 -354 87 50 -160 -283 229 145 22 -44 -281 30
1979 30 173 320 -20 -68 100 127 -131 8 139 -84 267 -68 -155 -100 -59 -92 252 25 33 -137 -192 -57 -27 413
2003 413 54 307 78 117 99 -346 13 212 208 -248 -237 -322 -49 330 132 -69 164 -195 -46 76 -156 -210
2025 -210 32 63 91 270 -226 347 231 -80 -173 224 142 -67 -162 -135 -313 -38 5 -204 -28 -115 134 -11 -9
2048 -9 116 156 -129 50 15 -220 34 -1 -4 22 15 -120 64 -32 125 -127 -175 132 -29 -73 -21 301 216 173 108 24
2074 24 -7 148 56 17 25 -160 -138 -54 -246 161 54 -46 -1 185 17 46 -203 44 18 -51 -33 92 45 -103 275
$$ packed form
1909D9k01P1J36l25L09K98j47j75K09p5q3L6J02j52j64l0k49j73N00K8J62j94
1931f8k46N45j56P0j86L0J32j19k22K68l87J95Q6j6Q9Mj06N3J10M4p9j25N2l7
1955f9J89o8J4M1j11J7K5j78j21L81k14N1Ol17M41l7k10j23N12q4j23o6k37L11
1979C0J43J47l40m8J68K7k58J39J31k23L51l35q7N5M1l3L44k27Qj70n5J35L0M40
2003D13l59K53k29L9j8m45L59J99mm56J1q5K73L79j98k01K33l59J49J22k32n4
2025b10K42L1K8J79m96N73j16l11r3L97q2k09r5K7j78K75M3k09J76q7K49j45K
2048iJ25M0k85J79l5k35K54l5lK6pj35J84r6J57k52m8L07j61m4N2L22q5m3o5q4
2074B4l1J55r2l9Qj85K2Q4j92M07j07j00M5J86j68K9k49K47k6o9J8J25m7j48L78
$$ plain form
2099 275 -76 -179 -136 74 -329 -161 90 -153 156 -261 38 -179 -28 276 -42 -106 -25 347 44 18 63 -168
2121 -168 113 -318 -12 -80 -78 -53 -167 174 56 -137 94 173 106 147 -192 52 56 -141 -303 -83 167 -146 -200
2144 -200 -57 24 183 160 4 -141 -47 -226 -20 -176 151 -203 140 267 -48 249 -71 257 -49 -19 188
2165 188 7 -165 -11 26 -285 193 63 -153 147 -92 -449 -18 185 62 -305 5 125 -68 44 231
2185 231 -27 113 183 233 33 104 136 -294 -183 214 75 -172 -63 107 -9 -146 -115 -177 56 -244 3 201
2207 201 2 147 -6 -3 56 2 48 -107 -89 270 106 -36 -142 -275 -28 -3 -25 63 -180 300 -147 219 157
2230 157 -119 39 35 147 137 132 25 160 -19 -165 57 -82 2 -186 196 -126 -65 299 302 205 91 227 41
2253 41 162 25 -36 42 167 -166 -263 -102 29 181 23 61 186 196 17 88 49 -71 -26 -278 -19 -28 208 59
$$ packed form
2099B75l51j03M3K10m03J68K51k43L09m17K99k17J51L04l18o4Q1L72l03k6M5k31
2121a68K81m31L06o8KK5j14L41j18j93K31P9o7M1l39K44Mj97j62K20K50l13n4
2144b00J43Q1J59k3j56j45R4j79K06j56L27l54L43J27l15K97l20L28l06L0K07
2165A88j81j72J54L7l11M78j30k16L00k39l57M31K03j23l67L10J20j93J12J87
2185B31k58J40P0N0k00P1L2m30J11L97j39k47J09J70j16j37L1o2K33l00K47J98
2207B01j99J45j53LN9n4M6j55J8L59j64j42j06j33K47K5k2Q8k43M80m47L66o2
2230A57k76J58mJ12j0nj07J35j79j46K22j39Q4j88L82l22O1L64Lr7j14J36j86
2253D1J21j37o1P8J25l33r7J61J31J52j58L8J25J0j79P1l9j20M5k52K59rK36j49
$$ plain form
2277 59 -161 -112 160 -270 -218 106 71 -97 -8 -14 -38 -121 -230 158 -46 -124 300 51 -42 115 -135 133 18 -110
2301 -110 -308 120 53 242 -139 266 -214 -117 -32 -45 -34 53 -34 -25 67 429 213 133 -31 54 311 13 172 -64
2325 -64 -209 -59 -74 -59 -94 -163 41 -164 -123 -79 -289 72 190 38 -186 -108 122 50 128 -302 164 233 -44 -7
2349 -7 -352 -92 -94 212 -153 -254 242 99 -43 -79 76 -173 48 211 287 150 -69 141 55 149 -107 -69 7
2372 7 122 151 -430 103 -167 111 15 -36 -68 170 -5 -164 148 -151 17 204 56 59 -60 150 115 -97 125
2395 125 184 -88 -158 149 -29 20 -54 -79 295 88 216 40 -47 40 53 51 290 -1 -35 17 -218 105 -278 -39
2419 -39 -187 81 -197 100 14 -152 -19 465 -57 77 -272 319 199 273 -85 -274 261 143 171 31 -133
2440 -133 -417 33 -246 -116 -118 -81 50 -40 141 -260 -6 3 54 -93 -91 32 78 27 -107 177 278 -8 -60 -12
$$ packed form
2277E9k20M9K72m30N2L24l5j68Q9ok4q3j09L88k04p8M24k49r3J57k50K68j15j28
2301a10j98M28o7J89l81M05m80R7Q5j3J1Q7q7RR2L62k16q0j64Q5K57k98J59k36
2325f4j45J50j5J5l5o9K04k05M1M4k10L61J18j52k24P8K30p2P8m30M66O9k77L7
2349gl45K60kL06l65j01M96j43j42l6J55k49K21J63P6j37k19K10q6R4k56L8P6
2372GJ15K9n81N33k70K78r6n1l2K38j75j59L12k99J68J87j48Lj19K10l5k12K22
2395A25N9k72p0L07j78M9p4k5L74k07J28j76q7Q7J3kK39k91l4N2k35L23l83K39
2419c9j48K68k78K97q6j66J33M84n22J34l49N91j20P4l58j89N35j18K8j40j64
2440a33k84M50k79J30kL7J31r0J81m01K54RN1j47KJ23M6n1j34K84J01k86n2M8
$$ plain form
2464 -12 -85 -82 5 -18 -46 -186 -92 75 55 -105 -354 -212 -273 278 -9 92 118 -100 96 215 -136 30 225 -108
2488 -108 -26 59 111 -9 -418 -7 -45 -330 147 -67 107 40 108 76 -62 288 89 -29 -28 -200 94 115 -3
2511 -3 -222 117 15 143 -109 -121 147 1 96 115 -229 -79 -16 154 120 94 129 -59 -102 -106 179 193 94 42 -328
2536 -328 -54 158 -19 71 361 132 18 17 279 96 -14 215 -97 -78 -154 -23 183 -36 90 13 46 -63
2558 -63 -70 -145 -21 -46 -20 -134 -10 -28 54 -29 -101 -71 12 175 -11 0 -256 -52 175 -241 -150 -323 38 140 -39
2583 -39 21 28 -31 22 -112 -125 407 102 133 -169 -192 -102 233 28 -206 -46 -13 -101 93 -9 -198 257 -162 -67
2607 -67 -105 151 -106 -81 149 -177 -45 241 166 -140 28 -95 -73 -86 -209 -149 -128 -120 204 -149 171 -414 -74
2630 -74 56 188 368 -79 -162 -39 108 65 130 -61 -58 -96 66 -120 -89 311 209 -341 -84 -13 -39 43 52 137 9
$$ packed form
2464a2p3LQ7k3k8j40R4J67k0j60k49J42o1N51k87J01K6k18J96J19l51J66J95l33
2488a08Q2Q5N2j20m09M11l8k85M77k14J74o7O8l2j38L50j99j18Jj72K94K1j18
2511ck19L39j02J28k52j2K68j46R5J9l44J50O3J70l4k6L5j88m3mK85J4r9n2l70
2536c28K74K12j77R0K90k29j14jK62j83j10K29l12J9p6J31K06k19J26p7L3j09
2558f3pp5J24k5K6j14J24j8Q2q3p2L0Q3J63j86J1k56K04K27m16R1j73L61J02j79
2583c9O0Pn9N3j34j3N32l05L1l02k3R0L35k05k34J60L3q8J94j02j89M55m19R5
2607f7l8K56k57K5K30l26J32K86p5l06J68j23K2j3j23O0K1QL24l53L20n85L40
2630g4J30J32J80m47q3J23J47m3O5j91Ll8J62j86L1M00j02n50K57P1k6Q2RQ5j28
$$ plain form
2655 9 257 78 -120 138 179 -202 -316 -7 -316 32 19 274 -134 -28 -72 114 200 -141 196 126 13 -81 75
2678 75 119 23 -30 -114 26 281 98 159 34 -180 -176 -153 -124 166 -203 -18 38 -42 109 -130 -80 160 -72 -201
2702 -201 -81 141 -90 -33 63 317 39 202 67 197 -57 -188 80 -239 208 -191 20 -175 304 -27 9
2723 9 11 122 -153 100 164 0 43 -95 110 -66 330 -78 129 92 -96 -142 112 44 149 134 -66 71 -194
2746 -194 -162 -16 89 233 -170 -91 -59 -45 228 110 -11 0 56 -157 174 192 178 -43 186 121 -371 -72 -76 179
2770 179 235 -128 -143 -242 -74 2 163 161 132 -177 134 -54 -165 41 -28 -27 -203 60 -23 -61 186 60 137 116 -87
2795 -87 -131 297 191 58 266 -8 298 -57 75 -312 -224 -58 177 -77 27 99 169 190 -103 150 165 39
2817 39 168 -187 -67 23 50 97 54 -40 128 117 -85 -90 -130 -8 -27 -65 149 -32 158 -80 -70 13 293 193 137
$$ packed form
2655IK48j79j98K58M1l81j14L09l09L48j3K55m08J06m4J86Q6l41L37p0j13r4J56
2678G5M4r6n3q4J40K55j83O1j25k14MK3K9K90l69J85N6q0J51k39N0K40k32j29
2702b01J20K22k31N7R6K54k78J63j35J30k54j31K68l19M47l99K11j95M79l31L6
2723IKJ11k75K53O4j64M3j38K05j76L96m08K07l7j88m6K54o8J05j5k00J37k65
2746a94L2J46J05J44m03P9L2J4K73j18j21J1N6k13L31J8j4k21K29o5m92K99mK55
2770A79N6l63j5r9J68P6J61kk9l09L11j88j11K06o9Jj76K63q3l8K47j26P7k1k03
2795h7m4M28j06j33K08k74L06l55J32l87Q8J66K35k54J04P2P0K1k93K53J5j26
2817C9J29l55J20R0K7M7m3r4J68j1k02nm0J22j9l8K14j81J90k38J0Q3K80j00n6
$$ plain form
2842 137 48 -252 -146 370 226 -184 -111 -239 -16 -336 252 -19 -35 -53 101 -14 -37 240 -126 -161 59 30
2864 30 -241 35 176 153 -173 -107 50 21 144 -210 201 -157 98 -233 24 345 35 -130 -57 259 -116 260
2886 260 275 102 377 -50 -13 348 -10 -135 -27 12 -410 -80 -206 38 -75 -132 -194 -192 -106 117 36 -86 90
2909 90 215 -169 -266 -128 -133 -118 -94 109 -130 200 187 202 -64 -21 175 -132 5 121 -185 -226 -6 191 30
2932 30 6 -80 256 74 -282 123 61 49 -126 -162 -116 -45 -188 -19 -269 35 -240 -72 -187 -11 -289 131 12
2955 12 63 -139 99 120 -19 101 56 21 -98 110 -62 70 68 9 92 57 37 -184 134 -89 -88 72 19 -122 -162
2980 -162 156 -13 233 238 -258 -145 -150 -326 148 -148 -17 38 64 90 119 -157 22 -28 -126 172 106 105 96 12 -92
3005 -92 9 -127 -72 55 -160 -264 80 154 266 152 -113 118 -126 -84 202 92 51 -88 -83 -6 79 216 -58
$$ packed form
2842A37q9l00J06N16j44m10P3j28K23l20N88k71j6j8J54j15k3K77l66l5K20k9
2864C0k71K76J41k3l26O6J57k9J23l54M11l58K55l31K57L21l10j65P3L16l75L76
2886B60J5j73K75m27L7L61l58j25J08L9m22L30j26K44j13n7o2KQ6K23q1j22J76
2909I0J25l84r7J38nJ5K4K03k39L30j3J5k66M3J96l07J37J16l06m1K20J97j61
2932C0k4q6L36j82l56M05o2j2j75l6M6P1j43J69k50L04k75J68j15J76k78M20j19
2955A2N1k02K38K1j39J20m5l5j19K08j72J32kn9Q3l5k0k21L18k23JJ60n3j41m0
2980a62L18j69K46Nm96J13nj76M74k96J31N5K6K6K9k76J79n0r8K98o6jrq4j04
3005i2J01j36N5J27k15j04L44P4J12j14k65K31k44M2K86j10m1j39NP7Q5J37k74
$$ plain form
3028 -58 -49 -210 241 -77 -179 -79 2 203 -91 -14 -117 144 -54 -36 66 181 81 11 277 -9 223 -155
3050 -155 -132 190 -143 -199 173 243 -93 -193 10 222 -147 149 -73 -83 -95 -75 221 142 -85 -52 121 113 -184
3073 -184 -3 56 -126 -172 -150 -30 -199 -35 -131 -81 -302 246 56 -1 -43 84 -3 -107 -48 117 11 -86 -57 123
3097 123 -68 -189 -189 33 135 92 -317 119 -74 -69 179 3 111 42 -243 -134 40 140 22 -299 146 -309
3119 -309 -53 -150 -15 -162 -10 83 -34 56 -136 -376 -22 32 41 115 143 63 6 134 167 26 -157 150 -204 -134
3143 -134 -149 -70 -304 55 -70 -66 197 45 -41 -32 344 -67 22 64 5 -99 29 90 -68 -39 -33 -19 -301 -21 113
3168 113 -110 7 59 215 205 -115 -162 48 106 -42 86 10 13 -102 -21 -77 -66 123 202 46 73 20 -107 0
3192 0 253 85 -82 155 -162 -313 306 -3 -4 -201 -66 185 23 -20 -237 -182 -113 116 -75 -1 -130 -209 -309
$$ packed form
3028e8Rj61M51l18j02J00Q1K01k94P7j03K61j98J8J02J15j00p0K66k86K32l78
3050a55K3L22l33n6L72P0l36j00K03K12l69K96k22j0j2K0K96p9k27L3J73qk97
3073a84J81N9j82m6K2J20j69J64r6N0k21N48j90n7m2J27q7j04N9J65j06r7K9J80
3097A23j91j21%K22J02m3m09M36j93NK48j76J08o9k85J09J74J00j18l21M45m55
3119c09K56r7J35j47J52R3j17R0j92k40L54N4RP4K8q0n7J28L3j41j83L07l54P0
3143a34j5P9k34L59j25MK63j52q6RL76m11Q9M2n9j04J28O1j58K9OJ4k82K80J34
3168A13k23J17N2J56j0l20m7K10N8j48J28p6Lj15Q1n6J1J89P9j56K7n3j27J07
3192@K53j68j67K37l17j51O19l09jj97J35K51j62m3k17N5O9K29j91P4j29p9j00
$$ plain form
3215 -309 64 126 128 -196 14 -39 101 195 -258 219 101 301 405 51 -169 -51 114 -41 221 -55 -258 -37
3237 -37 -81 -148 245 54 -28 374 -12 30 32 27 -67 -333 -121 26 -27 279 60 175 -134 187 -242 -6 -90 180
3261 180 0 2 74 -98 108 -151 30 -35 134 120 212 -206 -9 9 59 -139 -61 -147 -5 -127 -193 -57 -117 151
3285 151 -109 -93 398 -61 -290 -65 -100 162 -157 136 -31 -169 82 -119 73 -154 -16 140 68 76 3 218
3307 218 41 -45 -275 163 -73 -51 -109 -105 -91 -70 68 328 -124 7 -63 -87 27 -142 -160 4 -158 -86 24 81
3331 81 -65 174 -40 91 23 -13 -94 116 13 -74 -76 113 -72 48 224 43 208 353 55 -71 -116 227 4
3354 4 320 380 124 207 112 -251 139 340 -75 -403 15 -57 22 -70 -20 -299 -106 -163 -119 -30 -156 -25 -73 -76 -28
3379 -28 -187 77 178 -150 151 -52 -79 161 54 -6 43 -308 141 4 336 78 160 -57 147 227 -139 112
$$ packed form
3215c09L73O2Kl24K10n3J40R4m53M77j18K00J04l54k20J18J65j55K62k76k03K21
3237c7m4o7L93j91q2M02l86M2Knr4k66K12J47n3L06k19J15l09L21m29K36q4K70
3261A80j80KP2j72K06k59J81o5J69j4R2m18J97J8N0j98P8q6J42j22o6J36o0K68
3285A51k60J6M91m59k29K25l5K62l19K93j67j38K51k01J92k27J38J56p2Qp3K15
3307B18j77q6k30M38k36K2n8MJ4K1J38K60m52J31p0k4J14j69j8J64j62P2J10N7
3331H1j46K39k14J31o8l6q1K10j03q7kJ89j85J20J76j81J65J45k98j26m5L43k23
3354DL16O0k56Q3r5l63L90K01m15l28M18p2P9r2N0k79J93n7M4Q9j26J31m8lM8
3379b8j59K64J01l28L01k03k7K40j07o0M9l51M49j37L32k58Q2k17K04Q0l66K51
$$ plain form
3401 112 -34 119 91 -191 -215 -140 226 135 -221 -200 -53 118 -122 11 45 -62 232 164 141 6 88 32 -160
3424 -160 106 -29 -97 -163 -16 -4 169 -168 -55 43 74 -143 -81 -98 160 -238 -83 159 -60 84 -32 -20 207
3447 207 -210 281 31 307 1 -94 172 13 -248 -30 -144 16 48 -7 101 59 -110 138 81 212 182 -79
3469 -79 111 -33 -96 -37 138 -51 -64 -192 -111 -67 72 37 255 -12 92 243 5 7 -260 -41 -17 192 -22
3492 -22 106 76 116 -201 134 58 -32 -183 77 -166 82 109 217 169 -100 -212 -73 -186 -229 203 -114 160 -108
3515 -108 -62 -7 -74 149 -379 57 84 42 0 -268 -38 109 209 -68 -55 42 149 -163 312 -47 319 108 32
3538 32 -339 74 153 -97 -100 8 17 18 6 2 -188 105 152 -97 -32 -69 100 -143 -81 -58 -271 151 346 57 123 -8
3564 -8 64 252 61 -76 -309 -64 -49 36 -3 -233 -92 267 211 -70 47 -215 100 153 6 169 -174 -164 -127
$$ packed form
3401A12j46J53k8k82k4P5L66r1l56K1J47J71k40J33L4j07K94o8k3j35Q2n6j92
3424a60K66j35o8o6J47J2J73l37J13R8L1k17O2j7K58l98J55K42k19J44j16J2K27
3447B07m17M91k50K76l06r5K66j59k61K18j14J60L2n5J08m2j69K48n7J31l0k61
3469g9J90j44o3N9J75j89j3j28Q1M4J39l5K18k67J04J51k38Kk67K19K4K09k14
3492b2J28l0M0l17L35p6r0j51K60k43K48K7J08m8k69j12J39j13m3M32l17K74k68
3515a08M6N5o7K23n28M36K7m2m2k68K30J47J00k77J3R7J07l12M75l59L66k11p6
3538C2l71M13P9k50lJ08RJj2mj90K93M7k49O5l7J69k43O2K3k13M22J95k89O6j31
3564hP2J88j91j37k33K45J5Q5l9k30J41L59n6k81J17k62L15N3j47J63l43J0L7
$$ plain form
3587 -127 -73 203 229 -407 22 73 -14 -146 -347 -100 149 -138 51 26 37 86 238 -159 63 87 7 -206 141
3610 141 -138 359 -312 125 -67 -125 8 101 -7 128 86 -42 66 -264 184 75 -69 -58 -254 -74 -67 -36
3632 -36 -52 -130 279 -139 142 215 217 -218 141 -51 -168 -114 27 19 -201 87 -269 -32 -137 -177 -167 -2 211 -244
3656 -244 -114 -141 -225 19 47 182 -88 140 -86 121 186 -199 30 -182 69 -125 209 56 -69 -188 -36
3677 -36 152 -211 -166 -194 -101 -158 -107 54 61 -112 -54 -299 -31 -88 112 -251 206 400 61 -42 -34 120 -27 71
3701 71 -29 98 -34 126 62 -94 142 -420 91 -221 66 -54 47 7 76 -38 42 104 -74 -66 113 157 193
3724 193 -93 -6 12 88 -26 81 -92 -100 -32 27 37 -40 63 0 193 -175 26 -88 29 -83 148 339 190
3747 190 116 -209 -44 54 213 213 40 -81 292 283 229 32 -14 73 132 -25 -124 -35 15 7 132 196 -96 -82 -207 33
$$ packed form
3587a27N4K76K6o36M29N1q7j32k01K47K49k87J89k5J1M9J52l97K22K4q0k13L47
3610A41k79M97o71M37j92n8J33R3j08J35m2j28J08l30M48j09j44J1j96J80PL1
3632c6j6p8M09m18K81P3Km35L59j92j17N4J41qk20K88l56K37j05m0J0J65K13m55
3656b44J30k7q4K44K8J35k70K28k26K07O5l85K29k12K51j94L34j53j25j19J52
3677c6J88l63M5k8R3n7N1J61Pj73N8k45K68n7K00l63M57J94l39j03QJ54j47R8
3701G1j00J27j32J60o4j56K36n62N11l12K87j20J01m0O9j14Q0O2j78QJ79M4L6
3724A93k86Q7J8P6j14J07j73qO8N9J0p7J03o3J93l68K01j14J17j12K31J91j49
3747A90p4l25J65R8J59%j73j21L73rn4j97m6Q7N9j57r9Q9N0qJ25O4k92J4j25K40
$$ plain form
3773 33 -211 14 40 114 -133 -57 76 -38 225 -256 15 21 -139 126 91 -15 -41 185 -78 -239 30 -36 -143
3796 -143 202 89 127 -45 -133 -156 73 -93 -190 -60 -23 164 63 -11 -291 59 29 63 -76 -75 85 116 163 35
3820 35 89 96 -56 162 -257 -227 -304 -2 102 -131 131 81 -297 222 -71 22 33 -267 3 -212 -33 -181 68
3843 68 -155 78 279 -60 -393 -57 -254 177 -7 -69 129 -23 221 -215 -148 122 59 -56 204 35 48 219
3865 219 186 -86 -97 -390 -71 102 33 218 -63 -77 -97 51 -31 -21 -140 124 23 109 88 203 8 92 1 -16
3889 -16 170 -318 -84 -218 142 -136 -62 247 -9 39 -130 124 6 76 165 -8 -44 -53 -87 -3 158 -133 -133 31
3913 31 -110 96 -71 -4 -114 213 113 -136 236 87 283 111 -10 -60 -181 71 57 -135 113 220 -65
3934 -65 -139 35 97 56 -84 268 213 -14 -138 240 -119 -9 -238 -26 136 -17 61 -72 -51 51 63 7 -178
$$ packed form
3773C3k44K25K6P4k47P6J33j14K63m81K71Oj60K65l5j06k6K26k63j61K69o6j07
3796a43L45j13L8j72q8k3K29j66r7J30L7J87j01p4k80L50l0L4j39JJ60L1M7j28
3820C5N4Pj52K18m19L0p7L02J04k33K62n0l78N19k93R3J1l00K70k15J79j48K49
3843F8k23K33K01l39l33L36j97M31j84o2J98j52K44m36O7K70o3j15K60j69J3J71
3865B19l3k72j1k93L19J73o9J85k81j4k0J48q2J0j19K64j01Q6k1J15j95Q4r1j7
3889a6J86m88K34j34L60k78P4L09k56M8j69K54j18P0Q9j73l6rl4Q4J61k91%J64
3913C1j41K06j67O7j10L27j00k49L72j49J96j72j21n0j21K52j4j92K48J07k85
3934f5p4J74O2m1j40L52n5k27j24L78l59J10k29K12J62j53P8j33K1J02J2n6j85
$$ plain form
3957 -178 -20 38 -181 -113 159 -80 -182 357 59 184 -35 162 -84 147 -207 -2 148 -78 -74 162 -76
3978 -76 -8 -175 -131 136 91 16 81 254 12 -64 -243 -306 80 32 -14 -114 84 -118 -295 46 -71 -36 -46 -71
4002 -71 -86 -136 -16 -14 105 -148 -92 42 43 -110 92 26 33 -29 40 -7 -119 15 -337 73 64 343 -6 -22 -209 -14
4028 -14 359 -162 120 -157 -261 61 -49 115 -28 -44 34 178 -21 -11 -6 -29 370 -107 -428 -41 -83 -276 139
4051 139 153 211 0 146 -13 56 -71 52 -101 -113 -20 15 33 159 -66 -95 154 246 -64 -29 172 -146 -179 -69
4075 -69 155 -48 -27 -274 -223 70 151 -49 146 100 -17 -10 0 220 160 58 17 -169 -70 40 -10 0 6 14 268 131
4101 131 194 98 -151 -131 -189 150 -24 47 7 50 179 33 -94 480 125 -86 83 10 -198 235 50 -139 -22
4124 -22 131 59 -98 -101 65 -6 -193 -52 -191 219 -82 130 -99 -162 286 122 -185 -268 -156 -48 35 246 127
$$ packed form
3957a78J58N8k19O8K72k39j02N39k98J25k19J97k46K31l54K05J50k26MK36k38
3978g6O8j67M4K67m5p5O5J73k42p6j79o3L86m8m6j00J98k02j77L41j17L5j0k5
4002g1j5n0J20KJ19k53N6J34Jj53K02o6Po2O9m7j12J34l52M10rK79l49j6j87J95
4028a4L73n21K82k77j04L22j10J64j43j6P8J44j99J0Nk3L99m77l21L87m2j93M15
4051A39J4N8k11J46j59O9j27J23j53j2R3L5J8J26k25k9K49R2l10L5K01l18l3J10
4075f9K24k03K1k47N1K93Q1k00J95m6j17PJ0K20o0j02m1j86R9J10n0J0OQK54j37
4101A31O3r6k49K0n8L39j74P1m0M3J29j46j27N74l55k11J69p3k08M33j85j89J17
4124b2J53p2j57lJ66p1j87J41j39M10l01K12k29o3M48j64l07q3J12J08Q3K11j19
$$ plain form
4147 127 95 -227 194 -237 -18 -28 174 107 102 -88 -14 -52 -45 90 25 -69 -157 -107 -247 386 275 -3 -53 118 -18
4172 -18 -3 -74 65 -31 -107 8 -71 157 -10 110 -26 -16 195 -8 2 -214 -211 70 9 -94 -39 -101 266 -232
4196 -232 446 110 -72 137 76 -21 262 -95 106 134 -386 -130 19 -47 193 -45 78 42 4 160 -392 16
4218 16 -43 161 -121 -38 34 -83 124 93 -53 -130 113 -74 59 1 -179 -83 206 127 104 -65 -183 221 -98
4241 -98 9 75 148 5 236 180 -48 -47 -158 97 -31 -175 -5 -160 215 19 -41 -49 -55 -194 -72 -126 47 -186
4265 -186 76 162 -51 -52 -118 219 94 -133 153 96 -160 203 167 -76 118 54 9 -90 -103 -69 106 120 21 23 87
4290 87 -72 -154 -34 12 -112 29 -90 -22 -33 310 -14 -95 -176 -23 -86 -75 -511 -12 65 -141 -290 15 120
4313 120 -1 126 -97 42 10 103 78 150 -85 87 126 12 -41 -73 -300 189 -189 -52 -162 -86 27 -330 -44
$$ packed form
4147A27l2l22M21m31K19j0K02o7nj90P4l8PJ35o5r4q8N0j40O33j11k78n0J71j36
4172a8J5p1J39r6p6J15p9K28j67J20j36J0K11k03J0k16LK81o1j03N5o2L67m98
4196b32O78l36j82K09o1r7K83l57K01K8n20K56J49o6K40k38J23l6l8J56n52M08
4218A6n9K04k82Q3P2j17K07l1j46p7K43j87J33n8j80R6K89p9k3j69j18M04l19
4241i8J07O6P3j43K31n6k28Jj11K55j28j44J70j55L75j96o0qoj39J22n4J73k33
4265a86K62Q6k13jo6L37j25k27K86n7k56L63l6k43J94o4m5r9j3L4J75J4r9KO4
4290H7j59q2J20M6j24J41j19O8j1L43l24q1q1J53o3J1m36M99P7k06j49L05J05
4313A20j21J27k23J39l2R3k5P2k35J72L9j14n3l2k27M89l78J37j10P6J13l57K86
$$ plain form
4336 -44 -232 93 -99 -24 260 -162 -48 84 166 211 -151 23 -159 0 12 117 120 156 -144 66 83 -110 13
4359 13 -7 -169 287 239 -91 113 67 263 -7 -85 92 42 -209 6 40 -307 77 110 -34 175 126 110 -407
4382 -407 34 -96 152 145 -75 -254 92 -94 -38 -245 21 167 130 167 88 -74 -111 48 154 118 266 -102 -230
4405 -230 149 107 181 226 117 -151 -117 224 40 195 141 150 -36 68 -35 -52 169 173 -221 62 -120 51 -3 -48
4429 -48 284 -220 -249 -33 247 -109 226 -107 -47 127 -271 -66 123 -1 52 -69 33 -48 181 38 257 -42
4451 -42 -239 -83 -64 92 -231 100 179 116 -138 -134 -138 184 -12 -59 183 -133 285 -8 -204 146 -25 35 13 19
4475 19 -87 83 -71 -231 38 -78 94 13 -27 -196 -143 238 153 -24 -88 326 -64 -68 175 30 129 -164 -63
4498 -63 -16 151 158 145 227 -94 -56 -20 -134 -161 99 190 -142 -312 -45 253 18 64 41 267 -88 -85 58 -266 -163
$$ packed form
4336d4j88L25j92P5K84m22J14J32Q2M5l62J74j82J59J2J05LL6l00K10J7j93J23
4359A3k0j62M56m8l30K04m6J96k70p8J77n0k51K15L4l47L84L3j44K09m9j6n17
4382d07M41j30K48pk20j79L46j86N6k07K66J46l7L7p9j62l7J59J06l6J48l68j28
4405b30L79m2P4M5j09k68L4L41j84J55n4Rj86J04j03j7K21Ml94K83j82J71n4m5
4429d8L32n04k9K16K80l56L35l33O0J74l98K05J89j24N3j21J02q1K29j43K19k99
4451d2j97J56J9J56l23L31P9o3k54MmL22j96m7K42l16M18k93j96L50j71O0k2O
4475A9j06J70j54j60K69j16J72q1m0j69N3L81q5j77o4M14l90mK43j45R9k93J01
4498f3M7J67Pj3Q2l21L8L6j14k7K60R1l32j70K67K98k35M6k3K26l55LJ43l24J03
$$ plain form
4523 -163 -50 -2 176 -184 -185 52 -252 144 -77 -95 64 236 -124 -14 -15 -111 82 52 12 -63 -40 -27 35 66 256
4548 256 -48 256 374 -145 130 45 107 118 -39 209 -305 42 129 5 218 -56 -250 -219 83 -6 132 6
4570 6 -131 30 78 9 -6 38 15 -306 226 -38 -64 -302 -260 -33 -208 -209 -112 -45 -104 -17 251 27 -10 149 -76
4595 -76 48 -161 250 172 81 89 -1 41 65 133 -195 69 -167 144 -65 -221 -21 36 -63 232 156 -97 -125 -4
4619 -4 18 -173 172 -48 -66 -114 284 -224 -168 -55 142 -43 13 -70 83 47 157 74 97 -57 -282 -12 208 -294
4643 -294 -108 104 -454 -41 -171 -128 -59 -53 -223 -147 -2 -55 -10 120 83 90 -150 -148 25 79 -33 -93 209 -6 34
4668 34 -333 -73 -58 85 21 26 19 390 33 -267 130 -73 -117 37 0 -77 -292 -32 -60 76 -131 220 -111 -179
4692 -179 -69 65 -136 -29 53 146 -88 -18 -118 71 -129 -328 2 309 -12 219 -32 213 54 -134 -118
$$ packed form
4523a63J13M8J78l60jK37l04L96k21j8J59J72l60J10jr6J93l0m0p5K3J3O2L1J90
4548B56l04L04J18n19K75q5O2J1j57K48n14L47Q7j24K13k74j94L1L02q9J38j26
4570Fj37J61M8o9j5M4k3l21N32k64k6k38M2K27j75jR7O7n9Q7K68k24l7J59k25
4595g6J24k09M11p8r1Qr0M2K4O8l28K64k36L11k09j56K00N7r9K95p6k53k8J21
4619dK2j91L45k20j8m8L98n08N6J13J97j85N6q3J53l6J10q3K3j54k25K70K20n02
4643b94J86K12n58M13j30M3O9Oj70P6J45n3M5J30l7Pk40KJ73N4j12o0L02k15M0
4668C4l67K60J5J43o4NpL71l57l00L97k03m4J54l7p7k15K60k8J36k07L51l31o8
4692a79J10J34k01J07Q2R3k34P0j00J89k00j99L30L07l21K31k51K45j59j88J6
$$ plain form
4713 -118 -141 -218 77 117 -191 152 37 -62 378 7 3 -61 -11 -20 -183 -316 177 -124 -158 53 57 -119 -100 -339 6
4738 6 26 -159 -45 -155 71 -125 285 -52 -356 -229 -168 -41 26 81 40 205 12 12 -38 -45 277 -308 -46 138
4762 138 -233 333 160 34 251 -88 -43 69 -246 18 -130 61 131 -24 -53 2 -144 62 71 6 97 -94 81
4785 81 333 205 337 -146 -71 45 51 236 -223 -120 -334 -228 -19 214 -87 70 101 -213 227 107 -229 -79
4807 -79 -52 108 -190 55 132 80 -179 -156 72 8 192 -106 -38 200 273 39 -308 120 408 -153 140 -44 -87
4830 -87 -36 86 33 -114 -152 -41 15 -59 -93 -217 -142 84 -48 -165 -79 -157 25 309 -206 -90 -220 96 198
4853 198 -36 80 47 -241 13 -256 -2 108 116 155 -69 -122 258 -216 96 -234 -96 65 -300 34 116 -58
4875 -58 53 49 71 -154 141 9 35 30 114 -18 -39 -33 289 180 39 -23 -103 137 -143 -42 -32 296 -15 234 -183
$$ packed form
4713a18k3p7K95M0l08L43j15r9M40l71mo4N0rj63j33M93l01l4K11Mj76J9k39L45
4738FK0j85J14j10K26j96M10l37l04J27O1J27O7N5m1J65j93%n0pL22n85K62J84
4762A38l71N66j73j26K17l39M5J12l15K64j48J91P0j55k9N5j46K06Ro5R1j91J75
4785H1K52j28J32m83P5J16OJ85m59J03k14J06K09K33l01J57L1l14M40j20l36J50
4807g9K7J60k98K45P7n2k59K3K28o4J84k98O8K38P3k34l47M28K88n61K93j84m3
4830h7N1J22n3j47l8J11N6p4l4j24P5K26j32j17Q6p8J82K84n15J16j30L16J02
4853A98k34J16l3k88K54k69K54J10QL9k24n3L80m74L12l30J38J61l65L34Q2j74
4875e8J11mK2k25K95j32K6nQ4j32k1OL22j09j41o2q0K40k80J01J0L28l11K49m17
$$ plain form
4900 -183 -121 -30 55 -28 -321 5 30 255 229 -183 124 -108 -316 -47 17 -3 70 -108 -7 -63 17 -189 -10 178
4924 178 -45 -28 16 -281 51 183 250 40 178 -191 -22 46 -105 -96 7 -167 -219 45 -200 -79 333 343 -102
4947 -102 -11 55 34 99 154 75 -191 150 260 -262 87 169 -174 -18 -94 -63 -27 -202 -66 47 -199 170 -13
4970 -13 69 181 83 30 233 121 158 -65 204 120 -26 -82 -157 99 -240 -71 -56 -50 79 -67 73 111 -2 -64
4994 -64 20 67 -65 104 58 56 157 65 64 123 12 -51 -12 -124 186 34 -120 -329 52 -88 -140 103 134 41 -106
5019 -106 -57 30 36 119 -45 50 101 -62 92 94 43 -118 136 -36 -67 12 -143 101 76 308 -129 134 134 38 188
5044 188 -124 -91 -43 105 0 -8 -114 131 62 13 281 153 -107 -64 -86 -33 11 49 -88 143 -61 113 -1 357
5068 357 92 -410 -99 -258 250 26 -184 -102 -124 47 14 156 -167 66 170 -118 73 -53 -74 -70 -300 206
$$ packed form
4900a83O2R1Q5q3k93L26K5K25k6m12L07k32k08K69O4k0P3j78J01n6Q0k06J79J88
4924A78k23J7M4k97L32J32O7k10J38l69J69O8j51RJ03j74n2K64k45J21M12J0m45
4947a02R1O6k1O5N5p9k66L41J10n22L49Q2l43J56p6L1L6j75J36J13k46L69j83
4970a3Q2J12r8n3K03j12L7k23K69q4j46n6p5K56l39J69J5OJ29j46J40L8j13o2
4994f4Q4M7j32J69m6kJ01r2jN9j11o3L9j12L10j52j54k09L81j40n2K43L1r3j47
5019a06M9Q7OQ3j64R5N1j63J54Kn1j61K54j72l1P9j55K44k5K32m37K63%r6J50
5044A88l12L3M8J48j05qj06K45o9m9K68j28k60M3k2N3M4L8j37K31k04J74j14L58
5068C57k65n02L11j59N08k24k10Q2k2J71l3J42l23K33J04k88J91j26k1Mk30N06
$$ plain form
5090 206 63 -296 -92 244 -265 97 -227 73 96 67 222 85 -180 -405 131 -20 -87 -112 -51 76 -68 43
5112 43 -48 -38 92 -307 292 -92 -50 -197 20 -101 131 55 -206 32 -37 378 6 -113 -183 54 63 -318 32
5135 32 -109 -79 19 83 -67 49 1 133 141 -108 -58 111 5 26 -47 40 -132 -3 -10 41 -52 202 120 36 381 82
5161 82 145 -230 -33 91 30 102 33 -130 -40 43 100 102 -173 23 -17 -92 54 -59 -211 -6 12 -202 41 9 77
5186 77 -63 -79 91 -39 -22 -77 6 -124 -51 136 -35 5 17 -290 -56 95 -233 58 -234 -32 -39 150 -46
5209 -46 0 -267 -37 206 59 16 -297 296 -4 79 -63 113 -62 184 -68 -77 54 54 2 -1 -29 -92 10 -32 -210
5234 -210 30 -31 -33 60 -28 -189 -301 18 180 -31 -81 174 146 383 -202 189 211 50 263 -121 115 -207 -47
5257 -47 -8 -9 47 51 315 153 8 -168 179 104 -102 109 -7 -14 78 -12 172 -25 309 0 188 124 196 -116 22
$$ packed form
5090B06j43l59K04L36n09L62l24L00K3k9J55j37k65k25N36j51o7k5O1J27j44J11
5112D3r1J0J30l99N99l84M2j47K17j21K32p6k61K38o9M15l72j19p0K37Rl81L50
5135C2j41L0R8O4j50J16m8J32Qk49N0J69j06K1p3Q7j72J29pN1r3K54q2q4L45k99
5161H2O3l75J97J24o1P2o9j63R0Q3N7Kk75J96m0p5J46j13j52K05J8k14K43l2O8
5186G7j40j6J70j30J7n5Q3j30P3J87j71M0J2l07K34J51l28K91k92K02pJ89j96
5209d6M6k67K30K43j47m3l13N93l00Q3j42J76j75K46k52rJ31%n2lk8o3J02m2j78
5234b10K40o1kR3q8j61j12L19J62k11n0K55k8K37n85L91K2j61K13l84K36l22J60
5257d7L9jN6MK64j62j45j76L47p5k06K11j16pR2r0J84j97L34l09J88o4P2l12J38
$$ plain form
5282 22 170 116 -45 -30 -175 116 348 -224 -79 447 281 -149 -82 18 -176 -97 -72 -17 -102 159 -324 107 66
5305 66 -28 -67 -380 -15 53 86 169 240 -139 241 35 12 -98 248 -132 -179 -19 124 -90 18 96 137 -373 -49
5329 -49 215 130 -48 -249 6 -55 -105 -82 -103 -263 179 18 88 113 130 -32 -1 256 -116 16 -78 -266 -7 102
5353 102 123 -39 -34 121 340 -42 3 -164 -128 296 -11 135 82 145 53 34 -237 -163 -89 -162 -221 78 -51 -206
5377 -206 235 -50 -20 164 10 -187 137 -122 -147 -310 300 15 -57 13 -240 -130 -146 4 33 26 -62 290 149
5400 149 -189 102 163 -177 173 42 71 189 110 -50 -169 130 -120 224 151 90 -269 -49 -1 52 93 116 196
5423 196 -171 157 -273 53 310 -42 -302 -68 194 72 54 2 -134 127 -219 -54 62 66 64 -151 51 -231
5445 -231 16 -101 183 -227 -59 139 15 115 -128 168 -145 88 -154 78 163 210 2 268 212 222 -82
$$ packed form
5282B2J48n4j61J5j45K91K32n72J45N26j66m30O7J00j94P9K5N5q5K61m83M31m1
5305F6r4l9l13L65O8L3Q3P1l79L80k06k3j10L46l80m7J60J43k14J08P8M1n10L24
5329d9K64q5j78k01K55o1n0K3k1j60M42j61P0K5J7j62L1K57l72J32r4j88K59J09
5353A02K1j62NJ55K19l82M5j67L6M24l07J46n3O3r2j9k71P4P4p3n9K99j29j55
5377b06M41k85L0J84j54j97L24k59k5j63O10k85p2P0k53J10j6J50K9pq8L52j41
5400A49l38K91O1l40L50j31K9J18p9j60j19K99k50L44p3o1l59K20M8N3M1K3Q0
5423A96l67L28m30L26K57l52k60K34K62j22j8n2j36K61l46J65J16Mkk15K02k82
5445b31K47j17K84m10J68J98j24J00k43K96l13K33k42K32Q5M7k08K66n6J0l04
$$ plain form
5466 -82 163 -8 99 74 -60 88 200 -112 -369 -98 -58 -144 -84 20 -24 -152 119 16 286 -34 84 -15
5488 -15 117 26 100 68 -164 -292 -181 193 -55 30 154 24 -217 71 178 286 48 -88 26 -50 58 7
5510 7 152 -2 -125 -220 228 32 -34 -95 -101 346 74 -204 150 -105 -115 -209 85 -108 -68 174 -103 -4 180 221
5534 221 320 -146 -325 62 -9 136 36 113 -180 -287 11 -58 344 215 151 98 51 84 -121 37 117 -53 16
5557 16 -345 51 -12 -166 185 -275 47 -47 -89 30 19 176 155 -22 -26 -17 27 -8 -20 9 81 -83 -220 -368 -121
5582 -121 -70 209 338 74 132 -77 -41 -50 -14 -11 226 269 -34 -209 4 -1 -210 140 89 -99 -179 24 -147 318
5606 318 -65 157 4 -88 -68 -5 -51 -37 -10 148 1 239 -83 -80 261 -111 -274 -10 -285 -79 -6 -31 132
5629 132 -179 84 -29 176 272 75 -39 -40 -75 21 72 -219 -273 102 200 160 -168 -13 -26 109 -184 114 -56
$$ packed form
5466h2K45j71J07k5j34J48J12l12k57K71M0q6O0J04m4j28K71j03K70l20J18r9
5488a5J32r1P4l2k32j28J11L74k48Q5J24j30k41K88J07J08k38j36J14p6J08n1
5510GJ45j54j23r5M48j96o6o1oM47k72k78L54k55j0r4K94j93M0K42k77R9J84M1
5534B21R9m66j79L87p1J45j00P7k93j07K98o9M02j29o4n3m7L3k05J58Q0j70O9
5557A6l61L96o3j54L51m60L22r4m2J19j1J57k1j77mRM4l5j2K9P2j64j37j48K47
5582a21N1K79J29k64N8k09L6rL6LK37M3l03j75K13nk09L50n1j88q0K03j71M65
5606C18l83K22j53r2K0O3m6J4K7J58j47K38l22LL41l72j63K64k75K06P3k5J63
5629A32l11K63j13K05R6j97j14jl5R6N1k91n4L75R8m0l28J55j3J35k93K98j70
$$ plain form
5652 -56 -201 -177 -205 311 344 -95 124 -123 19 -205 19 275 -134 -38 38 -302 -25 -74 280 443 -8 116
5674 116 241 -24 330 197 86 70 122 231 19 -81 77 160 -115 257 201 -91 36 -2 75 -151 -154 -24 -83
5697 -83 33 80 236 35 57 181 142 -135 54 30 7 -133 95 -246 -264 -164 73 72 -75 -51 -131 2 95 -64
5721 -64 -117 -203 49 110 -75 101 -64 -221 -44 219 138 -33 -77 78 -274 154 225 -12 -143 15 -45 -12 45
5744 45 178 -125 -132 69 355 125 74 200 286 107 -106 -39 -507 -201 300 -202 13 -46 205 231 127 -44 -414
5767 -414 0 -243 -161 -63 32 -144 372 -111 -144 233 -233 -199 179 29 -162 106 -113 74 -84 -36 -22 -129
5789 -129 149 -202 120 103 -136 40 184 -30 190 -351 -142 -214 -68 -32 156 26 122 -124 -52 -260 407 215
5811 215 -295 -46 -20 81 79 -99 214 -11 0 -39 -170 -159 102 -16 -280 -33 -65 171 -147 -166 -41 -30 103
$$ packed form
5652e6j45K4k8N16L3m39K19k47J42k24K24K56m09R6P6l40K77m9L54J63m51J24
5674A16J25k65L54j33j11j6N2J09k12j00J58Q3k75L72n6k92J27l8P7k26lJ30n9
5697h3J16M7J56k01K2J24l9k77J89k4k3j40K28l41j8J00K37jj47K4q0J33R3j59
5721f4n3q6K52O1j85J76j65j57J77K63q1j71m4J55l52M28P1k37j31J58o0L3N7
5744D5J33l03pK01K86k30n1J26Q6j79k13O7m68L06N01n02K15n9K51K6j04j71l70
5767d14M14k43Q2R8R5j76N16m83l3L77m66L4L78j50j91K68k19J87j58M8J4j07
5789a29K78l51L22j7k39J76J44k14K20n41K09p2J46L6J88j30R6k46P2k08O67j92
5811B15n10K49K6J01kj78L13k25J1l9j31J1K61j18k64K47l2K36l18j9J25J1J33
$$ plain form
5834 103 190 29 73 15 81 160 24 65 -215 23 90 -390 -47 -314 -28 34 42 16 415 -174 -171 -91 138 131 -230
5859 -230 -119 -65 77 27 54 -47 -182 -213 -97 -92 189 41 285 -149 248 -69 55 122 -91 97 -350 -186
5881 -186 37 141 -191 -167 129 -7 84 51 232 17 221 -88 -156 -137 104 71 -161 61 155 50 1 134 254
5904 254 -290 -185 280 15 192 306 267 -250 -2 37 169 -144 -53 -62 188 -191 28 -149 41 340 58 -130
5926 -130 39 204 -62 -279 266 -223 -172 -36 -184 90 -32 -38 -185 115 -32 24 -151 -268 211 78 -236
5947 -236 30 87 34 -227 -149 -99 57 227 99 228 95 -236 73 -119 150 13 41 333 7 -130 41 -70
5969 -70 21 36 -131 20 142 104 -224 99 181 -56 140 59 -15 -36 -101 -11 -107 -106 35 3 116 37 0 17 51 132
5995 132 180 -174 -162 -24 -136 204 51 -100 -222 61 33 -88 -111 -89 -68 11 -10 117 -51 -104 -33 -184 50
$$ packed form
5834A03Q7j61M4n8O6P9j36M1k80K38O7m80L43k67K86O2Qk6L99n89LQ0K29pl61
5859b30J11N4J42n0K7j01j35l1J16NK81j48K44m34L97l17J24O7k13J88m47J64
5881a86K23J04l32K4K96j36R1l3J81k15K04l09o8J9K41l3k32K22R4j05m9J33J20
5904B54n44J05M65k65J77J14l9n17K48L9J32l13R1rK50l79K19j77J90K99k82j88
5926a30J69J65k66k17N45m89N1J36j48K74j22oj47L00j47N6j75j17M79j33l14
5947b36K66N7n3k61P8N0J56J70j28J29j33l31L09j92K69j37K8K92l26j37J71j11
5969g0R1J5j67J51J22l8l28L23Q2k37J96q1p4k1o5R0r6JJ41l2J13p9l7J7L4Q1
5995A32M8l54J2J38j12L40j53j51j22K83k8j21k3K2K1P9k1J27j68n3P1j51K34
$$ plain form
6018 50 -35 -39 42 -32 -103 -211 -80 -31 193 -15 -58 12 85 95 -94 -189 -96 113 16 -70 -172 5 327 -160 297
6043 297 63 23 76 65 -239 -80 276 -26 175 53 190 -34 -50 -2 105 251 65 27 -74 -144 -85 -89 245
6066 245 -104 -113 39 93 224 33 113 179 171 -24 138 -135 63 -36 -47 -108 -47 -2 -39 90 -9 268 -135 -296 207
6091 207 232 9 66 64 -290 148 -21 156 211 276 205 -298 174 230 -56 86 -125 18 335 -202 -117 -235 226
6114 226 279 131 191 -174 17 -96 17 69 -64 62 -23 106 427 22 74 49 9 139 -46 14 109 -128 -70
6137 -70 -14 81 76 -223 25 25 -273 -214 15 -82 -202 23 192 -12 -287 152 -4 173 88 40 -68 -152 151 339
6161 339 -155 -23 65 -186 -191 -5 64 -19 -185 -49 199 -51 297 -211 27 -288 -144 147 -418 -223 98 151
6183 151 86 40 -97 -90 -70 306 162 -36 164 -15 -4 -53 247 -214 -171 178 -61 8 -29 44 -280 24 135 12
$$ packed form
6018E0q5mQ1p4p1j08J31M9K24k08m3P0P3J0j89r5R3K09r7q6j02J77L22m87M57
6043B97k34m0N3j1l04J59L56l02K01j22J37k24j6M8J07J46j86l8j01p0N9mL34
6066B45l49rJ52N4J31j91Q0O6qj95J62k73J98r9j1o1O1M5l7J29r9K77m03j61N03
6091B07K5k23N7kl54M38j69J77N5O5p1n03M72N6k86J42k11J43L17n37Q5j18M61
6114B26N3j48O0l65J91j13J13N2j33J26q5J29L21m05N2k5m0J30j85O0R5k37N8
6137g0N6R5nk99K48%k98N9K29r7j20K25J69k04k75M39j56J77q5m8j08q4L03J88
6161C39m94J32Q8k51nJ86O9q3j66J36K48k50L48n08K38l15J44K91n65J95L21N3
6183A51o5m6j37PK0L76j44j98K00j79J1m9L00m61M3L49k39O9l7P3l24L04J11j23
$$ plain form
6207 12 -101 -64 -198 172 -144 -6 -32 167 -62 154 2 160 -6 -102 -192 -35 -140 -148 276 99 217 -82
6229 -82 -24 111 -70 -12 78 -28 -273 -5 -204 -266 66 192 49 -274 30 -184 -72 130 -7 -11 44 -297 -100
6252 -100 -20 61 -210 49 -18 -38 -69 -73 146 50 191 -34 -295 -53 -64 183 126 -53 80 195 -166 91 128 66
6276 66 -205 -71 -193 -41 72 168 -53 -115 -113 30 -8 163 -48 105 -146 -54 -29 134 27 -38 117 -166 176
6299 176 68 -186 -11 37 18 126 -50 -247 -272 119 12 -105 -139 -17 -17 -128 -44 401 18 -68 107 -71 -90
6322 -90 229 -146 -156 15 -46 -169 81 -17 64 39 14 20 -91 218 73 326 -107 113 -84 -163 142 -32 -145
6345 -145 282 -108 -152 -49 -27 39 -64 105 225 -30 61 39 159 162 36 -32 55 -123 -93 86 -139 -65 -254 -236
6369 -236 -25 178 -43 -33 -45 0 72 228 -118 -87 143 -82 -137 -34 -160 -165 -189 -155 -73 -17 379 159 -27 137
$$ packed form
6207A2j13L7j34L70l16J38k6J99k29K16j52J58j66r6r0J57j05qM24j77J18k99
6229h2N8J35j81N8R0j06k45K68j99o2L32J26j43l23L04k14J12K02j37mN5l41J97
6252a00Q0Q1k71K59o7k0l1mK19r6J41k25k61K42j1K47n7j79J33J15l61K57L7o2
6276F6k71J34j22J52J13R6k21o2KJ43l8J71k11J53k51R2K5J63j07o5J55k83L42
6299A76j08k54J75M8j9J08j76j97k5L91j07j17l4J22%j11Q4M45l83q6J75j78j9
6322i0L19l75j0J71o1j23K50r8Q1k5k5Oj11L09j45K53m33K20j97p9L05j74j13
6345a45M27l90m4J03K2O6j03J69J20k55R1k2J20Lj26o8Q7j78L0J79k25P4j89J8
6369b36K11K03k21J0j2M5P2J56l46L1K30k25n5J03j26nk4L4Q2N6L96k20j86J64
$$ plain form
6393 137 -25 145 -19 84 150 72 101 186 3 -158 79 -38 145 95 19 -49 119 -179 133 -86 -123 -54 186
6416 186 -159 84 267 39 199 83 -164 73 -80 111 -156 -49 -62 20 -207 -100 71 -18 42 154 18
6437 18 -158 90 186 -26 -240 -136 71 10 -26 -313 -166 -32 -265 77 -236 -228 -60 140 229 70 -19 -19 92
6460 92 1 -113 40 -55 6 -76 -83 -117 81 -154 -28 243 -32 130 93 -133 -22 124 111 -150 189 -113 51
6483 51 -183 -6 -20 -122 -8 94 31 48 120 14 265 -5 -248 127 -78 28 201 91 -218 -340 -22 -255
6505 -255 84 164 -233 91 -13 18 -183 -259 137 -3 55 -95 -338 -135 -193 110 150 -36 -131 2 90 111 -23
6528 -23 101 24 -165 39 177 -2 48 147 -16 180 -122 -71 88 120 117 -61 -27 -62 37 104 -8 -152 58 -259
6552 -259 -103 -96 -365 72 -115 169 160 -30 119 175 47 299 297 9 267 -7 51 80 66 336 37 84 -82 170
$$ packed form
6393A37j62J70j64J03O6p8K9Q5j83j61K37j17J83n0p6o8J68k98L12k19l7O9K40
6416A86l45K43J83k28J60j16k47K37j53J91k67J07j3Q2k27J07J71q9O0J12j36
6437A8j76K48R6k12k14J04K07o1l6k87J47J34k33L42l13QJ68K00Q9j59q9%J11
6460I2r1j14J53r5O1q2pl4J98k35J26K71k75J62l7k26J11J46j3k61L39l02J64
6483E1k34J77j4j02J14J02o3J7P2j06K51k70k43L75k05J06J73j10l09j22L18k33
6505b55L39Q0l97L24j04L1k01p6L96j40N8j50k43K03n8L03M0j86r5J33Q8K1j34
6528b3J24p7j89K04J38j79N0R9j63J96l02N1J59L2lj78L4l5R9O7j12j44K10l17
6552b59J56Pk69M37j87K84rj90J49N6j28K52kk88K58k74N8K9j4K70k99M7j66K52
$$ plain form
6576 170 -80 -49 -43 173 -125 0 79 -1 -194 -26 -9 35 -149 144 -454 274 -294 -17 -156 85 -255 -77
6598 -77 100 -246 261 -238 46 103 96 146 98 -29 18 -57 185 252 76 -24 92 90 16 47 -306 91 113 -199 -108
6623 -108 -95 -196 9 139 17 -94 -16 -235 -108 -67 -279 -162 201 53 219 16 -34 -82 -28 -121 -132 -25 -71
6646 -71 116 91 -152 -154 -70 -73 -65 -282 -120 -81 98 -120 87 61 7 63 232 -3 -271 21 -283 -44 -125 18 -22
6671 -22 -185 -72 256 88 97 75 -97 280 36 51 267 -71 92 145 196 231 131 -159 -176 -81 75 77 367 345
6695 345 -206 -343 29 12 -40 -2 27 100 91 -119 28 -24 22 22 -107 86 -83 -66 -251 -36 130 -22 -171 -48
6719 -48 -364 26 -3 -252 -161 49 29 -241 111 144 215 -90 -10 -50 -94 64 -55 -94 30 -107 134 51 51 93 19
6744 19 297 -196 -45 25 80 24 -196 -39 -53 52 -55 -306 -86 -12 -341 37 -40 -42 237 61 -121 -49 -56 -24
$$ packed form
6576A70k50L1OK16k98J25P9q0j93J68J7M4j84K93n98P28n68K77j39K41l40J78
6598g7J77l46N07m99K84N7pN0m8j27M7p5K42O7j76j00J16kp4L1l53L97K2l12R1
6623a08J3j01K05J30j22j11P8k19J27M1k12J17L63j48J66k03n0m8N4r3j1J07m6
6646g1J87k5k43kQ4lQk17J62L9J79k18K07k6n4N6J69k35k68K92l04K39q1J43m0
6671b2j63J13L28j68Rk2j72L77k44J5K16l38J63N3N1L5j00k90j7R5J56KK90k2
6695C45n51j37L72j7n2L8K9P3rk10J47n2M6%j29J93j69J7j85K15J66j52j49J23
6719d8l16L90k9k49R1K10k0k70L52L3P1l05Q0m0m4J58j19l9J24j37K41q3%M2p4
6744A9K78m93J51P0N5n6k20J57j4J05j07k51K20P4l29L78p7kK79j76j82P2pL2
$$ plain form
6768 -24 87 -137 -231 -67 -129 3 -8 -86 -184 25 144 -97 -123 100 -286 -65 -34 425 -8 145 178 -333 -96
6791 -96 -220 92 -76 -75 218 139 -151 24 -71 116 18 121 -49 -76 -114 -57 48 -181 -23 19 -3 196 -11 60
6815 60 -125 186 -251 -63 -302 -323 -241 112 -44 112 30 85 12 -72 -83 -348 48 -33 256 9 -94 66 184
6838 184 78 0 -39 111 -142 -39 108 10 137 -68 169 140 -48 -192 179 186 -149 19 -68 257 115 -72
6860 -72 311 -42 58 25 61 78 -22 -77 44 -234 56 -145 15 144 -35 -122 -41 -194 -311 -401 -182 123 -2
6883 -2 -34 133 125 144 -109 -207 -55 110 89 111 -8 81 87 83 -63 30 60 275 55 -183 -112 75 196 16 -153 -46
6909 -46 92 126 154 7 -107 -39 -32 -153 -65 55 -100 -127 290 56 -59 77 -112 -217 192 42 -2 -9 20 -322
6933 -322 34 -24 -19 98 31 -140 -51 155 -330 -44 -264 262 -105 29 -4 -50 177 107 163 20 -10 -186 -179 -32
$$ packed form
6768b4J11k24r4J64o2J32j1p8r8K09J19k41k6K23l86K21L1M59m33J53L3n11K37
6791i6j24L12j68JK93p9k90J75r5J87r8J03j70k7l8N7J05k29J58M2k2J99k07P1
6815F0j85L11m37J88k39k1Q2L53j56J56q2N5p3q4j1k65L96q1K89k47j03J60J18
6838A84j06p8l9J50k53J03J47r8J27k05K37k9j88j44L71Pl35J68q7L25j42j87
6860g2L83l53J00l3L6J7j00n5J21k78K90k01J60J29j79q7Q1j53j17r0K19L05j25
6883bl2J67qJ9k53r8J52J65k1K2j19Q9Omj46R3L0K15k20k38P1J87J21j80j69J07
6909d6J38L4K8j47j14O8Pj21Q8J20j55k7M17k34j15J36j89j05M09j50m4pK9l42
6933c22L56n8NJ17o7j71Q9K06m85K86k20N26l67J34l3m6K27p0N6j43l0j76PJ47
$$ plain form
6957 -32 151 56 171 197 -59 85 -95 56 -353 -106 -156 172 -30 -37 79 149 -228 -553 14 -216 4 -151
6979 -151 25 -76 -178 50 -129 -214 -145 -117 -98 78 60 115 -33 101 144 100 -157 -66 -118 -194 -60 88 38 28
7003 28 260 -131 -70 -471 166 -165 158 0 136 83 -126 46 164 -113 133 -144 -145 137 191 27 -140 234
7025 234 95 85 53 28 -148 252 -4 -44 -23 168 171 85 42 -193 -62 58 3 -43 -126 -118 111 -169 -300 -137 61
7050 61 29 38 281 -275 -197 -40 -180 71 -114 -35 -57 -164 49 -134 27 0 -62 6 -183 174 227 35 -208 -79
7074 -79 -97 10 7 90 -69 229 294 -215 128 26 62 0 -20 228 -128 -157 88 84 14 38 35 -201 27 60 -140 67
7100 67 227 71 85 278 -98 28 23 160 -40 33 89 7 134 238 -168 112 -150 17 96 -178 35 -251 -282
7123 -282 -117 169 255 -32 344 27 76 9 2 -156 60 -13 17 -326 -111 -92 -167 -93 43 201 10 -208 118
$$ packed form
6957c2J83r5J15K6k56J44j80J51m09K47n0L28k02pJ16P0l77l25N67k30K20j55
6979a51J76j01j02K28j79q5O9K8J9J76j8N5j48J34M3m4k57R1n2p6J34J48n0j0
7003B8K32l91O1m01O37l31L23j58J36n3k09J72J18k77K46k77jK82N4j64j67L74
7025B34j39j0l2k5j76M00k56m0K1J91Lq6m3k35J31J20n5m6q3QK29k80j31J63J98
7050F1l2RK43n56P8J57j40K51j85P9k2j07K13j83J61k7o2O8j89L57N3j92k43J29
7074g9j8J07lQ3j59K98O5n09L43j02L6o2k0K48l56k9K45mp0K4lk36K28L3k00K07
7100F7J60j56J4J93l76J26nJ37k00P3N6q2J27J04m06K80k62J67P9k74K13k86l1
7123b82J65K86Q6k87L76l17M9o7pj58K16p3L0l43K15J9p5P4J36J58j91k18L26
$$ plain form
7146 118 32 68 -252 -19 43 188 425 173 211 -231 115 175 -126 96 145 -105 7 15 -28 91 -124 37 -30
7169 -30 -64 185 42 407 -30 -82 154 192 96 -105 149 227 -51 49 55 -36 -2 -190 -277 28 9 149 -84 -26
7193 -26 -40 16 -66 75 126 26 124 245 107 -49 351 -64 -99 -132 -110 73 111 -174 92 156 147 60 -122 151 79
7218 79 -119 212 8 -18 92 -87 115 -261 141 34 127 37 -200 -108 88 -334 -209 -208 292 -9 -154 93
7240 93 155 132 163 -62 -96 64 34 -74 -68 -36 4 -68 -85 -28 -103 -39 127 125 35 159 126 -373 4 270 -229 -20
7266 -20 -67 -10 79 296 183 -400 66 -127 7 -53 -206 -178 -73 -33 -264 -171 -91 95 77 52 -184 -211 144 -3
7290 -3 -69 -252 -111 -306 -55 153 14 -146 163 168 73 -161 -102 -71 214 -218 -187 151 70 73 -44 -155 -76 -33 97
7315 97 -86 -123 0 104 -214 -88 290 -219 99 43 295 -95 201 -152 -116 -23 155 67 -315 -4 106 -112
$$ packed form
7146A18q6L6l20K33O2J45K37k52L8m42L46O0l01K22M9k50J12Qm3J19k15J61o7
7169c0l4K49j43L65m37n2K36L8r6k01K54P8k78J00Or1L4j88q7L05j9J40k33N8
7193b6j4N6q2J41N1j00R8J21j38j56M00m15l5l3K2J83L8k85K66O4rq7j82K73p2
7218G9j98L31k04k6J10j79K02l76M02j07R3r0k37R2J96m22J25JN00l01j45K47
7240I3O2k3L1k25l4J60l0j08OL2M0p2j7N7p5O4J66kr0J24l3m99L77K66m99K09
7266b0m7N7Q9K17j13n83M66j93J34o0j53K8J05M0k31R3Q0J86j8k5k36k7L55j47
7290co6j83J41j95K51K08j39j60L09Nr5k34N9L1K85m32L1L38q1Lj17j11P9M3J30
7315I7j83l7J23J04l18J26L78n09L18n6K52l90K96l53L6R3J78q8l82L11J10k18
$$ plain form
7337 -112 58 -295 -298 60 -31 -143 -38 -55 33 -15 56 139 -25 15 301 45 223 89 83 -101 -126 107 57 -11 -77
7362 -77 96 -39 -155 -19 -65 48 -59 126 255 -90 -83 -71 -164 41 58 162 86 3 -164 -221 -180 34 -47 -229
7386 -229 133 133 -43 80 -203 -10 -240 274 176 167 204 59 -7 70 -10 131 -28 -10 95 -69 33 -70 -84 168
7410 168 -22 13 -51 -65 57 42 42 70 -8 1 20 -86 -283 -158 -96 -73 -163 -62 -11 -17 -253 83 -59 -343 20 -99
7436 -99 66 132 -112 59 89 24 -208 63 -309 -303 -62 -81 -80 -91 -138 -225 -39 -28 213 89 -78 117 58 -100 90
7461 90 -171 241 62 80 252 307 -92 -65 77 88 26 2 232 -13 -74 8 -11 -62 2 -191 -78 56 -39 134
7485 134 -107 211 -76 250 -158 -227 305 45 -71 86 23 176 134 -89 -74 112 32 -196 88 -223 41 56
7507 56 72 -76 255 145 120 344 106 -67 212 207 181 -23 29 -266 -137 -248 56 -44 -203 101 -23 160
$$ packed form
7337a12J70l53lL58r1j12J05j7Q8m8P1Q3j64M0K86k56J78j34oj84k5K33n0o8o6
7362g7J73j35j16J36m6J13j07J85J29l45PJ2r3K05J7J04p6q3j67n7M1K14q1j82
7386b29L62%j76J23k83J93k30N14r8rL7j45o6P7q0J41j59J8J05j64J02j03j4K52
7410A68j90L5o4j4J22j5%K8p8RJ9j06j97J25O2K3r0J01N1ok36L36j42k84L63j19
7436i9J65O6k44J71L0o5k32K71l72OK41j9Jj1m7q7J86J1K41j24j67J95n9j58J90
7461I0k61M12j79J8J72N5l99K7J42J1o2k4K30k45o1Q2j9n1O4j93J13J34r5J73
7485A34k41L18k87L26m08o9N32k60j16J57o3J53m2k23J5J86q0k28K84l11K64J5
7507E6J6j48L31j10k5K24k38j73K79nk6k04N2k95J29j11L04j00j59L04j24J83
$$ plain form
7529 160 -14 128 -67 29 -143 -134 69 77 66 -23 20 166 71 -66 37 -110 -440 -102 -67 62 102 102 126 97 87
7554 87 62 54 -1 -150 -97 20 18 33 -170 -193 -152 92 -47 -36 -10 -106 210 -17 -209 -258 90 -218 106 -205 -169
7579 -169 305 -278 -173 35 30 -9 -143 -110 -110 -151 -107 -282 -59 131 -64 120 82 2 -145 -26 -174 -173 -201 219
7603 219 117 -105 156 254 -254 -237 -99 -235 -78 222 176 96 -17 -57 -172 222 189 79 24 -45 -11 50 -84
7626 -84 135 79 254 307 59 -373 101 -135 -80 209 93 -124 186 -44 -146 -7 -233 202 -14 -36 -252 -60
7648 -60 -66 -173 -18 -191 -19 -211 221 0 -102 49 -86 -280 -19 -10 158 122 39 72 -242 78 -27 -45 6
7671 6 -3 68 -79 5 177 -171 -237 -104 -64 3 -60 -82 215 193 -191 -143 72 -77 -93 -94 1 -94 -45 84 -3 205 -287
7698 -287 53 189 -243 154 56 105 -208 -279 185 66 19 -38 -164 -192 -20 -91 -14 106 4 -148 -67 22 73 69
$$ packed form
7529A60j74J42j95R6j72RK03Qj1q9M3J46r5j37J03j47l30L38L5J29M0%K4k9j0
7554H7k5qn5j49N3J17kJ5k03k3M1K44j39J1K6r6L16k27j92m9L48l08L24l11L6
7579a69M74n83J05K08nl9j34L3%m1M4j75K23J90j95J84l8q0j47J19j48Jk8M20
7603B19j02k22K61R8n08J7J38j36J57L00m6q0j13m0j15L94l3j10n5o9L4O1j34
7626h4K19n6J75N3k48m32M74k36N5K89j16k17L10k30j02J39k26M35k16k2k16J92
7648f0oj07J55j73J72j92M32k21j02J51j35j94K61RJ68l6q3L3l14L20j05j8N1
7671FrP1j47Q4J72l48o6J33M0O7o3k2K97k2l84M8K15j49j6jR5r5M9J29q7K08m92
7698b87L40J36m32L97r8M9l13p1M64j19m7n7j26k8J72p1P7J20j02j52Q1Q9N1m
$$ plain form
7722 69 -111 -36 22 9 41 -128 -19 107 -20 -62 -86 -38 154 104 344 -103 -45 58 -121 -191 18 74 88 28 -21
7747 -21 -322 2 -18 -129 -30 132 66 125 52 -350 -45 -12 158 189 -44 -102 -122 -135 -80 162 -310 83 -20 61
7771 61 78 -28 36 -19 -80 102 -182 6 157 -23 78 20 92 23 19 -22 45 109 238 310 -196 75 252 211 57
7796 57 -105 79 169 103 -224 -301 22 -93 28 -13 -81 195 -54 137 34 105 20 21 -38 -72 4 -266 -166 320
7820 320 6 79 18 15 101 -90 149 146 157 -77 47 144 161 105 -145 322 57 37 -86 -99 -59 83 50 105 127 134
7846 134 -91 -125 25 -51 -29 -149 -5 -196 -138 -62 241 73 163 -218 -179 -58 180 133 -19 -68 -272 -1 -187
7869 -187 114 -178 252 163 2 -16 -173 316 -59 -145 30 -44 -89 159 -61 -205 196 39 122 132 55 -180 -194
7892 -194 -125 -280 -62 157 -424 -27 -49 174 217 -36 74 -28 -35 26 -124 -104 209 -13 5 -81 -70 -263 -84
$$ packed form
7722F9j80P5N8j3L2j69J09J26j27m2k4M8J92n0K40m47N8J03j79p0K09N6J4o0m9
7747b1l01L24k0j11R9J62o6N9p3m02L05L3J70L1k33n8k0j3N5K42m72L93j03Q1
7771F1J7j06O4n5o1J82k84J88J51j80J01n8P2o9mm1O7O4J29P2n06K71J77m1j54
7796E7j62J84R0o6l27p7L23j15J21m1o8K76k49J91j03P1q5Jn9l4P6k70J00M86
7820C20l14P3o1lQ6j91K39lJ1k34J24R7J7n6k50M67k65k0j23j3M0J42l3N5K2P
7846A34k25l4J50p6K2j20J44j91N8P6L03j68R0l81L9J21K38m7j52m9k04K71j86
7869a87L01k92M30q9j61j8j57M89l75q6J75p4m5K48k20j44M01j57Q3J0p7k35j4
7892a94O9j55K18K19n81L97k2K23M3k53J10j02pO1j50K0L13k22J8q6J1j93J79
$$ plain form
7915 -84 -26 45 -102 40 227 9 59 310 114 -7 17 187 -52 -179 99 17 248 -17 -19 -69 -133 -257 -131
7938 -131 28 -51 -206 279 63 -81 -149 -67 -81 -40 228 228 278 -151 -21 -136 -12 243 98 302 39 -28 53
7961 53 -184 109 155 127 13 -68 -211 120 20 84 257 6 186 -58 264 -109 59 -45 156 -141 -144 -212 54
7984 54 56 -11 -10 17 124 156 -94 136 -105 2 334 201 64 -67 19 372 170 -114 -91 -54 51 -187 -38 141
8008 141 -244 -36 80 226 -137 -111 84 -36 0 -69 53 -26 -10 -120 -8 12 30 -107 -142 249 341 -93 -10
8031 -10 -59 77 135 -117 49 -240 51 21 -107 -62 141 -175 -8 53 139 41 -244 -59 37 -239 119 22 176
8054 176 -25 -193 156 87 130 31 230 -109 -41 259 -137 34 -250 -62 -71 368 121 47 -210 -262 136 -111 93
8077 93 -107 19 23 -200 -157 -100 -228 -46 60 351 -263 72 111 264 -265 70 -93 -130 -64 -68 111 -104 -42 -261
$$ packed form
7915h4N8P1j47J42J87k18N0K51j96j21K4J70k39j27K78q2K31k65kn0o4j24J26
7938a31J59p9j55M85k16j44o8Q2j4M1K68%N0m29J30j15J24K55j45K04k63o7Q1
7961E3k37K93M6k8j14q1j43L31j00O4J73k51J80k44L22l73J68j04K01k97lo8K66
7984E4Ko7JK7J07L2k50K30k41J07L32j33j37j31Q6L53k02k84K3L7J05k38J49J79
8008A41l85K08J16J46l63K6J95j20L6o9J22p9J6j10J12K0J8j37l5L91R2m34Q3
8031a0m9J36N8k52J66k89K91l0j28M5K03l16J67O1Q6r8k85J85R6k76L58r7J54
8054A76k01j68L49o9M3r9J99l39O8L00l96J71k84J88rM39k47p4k57n2L98k47K04
8077I3k00J26Mk23M3N7j28J82J06K91o14L35L9J53n29L35j63l7O6mJ79k15O2k19
$$ plain form
8101 -261 -182 -3 40 155 -114 -137 -116 -262 -145 -2 -212 -48 36 239 -151 -160 3 104 145 -98 -144 216 270
8124 270 -46 -128 70 133 131 -211 207 50 -99 -269 -74 39 -115 112 -2 107 -169 -147 156 282 153 -33
8146 -33 86 -100 72 -35 -80 48 29 67 14 -161 -87 198 216 -175 92 52 87 19 -126 91 50 -1 -93 -75 104
8171 104 -81 -181 -43 24 71 -263 -217 73 -264 131 -89 119 153 138 -136 -55 156 13 275 -177
$$ packed form
8101b61P9J79M3J15k69k3K1j46J17J43k10J64Q4K03l90rJ63J01M1k43m6L60N4
8124B70l16q2J98O3kl42M18j57j49j70J95J13j54K27j14J09k76K2L03J26j29j86
8146c3J19j86J72j07m5J28j9L8n3j75P4K85J8l91K67m0L5o8j45K17m1n1r2J8J79
8171A04j85j00J38O7M7l34M6K90l37L95k20K08L4j5k74Q1K11j43K62m52
8191a77
$$ Imaginary data points
##PAGE= N=2
##DATA TABLE= (X++(I..I)), XYDATA
$$ plain form
0 0 0 0 0 0 0 0 0 0 0 0 0 -8 8 -8 8 -16 16 -24 24 -32 36 -40 48 -61 72 -80 96 -112 128 -146 167 -190 215
33 215 -246 278 -311 350 -393 440 -489 545 -606 671 -743 822 -909 1003 -1107 1219 -1343
50 -1343 1479 -1630 1796 -1982 2190 -2425 2693 -2998 3356 -3774 4279 -4897 5678 -6691 8077
65 8077 -10089 13289 -19173 33612 -148716 -100832 148952 -103307 -126070 73222 76929 -45038
77 -45038 56820 92498 8591 16448 76622 6945 -25129 4529 -9096 -36263 -10818 -24338
89 -24338 -38800 -17297 -17253 -32040 -1333 -6476 -31881 14649 53775 2224 -2886 59326 51538
102 51538 5980 26059 31860 -7869 -9699 -1976 -42357 -55897 -28531 -29578 -37872 -13266 -2415
115 -2415 -1505 26632 43561 32112 36659 42263 22517 9437 8557 -11034 -24985 -19169 -26521 -38274
$$ packed form
0@%%%%%%%%%%%qJ6j6J6k4L2m0M8n6O8p6Q8j09J33j52J76k08K40k74L13l57M05
33B15m61N24n89O61p43Q33r29J034j151J277j414J565j731J912k110K326k562
50a343K822l109L426l778M172m615N118n691O354p130Q053r176J0575j2369J4768
65H077j8166K3378l2462N2785j82328M7884K49784k52259k2763J99292L707j21967
77d5038J01858L5678q3907P857O0174o9677l2074K9658j3625k7167K5445j3520
89b4338j4462K1503M4j4787L0707n143k5405M6530L9126n1551n110O2212p788
102E1538m5558K0079N801l9729j830P723m0381j3540K7366j047q294K4606J0851
115b415R10K8137J6929j1449M547N604j9746j3080q80j9591j3951N816p352j1753
$$ plain form
129 -38274 -22673 -9704 -13869 -5691 6841 4751 10613 21237 12713 7657 19372 18063 5494
142 5494 6999 7877 -1800 -4430 -4853 -15987 -20764 -18063 -23483 -23538 -10107 -6091 -7763 6495 22038
157 22038 21400 23236 30899 24234 14182 11966 2883 -11950 -16738 -20906 -30629 -29475 -17828 -14116
171 -14116 -11801 973 10759 12207 18439 25041 18976 13027 13913 9969 359 -3071 -5006 -12103 -13749
186 -13749 -9155 -11040 -15687 -11225 -6475 -7072 -3595 3090 3859 5512 14112 18415 16097 17288 16388 8960
202 8960 3224 1566 -7373 -18421 -19643 -19956 -23872 -20224 -10690 -7045 -1362 10813 17314 17828 22110
217 22110 23900 16027 9844 8912 1476 -8950 -11770 -13353 -17603 -15771 -10316 -10884 -9881 -2383 1286
232 1286 1631 6019 9005 6594 7754 12910 11477 8181 8809 7440 1575 -208 -2014 -9753 -15042 -14470
$$ packed form
129c8274J5601J2969m165Q178J2532k090N862J0624q524n056J1715j309j2569
142E494J505Q78r677k630m23j1134m777K701n420n5J3431M016j672J4258J5543
157B2038o38J836P663o665j0052k216r083j4833m788m168r723J154J1647L712
171a4116K315J2774R786J448O232O602o065n949Q86l944r610l430j935p097j646
186a3749M594j885m647M462M750n97L477O685P69J653Q600M303k318J191r00p428
202H960n736j658q939j1048j222l13l916L648R534L645N683J2175O501N14M282
217B2110J790p873o183r32p436j0426k820j583m250J832N455n68J003P498L669
232A286L45M388K986k411J160N156j433l296O28j369n865j783j806p739n289N72
$$ plain form
248 -14470 -14912 -16486 -12187 -6369 -2790 2947 11556 15696 16883 18169 16522 11619 6931 2590 -4847
263 -4847 -11731 -13748 -14518 -14442 -11843 -8619 -5835 -1185 4367 7175 7949 8726 7927 6394 5707 4543 1543
280 1543 -354 -576 -1543 -2005 -2156 -2731 -4987 -6307 -5784 -5291 -5494 -4774 -2949 -137 3443 6987 9162
297 9162 9818 9956 9481 6877 2995 -1639 -6463 -9673 -11065 -12026 -10611 -7987 -4994 178 5439 8861
313 8861 10250 10799 9506 6779 3999 1708 -2467 -5794 -7183 -7478 -6689 -5237 -3457 -1793 171 2080
329 2080 3073 3454 3152 2244 1761 2301 2451 2355 1806 1369 1169 1367 251 -2083 -4250 -5187 -6139 -6841 -6424
348 -6424 -5152 -3652 -390 3479 6572 9202 10189 9441 8355 6708 3153 -1606 -5243 -8383 -10695 -10371
364 -10371 -9209 -8025 -5234 -1109 2106 4692 7601 7910 6468 6615 5834 3395 1191 75 -1496 -2942
$$ packed form
248a4470m42j574M299N818L579N737Q609M140J187J286j647m903m688m341p437
263d847o884k017p70P6K599L224K784M650N552K808P74P77p99j533o87j164l000
280A543j897k22r67m62j51n75k256j320N23M93k03P20J825K812L580L544K175
297I162O56J38m75k604l882m634m824l210j392r61J415K624K993N172N261L422
313H861J389N49j293k727k780k291m175l327j389k95P89J452J780J664J964J909
329B080R93L81l02r08m83N40J50r6n49m37k00J98j116k334k167r37r52p02M17
348f424J272J500L262L869L093K630R87p48j086j647l555m759l637l140k312L24
364a0371J162J184K791M125L215K586K909L09j442J47p81k439k204j116j571j446
$$ plain form
380 -2942 -2414 -2839 -3911 -3980 -3686 -3966 -3883 -3068 -2995 -2342 -314 1935 3564 5305 6493 6863 6755 6109 4460
399 4460 1043 -1884 -4640 -6643 -7846 -7988 -7171 -6431 -4360 -287 3183 4370 5899 7863 6922 4695
415 4695 4467 2979 -844 -2431 -2182 -3926 -4321 -2294 -2757 -3790 -930 1128 -984 -908 1563 394 -741
432 -741 2023 2705 1019 2783 4384 1938 1505 3087 -355 -3581 -2241 -2724 -6111 -4964 -2314 -3670
448 -3670 -2240 2602 3599 2237 5471 6527 2864 2704 2974 -1132 -4313 -2522 -3114 -5862 -3630 -1238
464 -1238 -2197 -823 3103 2360 1772 3467 2795 510 694 959 -1318 -1700 -81 -543 -1213 -15 -265 -1068
482 -1068 -712 37 -866 -1235 -996 -920 -660 1169 2575 2774 2418 3276 3231 1674 355 -741 -2654 -4715
500 -4715 -4112 -3659 -5024 -3906 -141 473 939 4659 5810 3903 4340 5251 1642 -724 475 -2055 -5076
$$ packed form
380b942N28m25j072o9K94k80Q3Q15P3O53K028K249J629J741J188L70j08o46j649
399D460l417k927k756k003j203j42Q17P40K071M073L470J187J529J964r41k227
415D695k28j488l823j587K49j744l95K027m63j033K860K058k112P6K471j169j135
432g41K764O82j686J764J601k446m33J582l442l226J340m83l387J147K650j356
448c670J430M842R97j362L234J056l663j60K70m106l181J791n92k748K232K392
464a238r59J374L926p43n88J695o72k285J84K65k277l82J619m62o70J198k50q03
482a068L56P49r03l69K39P6K60J829J406J99l56Q58m5j557j319j096j913k061
500d715O03M53j365J118L765O14M66L720J151j907M37R11l609k366J199k530l021
$$ plain form
517 -5076 -2712 -2229 -4916 -2455 167 -1948 -524 2958 1104 -1460 2397 2593 -495 1797 4004 37
533 37 117 4228 1995 -1858 947 134 -4888 -3829 -1803 -5143 -5706 -717 -976 -2322 3334 5448 2497
550 2497 4326 7179 2993 485 2681 369 -4753 -3763 -1892 -4686 -5115 -1928 -1231 -721 1541 2015
566 2015 830 2080 2788 1298 879 1181 28 -146 1073 359 -669 600 559 -1500 -1593 -206 -1575
583 -1575 -2957 -1901 -1280 -1366 -92 1251 1866 2174 2818 2928 2604 1291 470 -867 -1819 -2529 -3072 -2464
601 -2464 -2479 -1663 -153 525 1048 2174 2201 1904 1757 1378 -473 -1357 -490 -1115 -2219 -885 124 -1006
619 -1006 -214 1354 496 562 1425 170 -1208 682 628 -1039 -275 1129 369 -117 1316 288 -899 285
637 285 -367 -2721 -1512 27 -2302 -1939 1716 1495 -34 2618 3919 1167 1878 2801 -604 -2229 -432
$$ packed form
517e076K364M83k687K461K622k115J424L482j854k564L857J96l088K292K207l967
533C7Q0M111k233l853K805q13n022J059K026l340n63M989k59j346N656K114k951
550B497J829K853m186k508K196k312n122R90J871k794m29L187O97N10K262M74
566B015j185J250P08j490m19L02j153j74J219p14j028J269m1k059r3J387j369
583a575j382J056O21q6J274J343O15L08O44J10l24j313q21j337r52p10n43O08
601b464j5Q16J510O78N23J126K7k97j47l79j851q84Q67o25j104J334J009j130
619a006P92J568q58O6Q63j255j378J890n4j667P64J404p60m86J433j028j187J184
637B85o52k354J209J539k329L63L655k21j529K652J301k752P11R23l405j625J797
$$ plain form
654 -432 -2112 -4076 -2021 -1388 -3205 -1209 1710 612 603 3266 2335 508 2157 2386 -489 -297 858
671 858 -741 -2030 236 -624 -1957 -800 -377 -1741 -1611 -311 -1351 -992 733 954 691 2448 3128
688 3128 1946 2448 2492 1080 -613 -543 -1317 -2912 -2829 -2605 -2705 -2041 -689 21 838 1917 2507 2016 2256
707 2256 2031 1426 353 109 -318 -932 -952 -1017 -907 -1366 -964 -365 -585 -762 -420 -382 -87 295 753 709 644
728 644 1511 1246 1138 1105 765 -439 -539 -901 -1669 -1920 -1769 -1507 -1683 -268 575 286 1456 1988 1520 1620
748 1620 1653 447 -433 -379 -867 -1687 -1321 -952 -797 -749 170 820 148 841 966 327 -83 254 -122 -297 211
769 211 17 -446 349 279 26 -324 114 -134 -881 -635 -271 -881 -298 405 408 530 1343 1389 753 546 256 -492
791 -492 -739 -1288 -1464 -1684 -1193 -982 -497 243 1210 1289 1501 1585 1597 922 749 145 -265 -746 -1220 -1120 -1502
$$ packed form
654d32j680j964K055O33j817J996K919j098rK663r31j827J649K29k875J92J155
671H58j599j289K266q60j333J157M23j364J30J300j040L59J725K21k63J757O80
688C128j182N02M4j412j693P0p74j595Q3K24j00O64J352P10Q17J079N90m91K40
707B256k25o05j073k44m27o14k0o5J10m59M02N99k20j77L42L8K95L82M58m4o5
728F44Q67k65j08l3l40j204j00l62p68k51J51K62j76J415Q43k89J170N32m68J00
748A620L3j206q80N4m88q20L66L69J55M8R19O50o72O93J25o39m10L37l76j75N08
769B11j94m63P95p0k53l50M38k48p47K46L64o10N83P03LJ22Q13M6o36k07k90p48
791d92k47n49j76k20M91K11M85P40R67P9K12Q4J2o75j73o04m10m81m74J00l82
$$ plain form
812 -1502 -1035 -926 -668 -526 -27 249 97 411 674 535 696 939 1006 778 853 785 460 -70 -314 -702 -1249
833 -1249 -1342 -1578 -1696 -1214 -1021 -305 -27 1253 1674 1945 1929 1901 1507 1098 170 -437 -829 -1254 -1613 -1835 -1650
854 -1650 -1283 -621 -469 -50 393 707 712 430 955 795 928 683 569 384 92 297 -92 -365 -674 -768 -1326
875 -1326 -1414 -1117 -888 -734 -251 266 373 830 1772 1685 1312 1425 834 -7 -288 -471 -1285 -1173 -1076 -1461 -807
896 -807 -278 14 -1 609 1226 493 260 931 300 134 376 -108 -729 -183 83 -411 -192 242 -391 -612 -158
917 -158 -383 -734 -467 122 -104 534 935 520 375 801 711 -354 85 -141 -1161 -826 -429 -1126 -942 256
937 256 316 -29 1104 1161 680 619 793 210 -359 39 -862 -1138 -987 -389 -1031 -411 73 -35 440 704 428
958 428 600 899 422 277 321 385 -313 -86 55 -458 -689 -152 -471 -938 -525 -740 -811 -420 231 270 905 902
$$ packed form
812a502M67J09K58J42M99K76j52L14K63j39J61K43O7k28P5o8l25n30k44l88n47
833a249r3k36j18M82J93P16K78J280M21K71j6k8l94m09r28o07l92m25l59k22J85
854a650L67O62J52M19M43L14Nk82N25j60J33k45j14j85k92K05l89k73l09r4n58
875a326q8K97K29J54M83N17J07M57R42q7l73J13n91q41k81j83q14J12R7l85O54
896h07N29K92j5O10O17p33k33O71o31j66K42m84o21N46K66m94K19M34o33k21M54
917a58k25l51K67N89k26O38M01m15j45M26r0j065M39k26j020L35L97o97J84J198
937B56O0l45J133N7m81o1J74n83n69L98r01k76J51N98o42O20M84j08M75K64k76
958D28J72K99m77j45M4O4o98K27J41n13k31N37l19m67M13k15p1L91O51L9O35l
$$ plain form
980 902 861 1423 1295 892 431 589 -113 -899 -779 -1561 -1764 -940 -820 -722 -256 612 403 615 1339 914 592
1001 592 996 471 -95 278 381 -332 -547 -191 -572 -1182 -450 -403 -907 -515 159 -581 -355 829 995 294
1021 294 1252 1725 371 519 1127 -143 -912 -278 -691 -1946 -882 -613 -1108 -643 421 195 142 1019 1109
1040 1109 767 628 776 236 -406 260 -81 -506 -548 -124 -395 -323 32 -57 80 129 -286 -93 396 504 191
1061 191 320 775 519 251 808 327 -369 -434 -313 -426 -707 -308 -709 -560 -283 197 410 246 827 714
1081 714 477 161 279 -348 -263 -527 -403 -680 -593 243 255 -4 534 378 119 409 336 54 57 312 -75 -981
1103 -981 -152 -141 -379 -501 36 41 -127 293 -23 -314 93 40 -64 351 741 192 149 919 256 -385 234 -46
1125 -46 -872 -596 -510 -767 -1010 -64 104 -371 648 715 459 741 1074 746 102 217 -76 -590 -624 -383 -857
$$ packed form
980I02m1N62j28m03m61J58p02p86J20p82k03Q24J20R8M66Q68k09K12P24m25l22
1001E92M04n25n66L73J03p13k15L56l81o10P32M7n04L92O74p40K26J184J66p01
1021B94R58M73j354J48O08j270p69O34m13j255J064K69m95M65J064k26n3Q77R0
1040A109l42j39J48n40o42O66l41m25m2M24k71P2L55q9J37M9m15J93M89J08l13
1061A91J29M55k56k68N57m81o96o5J21j13k81L99m01J49K77M80K13j64N81j13
1081G14k37l16J18o27Q5k64J24k77Q7Q36J2k59N38j56k59K90p3k82LK55l87r06
1103i81Q29J1k38j22N37Nj68M20l16k91M07n3j04M15L90n49m3P70o63o41O19k80
1125d6q26K76Q6k57k43R46J68m75J019O7k56K82L33l28o44J15k93n14l4K41m74
$$ plain form
1146 -857 -712 24 -237 -423 179 169 -270 107 505 102 -51 753 270 250 426 483 155 -152 17 -336 -856
1167 -856 -710 -514 -830 -542 -32 -419 -399 604 964 486 947 1073 187 192 12 -359 -352 -421 -526 -792 -651 -366
1189 -366 -252 -345 99 627 474 182 369 270 38 324 553 116 238 172 267 63 -198 -431 -526 -47 -63 -316
1211 -316 -462 -110 -451 94 246 151 344 571 638 174 -47 138 -180 -291 -489 -440 -598 -305 -292 2 164
1232 164 273 289 464 74 256 86 -160 -83 -364 -346 166 -197 -41 -263 263 74 320 596 156 44 199
1253 199 94 -79 233 274 -94 -139 49 176 -105 -198 -134 -430 -206 -339 -227 -267 7 260 -36 412 461 444
1275 444 115 107 106 24 -334 -407 -469 -706 -277 -352 -344 -112 91 396 505 269 587 138 361 365 67 -92 121 -116
1299 -116 -283 69 -153 -177 -294 -250 -202 -236 -163 -37 144 126 254 285 555 678 567 449 201 93 -256 -263 -506
$$ packed form
1146h57J45P36k61j86O02j0m39L77L98m03j53Q04m83k0J76N7l28l07J69l53n20
1167h56J46J96l16K88N10l87K0J003L60m78M61J26q86Nj80l71Po9j05k66J41K85
1189c66J14r3M44N28j53k92J87r9k32K86K29m37J22o6R5k04k61k33r5M79j6k53
1211c16j46L52l41N45J52r5J93K27O7m64k21J85l18j11j98M9j58K93J3K94J62
1232A64J09J6J75l90J82j70k46P7k81J8N12l63J56k22N26j89K46K76m40j12J55
1253A99j05j73L12M1l68m5J88J27k81r3O4k96K24j33J12m0K74K53k96M48M9j7
1275D44l29qjq2l58p3o2k37M29p5QK32K03L05J09k36L18m49K23Mk98j59K13k37
1299a16j67L52k22k4j17M4M8l4P3J26J81j8J28L1K70J23j11j18k48j08l49pk43
$$ plain form
1322 -506 -459 -676 -435 -439 -290 57 404 302 586 518 57 715 293 187 -87 173 8 -323 -51 -339 -69
1343 -69 -403 -262 94 203 -102 -342 -114 122 8 172 75 250 12 514 302 177 152 189 -25 -88 -63 -404
1365 -404 -160 -555 40 4 -109 90 37 327 225 137 -57 -102 75 -9 201 -145 -166 -157 11 -132 149 379 268
1388 268 -110 286 48 -99 -131 -115 -237 -47 62 41 -259 144 236 105 -122 51 -126 -240 103 -99 -25 -153
1410 -153 278 374 275 332 38 -94 -17 79 -187 -266 30 -220 -197 -23 5 101 158 119 577 485 199 46 -104 57
1434 57 -167 -180 -358 -163 -344 -192 -337 -132 128 -61 51 24 214 11 219 -3 -18 160 367 280 -73 158
1456 158 244 -79 -315 -327 -167 -530 -284 -355 -251 186 381 345 427 768 434 460 606 59 66 213 -449 -278 -386
1479 -386 -43 -537 -333 368 12 -197 120 63 44 60 219 -87 -154 4 10 -218 303 406 -206 -243 166 139 -139
$$ packed form
1322e06M7k17K41mJ49L47L47j02K84o8m61O58m22j06k74K60j65l31K72k88K70
1343f9l34J41L56J09l05k40K28K36j14J64r7J75k38N02k12j25k5L7k14o3K5l41
1365d04K44l95N95l6j13J99n3K90j02q8j94m5J77q4K10l46k1RJ68j43K81K30j11
1388B68l78L96k38j47l2J6j22J90J09k1l00M03R2j31k27J73j77j14L43k02P4j28
1410a53M31R6r9N7k94j32P7R6k66p9K96k50K3J74K8R6N7l9M58r2k86j53j50J61
1434E7k24j3j78J95j81J52j45K05K60j89J12k7J90k03K08k22j5J78K07q7l53K31
1456A58Q6l23k36j2J60l63K46p1J04M37J95l6Q2L41l34K6J46n47PJ47o62J71j08
1479c86L43m94K04P01l56k09L17n7j9J6J59l06o7J58Ok28N21J03o12l7M09k7k78
$$ plain form
1502 -139 8 71 -451 290 208 -236 164 211 166 -16 228 74 -117 4 67 -158 0 -185 -175 -18 -170 -2
1524 -2 -178 250 289 209 319 163 -84 -375 139 -40 -157 -153 -36 46 89 62 87 38 -24 52 -9 -111 -155 54 131
1549 131 165 8 -93 227 -60 -102 -95 -185 45 -41 -118 -420 82 61 -4 125 176 154 58 269 -56 7 187 -302
1573 -302 -369 -161 -275 -425 -186 -118 -126 27 -73 342 279 416 92 177 -13 51 -32 -68 -60 -181 -46 180 -65 -60
1597 -60 27 -50 -254 -135 -152 -95 -35 297 274 241 82 119 2 132 -49 -145 -141 -40 -232 -398 -68 -98 -238 -24
1621 -24 326 87 -18 215 108 3 249 252 -28 11 210 27 71 140 92 -28 88 -34 -199 -114 -170 -105 -207
1644 -207 -131 7 55 141 160 84 38 212 183 -96 -172 21 -213 -149 86 8 -495 219 -304 -106 -134 157 15 -66
1668 -66 251 205 -10 4 16 -395 -14 -73 -82 -41 -298 -34 290 -7 48 -292 -376 -160 -108 -53 -106 -59 -46 148 218
$$ packed form
1502a39J47O3n22P41q2m44M00M7m5j82K44j54j91J21O3k25J58j85J0J57j52J68
1524bj76M28L9q0J10j56k47k91N14j79j17MJ17Q2M3k7K5m9o2P6o1j02m4K09P7
1549A31L4j57j01L20k87m2Pr0K30q6p7l02N02k1o5J29N1k2r6K11l25O3J80m89
1573c02o7K08j14j50K39O8qJ53j00M15o3J37l24Q5j90O4q3l6Qj21J35K26k45N
1597f0Q7p7k04J19j7N7O0L32k3l3j59L7j17J30j81r6MJ01j92j66L30l0j40K14
1621b4L50k39j05K33j07j05K46Lk80L9J99j83M4O9m8j20J16j22j65Q5n6O5j02
1644b07P6J38M8Q6J9p6m6J74k9k79p6J93k34O4K35p8n03P14n23J98k8K91j42q1
1668f6L17m6k15J4J2m11L81n9rM1k57K64L24k97N5l40q4K16N2N5n3M7J3J94P0
$$ plain form
1693 218 79 -172 -28 173 -54 14 -221 33 34 56 333 165 36 24 -65 -210 344 -177 -175 58 -12 56 -132
1716 -132 -6 53 -141 45 404 105 47 45 202 -70 -14 -24 -37 -190 -351 -4 -117 -200 -106 1 -45 182 -27
1739 -27 227 236 -114 -98 7 -21 19 31 162 -150 -7 189 -144 -223 -44 -150 -78 -21 116 91 -65 157 206 147
1763 147 335 376 223 -39 80 7 48 31 -14 -252 29 186 109 -8 -60 13 219 -184 -52 75 -42 282 13
1786 13 -59 -173 152 235 -4 74 -239 -13 218 -146 -184 32 -267 169 85 -107 286 -66 -29 -1 196 0 -62
1809 -62 -273 24 -328 -97 -248 69 9 -67 69 138 -238 -212 182 -84 -33 -310 42 208 50 112 -113 191
1831 191 241 189 -127 -43 41 -350 -120 69 -124 34 -65 215 37 -41 112 36 -191 118 62 -71 -163 -167 -26 44
1855 44 196 34 -81 22 69 59 -351 -213 67 219 -416 -157 216 -11 -160 50 -16 239 60 -98 -263
$$ packed form
1693B18j39k51J44K01k27O8k35K54JK2K77j68j29j2q9j45N54n21KK33p0O8j88
1716a32J26N9j94J86L59k99n8kJ57k72N6j0j3j53j61L47j13q3R4J07m6K27k09
1739b7K54Rl50J6J05k8M0J2J31l12J43J96l33p9J79j06P2N7J37k5j56K22M9n9
1763A47J88M1j53k62J19p3M1j7m5k38K81J57p7j17n2P3K06m03J32J27j17L24k69
1786A3p2j14L25Q3k39P8l13K26K31l64l8K16k99M36q4j92L93l52L7K8J97j96o2
1809f2k11K97l52K31j51L17o0p6J36O9l76K6L94k66N1k77L52J66j58O2k25L04
1831A91N0n2l16Q4Q4l91K30J89j93J58r9K80j78p8J53p6k27L09n6j33r2mJ41P0
1855D4J52j62j15J03M7j0m10J38K80J52o35K59L73k27j49K10o6K55j79j58j65
$$ plain form
1876 -263 -191 -43 44 30 -231 -106 106 -50 -73 17 127 48 -41 -88 -179 257 -25 -55 62 -144 263 92 91 278
1900 278 187 67 104 6 74 22 61 -322 -83 -170 -254 -238 62 336 11 254 -124 67 -95 -77 172 -71 -74 -42
1924 -42 -82 14 108 -21 82 108 140 -36 -134 -29 -128 -56 -102 -122 -137 -35 98 38 12 -38 -72 -185 -325 -250 -89 -43
1950 -43 -115 -158 -78 -45 31 13 7 103 103 -99 -140 77 156 -173 -185 -127 -136 -200 159 171 -192 18 50 -101 -113 -14 -31 -15
1978 -15 245 -43 4 42 24 -116 264 49 -60 259 279 181 -97 46 15 -89 -130 247 124 -75 269 -173 -84
2001 -84 237 138 -105 -239 1 -81 -168 13 232 3 0 101 -14 237 77 24 -25 138 -109 -85 -106 -351 -134
2024 -134 150 66 138 34 159 -26 152 123 166 -147 -57 -13 -67 256 -55 -71 28 217 45 84 -346 -6 18 -53
2048 -53 -57 -91 65 100 -25 51 98 -223 328 14 155 -356 -157 100 -150 6 62 -392 -116 136 -70 26 63
$$ packed form
1876b63P2J48Q7j4k61J25K12j56k3R0J10p9q9m7r1M36k82l0J17k06M07j71jJ87
1900B78r1j20L7r8O8n2L9l83K39q7q4J6L00K74l25K43l78J91j62J8K49k43lL2
1924d2m0R6R4j29J03K6L2j76r8J05r9P2m6k0j5J02J33o0k6n0l4j13j40P5J61M6
1950d3p2m3Q0L3P6j8oR6%k02m1K17P9l29j2N8ro4L59J2l63K10L2j51j2R9j7J6
1978a5K60k88M7L8j8j40L80k15j09L19K0r8k78J43l1j04m1L77j23j99L44m42Q9
2001h4L21r9k43j34K40q2q7J81K19k29lJ01j15K51j60n3m9J63k47K4k1k45K17
2024a34K84q4P2j04J25j85J78k9M3l13R0M4n4L23l11j6R9J89j72L9m30L40K4p1
2048e3ml4J56L5j25P6M7l21N51l14J41n11J99K57k50J56N6m54K76K52k06R6L7
$$ plain form
2071 63 -36 -29 -102 -245 81 -32 -37 169 -81 -98 -124 -51 1 -218 14 -170 -225 10 93 75 74 -113 -142 194 25 89
2097 89 301 83 118 65 -192 140 2 -63 45 -176 79 -73 245 -12 149 -58 -72 -306 -232 66 -150 131
2119 131 -7 -110 149 242 -22 79 -112 -119 -224 139 -259 -327 -39 -342 167 -302 -59 -94 24 122 62 -12 -7
2142 -7 219 -62 -252 -102 75 -183 -127 -94 -71 145 206 268 -48 118 97 -67 -74 6 -45 -112 173 80 -75 105 201
2167 201 -232 -248 -16 137 -16 107 -63 -283 35 92 281 4 4 336 -8 -36 -143 -199 134 -2 3 121 103
2190 103 206 -147 67 229 299 347 65 96 -287 45 -120 -141 -251 52 -10 -21 -169 -21 -81 82 -153 284
2212 284 -116 -171 238 -261 -63 50 -113 -73 -12 205 71 -148 -92 -5 10 -208 101 -176 -69 -45 33 -46 -39 -122
2236 -122 145 180 -103 18 -258 152 -135 -123 161 121 -179 -248 40 -81 142 -91 -114 252 135 -97 43 -144
$$ packed form
2071F3r9Pp3j43L26j13nK06k50j7k6P3N2k19K32j84n5K35Q3j8jj87k9L36j69O4
2097H9K12k18L5n3k57L32j38o5J08k21K55j52L18k57J61k07j4k34P4K98k16K81
2119A31j38j03K59R3k64J01j91pj05L63l98o8K88l03N09m69K43l5J18R8o0p4N
2142gK26k81j90J50J77k58N6L3K3K16O1O2l16J66k1j64pQ0n1o7K85r3j55J80R6
2167B01m33j6K32J53j53J23j70k20L18N7J89k77%L32l44k8j07n6L33j36NJ18j8
2190A03J03l53K14J62P0M8k82L1l83L32j65k1j10L03o2j1j48J48o0J63k35M37
2212B84m00n5M09m99J98J13j63M0O1K17j34k19N6Q7J5k18L09k77J07K4P8p9Pq3
2236a22K67L5k83J21k76M10k87J2K84m0l00o9K88j21K23k33k3L66j17k32J40j87
$$ plain form
2258 -144 154 -31 311 59 157 -8 67 -118 -85 -13 -124 -156 -125 66 -121 -240 -55 312 53 160 -168 270
2280 270 -175 107 -217 -65 117 184 133 -217 -264 -29 -160 -27 -17 -31 -61 76 -195 -212 24 30 -252 -124 333
2303 333 -28 -296 144 -2 -256 131 138 1 241 91 211 176 65 247 128 -258 60 24 -202 -28 243
2324 243 164 -145 81 -230 38 -263 -147 -3 -54 -113 -18 -233 161 -495 -343 16 -8 -80 -135 -78 94 153 80
2347 80 -96 165 411 -87 71 -236 73 51 -228 -291 -126 41 63 -76 224 -142 -164 364 46 171 79 -19
2369 -19 78 92 70 214 62 -82 -23 -136 95 -132 -228 22 -126 -30 111 -168 -75 -198 -32 264 -148 414 9
2392 9 -34 8 -268 51 -110 -95 -389 -6 34 -172 285 239 -99 -188 72 -33 -131 455 161 -265 -398 -138 107
2415 107 73 70 177 -45 -194 171 11 12 -22 -79 -50 12 15 62 -20 8 -63 -94 -66 128 61 -73 21 -241 45 -62
$$ packed form
2258a44K98j85L42k52R8j65P5j85L3P2j11l2L1J91j87j19J85L67k59J07l28M38
2280B70m45K82l24J52J82O7n1l50m7K35j31J33J0j4l0J37k71j7K36Ok82J28M57
2303C33l61k68M40j46k54L87Pj37K40j50J20l5j11J82j19l86L18l6k26J74K71
2324B43p9l09K26l11K68l01J16J44n1n9R5k15L94o56J52L59k4p2n5N7J72N9p3
2347H0j76K61K46m98J58l07L09k2k79o3J65J67K2j39L00l66k2N28l18J25r2r8
2369a9R7J4k2J44j52j44N9j13K31k27r6K50j48R6J41k79R3j23J66K96m12N62m05
2392Im3M2k76L19j61J5k94L83M0k06M57m6l38q9K60j05r8N86k94m26j33K60K45
2415A07l4lJ07k22j49L65j60Jl4n7K9O2LM7q2K8p1l1K8J94o7j34R4k62K86j07
$$ plain form
2441 -62 -67 -106 -80 -83 -168 -112 -72 -99 9 -142 -9 -181 -189 -163 161 -210 0 90 374 -198 227 148 133 35 157 48
2467 48 33 30 -33 39 -338 -28 180 -8 166 -46 -24 73 -225 183 -114 -57 -78 -57 290 31 -224 -40 -58 -133
2491 -133 -101 238 -118 -79 65 -55 -127 -9 20 176 -8 -328 87 -67 268 70 260 187 57 27 299 74
2513 74 -175 6 -170 -252 30 124 -215 -110 -17 83 -207 -5 -87 -32 -338 -12 221 -105 152 -52 -85 161
2535 161 29 80 -107 -275 25 5 -97 -50 -9 134 -163 -43 -268 -129 -40 -123 -14 74 117 -90 -22 -124 -80
2558 -80 5 -86 169 158 -74 -81 -134 41 -288 47 52 -223 355 -64 64 82 21 -190 -71 -136 -77 -40 232 3 216
2583 216 -153 -270 -184 82 214 -89 90 102 -87 288 115 -119 -11 -304 222 184 83 -172 84 102 -74
2604 -74 -27 64 -32 -61 -64 -13 229 -179 -19 9 146 276 99 -5 70 -66 251 -181 259 364 -44 -222 74
$$ packed form
2441f2nl9K6lq5N6M0k7J08j51J33j72qK6L24l71K10R0K84n72M25p9j5r8J22j09
2467D8j5lo3P2l77L10K08j88J74k12K2R7k98M08k97N7k1K1L47k59k55J84j8p5
2491a33L2L39l56L9J44j20p2J18K9J56j84l20M15j54L35j98J90p3j30l0K72k25
2513G4k49J81j76q2K82R4l39J05R3J00k90K02q2N5l06L26K33l26K57k04l3K46
2535A61j32N1j87j68L00k0j02M7M1J43k97J20k25J39Q9q3J09Q8M3k07O8j02M4
2558h0Q5r1K55j1k32pn3J75l29L35Nk75N78m19J28J8o1k11J19o5N9L7K72k29K13
2583B16l69j17Q6K66J32l03J79J2j89L75j73k34J08k93N26l8j01k55K56J8j76
2604g4M7R1r6k9lN1K42m08J60K8J37J30j77j04P5j36L17m32M40J05m08j78K96
$$ plain form
2627 74 -60 -30 108 94 201 -180 296 62 -143 -4 -17 -216 -283 112 -176 -113 88 137 -108 -118 66 -102 16
2650 16 -68 146 -123 -95 136 -151 -257 136 -33 -185 -22 -142 227 83 133 -148 -161 333 83 88 19 -15 -204
2673 -204 -45 42 -354 -70 -115 -252 31 -45 220 153 -187 -78 82 -268 157 -74 -27 -32 162 97 164 234 31
2696 31 -226 37 -248 -124 92 -202 155 123 48 -94 261 66 233 230 49 239 -93 -102 -259 88 -155 86
2718 86 -104 43 -160 -135 83 -190 85 184 26 220 -192 -93 -166 27 -127 -4 284 -42 -170 51 -150 221
2740 221 -261 -3 58 -43 -96 -24 -94 -157 168 -116 -229 -103 -73 24 -184 54 -9 -114 -128 -267 84 -2 51 -190
2764 -190 -47 246 38 -22 -207 33 -170 -24 39 -33 -204 200 86 39 -112 172 109 215 -122 -197 -84 247
2786 247 52 143 127 -37 154 -151 8 -49 16 68 -28 -233 24 -105 79 -65 70 -222 -120 -114 3 -76 -318
$$ packed form
2627G4j34L0J38j4J07l81M76k34k05J39j3j99o7L95k88O3K01M9k45j0J84j68J18
2650A6q4K14k69K8K31k87j06L93j69j52J63j20L69j44N0k81j3M94k50No9l4j89
2673b04J59Q7l96K84m5j37K83p6K65o7l40J09J60l50M25k31M7nJ94o5O7P0k03
2696C1k57K63k85J24K16k94L57l2p5j42L55j95J67lj81J90l32rj57L47k43K41
2718H6j90J47k03K5K18k73K75R9j58J94m12R9p3J93j54J23K88l26j28K21k01L71
2740B21m82K58O1j01n3P2p0o3L25k84j13J26L0R7k08K38o3j05j4j39L51q6N3k41
2764a90J43K93k08o0j85K40k03J46O3p2j71M04j14m7j51K84o3J06l37p5J13L31
2786B47j95R1j6j64J91l05J59n7O5N2r6k05K57j29J84j44J35k92J02OJ17p9k42
$$ plain form
2809 -318 -404 -128 71 437 216 -221 38 243 234 4 193 57 -114 -64 219 -103 37 -32 -52 71 -20 77 -195
2832 -195 -273 160 262 204 -310 -15 94 -75 -47 -65 87 111 -109 -130 -130 -23 254 166 46 -89 -220 -128 124
2855 124 -60 46 -102 87 42 81 101 40 317 -338 -9 107 184 -103 -94 108 39 62 199 -89 -27 34 17 115
2879 115 -198 65 158 231 -14 -54 244 87 95 159 75 57 2 -65 -116 -7 29 -27 157 290 -33 124 3 38 -204
2904 -204 108 -34 9 136 80 -317 118 78 25 -44 61 127 0 20 25 71 -59 -124 -20 32 130 10 -186 196
2928 196 189 -81 -86 -31 -7 470 49 302 -10 12 -20 18 -59 -111 206 162 -74 136 72 115 -268 159 -26 200 -167
2953 -167 205 250 -61 -110 -74 39 -18 -146 -170 211 -16 -209 112 -26 -56 123 -210 -36 -229 -17 78 -1 99
2976 99 11 280 263 21 120 191 -148 52 12 128 -17 -68 284 102 127 -40 -192 268 43 -22 155 225 109
$$ packed form
2809c18q6K76J99L66k21m37K59K05rk30J89j36j71N0K83l22J40o9k0J23r1R7k72
2832a95p8M33J02n8n14K95J09j69K8j8J52K4k20k1%J07K77q8j20j35j31R2K52
2855A24j84J06j48J89m5L9K0o1K77o55L29J16P7k87RK02o9K3J37k88O2O1j7R8
2879A15l13K63R3P3k45m0K98j57QO4q4j8n5o7n1J09L6n6J84J33l23J57j21L5k42
2904b04L12j42M3J27n6l97M35m0n3o9J05O6j27K0NM6j30o5J04N2R8j20j96L82
2928A96pk70nN5K4M77m21K53l12K2l2L8p7n2L17m4k36K10o4M3l83M27j85K26l67
2953a67L72M5l11m9L6J13n7j28k4L81k27j93L21j38l0J79l33J74j93K12R5p9J00
2976I9q8K69j7k42R9P1l39K00m0J16j45n1L52j82K5j67j52M60k25o5J77P0j16
$$ plain form
2999 109 274 28 21 -41 -23 -14 -339 41 53 -17 17 -133 210 244 60 128 -419 -119 269 130 98 -102 -37 160
3023 160 -6 225 126 -87 -184 -1 -99 -60 235 70 11 -48 -152 156 -42 201 -152 -67 45 -62 -161 127 2
3046 2 -101 -29 33 -202 32 7 -35 29 327 57 10 187 201 78 169 30 173 187 242 -19 -17 97 -5 -96 66
3071 66 -36 179 -77 -107 -29 -15 131 196 40 -49 -124 -139 89 -186 -35 -201 403 172 -159 154 5 -76 -142
3094 -142 162 227 54 98 38 -181 -303 -49 -170 106 -104 -154 202 84 -102 123 -128 329 10 162 47
3115 47 -104 73 208 -2 -259 185 -46 4 99 97 -11 147 211 42 129 -230 90 93 -110 182 16 9 103 -11
3139 -11 328 -118 -37 -12 -240 -199 61 -13 133 -102 166 32 -153 282 -210 248 -38 -22 233 -39 303 -133
3161 -133 116 31 -185 68 -133 -51 -16 28 -53 232 -46 69 259 -147 -111 -161 79 -200 274 295 205 50 -83
$$ packed form
2999A09J65k46po2J8Rl25L80J2p0L4j50L43L4j84O8n47L00L88j39l2k00O5J97
3023A60j66K31r9k13r7J83r8L9K95j65n9n9j04L08j98K43l53Q5J12j07r9K88j25
3046Bj03P2O2k35K34k5m2O4K98k70m7J77J4j23R1j39J43J4N5k61KJ14j02r1J62
3071F6j02K15k56l0P8J4J46O5j56q9p5j5K28k75J51j66O04k31l31L13j49q1o6
3094a42L04O5j73M4o0k19j22K54j21K76k10n0L56j18j86K25k51M57l19J52j15
3115D7j51J77J35k10k57M44k31N0R5kj08J58O4j69Q7l59L20Lk03K92j66pR4j14
3139a1L39m46Q1K5k28M1K60p4J46k35K68j34j85M35m92M58k86J6K55k72L42m36
3161a33K49q5k16K53k01Q2L5M4q1K85k78J15J90m06L6n0K40k79M74K1r0j55j33
$$ plain form
3184 -83 264 119 27 -241 -79 26 258 69 126 -90 -176 127 51 -72 36 -212 241 250 -70 301 -87 138
3206 138 -90 25 162 -46 -32 -72 -117 -7 23 16 -115 -5 142 196 30 137 156 22 105 147 -67 157 -405
3229 -405 -59 -45 -316 177 194 8 -15 -62 -125 27 -174 -40 -152 211 209 77 -115 27 169 206 -76 -44 -156
3252 -156 271 -142 4 -5 -148 -27 116 -41 40 64 44 36 -168 233 -111 -38 142 252 -336 91 192 135 38
3275 38 -94 45 188 19 -13 -118 -162 -1 -188 -4 -90 90 -95 94 0 245 303 164 219 -13 191 -24
3297 -24 -96 -21 -16 -80 17 123 13 -152 -66 79 44 116 89 -52 48 206 -7 99 16 151 213 -153 220 -186
3321 -186 -65 149 -73 113 32 -102 12 -228 -108 -134 -76 -114 -75 95 -161 69 121 45 175 99 180 -22 9
3344 9 -126 158 215 46 -140 80 58 -105 72 50 134 255 19 32 137 -15 195 112 44 21 20 257 -279 -19
$$ packed form
3184h3L47j45r2k68J62J05K32j89N7k16q6L03p6j23J08k48M53Rl20L71l88K25
3206A38k28J15J37k08J4m0m5J10L0pj31J10J47N4j66J07J9j34Q3M2k14K24n62
3229d05L46J4k71M93J7j86k3m7o3J52k01J34j12L63kj32j92J42J42L7k82L2j12
3252a56M27m13J46rj43J21J43j57Q1K4k0qk04M01l44P3J80J10n88M27J01n7r7
3275C8j32J39J43j69l2j05m4J61j87J84q6J80j85J89r4K45N8j39N5k32K04k15
3297b4p2P5No4R7J06j10j65Q6J45l5P2k7j41J00J58k13J06q3J35O2l66L73m06
3321a86J21K14k22J86q1j34J14k40J20k6N8l8L9J70k56K30N2p6J30p6Q1k02L1
3344Ij35K84N7j69j86K20k2j63J77k2Q4J21k36J3J05j52K10q3o8k3jK37n36K60
$$ plain form
3368 -19 140 156 -258 -167 -269 -34 -34 -123 224 -67 75 -227 -128 -43 39 -96 -33 -114 -197 -179 18 5 -6 4 88 59
3394 59 202 20 -180 202 61 18 20 53 126 126 -111 -60 182 68 -18 326 12 -86 9 -135 429 33 69 -55
3418 -55 62 116 -243 17 -37 -142 12 274 -20 -15 -134 -57 42 58 -23 -78 -288 -29 181 -109 148 40 -58 -174
3442 -174 -124 85 -85 0 239 -128 171 -159 113 -104 -110 114 -185 -110 -39 51 106 123 -164 -176 47 242 30
3465 30 -190 86 3 73 206 -52 117 -114 -118 -133 -56 30 -2 187 -32 -47 103 198 -55 302 -22 44 -56 -10
3489 -10 -263 -48 71 -65 -3 56 -287 -34 151 -130 -67 360 206 -40 78 -33 -124 291 -174 -124 -214 -12
3511 -12 -284 -235 140 20 212 -18 100 83 84 268 77 154 2 86 -46 -317 63 175 125 49 -112 76 376
3534 376 40 -107 -40 -273 -37 360 410 108 200 -147 -216 106 -216 -3 135 -169 17 -26 134 -48 -17 -189
$$ packed form
3368a9J59J6m14R1j02K35%q9L47k91J42l02R9Q5Q2j35O3q1q3J8J97j3j1J0Q4k9
3394E9J43j82k00L82j41m3KL3P3%k37N1K42j14q6L44l14r8R5j44N64l96L6j24
3418e5J17N4l59K60n4j05J54K62k94Nj19P7R9J6q1n5k10K59K10k90K57j08r8j16
3442a74N0K09j70Q5K39l67K99l30K72k17oK24k99P5P1R0N5J7k87j2K23J95k12
3465C0k20K76q3P0J33k58J69k31mj5P7Q6l2J89k19j5J50R5k53L57l24O6j00M6
3489a0k53K15J19j36O2N9l43K53J85k81O3M27j54k46J18j11r1M15m65N0r0K02
3511a2k72M9L75j20J92k30J18j7JJ84j91P7j52Q4j32k71L80J12n0p6j61J88L00
3534C76l36j47O7k33K36L97N0l02R2l47o9L22l22K13J38l04J86m3J60j82L1j72
$$ plain form
3556 -189 -84 223 126 103 121 172 268 -38 52 -52 -40 -52 -309 -20 -25 -316 44 -14 -69 -82 125 16 1 100 109 121
3582 121 37 96 -196 134 75 64 146 -2 126 221 -184 73 24 96 -91 48 150 -13 -20 -313 33 37 14 58 -246
3607 -246 -88 -183 132 38 -14 -77 -57 108 177 -72 -84 -13 23 -75 25 1 -56 106 105 47 113 -223 79 90 -3 323
3633 323 64 109 54 43 -149 -137 -35 1 -183 -115 -56 -62 -314 70 61 -124 -116 37 47 -62 60 200 170 17 -246
3658 -246 -75 -144 -42 37 -322 159 -212 46 -16 -38 -48 64 21 64 166 178 38 -158 -227 180 232 -9 109
3681 109 -167 178 -134 204 231 -107 18 -50 34 143 176 -73 0 244 -46 208 -189 268 100 -120 36 192
3703 192 -171 59 60 -54 280 -199 -244 -64 -207 188 23 202 -186 15 408 48 138 -10 165 28 247
3724 247 86 108 13 57 -167 -134 12 -137 191 127 116 45 103 -25 -7 13 59 -50 78 -289 -25 -61 -259 245
$$ packed form
3556a89J05L07r7k3J8N1R6l06R0j04J2j2k57K89nk91L60n8n5j3K07j09j5R9RJ2
3582A21q4N9k92L30n9j1Q2j48J28R5m05K57m9P2j87J39J02j63pk93L46Mk3M4l04
3607b46J58r5L15r4n2o3K0J65O9k49j2P1L6r8J00k4n7J62jn8O6l36L02J1r3L26
3633C23k59M5n5j1j92J2J02L6j84O8N9ok52L84rj85QJ53J0j09J22J40l0j53k63
3658b46J71o9J02P9l59M81l71K58o2k2j0J12m3M3J02J2j40j96o9M07N2k41J18
3681A09k76L45l12L38K7l38J25o8Q4J09L3k49P3K44k90K54l97M57j68k20J56J56
3703A92l63K30Jj14L34m79m5J80j43L95j65J79l88K01L93l60R0j48J75j37K19
3724B47j61K2r5M4k24L3J46j49L28o4j1p1N8j28J8K0M6j09J28l67K64l6j98N04
$$ plain form
3748 245 208 29 -64 70 -323 80 -94 -31 -220 -264 -173 119 -158 -140 336 -30 59 -89 176 -56 -230 266
3770 266 -179 -11 -61 128 -76 -93 -98 308 210 177 60 -155 312 175 347 -281 33 -90 -302 101 -377 -26
3792 -26 144 -37 -263 48 66 -216 -127 -46 -324 -90 -98 167 -131 132 92 -23 139 241 -388 -72 129 -125
3814 -125 -136 -178 -137 106 -322 -290 -204 57 187 -70 -85 -185 -217 -123 -60 81 6 3 -57 -29 -68 153 -43 -59 104
3839 104 -271 -33 -19 25 16 -112 -50 296 -147 71 267 -62 -110 -370 -105 -19 134 250 114 -342 25 77 148
3862 148 -122 -18 -80 -60 -58 -79 -310 120 35 -48 196 -169 -509 253 117 -10 45 142 75 286 -120 210 96
3885 96 176 8 -62 30 -130 -123 -46 -160 -66 155 0 76 165 -111 -41 0 -28 -194 -108 40 11 220 230 37 -198
3910 -198 15 2 -7 -44 -28 -12 -8 120 -26 108 -127 65 42 22 -27 -41 -47 44 -125 -37 64 -182 -252 -45 224 57
$$ packed form
3748B45l7j79r3J34l93M03j74O3j89m4R1K92k77J8M76l66Q9j48K65k32j74M96
3770B66m45J68n0J89k04j7nM06r8l3j17k15M67j37J72o28L14j23k12M03m78L51
3792b6J70j81k26L11J8k82Q9Q1k78K34qK65k98K63m0j15J62J02o29L16K01k54
3814a25j1m2M1K43m28L2Q6K61J30k57j5j00l2R4O3J41p5lo0K8l9K21j96j6J63
3839A04l75K38J4M4rj28O2L46m43K18J96l29m8k60K65Q6J53J16j36m56L67N2P1
3862A48k70J04o2K0Kk1k31M30q5q3K44l65l40P62j36j27N5R7o7K11m06L30j14
3885I6Q0j68p0R2j60PP7j14R4K21j55P6Q9k76P0M1k8j66Q6J48k9K09J0j93k35
3910a98K13j3rl7J6J6MJ28j46J34k35J92k3k0m9j4oR1j69Q8J01k46p0K07K69j67
$$ plain form
3936 57 54 24 -54 25 -47 -277 89 137 109 55 55 112 135 -85 -281 54 -51 174 55 -62 147 -1 -21 -60 136
3961 136 44 -30 232 -190 -96 -271 -133 -26 -38 -12 60 180 236 -16 -169 146 93 23 -18 -35 98 -201 78 -120
3985 -120 146 78 -313 -88 -95 83 -21 238 77 148 105 -385 -176 -10 -22 164 -32 -109 13 -71 -125 -320 -25
4008 -25 -314 28 24 -89 74 5 -60 -54 89 156 -37 -121 -91 376 302 -278 79 -43 -318 -163 -105 136 -394 110
4032 110 -77 87 21 285 -103 -109 53 122 327 -4 104 10 17 203 231 -48 96 146 11 115 188 -79 -69 -232
4056 -232 -121 -143 -211 185 -285 -124 0 40 84 69 -37 130 -230 -244 96 160 -35 -38 -215 -20 267 -22 198
4079 198 135 -17 29 -289 117 -25 155 205 1 190 246 66 318 -25 199 -312 -150 26 -245 -71 -210
$$ packed form
3936E7ll0p8P9p2k30L66M8k8n4%N7K3k20j96L35j05K25j19j17K09j48k0l9J96
3961A36r2p4K62m22R4j75J38J07j2K6P2J20N6k52j53L15n3p0m1j7J33k99K79j98
3985a20K66o8l91K25pJ78j04K59j61P1m3m90K09J66j2J86j96p7J22q4n4j95K95
4008b5k89L42mj13J63o9o5OJ43O7j93q4L0M67p4n80L57j22k75J55N8K41n30N04
4032A10j87J64o6K64l88oJ62O9K05l31J08r4PJ86K8k79J44N0j35J04P3k67J0j63
4056b32J11k2o8L96m70J61J24M0M4j5j06J67l60j4L40O4j95lj77J95K87k89K20
4079A98o3j52M6l18M06j42J80N0k04J89N6j80K52l43K24n11J62J76k71J74j39
$$ [...]
8191i7
##END NTUPLES=NMR FID
##END=
