##TITLE=1H_DE-80H_X3
 200.13MHz, CDCl3
 8 sc
 
 19ns.26.2.2025
##JCAMPDX= 6.0         $$ Bruker NMR JCAMP-DX V2.0
##DATA TYPE= NMR FID
##DATA CLASS= NTUPLES
##ORIGIN= UXNMR, Bruker Analytische Messtechnik GmbH
##OWNER= pz
$$ XWIN-NMR		Version 3.5
$$ Wed Feb 26 17:47:36 2025 Russian Standard Time (UT+4h)  new_Human@DPX200
##.OBSERVE FREQUENCY= 200.1313
##.OBSERVE NUCLEUS= ^1H
##.DELAY= (6, 6)
##.ACQUISITION MODE= SIMULTANEOUS
##.ACQUISITION SCHEME= undefined
##.AVERAGES= 8
##.DIGITISER RES= 18
##SPECTROMETER/DATA SYSTEM= spect
##.PULSE SEQUENCE= zg30
##.SOLVENT NAME= CDCl3
##.SHIFT REFERENCE= (INTERNAL, CDCl3, 0, 14.3821)
##AUDIT TRAIL= $$ (NUMBER, WHEN, WHO, WHERE, WHAT)
$$ ##TITLE= Audit trail, XWIN-NMR		Version 3.5
$$ ##JCAMPDX= 5.01
$$ ##ORIGIN= Bruker BioSpin GmbH
$$ ##OWNER= new_Human
$$ C:/Bruker/XWIN-NMR/data/yarkov/nmr/H-C/1/audita.txt
$$ ##AUDIT TRAIL=  $$ (NUMBER, WHEN, WHO, WHERE, WHAT)
(   1,<2025-02-26 17:45:18.01 +0400>,<new_Human>,<DPX200>,
      <created by zg, POWCHK disabled, PULCHK disabled
       configuration hash MD5:
       00 E9 B6 7A A2 85 ED C7 34 08 36 98 17 FE 4E 26
       data hash MD5: 16K
       9B F2 B2 72 B3 68 B4 3A 48 02 77 D3 A3 AD E4 B5>)
$$ ##END=
$$ 
$$ hash MD5
$$ 48 22 10 89 C8 C8 9B FA 48 BC 74 2F 34 49 F9 01
##$RELAX= 
##$RELAX= 
##$RELAX= 
##$RELAX= 
##$RELAX= 
##$RELAX= 
$$ Bruker specific parameters
$$ --------------------------
##$DU= <C:/Bruker/XWIN-NMR>
##$EXPNO= 1
##$NAME= <H-C>
##$PROCNO= 1
##$TYPE= <nmr>
##$USER= <yarkov>
##$AMP= (0..31)
100 100 100 100 100 100 100 100 100 100 100 100 100 100 100 100 100 100 
100 100 100 100 100 100 100 100 100 100 100 100 100 100 
##$AQSEQ= 0
##$AQ_mod= 1
##$AUNM= <au_zg>
##$AUTOPOS= <>
##$BF1= 200.13
##$BF2= 200.13
##$BF3= 200.13
##$BF4= 200.13
##$BF5= 200.13
##$BF6= 200.13
##$BF7= 200.13
##$BF8= 200.13
##$BYTORDA= 1
##$CFDGTYP= 0
##$CFRGTYP= 5
##$CHEMSTR= <none>
##$CNST= (0..31)
1 1 145 1 1 1 1 1 1 1 1 1 1 1 1 1 1 1 1 1 1 1 1 1 1 1 1 1 1 1 1 1 
##$CPDPRG= <>
##$CPDPRG1= <>
##$CPDPRG2= <>
##$CPDPRG3= <>
##$CPDPRG4= <mlev>
##$CPDPRG5= <mlev>
##$CPDPRG6= <mlev>
##$CPDPRG7= <mlev>
##$CPDPRG8= <mlev>
##$CPDPRGB= <>
##$CPDPRGT= <>
##$D= (0..31)
0 0.7 0 0 0 0 0 0 0 0 0 0.03 0 0 0 0 0 0 0 0 0 0 0 0 0 0 0 0 0 0 0 0 
##$DATE= 1740577517
##$DBL= (0..7)
120 120 120 120 120 120 120 120 
##$DBP= (0..7)
150 150 150 150 150 150 150 150 
##$DBP07= 0
##$DBPNAM0= <>
##$DBPNAM1= <>
##$DBPNAM2= <>
##$DBPNAM3= <>
##$DBPNAM4= <>
##$DBPNAM5= <>
##$DBPNAM6= <>
##$DBPNAM7= <>
##$DBPOAL= (0..7)
0.5 0.5 0.5 0.5 0.5 0.5 0.5 0.5 
##$DBPOFFS= (0..7)
0 0 0 0 0 0 0 0 
##$DE= 6
##$DECBNUC= <off>
##$DECIM= 32
##$DECNUC= <off>
##$DECSTAT= 4
##$DIGMOD= 1
##$DIGTYP= 9
##$DL= (0..7)
0 120 120 120 120 120 120 120 
##$DP= (0..7)
150 150 150 150 150 150 150 150 
##$DP07= 0
##$DPNAME0= <>
##$DPNAME1= <>
##$DPNAME2= <>
##$DPNAME3= <>
##$DPNAME4= <>
##$DPNAME5= <>
##$DPNAME6= <>
##$DPNAME7= <>
##$DPOAL= (0..7)
0.5 0.5 0.5 0.5 0.5 0.5 0.5 0.5 
##$DPOFFS= (0..7)
0 0 0 0 0 0 0 0 
##$DQDMODE= 0
##$DR= 18
$$ [...]
##$SUBNAM0= <"">
##$SUBNAM1= <"">
##$SUBNAM2= <"">
##$SUBNAM3= <"">
##$SUBNAM4= <"">
##$SUBNAM5= <"">
##$SUBNAM6= <"">
##$SUBNAM7= <"">
##$SUBNAM8= <"">
##$SUBNAM9= <"">
##$SW= 18.0517328524113
##$SWIBOX= (0..15)
0 0 2 0 0 0 0 0 0 0 0 0 0 0 0 0 
##$SW_h= 3612.71676300578
##$TD= 16384
##$TD0= 1
##$TE= 0
##$TE2= 300
##$TE3= 300
##$TEG= 300
##$TL= (0..7)
0 120 120 120 120 120 120 120 
##$TP= (0..7)
150 150 150 150 150 150 150 150 
##$TP07= 0
##$TPNAME0= <>
##$TPNAME1= <>
##$TPNAME2= <>
##$TPNAME3= <>
##$TPNAME4= <>
##$TPNAME5= <>
##$TPNAME6= <>
##$TPNAME7= <>
##$TPOAL= (0..7)
0.5 0.5 0.5 0.5 0.5 0.5 0.5 0.5 
##$TPOFFS= (0..7)
0 0 0 0 0 0 0 0 
##$TUNHIN= 0
##$TUNHOUT= 0
##$TUNXOUT= 0
##$USERA1= <user>
##$USERA2= <user>
##$USERA3= <user>
##$USERA4= <user>
##$USERA5= <user>
##$V9= 5
##$VALIST= <valist>
##$VCLIST= <CCCCCCCCCCCCCCC>
##$VD= 0
##$VDLIST= <DDDDDDDDDDDDDDD>
##$VPLIST= <PPPPPPPPPPPPPPP>
##$VTLIST= <TTTTTTTTTTTTTTT>
##$WBST= 1024
##$WBSW= 4
##$XGAIN= (0..3)
0 0 0 0 
##$XL= 0
##$YL= 0
##$YMAX_a= 198450
##$YMIN_a= -203924
##$ZGOPTNS= <>
##$ZL1= 120
##$ZL2= 120
##$ZL3= 120
##$ZL4= 120
##$ABSF1= 10
##$ABSF2= 0
##$ABSG= 5
##$ABSL= 3
##$ALPHA= 0
##$AQORDER= 0
##$ASSFAC= 0
##$ASSFACI= 0
##$ASSFACX= 0
##$ASSWID= 0
##$AUNMP= <proc_1d>
##$AZFE= 0.1
##$AZFW= 0.1
##$BCFW= 1
##$BC_mod= 2
##$BYTORDP= 1
##$COROFFS= 0
##$CY= -3
##$DATMOD= 1
##$DC= 2
##$DFILT= <>
##$DTYPP= 0
##$F1P= 0
##$F2P= 0
##$FCOR= 0.5
##$FTSIZE= 0
##$FT_mod= 4
##$GAMMA= 1
##$GB= 0.15
##$INTBC= 1
##$INTSCL= 1
##$ISEN= 128
##$LB= 0.25
##$LEV0= 0
##$LPBIN= 0
##$MAXI= 10000
##$MC2= 0
##$MEAN= 0
##$ME_mod= 0
##$MI= 1.114404
##$NCOEF= 0
##$NC_proc= 0
##$NLEV= 6
##$NOISF1= 3.799351
##$NOISF2= 2.8
##$NSP= 1
##$NTH_PI= 0
##$NZP= 0
##$OFFSET= 14.38212
##$PC= 1
##$PHC0= -1163.348
##$PHC1= -32.20778
##$PH_mod= 1
##$PKNL= yes
##$PPARMOD= 0
##$PSCAL= 0
##$PSIGN= 0
##$REVERSE= no
##$SF= 200.129724274929
##$SI= 16384
##$SIGF1= 3
##$SIGF2= 2
##$SINO= 400
##$SIOLD= 16384
##$SREGLST= <1H.CDCl3>
##$SSB= 0
##$STSI= 0
##$STSR= 0
##$SW_p= 3205.1282051282
##$SYMM= 0
##$S_DEV= 0
##$TDeff= 0
##$TDoff= 0
##$TI= <>
##$TILT= no
##$TM1= 0
##$TM2= 0
##$TOPLEV= 0
##$USERP1= <user>
##$USERP2= <user>
##$USERP3= <user>
##$USERP4= <user>
##$USERP5= <user>
##$WDW= 1
##$XDIM= 8192
##$YMAX_p= 0
##$YMIN_p= 0
$$ End of Bruker specific parameters
$$ ---------------------------------
##NTUPLES= NMR FID
##VAR_NAME=  TIME,          FID/REAL,        FID/IMAG
##SYMBOL=    X,             R,               I
##VAR_TYPE=  INDEPENDENT,   DEPENDENT,       DEPENDENT
##VAR_FORM=  AFFN,          ASDF,            ASDF
##VAR_DIM=   8192,          8192,            8192
##UNITS=     SECONDS,       ARBITRARY UNITS, ARBITRARY UNITS
##FACTOR=    0.0002768,     1,               1
##FIRST=     0,             0,               0
##LAST=      2.2672688,     0,               0
##MIN=       0,             -203924,         0
##MAX=       2.2672688,     198450,          0
$$ Real data points
##PAGE= N=1
##DATA TABLE= (X++(R..R)), XYDATA
$$ [...]
2036d75j378m04M78J030J137J569L89l19j437j190j136m46n7J398J345J018O21
$$ -475 -1853 -2257 -1779 -749 388 1957 2346 2027 590 -600 -1736 -2182 -2239 -841 504 1522 2143
2053B143o4q86j401j247q37L8J100J307J410P57l66o86j343j330p09J16Q27J360
$$ 2143 2079 1193 -208 -1455 -2292 -2254 -1154 153 1563 2320 1954 1268 -75 -1405 -2114 -1998 -1171 189
2071A89Q23R80j4q55q93j675k39k13M73J351R98P98J70l31j135j733n62j24P43
$$ 189 1012 1992 1978 1123 230 -1445 -1684 -1897 -1424 -73 925 1723 1893 1562 427 -1306 -1868 -1992 -1249
2090a249J069J018R35M36p53j138q88j195j23N86R52J423P96J35l02j235j159
$$ -1249 -180 838 1773 2209 1456 318 -570 -1765 -1888 -1302 -350 1073 1869 2004 1702 467 -692
2107f92j015l3l5J210J166O81Q13m77q72j252r63m03L58Q19J385Q77K06l25r14
$$ -692 -1707 -1740 -1775 -565 601 1282 2095 1618 746 -506 -1469 -1872 -1514 -695 690 1567 1773 1448 534
2126E34o68j157m41q3J101R16J290M34l27p06j182r71p33L80P75J254Q05M10J30
$$ 534 -134 -1291 -1732 -1815 -714 202 1492 1926 1599 893 -289 -1260 -1993 -1613 -838 416 1221 1631 1761
2145A761q36q24j355m13KO86J171R61O34o6n17j051j063q54k3O94J169J206L55
$$ 1761 925 101 -1254 -1667 -1665 -979 192 1153 1787 1721 1204 153 -910 -1764 -1787 -1093 76 1282 1637
2164A637o3l69j094q43j048k0O78R61J121N95R9n00r90r12p35k83O62J028O19
$$ 1637 1574 1205 111 -732 -1780 -1800 -1122 -161 960 1555 1654 1154 164 -748 -1483 -1766 -1104 -76 543
2183E43R03L60p14j042q06o67m21L82Q07R19J098L99o27l33j284j109j49L22Q71
$$ 543 1446 1806 1092 50 -756 -1423 -1844 -1462 -655 264 1362 1761 1134 801 -483 -1592 -1741 -1419 -548
2202e48Q77J018J60l4o28j269q19l34J26Q02R29J029J85Qq86r73q13l15n3Q30
$$ -548 329 1347 1507 1473 845 -424 -1243 -1577 -1451 -649 280 1309 1494 1502 616 -357 -1170 -1485 -1538 -708
2222g08P75O09Q61K56j053p19j210j13k87O63Q58J054N93p2m17j071q37q98L36
$$ -708 67 676 1537 1793 740 21 -1189 -1302 -1589 -926 -68 986 1579 1507 1090 19 -818 -1716 -1380
2241a380M07R64R32L14K07l34j057q94n83R9M00P08R55N74J94n28p89p98m89n25
$$ -1380 -973 -9 923 1237 1444 1110 53 -841 -1424 -1325 -925 -217 738 1312 1506 978 189 -609 -1098 -1623
2261a623K99P34J132O16K58k07p37q45r82j30M31P05O79O79N12j72r06r43q56
$$ -1623 -1324 -590 542 1158 1416 1209 472 -373 -1355 -1485 -1054 -349 330 1009 1521 1349 443 -500 -1356
2280a356j46J61J058P98K52P06k58m05j036o20n45P5N22R53R92L11l21n30n23
$$ -1356 -1502 -1341 -283 515 767 1473 1215 810 -226 -846 -1391 -1316 -794 159 1151 1462 1141 611 88
2299H8r44n71N0N89R74O56M63l7n77r51o20k47k47P67N81P93N14j31m61q88p16
$$ 88 -856 -1427 -1377 -788 186 842 1305 1268 691 -260 -880 -1127 -1374 -607 -26 767 1281 1150 689 -199 -915
2320i15m64N0N85N32J157K89J81m55q34n23p32K6J13N10J201K72M47n32o10q76
$$ -915 -1379 -1329 -744 -212 945 1234 1415 960 126 -397 -1129 -1103 -990 -480 721 993 1440 908 298 -578
2340e78o08j68M50J62J346M86M98n98m42j036n47p7K22M50Q55O03M51l18p41q34
$$ -578 -1186 -1354 -904 -742 604 1090 1588 990 548 -488 -1035 -1112 -890 -440 415 1018 1469 1151 410 -424
2360d24n94j87J80L51R21N94Q0L64p76n38p12l62n4M57J183L45M31k27m85l30
$$ -424 -1018 -1205 -1025 -674 247 841 921 1285 509 -29 -741 -1103 -1157 -700 483 828 1259 1032 547 217
2380B17q94p37L58N95L87R37J78q2l92p06m79m68O0L23O36Q34K37j31l33n90m59
$$ 217 -677 -1414 -1056 -461 -74 863 1041 959 567 -139 -618 -1086 -1026 -703 -67 767 1004 873 540 -50 -509
2401e09o30L1L24N70O67Q04j29o28k54q55n01K80M12L79L77M85K94k33p45n69
$$ -509 -1139 -1108 -784 -214 453 1257 1128 500 246 -609 -1110 -830 -418 -39 338 823 1117 884 139 -430
2421d30l92l04J81N80O58Q70q1j97p05p07m08r0K14N25O31M42L2L32o68m61q09
$$ -430 -822 -1126 -945 -365 293 1163 1082 885 180 -527 -935 -1025 -811 -286 345 787 819 1151 483 22 -787
2442g87l17M90J72M84N72K55r7k47o95n35l24n9O79O05P24r3o8m32k19r94k73
$$ -787 -1104 -614 -442 42 614 869 772 525 -170 -705 -1029 -1088 -409 196 920 827 759 327 108 -886 -1159
2463a159L04L47O03K29O20k5n22n40k46n72N6M20M36M62L13k23N7o14m18n48o1
$$ -1159 -855 -508 95 324 944 919 397 -143 -389 -961 -905 -485 -49 413 726 503 560 -54 -472 -1020 -1081
2484a081N14N11N96L44m9k70n81k34m02k60L69M61O85N1J36qm14p42m39j88J46
$$ -1081 -567 -56 540 884 835 565 -16 -250 -652 -912 -543 -82 603 654 790 782 368 -374 -813 -1001 -855
2505h55Q16L33N08K71l40l89p46k7n69L01M40O51K77M67m28l98p57j49j65j75
$$ -855 -39 294 802 1073 733 344 -402 -429 -998 -697 -257 394 671 1138 710 312 -445 -594 -759 -934
2525i34L45O75M81K95k63k56n77l19n20L08K45Q75K15Q1K04p75j46n71j44q7L63
$$ -934 -589 86 567 862 599 343 -234 -553 -1073 -765 -520 355 570 651 855 80 -66 -637 -781 -868 -505
2546e05O18L72K19qj77m14n66m21K92Q6M35L13P26m8n12k71o06k55j18K19M81
$$ -505 113 485 704 696 519 105 -461 -882 -590 -504 -69 244 970 922 410 139 -467 -722 -840 -621 -140
2567a40P96j24J07l08l32k30m21M0J5J90Q04j7M75o1o40n02k28k16K42L76M44
$$ -140 656 532 639 331 -1 -231 -652 -612 -597 -407 397 380 855 794 154 -348 -576 -792 -550 -174 270
2588B70O10O6m78l20j95o51O0J77K79M17K55O2k48q1m72l67j50M23PO37M26J4
$$ 270 880 946 468 148 -47 -698 -638 -461 -182 235 490 552 304 223 -249 -616 -766 -343 -336 301 727 741
2610G41m9m88j88p93K88j82M57M11J66K96L20o51m01n01l2m0N11L55L70J8M7n30
$$ 741 692 204 16 -777 -489 -671 -214 197 363 659 979 328 -73 -574 -606 -646 -135 220 590 608 655 125
2632A25k05j54m74K57J94M99l7O10l07j20n16j48m40o8N84o2P36L41o8o9n34p75
$$ 125 -80 -234 -708 -451 -257 242 205 815 508 388 -128 -276 -716 -784 -200 -262 474 815 747 678 144 -631
2654f31j6N5L18L07Q8K58J28Ql82n38K5k39j75O11M75N84k00l23k94l95j55l29
$$ -631 -647 -592 -274 33 121 379 507 515 133 -405 -380 -619 -794 -183 292 876 676 353 59 -336 -491 -820
2676h20M01L22L31M79k11J01n10k34l01l56K69L17K60O16j01k57k43L1o58rN4
$$ -820 -419 -97 234 713 502 603 93 -141 -442 -798 -529 -212 48 664 563 306 63 94 -564 -573 -519
2697e19J81M49K07N65j19o56j99l48J47k79K84J61N67K86J48n55l37l37k03M0
$$ -519 -338 111 318 883 764 108 -91 -439 -292 -571 -287 -126 441 727 875 320 -17 -354 -557 -517
2717e17J13M33L03L98P0l72m43n1m22J10q3N42L12K75j27q6l98l01j99k15M41
$$ -517 -404 29 332 730 800 428 -15 -66 -488 -378 -461 81 393 668 541 455 57 -244 -443 -658 -217
2738b17LM96Q2J75j67j48m47j26l92K48M15L4L74K63j17j88l89m37k22M56M1M75
$$ -217 -214 282 364 539 372 224 -223 -349 -741 -493 -78 -44 330 593 476 288 -101 -538 -760 -304 -263 212
2760B12K84L0q8l70l29j24k41k41P06K02L07K13j67l13l97j9j91R8N4N37K95L86
$$ 212 496 526 438 68 -261 -385 -626 -867 -161 41 348 561 394 81 -316 -335 -526 -428 -374 163 458 844
2782H44o26N6j93k57l67r3M34K43L91K10k1o73J04l07j90l8M73j43Q60j37J74
$$ 844 218 274 81 -176 -543 -636 -202 41 432 642 621 -52 52 -255 -445 -483 -10 -153 707 570 744
2803G44l40k92j74o14K78J23K22J78K36K9k06L0n86m07M10n8J83M83L47J48o69
$$ 744 404 112 -62 -676 -398 -275 -53 125 361 390 184 214 -372 -779 -369 -427 -244 239 586 734 65
2824F5l3k65k56o5J60J31L74J95J95J49n14l83m7m53M72j08N16M70k38J41k37
$$ 65 32 -233 -489 -554 -394 -263 111 306 501 650 136 -247 -294 -747 -275 -383 133 603 365 506 269
2845B69n02m8j87J64J40M72J81M6j3l12pl65l13N2J35L66J77L21p5l85m18J35
$$ 269 -233 -281 -468 -304 -164 308 489 535 522 210 203 -162 -475 -423 -288 78 255 576 501 116 -302 -167
2867a67m27K21MO46k9J45j87P8k22l31k14R6j37L49K78J60L03j06l91k43n28M70
$$ -167 -594 -373 -369 277 248 393 206 284 62 -269 -483 -387 -524 -175 103 263 566 460 69 -174 -702 -232
2889b32j03L44L70r4L39l67j07Q2n59l38J40L98M01N51l73j71l02J02m14l37M16
$$ -232 -335 9 379 285 624 257 150 232 -327 -665 -525 -127 274 825 452 281 -21 81 -333 -670 -254
2910b54J13K69K20K33j73k74j03n74M7K13J33L52L2J30M8L8n13j02m66K00K22
$$ -254 -141 128 348 581 408 134 31 -543 -496 -283 -150 202 234 364 412 450 -63 -165 -631 -431 -209
2931b09J52N39k62J98j61k40j93l74o1K61L17J29L13K02l62m00o4k05O3J8L33
$$ -209 -57 482 220 418 257 17 -176 -550 -611 -350 -33 96 409 611 249 -151 -215 -420 -357 -339 -6
2952fK64K1l6J85j47n60k67nJ44M41L77J40j95lk25q0l36q2j9L24J66j7P07n40
$$ -6 258 279 243 428 281 -279 -546 -551 -407 34 411 551 356 353 128 48 -288 -370 -389 -65 101 84 791 251
2976B51n8l72k7m4q5j2P14J47n2J07k97k41k90K5p9J76K20J24O4J14m28k14m9
$$ 251 193 -179 -206 -250 -335 -347 367 514 462 569 272 31 -259 -234 -313 -137 83 207 271 385 -43 -257 -306
2999c06m59L98K59M9K99o4J39n9k09J3m35k44N76j78N20n3K23j92k56l91p8L05
$$ -306 -765 -367 -108 -59 240 176 315 256 47 60 -375 -619 -43 -221 299 246 469 277 21 -370 -448 -143
3021a43j71J80L53J71M0j81m80J42k80oL69O4o7K81K03No33j6N3k26K50P6jM61
$$ -143 -314 -134 219 390 430 249 -231 -89 -369 -375 -6 58 -9 272 475 480 -153 -169 -116 -342 -92 -16 -17 444
3045D44L7j41k53k28m31J77J67J93N7L12Q5j77rk97j9j68P5k0r1O69O4j9k44J7
$$ 444 481 340 87 -141 -572 -395 -228 -35 22 334 419 242 233 -64 -83 -251 -176 -196 -287 382 446 427 183 200
3069B00o85L93j82J17K95j2L91k84M5k21n32L37j95L11J98p5M00p8j72k83Pk95
$$ 200 -485 -92 -274 -157 138 126 517 233 278 57 -475 -138 -333 -22 176 101 501 423 251 -32 -25 -320
3091c20J69K31k07M56k13K45k7k61r5m31J11j85K52N17K33l06K18mm45j55k70
$$ -320 -151 80 -127 329 116 361 334 73 -22 -453 -342 -527 -275 242 475 169 387 383 -62 -217 -487
3112d87K9L65Q8N11p0l53P3l91kk02n9R5M98M5K24k99Q5k56M8o1j44J57J67k7
$$ -487 -458 -93 -5 506 436 83 156 -235 -237 -439 -498 -403 95 140 364 65 150 -106 -58 -119 -263 -106 61 34
3136C4J47%L9j32l81m3J34R3K27J51k12lM22m23n92L30Q3j74K47J33J0K14j86
$$ 34 181 181 220 88 -293 -336 -202 -109 118 269 57 54 476 53 -539 -209 -126 -300 -53 80 90 304 118
3159A18m3k41q7j75K59K41k9K4K8J33R3n11k22L06n0K64L01l21K09l38K62j10
$$ 118 75 -166 -253 -428 -169 72 43 67 95 228 321 -190 -412 -106 -156 108 409 88 297 -41 221 111
3181A11l45R2J26k19M02J61j93o9K00j84k18j59q2J88M99k28K41p2k53K74m96
$$ 111 -234 -142 -16 -235 167 328 135 66 266 82 -136 -295 -377 -189 310 82 323 251 -2 272 -224
3202b24l8k14L03K80J70j62L26o73K94k52l11K47K74K02j1J6n07L73j43r3k03
$$ -224 -262 -476 -173 107 277 115 441 -232 62 -190 -501 -254 20 222 211 227 -280 93 -50 -143 -346
3223c46k9K98J25K37O8k8n24N9O6j10k02qL87J25k25o3M84r2j34k30l8L6K43R4
$$ -346 -375 -77 48 285 353 325 -199 -140 -74 -184 -386 -394 -7 118 -107 -170 314 222 88 -142 -180 -144 99 193
3247A93j47M11k61j33P6j36k58J50l4L44l66M87j92j52k62K99l11L9J29K21p6
$$ 193 46 457 196 63 139 3 -255 -105 -139 205 -161 326 134 -18 -280 19 -292 -253 -124 97 21
3268B1Q9J2k00M6l29K00m6J20K09J3J50k36K78l54j55j1r3K77O9Q8J79l28j93
$$ 21 110 122 -78 -32 -361 -161 -207 -87 122 135 285 49 327 -27 -182 -193 -286 -9 60 148 327 -1 -194
3291a94n0J31Q7P8j69J16l4M62n06j06M2pm0J74j75J91kL45j63K5m4l26p4j16
$$ -194 -244 -113 -26 52 -117 -1 -35 427 -79 -185 -143 -150 -190 -16 -191 0 -2 343 180 205 161 -165 -239 -355
3315c55J28L50r7K68L4k70j81j63J47pk2j23J56K12L05j28j63r7K7m54L89l7j43
$$ -355 -227 123 26 294 328 58 -123 -286 -139 -146 -168 -291 -135 77 382 254 91 -6 21 -433 -44 -81 -224
3338b24K98K11j59k46k17MK6J61P6J27J51K1J51l44j34R2l10J62M0L84j42j20
$$ -224 74 285 126 -120 -337 -333 -307 -146 -70 57 208 229 380 36 -98 -6 -316 -154 -114 270 128 8
3360H%J33m5l96J50L7j24K3L96o1r2K1o9l7l4j95K7J86J20K6L18k68q5K95j98
$$ 8 8 141 96 -300 -150 -113 -237 -214 182 121 29 50 -19 -56 -90 -285 -258 -72 48 74 392 124 39 334 136
3385A36k92Q2pL59j63J21j39L1L5n51J62K06J18j85L41j59K69j69o0n40L61k09
$$ 136 -156 -74 -81 278 115 236 97 128 163 -388 -226 -20 98 -87 254 95 364 195 135 -405 -44 -253
3407b53J84K20j88J78n9Q9M1o30J28K48j59M77j27K67m02J10k24L10l66P5p2J90
$$ -253 -69 151 -37 141 82 171 212 -418 -290 -42 -201 276 149 416 14 124 -100 210 -156 -81 -153 37
3429C7J6J2K24l42KJ48l51K48j18R9J15k25L45k16K90m03p4j71O5M01N7k21K98
$$ 37 53 65 289 -53 -51 97 -254 -6 -124 -25 90 -135 210 -6 284 -119 -193 -364 -299 102 159 -62 236
3452B36j37k04J62m38J86R0K49n13R1N44j29ml24J06j06K54r9K54j81K52ol2k63
$$ 236 99 -105 57 -381 -195 -105 144 -369 -278 266 137 133 -191 -85 -191 63 -36 218 37 289 283 251 -12
3475a2j19K52l04L40j81K22l1j39j48m8P8n8j9J89k27K57K02K05m01L0l10L4J72
$$ -12 -131 121 -183 157 -24 198 167 28 -120 -168 -90 -148 -167 22 -205 52 254 459 58 88 -222 -188 -16
3498a6l46L77m8K75Nl2n9j21n9R5l51L94M9K6J56l90J23J64j76l46p2K99J75K44
$$ -16 -362 15 -33 242 247 215 156 35 -24 71 -280 114 163 189 345 -45 78 242 66 -280 -352 -53 122 366
3522C66r0r7o1k4j07k16p2L70nj94N21q4n21L70k73J6J07N5J8J53O5ll29m6m1
$$ 366 276 179 118 94 -13 -229 -301 69 64 -130 391 307 -214 156 -117 -101 6 61 79 232 297 294 -35 -81 -122
3547a22j44M1k23N84J2j07%J28j22n6j44Kj4J91Q2rK09j12l71r8K11k72L57J08
$$ -122 -266 -225 -448 136 148 41 41 169 47 -9 -153 -151 -165 26 108 99 308 196 -175 -273 -62 -334 23 131
3571A31j57L61n14O53l26k67J82r3M2p3L07l08J30J85k56L56l90k33L18j46KR0
$$ 131 -26 335 -179 474 148 -119 63 -30 12 -61 246 -62 68 253 -3 353 -37 -270 48 -98 -96 -6
3593fJ24Oq4O7j35j79J39l1L78j70J06k20J0K88m16j07L52l84M89j22j3M3j4l34
$$ -6 118 124 40 107 -28 -207 -68 -99 279 109 215 -5 5 293 -123 -230 122 -262 227 105 92 135 121 -213
3617b13j53j7K78Mj07K10J41N0k2j50j08J1J13k52L80j28R6N1p9J99k39Mk16k50
$$ -213 -366 -383 -105 -101 -208 2 143 193 171 21 -87 -76 37 -215 165 37 133 184 105 304 65 69 -147 -397
3641c97M13l3k2N9K43r0k21j00J87j33J14P2R1j21l8o2J37k12k10P8L88l28J78
$$ -397 16 -17 -39 20 263 173 -48 -148 39 -94 20 92 183 62 24 -38 99 -113 -323 -245 143 -185 -7
3664gJ09L29n48J06j13m6K3J81j85J85K45j63o6J1n8j71r4J09j96N37k26Q5J31
$$ -7 102 431 -117 -11 -124 -170 -147 34 -151 34 279 116 50 61 3 -168 -262 -153 -349 188 -38 47 178
3687A78j01j00j41J92o4n7J67m1R6J87l19j70r4J35n2L39OK74j88J31m13R9Q9
$$ 178 77 -23 -164 28 -36 -93 74 33 129 316 -3 -173 -267 -132 -184 155 161 435 247 378 -35 64 153
3710A53j7j45p7K74k91K56j04o3Lj08qK49l06N2K91J7m31K28M23n97ko5J79K16
$$ 153 136 -9 -86 188 -103 153 49 -14 -11 -119 -127 122 -184 -132 159 176 -255 -27 396 -201 -203 -268 -89 127
3734A27k23M18k77L80j00n55K40k1p5J06L3K6K03l58Mj02J55J70j31O8M2k84K14
$$ 127 -96 322 45 425 325 -230 10 -11 -86 20 53 79 282 -76 -72 -174 -19 151 20 88 130 -154 60
3757F0J30p3j68N6q4r2N6J95j07L25k42j29L1l46O5K99KM8l9N4L05k40j47m6L2
$$ 60 190 117 -51 5 -79 -171 -115 80 -27 298 56 -73 -42 -388 -323 -24 -22 26 -13 41 346 106 -41 -87 -55
3782e5J25l1j00J07K28rk19J63k89N1j28J81j0L7J39o0M1j62R8l12L55j58j57
$$ -55 70 39 -61 46 274 265 46 209 -80 -29 -157 24 14 51 190 130 171 9 107 -205 150 -8 -165
3805a65L69m95M01j26k02K67l96J40J46K43Jj17l6K63m40j20k5J42j22J69NL18
$$ -165 204 -291 110 -16 -218 49 -347 -207 -61 182 183 66 30 293 -147 -267 -292 -150 -272 -103 -98 220
3827B20K5j69K45l55m1Jo3Q4J58J93k08k43M6Q2k14K8J38J74J2l70N42j92j76
$$ 220 245 76 321 -34 -75 -74 -137 -53 105 298 90 -153 -107 -25 -239 -211 -73 101 113 -257 285 93 -83
3850h3J13j6n0ml3J93K5m2N3o6p1J73j98j4O3p2J9q6K25l50j8pK70K4Q1j32j14
$$ -83 30 14 -36 -40 -73 120 145 103 156 90 19 192 -6 -20 43 -29 -10 -96 129 -221 -239 -246 24 48 129 -3 -117
3877a17N0L53k27j8k21L74k71l4j7M62o39K94N4j29Q2j60o0N2r9L47K94m26J62
$$ -117 -67 286 59 41 -180 194 -77 -111 -128 334 -305 -11 43 -86 -4 -164 -224 -172 -271 76 370 -56 106
3900A06k88J40k05nj30O37j90r8L8R1k09K03j22j40L61l82P9K84l4k67j2J55J24
$$ 106 -182 -42 -247 -252 -382 255 65 -33 5 96 -113 90 -32 -172 189 -193 -114 170 136 -131 -143 12 136
3923A36l8j08Q3p4l8K08L5j66j45o1K47J85n09J04K42j70Q8k4J34j44K12k62J73
$$ 136 98 -10 73 -1 -39 169 204 38 -107 -168 79 264 -245 -141 101 -69 19 -5 129 -15 197 -65 108
3946A08O6m01L36J11l69J51j53o7J67j3K79k03m8K01R2l40M1rJ87k67k9K8J98
$$ 108 174 -227 109 220 -149 2 -151 -218 -51 -64 215 12 -36 165 257 -83 -42 -51 136 -131 -160 -132 66
3969F6N2K9n16M08k51K37j5J1k81J97L79j82n5k24LJ02l4P4R9n2J17k86J26J14
$$ 66 118 147 -369 39 -212 25 10 21 -260 -63 316 134 79 -145 -142 -40 -74 0 99 47 164 -122 4 118
3993A18l16J15O9n2J71k73L19K26m36K24n2n7j71M10k44k01N5J58j56K99j54J6
$$ 118 -198 -83 -14 -66 105 -168 151 377 -59 165 113 56 -115 295 51 -150 -95 63 -93 206 52 68
4015F8R7J2Q5m41K10K92m52J26j28K77k92J46K76j43j44K72j50J25k54j63K52
$$ 68 165 177 262 -179 31 323 -129 -3 -131 146 -146 0 276 133 -11 261 111 236 -18 -181 71
4036G1j31O5p2k01J25M49l35J29j55K39n80L02R4j95M59j36J6n4Q5p9j97K43q9
$$ 71 -60 5 -67 -268 -143 306 -29 100 -55 184 -396 -94 0 -195 264 128 144 90 175 96 -101 142 53
4059E3r0P3o7j88K84N1l50J16o8q2M14j8J22k57p0j7R1k5P7r0K50J15l31M3k2
$$ 53 -37 36 -31 -219 65 116 -234 -118 -186 -268 146 128 250 -7 -77 -94 -3 -28 49 -41 209 324 -7 36 14
4084A4K8k63j02N17q9j33R4o9J54m2k10K24l06k8lJ25m8J35l85L94o1K33n29O04
$$ 14 42 -221 -323 194 105 -28 66 -3 151 109 -101 123 -183 -211 -214 -89 -137 -2 -387 7 -54 179 -350 254
4108B54j05k33M5K73j02p5p4k03N95n85K85M4m1k0j06L55n81K41Q3j39r5j56N43
$$ 254 149 -84 -39 234 132 57 -17 -220 375 -210 75 119 78 58 -48 307 -274 -33 50 -89 -184 -340 203
4131B03k86K03l56M52l13k3lj93L34J34j94J67p9mk69R4P8JK97n5k29M45k27p5
$$ 203 -83 120 -236 216 -97 -120 -123 -316 18 152 -42 125 46 42 -227 -133 -55 -54 243 188 -41 404 177 102
4155A02j66K8k84O7J17O6J88j16j42J82J71j68LM1r2j24K00p3n0N8m8J53k04M3
$$ 102 -64 -36 -320 -253 -136 -70 118 2 -140 42 213 45 48 89 -3 -127 73 0 -50 8 -40 113 -91 -48
4179d8O9j0K5K2J66k3p9k01o4j29M29l02K30j19M69l66P9j68k85L3J66K7K52Q9
$$ -48 21 11 36 58 224 201 122 -79 -143 -272 157 -145 85 -34 435 69 148 -20 -305 -272 -106 -79 173 262
4203B62mo6l61J06l12K46j08N30l41r0J17R9J68l12J83j18m7j70K39l0K3n0j25
$$ 262 258 192 -169 -63 -375 -129 -237 293 -48 -138 -21 78 246 -66 117 -1 -48 -218 21 -9 14 -36 -161
4226a61K00k10J50k8j58O6J97j10J26K99l44L3j81O4j47K15j27J75j34K19J07
$$ -161 39 -171 -21 -49 -207 -141 56 -54 72 371 27 60 -121 -57 -204 11 -116 59 -75 144 251
4247B51n22K21N6pj1k34N87j86j74J24j93P0N5O3m53J39M57j68M8k76M47l60p1
$$ 251 -271 -50 6 -1 -12 -246 341 155 -19 105 -88 -18 37 100 -353 -214 243 75 123 -153 294 -66 -137
4270a37K14M0N3j93J81j96r2J70m6l15L72L1j38M66k30o3k26mJ3p9j12M60l58
$$ -137 77 117 170 -23 158 -38 -130 40 -6 -321 51 82 -56 410 180 117 -109 -113 -100 -179 -291 169 -189
4293a89J69q2M00k69l54O0k8K16L8o8k5K26k69L37j42j27k28l0M56n9j84K76r2
$$ -189 -20 -102 298 29 -325 -265 -293 -77 -39 -107 -132 94 -175 162 20 -107 -335 -365 91 32 -152 124 32
4316C2o6J62J67l46R2rj6J31k10N0M03k86k64M1R9n8j93K54j8J24M9j46j48j06
$$ 32 -34 128 295 -51 41 32 16 147 -63 -13 390 104 -160 -119 -20 -78 -271 -17 -35 89 138 -8 -156 -262
4340b62L3N1r7L90L8p5K26k70q3L3j81L48l23J63O0q5J35J3K14l67O1k43L79J47
$$ -262 -229 -178 -275 115 153 78 304 34 -49 -16 -197 151 -172 -9 51 -34 101 114 328 -39 22 -221 158 305
4364C05l10J66l8o8J12j52l56L36n0k28K23R6J07O3j13J13m43K85j21J85P3J87
$$ 305 -5 161 123 55 167 15 -341 -5 -55 -283 -60 36 143 206 93 206 -237 48 -73 112 185 372
4386C72j59m7j91n8K07k78J65j39L5K77q5j21j24J79k3j60k6M84k17m8P5K25n25
$$ 372 213 166 -25 -83 124 -154 11 -128 -93 184 99 -22 -146 33 10 -150 -176 308 91 43 118 343 -182
4409a82P0m3J12j91R4q3K4K93J29l72J44O3j61k9J67q0r2K60l22o4M48l81K53
$$ -182 -112 -155 -43 -234 -140 -223 -199 94 223 -149 -5 58 -103 -132 35 -45 -137 123 -199 -263 185 -196 57
4432E7j38N5k25L18p3n9Q8j78K53j11mQK4m0K46L1j93J7l48N08l26l4K73k18j9
$$ 57 -81 -26 -251 67 -6 -65 23 -155 98 -13 -17 -9 15 -25 221 252 59 76 -272 236 -90 -124 149 -69 -88
4457h8R6J13j19q0K80j7K5j75r0J29k74Q5j06J11J21O7l08L83j73k2k6j4J27p4
$$ -88 8 121 2 -78 202 185 210 35 -55 74 -200 -115 -221 -110 11 78 -230 153 -20 -42 -68 -82 45 -29
4481b9J52l41l8RK50n9j66L31p7K06j3l19J41k00J9K87M9l6J45k77L6j75k30M19
$$ -29 123 -218 -256 -247 3 -56 -222 109 32 238 225 -94 47 -153 -134 153 202 166 311 34 70 -105 -335 84
4505H4j68m6R4M5O5J16k05P4k29p6J84J2M13m42L0J72j46k32L12k07R5M7k06K98
$$ 84 -84 -130 -36 9 74 190 -15 59 -170 -246 -62 -50 363 -79 -49 123 -23 -255 57 -150 -55 -8 -214 84
4529H4J03p5O6k40j59L50j95J40j79K01k44m6J36m5N1J00o3p3O3J83j68j92L52
$$ 84 187 112 178 -62 -221 129 -66 74 -105 96 -148 -194 -58 -103 -52 48 -15 -88 -25 158 -10 -202 150
4552A50q8j08k54J23ML43q2P0j58OL3j02LJ31qj0M5j17J77N7k53J02j58l9L14
$$ 150 62 -46 -300 -177 -173 170 88 158 0 6 39 -63 -60 71 63 53 98 -19 158 215 -38 64 -94 -133 181
4577A81k7jj84J16J21K6l82K17j15q0j08M64j88j43P6L79o98M10n4k22L51O9m89
$$ 181 154 153 -31 85 206 232 -150 67 -48 -128 -236 228 40 -103 -27 352 -346 64 10 -212 139 208 -281
4600b81L88J63k77K2l23j60O58k21N6oJ31q0k86M50m56J85j34K59NK1O5k49K32
$$ -281 107 270 -7 15 -308 -468 190 -31 25 19 150 70 -216 234 -222 -37 -171 88 93 114 179 -70 162
4623A62k68j1J5K24O5l31K84j72J78k36J00k39M59k47P1j4Q4J4j19K53l16k15
$$ 162 -106 -117 -102 122 187 -144 140 -32 146 -90 10 -229 230 -17 54 40 124 138 19 272 -44 -259
4645b59P2J31K03Qj48K9k50J21L13l52M8J03J50k42L72j00j34J89j82J39kn52
$$ -259 -187 -56 147 155 7 36 -214 -93 220 -132 -84 19 169 -73 299 199 65 254 72 211 209 -343
4667c43K95K63k01M06k90m0j48q3Mn9R6J92k6J37j87L56m73K69l39m1L30J17k64
$$ -343 -48 215 14 420 130 90 -58 -141 -137 -196 -100 92 66 203 16 372 -101 168 -171 -212 118 235 -29
4690b9j34K08Q0k1k6k25L89k70o5L63j0j59Pl75K18J02J57k11j37l61N97k45J60
$$ -29 -163 45 125 104 78 -147 242 -28 -93 270 260 101 108 -267 -49 53 210 -1 -138 -499 98 -147 13
4713A3R4k8N8l33L24k82J13j77M09k51K7l7j50J61k81M47j71L77j55k04j39L48
$$ 13 107 79 137 -196 128 -154 -41 -218 191 -60 -33 -70 -220 -59 -340 107 -64 313 158 -46 -185 163
4735A63r0j78J1q3L10j05N0p4J27J58o05Q6L04q5j56J85J95l03K48k26K18j77
$$ 163 73 -105 -94 -177 133 28 78 4 131 289 -316 -230 74 -11 -167 18 213 -90 158 -68 150 -27
4757b7k90K85J35k26K01j3LJ53k65K20q6j29O9N0j23M3j17J90Mm81L74K13k54
$$ -27 -317 -32 103 -123 78 65 68 221 -44 176 90 -39 30 80 -43 0 -117 73 77 -404 -30 183 -71
4780g1R3j54Q9K15n9Kl48k0L87k33M1J74k29J90k37l8L55k31J63q4j31L11j66
$$ -71 22 -132 -43 172 113 115 -233 -253 134 -99 -58 116 -113 77 -160 -198 157 -74 89 5 -126 185 19
4803A9m2M19m51n6J24j1J59l94K81R9l48k5J35J2J81o3J15l11K89j2K0j61K55
$$ 19 -23 396 -55 -111 13 2 161 -233 48 147 -201 -226 -91 -79 102 39 154 -157 132 120 140 -21 234
4826B34j41L5k72PK04J34P8k20j87l5J14N8m9L21n26K47J28l6O9k90R5o0J91j12
$$ 234 93 128 -144 -137 67 201 279 59 -128 -163 -49 9 -40 281 -245 2 130 94 163 -127 -32 -92 99 -13
4850a3j08p0K27L1J52l9j07l74L30j1k09L5N30j04k39k50J62j1j4k03J83O3k77
$$ -13 -121 -191 36 67 219 180 73 -301 29 18 -191 -156 374 270 31 -219 -57 -68 -82 -285 -102 -39 -316
4873c16M83j69L5j05q7J49J2Q5p0j97K07Q2n1n51L53R0J5J16k4N0j29n2O8K23
$$ -316 167 -2 33 -72 -159 -10 2 87 17 -180 27 109 58 -493 -140 -50 -35 81 57 107 -22 -74 -6 217
4897B17r5k58j91M44m94K40J74K29l39KK85l45NJ05Q8J0L5k07P4j3O4j38j80K83
$$ 217 122 -136 -327 117 -377 -137 37 266 -73 -71 214 -131 -126 -21 67 77 112 -95 -21 -34 30 -108 -288 -5
4921er0K14J00j72j62J19r2J8p1k87L70L63m3J5k15J71m71P3J12j04k5K77j85
$$ -5 -95 119 219 47 -115 4 -88 -70 -141 -428 -58 305 262 277 62 233 -238 -165 -53 -157 -182 95 -90
4944i0n1L10m9qj95M0k18j06K76K37j89Q9j97J38Jk2k4r9J54m8j9o3J3L96k92
$$ -90 -141 169 120 112 -83 -43 -261 -367 -91 146 -43 46 -151 -13 -12 -34 -58 -157 -3 -51 -70 -133 -120 276 -16
4969a6k25J39J33k10JM34J2j75k64N0m0L0o1J37J31K04j02k00k11L43n17N52r9
$$ -16 -241 -102 31 -179 -178 256 268 93 -171 -121 -161 -131 -192 -55 76 280 178 -22 -233 110 -407 145 46
4992D6N7n4k0K07m07K01k32L85k67J9k8J38l9Qk7P2O4m48K19K23j07J39j33J28
$$ 46 103 49 29 236 -171 30 -202 183 -84 -65 -93 45 6 14 -13 59 123 -325 -106 117 10 149 16 144
5016A44O5l4j77M6l9k81M02J9l25L57l4j34j85M48l62q8J64j41J65j37L89k68
$$ 144 209 175 -2 44 5 -276 126 145 -180 177 143 9 -176 272 -90 -178 -14 -155 10 -127 262 -6
5038fJ03j90j31L23k61K32R4j8p3j52p4%P5j53K83n9pJ7K22l90J34J37j51j73
$$ -6 97 -93 -224 99 -162 70 164 146 73 -79 -153 -153 -78 -231 52 -7 -14 3 225 -165 -31 106 -45 -218
5062b18J0J47P7r8L39j39k99N4J92Q1j86r4J10P5q8K17j35J87l20J44Q1r1j74
$$ -218 -208 -61 16 -82 257 118 -181 -127 65 146 -40 -134 -24 51 -37 180 45 232 -88 56 137 46 -128
5085a28J69r2J60q4K2k20p4p1J45K08r0K17j7L2J48k53L8r7Q5n8Q6M1j03J78k87
$$ -128 41 -51 109 25 47 -173 -247 -318 -173 35 -55 162 145 177 325 72 110 13 98 40 126 167 64 242 -45
5110d5Jj5n9K44oK04m30K77k54M1l3j76j30J85L03m4J39k02J04j90MJ3k27L28
$$ -45 -44 -59 -118 126 120 324 -106 171 -83 -42 -75 -251 -381 -196 107 63 202 0 104 -86 -82 -69 -296 32
5134C2m00M09L00j61j49k5j59%R1n6J06j40L34l5j27L5oj58J68k47j18L43O1j54
$$ 32 -368 41 341 180 31 6 -153 -153 -62 -118 -12 -152 182 147 20 55 49 -109 59 -188 -306 37 98 -56
5158e6L12k79k94J37K4J11K49j81N5j89J78k17Q6K64j79l3j4j30J73P4L7Nk82
$$ -56 256 -23 -317 -180 -156 -45 204 23 78 -111 67 -150 -64 200 21 -12 -26 -156 17 91 128 133 -149
5181a49J43j15J2O7J69m4L5k96L02j85J03k77J01m1J64o8K19J48k17j57J80m02
$$ -149 -6 -121 -109 -42 127 83 118 -178 124 -61 42 -235 -134 -175 -11 -79 140 288 71 -86 94 -308
5203c08L96j89J13k5K5K60o3l9k72k7o7J97o6O5r6M17p3m25p1K93l74Q5K09r9
$$ -308 88 -101 12 -13 12 272 209 170 -102 -129 -196 1 -65 0 -96 321 248 -177 -248 45 -329 -244 -35 -134
5227a34M34l34J53M6j42J31k91K29l6R9k65J81l00L44p0j89J75J21l4q0PK7K26
$$ -134 300 -34 119 165 23 154 -137 92 56 155 -110 71 -229 115 45 -144 31 152 118 38 45 72 298
5250B98l43J46p7n1P7N7j22q4K53k48K04j27R5J0j01j15JK10j16mJ12k2J31k49
$$ 298 -45 101 24 -27 50 107 -15 -99 154 -94 110 -17 78 88 -13 -128 -127 83 -33 -37 75 53 184 -65
5274f5l9K28j71j72K07L03l79j19J40j29M12j62j77rL29k81J69J92j16j40k29
$$ -65 -104 124 -47 -219 -12 291 -88 -207 -67 -196 216 54 -123 -132 197 -84 85 277 161 21 -208
5295b08J14n4K1O2K5J09j9k45R3J56o9j29K38J58P1l13Q7j46J17o2K0k77J27J46
$$ -208 -94 -148 -127 -65 -40 69 50 -195 -102 54 -15 -144 94 252 323 10 97 -49 68 6 26 -251 -124 22
5319B2Jl7j89L6QJ93J46l64j06M41j44J03l75K48o8m6Q0j07K17J71oJ0m4M0l09
$$ 22 23 -14 -203 -167 -159 34 180 -184 -290 151 7 110 -265 -17 -85 -131 -51 -158 59 230 224 234 190 230 -79
5344g9Q6Nk7M1N7J66J5k27K17o04K79J74j55J2j62K25j06K05k14m1j4rK18q5O6
$$ -79 7 12 -15 26 83 249 264 37 254 -350 -71 103 -52 -40 -202 23 -83 122 -92 -133 -147 -156 62 -23 43
5369D3j19p0M70l99J85p4M6m83L06J80k69O8J56J91j94R4O0n4l22K99r3N0Q5k66
$$ 43 -76 -146 324 -75 110 36 82 -401 -95 85 -184 -116 40 231 37 131 191 137 -185 114 21 71 156 -110
5393a10K9p8O6q5j5J71K19Pj41R4j32j32L89k66L6o0J4J61j59r0L84j55j49l5
$$ -110 -81 -159 -93 -178 -193 -22 197 204 63 157 25 -107 282 16 52 -8 6 167 8 -82 302 147 -2 -37
5417c7l9j44K64M3o9J87l25j20m5L68J35l23J17J07k24k7O0q6j12N6J99j60M85
$$ -37 -76 -220 44 87 18 205 -120 -240 -285 83 218 -105 12 119 -105 -132 -72 -158 -270 -214 -15 -175 310
5440C10j96m08N77k86J32k92L6L81k34p1K97l70N4K17p0k4j8l45K83O5K79m28
$$ 310 114 -294 283 -3 129 -163 -127 254 20 -51 246 -124 -70 147 77 53 35 -310 -27 38 317 -111
5462a11K17k13L62k10j60r0K55K3P2l7K9J20m80P3oK32k12M76l49l0Q7l05M62
$$ -111 106 -107 255 45 -115 -205 50 73 145 108 137 257 -223 -150 -156 76 -136 340 -9 -39 48 -257 205
5485B05k88M0J35l19k60J44L41K85j70K5k80l1R8J20k45L01J02k0k95J76l59M36
$$ 205 -83 -43 92 -227 -487 -343 -2 283 113 138 -142 -173 -75 45 -200 101 203 183 -112 64 -295 141
5507A41l0k82K56q5J12J34k53Q9j36L5j14K09J61l02P6l8n2J10j50J53j95J63
$$ 141 111 -171 85 0 112 246 -7 82 -54 -19 -133 76 237 -65 11 -27 -79 31 -119 34 -161 2
5529BJ06n3q2R4J23k19j15L54k11l40M70j74P9R6j13k9J96N4k02M7j24J35L4j29
$$ 2 108 55 -27 67 190 -29 -144 210 -1 -341 129 -45 34 130 17 -12 184 238 36 83 -41 94 128 -1
5553ak22L10K8j10m9l3q6J7J07L90m36N7M8k11L90j72J34J62o8j20j43J56j71
$$ -1 -223 87 115 5 -44 -77 -163 -146 -39 351 -85 -28 20 -191 199 27 161 323 255 135 -8 148 -23
5576b3jj81R8K00r9k86K85J62l97J90j5j89O5K02M7j5R2j01j57m4K47J98j82o90
$$ -23 -24 -205 -107 93 -6 -292 -7 155 -242 -52 -67 -256 -191 11 58 43 135 34 -123 -167 80 278 96 -594
5600e94N62k34K40j00K18j65j56J71m3k6K74m20J55K61k19J95J83m33R0m3Q5j17
$$ -594 -32 -266 -26 -126 92 -73 -229 -58 -101 -127 147 -273 -118 143 -76 119 302 -131 -41 -84 1 -116
5622a16p1J94j48K41k05K62l87K78l13j13J74N1K65K04k44j14k86J52K34j77o9
$$ -116 -187 7 -141 100 -105 157 -230 48 -265 -378 -204 -153 112 316 72 -42 -328 -176 58 -119 -188
5643a88L63l74J21j18J85k4j21K41m91N22r5l4J93q1J06o6j12K2p3k71J45O7N5
$$ -188 175 -199 -78 -196 -11 -35 -156 85 -406 116 21 -13 180 99 205 139 27 49 -24 -295 -150 -83 -28
5666b8J15j79J02l07Q4K5L21l88K90P0j14KP3n8r7J53J08l85J64K33J8J25m00
$$ -28 87 -92 10 -297 -213 -188 133 -255 35 105 -9 -7 66 8 -89 64 172 -213 -49 184 202 327 -73
5689g3L63j85j78K26N3q1O7l06J17JM9n6P8k29J68K25N8n72K3K75N1j33k83J74
$$ -73 290 105 -73 153 206 125 192 -114 3 4 53 -3 75 -154 14 239 297 -275 -252 23 74 -59 -342 -168
5713a68Q5L04k69k5P4P6J49n47M49m0o2m7N0J95k08j46N0O9J60p6J7l11L52j26
$$ -168 -83 221 -48 -73 1 77 226 -321 128 88 26 -21 29 224 16 -130 -80 -11 149 73 90 -221 131 5
5737EJ71j70K44k92k56L36R6J6lj08P4M0j39j16K42j37j08n6R6j0R9j7j08K83
$$ 5 176 6 250 -42 -298 38 134 150 147 39 113 153 14 -102 140 3 -105 -161 -65 -75 24 7 -101 182
5761A82l06r2L23q8j78k6M07j58j07o1J44l7K16p4k56j7K14r8J13j33q3J74j38
$$ 182 -124 -216 107 19 -159 -185 222 64 -43 -104 40 3 219 145 -111 -128 86 -12 101 -32 -115 59 -79
5784g9j57M94k89l4K98k74J34j41j46m3J51K03o4k0o6M94q8o44M41K6m4j83K5
$$ -79 -236 258 -31 -65 233 -41 93 -48 -194 -237 -86 117 53 33 -33 461 373 -271 170 196 152 -31 -6
5807fj11L5L17m9l15K45n25M23l68O0J27K34j02J6r7J21j37L66M3n25J53K38r
$$ -6 -117 -82 235 186 -129 116 -409 14 -354 -294 -167 67 -35 -19 -116 5 -132 234 277 -248 -95 143 134
5830A34k35M37l76j29K31j43J26jR3j08J01p8M4j86J4m7K65j90P0N9j80k8J70
$$ 134 -101 336 -40 -169 62 -81 45 44 137 29 130 52 96 -90 -76 -123 142 -48 22 81 -99 -127 43
5853D3j49K25j6Q8n1j95p6Q0J11l38L58L7j97J15P6n8j2Jo3j18p7N09m65J02R3
$$ 43 -106 119 103 191 140 -55 -131 -51 60 -278 80 117 -80 35 111 53 41 42 -21 -139 -216 293 -172 -70 23
5878B3j60J96o2j6J6l1N3j46K93j49j40j13L44l9j60j18J49J4k80L02p6R2J06
$$ 23 -137 59 -3 -19 -3 -34 19 -127 166 17 -123 -236 108 69 -91 -209 -60 -46 -326 -24 -100 -8 98
5901I8l41J94O5M7q9l9Q4J20j2j12j6l0J78n6J20j60j26L2K96k13k71J35J47J7
$$ 98 -243 -49 16 63 -26 -65 19 139 127 15 -1 -31 147 91 211 51 -75 -43 253 40 -231 -96 51 68
5925F8j11J0j33J28N1R9n2L0p9j28K0o3J54k18Q4J02k00J44j56L52l58L10K4j66
$$ 68 -43 -33 -166 -38 13 112 60 90 11 -117 -97 -160 -6 -224 -140 -38 -238 -94 -250 102 -256 54 78 -88
5949h8J22j98R5K09j26j6j88J57R2N3k57K81j7l90L17JQ9l4J87l15P9k12K66k68
$$ -88 34 -164 -69 140 14 -2 -190 -33 59 112 -145 136 119 -271 46 47 136 102 289 -26 53 -159 107 -161
5973a61O9K30j90nj18K60k2K19k31k8r4K03l86K27L37m03J03k17N25k59k82L32
$$ -161 -92 138 -52 -57 -175 85 63 282 51 23 -71 132 -254 -27 310 -93 10 -207 318 59 -223 109
5995A09k47m4O3K40o1O1q0r8K72j23L8j59J35j23J2k19RN39n59K11L8J37n7%R4
$$ 109 -138 -182 -119 121 60 121 41 -57 215 92 130 -29 106 -17 -5 -224 -215 324 -235 -24 14 151 94 94 188
6020A88m04K34j14N6p6k9K43j22L2J2o4J76j79P7N0N7J10m35K36j93M24k55j35
$$ 188 -216 18 -96 -40 -116 -145 98 -24 8 20 -44 132 -47 30 80 137 247 -188 48 -145 279 24 -111
6043a11o9J68n5J34j33N4j33K00J7k01L00j10j93j17K36j03j12J23J05rK8l8L0
$$ -111 -180 -12 -67 67 -66 -12 -145 55 72 -129 171 61 -132 -249 -13 -116 -228 -105 0 -9 19 -19 11
6066A1j57n2j03M35q7j9n9l1j55L91k50J80n17K36Q1J1k18O7L24k8j85r0N03j5
$$ 11 -146 -198 -301 134 47 28 -31 -62 -217 174 -76 104 -413 -177 -96 -85 -303 -236 88 60 -125 -215 288 273
6090B73l07J24K06m30K23jKj81J37J85L8l66K55k06Q1j41j36K08j01L89l93K28
$$ 273 -34 90 296 -134 89 88 90 -91 46 231 269 -97 158 -48 33 -108 -244 -36 -137 252 -141 87
6112H7j22J26k06J97R4k12KO9K08k82K07j39j40K57k60K49L3k34K78k88J42l08
$$ 87 -35 91 -115 82 176 -36 -34 35 243 -39 168 29 -111 146 -114 135 168 -66 212 -76 66 -242
6134b42M95n02L81k1k84L93m4j91R5m9n3J78l39K9j63K98j26R2J07m7j29O0K11
$$ -242 253 -249 132 111 -173 220 176 -15 80 31 -22 156 -183 -154 -317 -19 -145 -53 54 7 -122 -62 149
6157A49j4p3J19l56L01j01k20j6K95J07j59J56j97J75k14K22l4j80N5j60M1J15
$$ 149 135 62 181 -175 126 25 -195 -211 84 191 32 188 -9 166 -48 174 140 -40 15 -145 -104 11
6179A1J00M5j17R6k14jJ33l20K45P7j90J54J05m25L81j41N9J88P3n62K16j99J41
$$ 11 111 156 39 135 -79 -80 53 -267 -22 55 -135 19 124 -301 80 -61 -2 186 259 -303 -87 -286 -145
6202a45R7J08L4j50N5k86K00J81j62Lk5L60k06k6k04L32j19j62J26j70j1K11R9
$$ -145 -48 60 94 -56 -1 -287 -87 94 -68 -65 -90 270 64 38 -166 166 47 -115 11 -159 -170 41 140
6225A40l50O3N9%r8R5k8M8J92q4j8J13l46J71k06J72J73p7J12M6k86J85m38M72
$$ 140 -210 -147 -88 -88 -186 -91 -119 -71 121 37 19 132 -214 -43 -249 -77 96 19 131 177 -109 76 -362 110
6249A10Mj90J16J54k00j0J69J37j30j93m1rj95K50j02J85K8j62J85Q3K0l48Q4
$$ 110 114 -76 40 194 -6 -16 153 290 160 -33 -74 -83 -278 -28 -130 55 83 -79 106 189 209 -139 -55
6272e5J35j8m5K7J6K4j01j55K34j09l11M15Q4o8k73L75k28j03j29K95K11j78%
$$ -55 80 62 17 44 60 84 -17 -172 62 -47 -358 57 141 73 -200 175 -53 -156 -285 10 221 43 43
6295D3j13O2K55m9k80J16J9r3J24k82M65r6r8r9J10l06J89m0K69l8O4k44K69n9
$$ 43 -70 -8 247 198 -82 34 53 -40 84 -198 267 171 73 -26 84 -222 -33 -73 196 158 222 -22 247 188
6319A88j73j10N8j74L19l7PJ19j73kj62N9J50j41m7K23j16k23K40k11J52j3M7
$$ 188 15 -95 -37 -211 108 71 78 197 24 22 -140 -81 69 -72 -119 104 -12 -235 5 -206 -54 -67 -20
6342b0o4K05J73j97o7l83L88J45m53L14K21k70N7pO2k78j30L24O0K0l52L27l61
$$ -20 -84 121 294 97 30 -353 35 180 -273 41 262 -8 49 42 104 -174 -304 20 80 100 -252 75 -286
6365b86J10K89k68J42K00k55p1K04j18K86m34K55J09j89p5J77r9J16M3j27P3p7
$$ -286 -176 113 -155 -13 187 -68 -139 65 -53 233 -201 54 163 -26 -101 76 -23 93 136 9 82 5
6387Eqj48K07k47J1J53j01P0K20k76J93j43k64K19n7O2O8j44L06l41m6K49QK60
$$ 5 -3 -151 56 -191 -180 -27 -128 -58 162 -114 79 -64 -328 -109 -166 -104 -36 -180 126 -215 -261 -12 -4 256
6411B56k47j21j12K95j11Q9p7n4K40j40J12q4j56K30k8k33L45r2l15J79K3j4J02
$$ 256 9 -112 -224 71 -40 49 -28 -82 158 18 130 46 -110 120 92 -141 204 112 -203 -24 -1 -15 87
6434H7r4k06K20Jj38M3J51l62L12J01j87l1M0k0L69m06m8J33j64K90j91M1L2J96
$$ 87 -7 -213 7 8 -130 -87 64 -298 14 115 -72 -103 -63 -83 286 -120 -168 -35 -199 91 -100 -59 -27 169
6458A69L8k27P2n6j39Q0j60O9J83j27K02k25O9K60k25J66N8j38kJ95m5r0q5r4
$$ 169 207 -20 52 -4 -143 -63 -223 -154 29 -98 104 -121 -52 208 -17 149 207 69 67 262 217 127 42 -52
6482e2j8K52j55L3J12m34K7L51l75K33J30j91J16MM3k9J14K92n04r9l6R0J30K2
$$ -52 -70 182 27 60 172 -262 -235 116 -259 -26 104 -87 29 33 76 47 161 453 -51 -150 -186 -96 34 56
6506E6O4J36l09p2K71p7k14J74L33n50K5K93o8q7Q5k15J38q0Q6K40k77J37j46
$$ 56 120 256 -53 -125 146 69 -145 29 362 -188 -163 130 62 -25 60 -155 -17 -97 -11 229 -48 89 -57
6529e7j75O7J76j07K01j90nj2L3q9K33r3p8K45k25K9K37N7j68p4k92K97m08J66
$$ -57 -232 -165 11 -96 105 -85 -90 -102 -69 -158 75 -18 -96 149 -76 -47 190 247 79 5 -287 10 -398 -232
6553b32J51M9j4L8K74k96L00N9n77O7J28j12K20l98M42j50j45J27J60j83j69q8
$$ -232 -81 -32 -46 -8 266 -30 270 329 -248 -181 -53 -165 55 -343 99 -51 -196 -69 91 -92 -261 -349
6575c49K19L54l51J08l6K24n41K16L07j86p6K66o7m11P04m02K27j81j50q5J9L05
$$ -349 -130 224 -127 -19 -55 169 -372 -156 151 -35 -111 155 88 -323 381 -21 206 25 -125 -210 -191 114
6597A14j73o1n3K22k34N4M0J29j25K81m05n4M34k98J25K53k0l24j20J88nO7j9
$$ 114 -59 -120 -173 49 -185 -131 -91 38 -87 194 -211 -265 169 -129 -4 249 229 -95 -215 -27 -32 35 16
6620A6q8J40m7N5l35L96k01j19P9K75j07J32l0k74J97J52l10K53P2m23K84k4j89
$$ 16 -72 68 21 76 -259 137 -64 -183 -104 171 64 196 166 -108 89 241 -69 184 256 -167 117 93 -96
6643i6J02K91l01J87k93Q1K54n1l77M04k36l7L9J48k23n5K02R6j4l8k64J89R0
$$ -96 6 297 -4 183 -110 -29 225 174 -203 201 -35 -72 -33 115 -108 -163 39 135 121 83 -181 8 98
6666I8K3J18l63N2K43j7q4L0qR3l7m6j94J01k24M57m32L15On24M57O0J9J29l16
$$ 98 121 239 -124 -72 171 154 70 100 92 185 148 102 -92 9 -215 242 -190 125 131 -393 64 124 143 272 -44
6691d4R1l9j91oK54k82L03q1k21J93j80K68k47L39k63N4j96J91OK04k45K77m85
$$ -44 47 8 -183 -189 65 -217 86 5 -216 -23 -203 65 -182 157 -106 -52 -248 -57 -51 153 -92 185 -300
6714c00J74K58m02L79k9j16J1o7K01m1k57p2J74L40l07J3J4N2J92k13L55k41k26
$$ -300 -126 132 -270 109 80 -36 -25 -92 109 68 -189 -261 -87 253 -54 -41 -27 25 217 4 359 118 -108
6737a08J23j01J19k17L62j08K58l48L4n8Jj76J56J11p7J15j95K68m78L79l23J49
$$ -108 15 -86 33 -184 178 70 328 -20 14 -44 -43 -219 -63 48 -29 86 -109 159 -319 60 -263 -114
6759a14J14kj91K21o6q4K59j75J46k42J5K28k7l50L76k84J70k12J11LK37j03n3
$$ -114 0 -2 -193 28 -38 -122 137 -38 108 -134 -119 109 82 -268 108 -176 -6 -218 -107 -104 133 30 -23
6782b3o1J97q9l60N05L2K9m48P2M0J79Q1O0l4j38N7k00J4O1N1j0K12k53N9Q3j85
$$ -23 -84 113 24 -336 169 201 230 -218 -146 -106 73 154 214 180 42 99 -101 -87 -26 25 15 227 -26 33 116 -69
6808f9K06q9j30J12l01J27Q1L4M7J52j78K79l12J02p2M4j64j02K47q6L19l85O8
$$ -69 137 48 -82 30 -271 -144 -63 -29 18 170 -8 271 -41 61 -11 33 -131 -233 14 -72 247 -138 -70
6831g0N3r4K78P9j40Q8O1k82p2M19j91j52L56n27L40l58K06J25j97j1K84k24K01
$$ -70 -17 -111 167 246 106 194 255 -27 -99 320 129 -23 333 -194 146 -212 -6 119 -78 -89 195 -29 172
6854A72k6m8j75J95j54j42k95L41J90o7J07J26l71K88l02J97O2k27J09M4K94l11
$$ 172 146 98 -77 118 -36 -178 -473 -132 58 -9 98 224 -147 141 -161 36 98 -129 -20 24 318 7
6876Gj43K79k03J54j9k46Q0kK10o3j37J3J99j58j05K50j35o3j40K34n0L6n5r5
$$ 7 -136 143 -60 94 75 -171 -91 -93 117 54 -83 -70 129 -29 -134 116 -19 -82 -222 12 -38 -2 -57 -152
6900a52N47k70k6k15J42M8j33n2lj2J54p1J05r1J78k99l2j9M24l53K7K46K69m73
$$ -152 395 125 99 -116 26 74 -59 -111 -114 -126 28 -43 62 -29 149 -150 -182 -201 223 -130 -103 143 412 -61
6924f1M2j90k7L27m3J27k34L6L5j00L9P4R8j38L2l97K65L37O1l50j05K31l7J73
$$ -61 -19 -209 -236 91 48 175 -59 -23 12 -88 -49 25 123 -15 17 -380 -115 222 283 -67 -172 59 22 195
6948A95m8p1j92J32p5j2O1k5j1j9K1j07K77k26M25m47p6P6K14l31P4L90o1Ol84
$$ 195 147 76 -116 16 -59 -71 -10 -35 -46 -65 -44 -151 126 -100 325 -122 -198 -122 92 -239 -165 225 164 170 -214
6973b14M15K1l60L43j70N2j2L3l62K73M7j64J06q8Q5j81M5L63l11K11k71P7L84
$$ -214 201 222 -138 205 35 87 75 108 -254 19 66 -98 8 -80 5 -176 -131 232 -79 132 -139 -62 322
6996C22n15J70K51l35m3R3J11K94l24j38L3L58j90j76k2m6K27K55k25j89J9l1
$$ 322 -193 -23 228 -107 -150 -57 54 348 24 -114 -81 277 87 -89 -111 -157 70 325 100 -89 -70 -101
7018a01K0J1P0M4l8j0Q5O1m7j0J07l55J20Mn8Q0n7M7J03j81p2L68l98K75k59O3
$$ -101 -81 -70 0 44 6 -4 81 142 95 85 192 -163 -43 -39 -97 -17 -74 -27 76 -105 -177 191 -207 68 -191 -128
7044a28K26k42KJ25j09L68r3k10qO4k02J35R0j89j48K78l0J47K0L18l40o1l68
$$ -128 98 -144 -142 -17 -126 242 149 -61 -69 -5 -207 -72 18 -171 -319 -41 -71 76 96 414 74 13 -355
7067c55L42M8m5Q9R2pm6k79J44jJ0J89j89K35l06P6j35Q1j58K71J13m08J40J21
$$ -355 -13 35 -10 79 171 164 118 -161 -17 -18 -8 181 -8 227 -79 -3 -138 -57 -215 56 169 -239 -99 22
7091B2R2k91L58k34N3l1k9K92l05L0L6%L17l01J3P6p7j11J41r3k46L08kj64M22
$$ 22 114 -177 181 -53 0 -31 -60 232 -73 -43 -7 -7 310 9 22 98 21 -90 51 -42 -288 20 18 -146 276
7116B76j86q2J7j39L21m82L19M0k06K04l23L04k03K46m69N38k25Lj3P9j55j64
$$ 276 90 8 25 -114 207 -275 44 84 -122 82 -241 63 -140 106 -363 175 -50 -47 -60 19 -136 -300
7138c00J74J78m07K93M2j4JJ84K0j86K00k81l7j9J03O5k04L13P6l52K23mRo9j74
$$ -300 -126 52 -355 -62 -20 -34 -33 151 171 -15 185 -96 -133 -152 -49 16 -188 125 201 -151 72 68 77 8 -166
7163a66K58K36l12o8l9L6n7n9L4M38l16J15j89q2L30k71N8KJ74j50J60l89M88
$$ -166 92 328 16 -52 -91 -55 -112 -171 -137 301 -15 100 -89 -171 159 -112 -54 -52 122 -28 132 -257 231
7186B31j79j27L2K24l86m6O75n73p2L65k8n9j65J76k75M64rk88K17m84J17J56
$$ 231 52 -75 -43 181 -205 -251 424 -149 -221 144 116 57 -108 68 -207 257 248 -40 177 -307 -190 -34
7208c4j3K14l31M20n9j15k13J94j49j7J25j81n2k1K48J76j03k23J69KJ04o2k95
$$ -34 -47 167 -164 256 197 82 -131 63 -86 -103 22 -159 -211 -232 16 192 89 -134 35 37 141 79 -216
7231b16K81j8k35N44m43O7N3K41k29m3j5l29L90k5J72o4L7l21J33K08k60K86m39
$$ -216 65 47 -188 356 -87 -20 33 274 45 2 -13 -342 48 23 195 131 168 -153 -20 188 -72 214 -225
7254b25O6K36j15rnM4OP2j47r7N1K94r0K1P3j12j82J51j37P5J29j22Q2k16K58
$$ -225 -159 77 -38 -47 -52 -8 -2 70 -77 -174 -123 171 81 102 175 63 -119 32 -105 -30 99 -23 59 -157 101
7279A01Q8j08l9j8M9j73k7L50n12J77J14j65K67j76M42k28k14k2oJ71j28JR9l26
$$ 101 189 81 42 24 73 -100 -127 223 -289 -112 2 -163 104 -72 370 142 -72 -94 -100 71 -57 -56 43 -283
7303b83M82mk03K81l98K66m29L19J5k07K25j48K93l71J56j08J25Q4k15RK85n35
$$ -283 199 195 -8 273 -125 141 -288 31 46 -161 64 -84 209 -162 -6 -114 11 95 -120 -111 174 -361
7325c61J82J30j87P1RM67m57J16J31j2L3j42p7j2Q4l54M59j64J24K3q7L03L1k67
$$ -361 -179 -49 -236 -165 -156 311 -146 -30 101 89 122 -20 -97 -109 -25 -379 80 -84 40 63 -24 279 310 43
7349D3P6j94j33N5R4J97k02J65j77j05L03k14M6K80j35j69j37Q9K96j69J1P1K13
$$ 43 119 -75 -208 -153 -59 138 -64 101 -76 -181 122 -92 -46 234 99 -70 -207 -118 178 9 20 91 304
7372C04k35Jk50L39k10P3q1k72J78L49k7J0j84k77L44k11J27J14k36J31JJ02j6
$$ 304 69 70 -180 159 -51 22 -59 -331 -153 196 169 179 -5 -282 62 -149 -22 92 -144 -13 -12 90 74
7395G4J76k35K26k27k24K41l84N07J03j56k30K38j66O1L4J48K31n30O9K98j29
$$ 74 250 15 241 14 -210 31 -353 154 257 101 -129 109 -57 4 38 186 417 -113 -44 254 125
7416A25l89N07j06k50P7K97k32J31l7j96L55k72Nl37L79%l6l7k6J18J13j26k91
$$ 125 -264 243 137 -113 -36 261 29 160 123 -73 282 10 15 -322 57 57 21 -16 -42 76 189 63 -228
7439b28K21m5M1j47O1J20K15n24L39j38l3L77R3l00j29n7N1O8M3j0j03K48q8j50
$$ -228 -7 -52 -11 -158 -97 23 238 -286 53 -85 -118 259 352 52 -77 -134 -83 -15 28 18 -85 163 75 -75
7463g5j1R1j43q4j10K17K37J3m98L60R9k7Lj31M9K82k34o2L0J3l03J31K22o3q8
$$ -75 -86 5 -138 -222 -332 -115 122 135 -363 -3 96 69 72 -59 -10 272 38 -24 6 19 -284 -153 69 6 -82
7488h2P5J17l9l33K13j05K68q6k81K57J05j52L42n45K63K4l5J08k95K71N1j37
$$ -82 -7 110 71 -262 -49 -154 114 28 -253 4 109 -43 299 -246 17 41 6 114 -181 90 141 4
7510Dl15L27J63k17j34L41l41L02j15K6k57o8L41mJ52k75J30j70K80r0L2l50L18
$$ 4 -311 16 179 -38 -172 169 -172 130 15 41 -216 -284 57 53 205 -70 60 -110 170 80 112 -238 80
7533H0k59L57j41l78l7L15J61L7j61M0j11o7L32n5L1j37K02j37p4o0K15j0j49
$$ 80 -179 178 37 -341 -378 -63 98 135 -26 14 -97 -164 168 113 144 7 209 72 -2 -62 153 143 -6
7556fl4R5O8N4k19m5k07L71k10P0J02l38L57k9m0N8j30j5K09j24J41j39j79p2
$$ -6 -40 55 123 177 -42 -87 -294 77 -133 -63 39 -299 58 29 -11 47 -83 -98 111 -13 128 -11 -190 -262
7580b62K41K6N4m8J4N3o7j71J47j82K05J62l62l9R5K31m25L41J66m19P8%M34n84
$$ -262 -21 5 59 11 25 78 11 -160 -13 -195 10 172 -190 -229 -134 97 -328 13 179 -240 -162 -162 272 -312
7604c12J47L70k62M0J53k82o3R9j42K17K44l05K59P0o86M90L3J3j90K14j19j42
$$ -312 -165 205 -57 -17 136 -146 -209 -110 -252 -35 209 -96 163 233 -453 37 70 83 -107 107 -12 -154
7626a54k9M03l2l77K14j95J33o3J93r4Jj01j33J88j64L00n1k5m7n0n8M61k03j73
$$ -154 -183 220 188 -189 25 -170 -37 -100 93 -1 0 -101 -234 -46 -210 90 39 14 -33 -83 -141 320 117 -56
7650e6K08j80l18L67o2K53R5p0o3j27L0l54L00j40M36j57l18k27K06j18L30j19
$$ -56 152 -28 -346 21 -41 212 307 237 174 47 77 -277 23 -117 319 162 -156 -383 -177 -295 35 -84
7672h4j30J9R0K40j70L1R1L3rJ4l03J89k7M5J69j82K77k57J17l21M6P8p7n3pJ93
$$ -84 -214 -195 -105 135 -35 -4 87 120 111 125 -178 11 -16 29 198 16 293 36 153 -168 -122 -44 -121 -174 -181 12
7698A2K66q1k56L0q1K6R4n0P2j49K86r3k31J26J00q9n8nR5j4L5K95l47K91l73
$$ 12 278 197 -59 -29 -110 -84 10 -40 32 -117 169 76 -155 -29 71 -18 -76 -81 14 0 35 330 -17 274 -99
7723i9R4j76L94j38N0j32l6K79j98J4k84M24k80L4J54J77l67p5M88n14L47l22
$$ -99 -5 -181 213 75 125 -7 -43 236 38 52 -232 192 -88 -54 100 277 -90 -165 323 -191 156 -166
7745a66K72k33K9J43j65J11k3j50J95p4j11R2JJ11J73k10K53k49n3J26j05Q0k17
$$ -166 106 -127 -98 45 -120 -9 -32 -182 13 -61 -172 -80 -79 32 205 -5 248 -1 -54 72 -33 47 -170
7768a70J41k6p1O4l4K4K2j76K95Q2l6m6j00Q1l09K91j51j58J93K64k62K21n1n7
$$ -170 -29 -55 -126 -62 -96 -72 -50 -226 69 151 115 69 -31 50 -259 32 -119 -277 -84 180 -82 139 88 31
7792C1j37N5j85L36o5J27j89p6K65j74Q7l41K70K58l10K6j25m3M23l70K60K6k64
$$ 31 -106 -51 -236 100 35 162 -27 -103 162 -12 75 -266 4 262 -48 -22 -147 -190 233 -137 123 149 -115
7815a15J03j66J00J82J05M1j53j32o2j54M92m62M45q6k64J99K2j37l5j71O2p3
$$ -115 -12 -178 -78 104 209 250 97 -35 -97 -251 241 -221 224 138 -126 73 95 -42 -77 -248 -186 -259
7837b59L12m7RP8O0p4r1Qj69J73P8J62r3J2j5j59q9L01k01J33Jj02L05m13K50
$$ -259 53 6 15 93 153 79 -12 -4 -173 0 78 240 147 159 144 -15 -104 197 -4 129 130 28 333 -80 170
7862A70k72J28j69J25J42k13r2J53K12n2j06q4J30j13l2RJ17j77L08k49J49k21
$$ 170 -102 26 -143 -18 124 -89 -181 -28 184 132 26 -58 72 -41 -73 -64 53 -124 184 -65 84 -137
7884a37o0K15j0K5k94NK75k19J49K42m03N2j83P9L03k26L73k49m0O6M59k36n3
$$ -137 -197 18 8 33 -261 -256 19 -200 -51 191 -212 -160 -343 -264 39 -187 186 -63 -103 -37 422 186 133
7907A33k67J40M0n7j17L1K4j5J87k86K60l66N50l46J2jJ09L07l54k61K78m0o4
$$ 133 -134 6 46 -11 -128 -97 -73 -88 99 -187 73 -293 257 -89 -77 -78 31 338 -16 -277 1 -39 -103
7930a03R6l1lp8K16k35L66j98j08J46l84K50k45K68j16P2k7k2M4J87j9J28j83
$$ -103 -7 -38 -41 -119 97 -138 228 30 -78 68 -316 -66 -311 -43 -159 -87 -114 -136 -92 95 76 204 21
7953B1k14L15k49K58k56O7J58l08L00j04k9M2rJ67m64J69M38k08j38J45n0J23
$$ 21 -193 122 -127 131 -125 -58 100 -208 92 -12 -41 1 -8 159 -305 -136 302 94 -44 101 51 174
7975A74j11p7K2J9J03k19q6l1K78N7k43M3J2Q1j03j3J52Q9n4J09l7k66p3J10L9
$$ 174 63 -14 8 27 130 -89 -175 -206 72 129 -114 -71 -59 22 -81 -94 58 147 93 202 165 -101 -174 -64 -25
8000b5K64n24J13L25j74J33o8L5j9j11m32M83j98K26J8k97J69J59j01J01j36P2
$$ -25 239 -285 -172 153 -21 112 44 79 60 -51 -483 0 -198 28 46 -251 -82 77 -24 77 -59 13
8022A3n7P3Q2j62J68J79m06K82k19J19j12K50l8J56m84J41K65j81j22K73j06p8
$$ 13 -44 29 111 -51 117 296 -110 172 -47 72 -40 210 172 328 -156 -15 250 69 -53 220 114 36
8044C6j15k42M91M8k36M9J18k50o1K16j91J19K24j87J23j42K30l74M33m36L1L80
$$ 36 -79 -321 170 218 -18 31 149 -101 -162 54 -137 -18 206 19 142 0 230 -144 289 -147 -116 264
8066B64m96J25J36k4l1J4P4J08J87l07P5L3k63L8O1K54k94o6J67QL8Pk33K25k05
$$ 264 -232 -107 29 5 -26 -12 62 170 357 50 125 158 -105 -67 -6 248 -46 -112 55 63 101 108 -125 100 -105
8091a05J29M7n0m09K64J34M1J7l6L91l18N4j21Lk4l6l17L64j99J26J47o7Q2j36
$$ -105 24 71 21 -388 -124 10 51 68 32 423 105 159 38 41 17 -19 -336 28 -171 -45 102 35 117 -19
8115a9p8K19o5j71J42J8l1l2j79J16O4Q6j64J7P9k9j59P2K13j8j11o5m0J42l4
$$ -19 -97 122 57 -114 28 46 15 -17 -196 -80 -16 70 -94 -77 2 -27 -186 -114 99 81 -30 -95 -135 7 -27
8140b7J62q9j02J13q3j21J82j34J73O4k29qM4M3J56j57J29k80K09K6k10M7J5J85
$$ -27 135 46 -56 57 -26 -147 35 -99 74 138 -91 -99 -55 -12 144 -13 116 -164 45 71 -139 -92 -77 108
8164A08K76l09n37J48K65r8R6K15k73J46p9K8R6J58k84R9p0L43l76J44l23M50
$$ 108 384 75 -462 -314 -49 -147 -51 164 -109 37 -42 -14 82 240 -44 55 -15 328 -48 96 -227 223
8186B23j46l04K42k7K35
$$ 223 77 -227 15 -12 223
8191B23
$$ Imaginary data points
##PAGE= N=2
##DATA TABLE= (X++(I..I)), XYDATA
0@%%%%%%%%%%%%%qJ6j6J6k4L2l2M0m8N6p2Q7r5J11j34J51j72J96k24K56k88L27
$$ 0 0 0 0 0 0 0 0 0 0 0 0 0 0 -8 8 -8 8 -16 16 -16 24 -24 32 -40 47 -48 63 -71 80 -92 104 -120 136 -152 175
35A75l70M15m66N21n82O48p21Q00q86R81j084J196j318J454j604J768j948K146
$$ 175 -195 220 -246 275 -307 341 -380 420 -466 515 -569 627 -691 763 -841 927 -1021 1125
53A125k367K614k889L203l565L982m470N051n758O640p779R307j1481J4856k0861
$$ 1125 -1242 1372 -1517 1686 -1879 2103 -2367 2684 -3074 3566 -4213 5094 -6387 8469 -12392
68a2392L4838j33716o1660J70991Q5733R1825K0266m0660j21598j11955r0554
$$ -12392 22446 -111270 -172930 -1939 83794 175619 195885 155225 33627 -78328 -168882
79a68882k3601L9620J06305J16053R5803K5290m1881r2650j06058j01174m4123
$$ -168882 -192483 -152863 -46558 69495 165298 190588 148707 56057 -50001 -151175 -195298
90a95298L3982R8199J14461R5873M0068k8096q7609j13315j02286m3486K9529
$$ -195298 -161316 -63117 51344 147217 187285 159189 71580 -41735 -144021 -187507 -157978
101a57978Q5754J08267R8000M5630k3360p7164j03481j00061n2931J8683P6013
$$ -157978 -72224 36043 134043 179673 156313 79149 -24332 -124393 -177324 -158641 -82628
112h2628J01510R6461N4596j0680o7978r9568j00247o1210O588O8564J01398R5965
$$ -82628 18882 115343 169939 159259 91281 -8287 -108534 -169744 -163156 -94592 6806 102771
124A02771N4808j357n4915r4952j01232o3077o95N5205R3273R9306O3235L589
$$ 102771 157579 156222 101307 6355 -94877 -157954 -158649 -103444 -10171 89135 152370 155959
136A55959m9352q6991r8375o8419j0665M8190Q7088R5944O6011J3249m0638q0917
$$ 155959 106607 19616 -78759 -147178 -157843 -109653 -22565 73379 139390 152639 112001 31084
148C1084r5155p0922j7824L7909P9369R3070P0544K1834l1379p4917r3822p4014
$$ 31084 -64071 -134993 -152817 -114908 -35539 57531 128075 149909 118530 43613 -50209 -124223
160a24223k5582K9702P3001R1484P3283K8032k4760o8183q9774p5254l1031K1778
$$ -124223 -149805 -120103 -47102 44382 117665 145697 120937 52754 -37020 -112274 -143305 -121527
172a21527O5610Q7224P3161L3635j5187n9905q5850p7277l7740J3481N8887Q3603
$$ -121527 -55917 31307 104468 138103 122916 63011 -22839 -100116 -137856 -124375 -65488 18115
184A8115P6060L9421r160n4511q0736p6646m3315N939N2468P8701P5363M4133
$$ 18115 94175 133596 124436 69925 -10811 -87457 -130772 -124833 -72365 6336 81699 125832
196A25832j994m7742p6726p5376m6806j474M5053P4811P4506M8605N074m0961
$$ 125832 123838 76096 -630 -76006 -122812 -124286 -79233 -4422 70084 118689 123763 82802
208H2802p2879p5041m9205q028L7382O9380P5244N0890J0133l4291o6392p3318
$$ 82802 9923 -65118 -114323 -122351 -84969 -15589 59655 110545 120678 86387 19995 -53323
220e3323n2808j3711L1425O3794P1827N5222J7032k8227o2305p2099n4625j9197
$$ -53323 -106131 -119842 -88417 -24623 47204 102426 119458 91231 28926 -43173 -97798 -116995
232a16995K5044N8465P0461N6705K1691k2522n6614o7710n5893k5294J7485N4302
$$ -116995 -91951 -33486 36975 93680 115371 92849 36235 -31475 -87368 -112662 -95177 -40875
244d0875O7746N6876K6755j4163n1579o7343n6968k7527J1026M7117O5292N9459
$$ -40875 26871 83747 110502 96339 44760 -22583 -79551 -107078 -96052 -48935 16357 75816
256G5816L0439r453m6001o3639n7899l1352N741M1393O2499N9855L2975m592l9676
$$ 75816 106255 96802 50801 -12838 -70737 -102089 -96348 -54955 7544 67399 100374 95782 56106
269E6106n9435n8489l5476J303L6644N7788N9297L7725J493l6102n7323n6878
$$ 56106 -3329 -61818 -97294 -95991 -59347 -1559 57738 95463 96956 60854 3531 -53347
281e3347l6775m971L0412N5344N8981L9821N330k9973n3134n6538l9687r211K6202
$$ -53347 -90122 -95093 -64681 -9337 49644 89465 94795 64822 11688 -44850 -84537 -93748 -67546
294f7546N1154N8066M1574R844k4624m9897n5999m0699j2278K0041M6585N6831
$$ -67546 -16392 41674 83248 93092 68468 18571 -37428 -78127 -90405 -70364 -23779 33052
306C3052M4132J3422k0345m6197n3386m2357j6381J6123M2835N4932M4964J7547
$$ 33052 77184 90606 70261 24064 -29322 -71679 -88060 -71937 -29102 25830 70794 88341
318H8341j6289m1840n2154m3750j9490J1499L8820N2474M6787K1171j1833l8731
$$ 88341 72052 30212 -21942 -65692 -85182 -73683 -34863 17611 64398 85569 73736 35005
330C5005n0091m3911k2833P490L5112M9598M6905K4449p258l4488m8390m4189
$$ 35005 -15086 -58997 -81830 -74340 -39228 10370 57275 81724 74466 39978 -8412 -52601
342e2601k5574L012L1396M7593M6762K7023k871l0529m5719m4570k7885r86K7375
$$ -52601 -78175 -75163 -43767 3826 50588 77611 74740 44211 -1508 -46078 -73963 -74949 -47574
355d7574M5078M6704K9753J085k8017m3449m3292k9991m910K3491M3326M5893
$$ -47574 -2496 44208 73961 75046 47029 3580 -39712 -69703 -74613 -51122 -7796 38097
367C8097L1026M847k3008m1349m3935l1052p869J9058M0463M5844L2586P844j9446
$$ 38097 69123 73970 50962 9613 -34322 -65374 -73243 -54185 -13722 32122 64708 72552 53106
380E3106l8670m3205l2117j0416J5552L7200M4607L4746J0626j6072l5735m2597
$$ 53106 14436 -28769 -60886 -71302 -55750 -18550 26057 60803 71429 55357 19622 -22975
392b2975l3335j3473J2658L4452M2794L5505J4025j2413l3367m1354l4533j5629
$$ -22975 -56310 -69783 -57125 -22673 20121 55626 69651 57238 23871 -17483 -52016 -67645
404f7645Q840L1812M2141L5626J6628q427l0755m0888l4733j7723N445K8196M0924
$$ -67645 -58805 -26993 15148 50774 67402 58975 28220 -12668 -47401 -65124 -59679 -31483 9441
417I441L6445J8841n376k7284l9021l5613k0064K571K5431L8642L7174K0906k235
$$ 9441 45886 64727 59351 32067 -6954 -42567 -62631 -60060 -34629 4013 41187 62093 59858
430E9858k4399l7408l6101k2229K75K2412L6911L6990K3206N98k1812l5295l6006
$$ 59858 35459 -1949 -38050 -60279 -60004 -37592 -681 36309 59515 60113 38301 3006 -33000
443c3000k4051k757J9921L4561L6392K4763M127j8629l4195l5767k5162o015J6867
$$ -33000 -57051 -59808 -39887 -5326 31066 55829 59956 41327 7132 -28635 -53797 -59812 -42945
456d2945L3212L6463K6028O094j5149l1523l5732k7282q085J4394L0449L5429
$$ -42945 -9733 26730 52758 58852 43703 12180 -23552 -50834 -58919 -44525 -14076 21353
468B1353K7647R117j3127k9180l4737k7842j1103J1374K8483L5221K8352J1511
$$ 21353 49000 58117 44990 15810 -18927 -46769 -57872 -46498 -18015 17206 45558 57069
480E7069r860k7089l4501k9570j2147Q694K5921L3487K9571J4115p589k5341l2421
$$ 57069 47209 20120 -14381 -43951 -56098 -47404 -21483 12004 41575 55690 48101 22760 -9661
493i661k9630j5226N891K3551L2564L0492J5758m434k2503l2601l0398j7092M062
$$ -9661 -39291 -54517 -48626 -25075 7489 37981 53739 49305 26802 -5799 -36197 -53289 -49227
506d9227K1481L0535L0365J8387j615k0567l0553l0368j8454K81J8828L0218L0088
$$ -49227 -27746 2789 33154 51541 49926 29359 -1194 -31562 -50016 -49735 -30907 -689 29399
519B9399J9164J219j6918k9564l1506k0196j499J6478K8575L0553K1011K909j5191
$$ 29399 48563 49782 32864 3300 -28206 -48402 -49901 -33423 -4848 25705 46716 49625 34434
532C4434k7396l0786k1605m051J4097K6899L0057K1438N890j1831k6073l0917
$$ 34434 7038 -23748 -45353 -49404 -35307 -8408 21649 43087 48977 37146 11073 -19844
544a9844k2738o120J1316K4724L0018K3744P493j0128k4654k9832k3751q309R408
$$ -19844 -42582 -48702 -37386 -12662 17356 41100 48593 38465 13811 -16021 -39772 -48081 -38673
557c8673K3400K9034K3488R913p150k2626k9845k3620j0564O651K1040K8731K4790
$$ -38673 -15273 13761 37249 47162 40012 17386 -12459 -36079 -46643 -39992 -18952 9779 34569
570C4569J1545m948k0451k8952k5084j2319M592J9581K7439K4801J3191k292j8256
$$ 34569 46114 41166 20715 -8237 -33321 -45640 -41048 -21467 5972 30773 43964 41672 23416
583B3416k7839k5306j3693K387J6846K6423K5138J4921k02j6389k6317k5936j5391
$$ 23416 -4423 -29729 -43422 -41035 -24189 2234 27372 42293 42091 25702 -615 -26551 -41942
596d1942R7J5372K5066K5752J5937J845j4344k5013k5676j6541k088J3614K3259
$$ -41942 -41845 -26473 -1407 24345 40282 42127 27783 2770 -22906 -39447 -41535 -27921 -4662
609d662K4742J8035M122j2130k3475k5820j8068m236J1395K2270K4676J8718O085
$$ -4662 20080 38115 42237 30107 6632 -19188 -37256 -41492 -30097 -7827 16849 35567 41652
622D1652r748k2377k5358j8908n812R161K0527K4079J9309P820p403k0559k4556
$$ 41652 31904 9527 -15831 -34739 -40551 -31390 -10863 13216 32525 40345 32942 12383 -12173
635a2173j9767q150P226J9213K3601K0420R621n477j8992k4407k0515r383M827
$$ -12173 -31940 -40090 -32864 -13651 9950 30370 39991 34514 15522 -8885 -29400 -38783 -33956
648c3956J7788K2927K0545J0937l544j6540k3444k0945j1414L249J5681K2421
$$ -33956 -16168 6759 27304 38241 34697 18157 -5287 -26232 -37646 -34397 -18716 3705
660C705K0757J2344j470j5389k2570k1176j2316J293J4442K1093K1034J3215K59
$$ 3705 24462 36806 35336 19947 -2623 -23799 -36115 -34822 -20380 713 21747 34962 35221
673C5221j3097k1518k1244j3612m45J2009K0333K1340J4258K115j1868k0129k0992
$$ 35221 22124 606 -20638 -34250 -34695 -22686 -2353 18987 33245 35360 23492 3363 -17629
686a7629j4792k237J0321J9176K1230J5291L643r739j9134k0962j5312l961Q451
$$ -17629 -32421 -34658 -24337 -5161 16069 31360 35003 25264 6130 -14832 -30144 -34105 -25654
699b5654J8112K0715J5910N093p846j7585k1096j5957n006O768J6434K0143J7100
$$ -25654 -7542 13173 29083 34176 26330 8745 -12351 -28308 -33314 -26546 -10112 10031 27131
712B7131O295n598j6200k0632j6980o593N064J5133J9815J6677P847l869j4354
$$ 27131 33426 27828 11628 -9004 -25984 -32577 -27513 -12380 7435 24112 31959 28090 13736
725A3736j9947j7417q170L886J3415J9202J7391R044k438j3202j9066j7702r005
$$ 13736 -6211 -23628 -31798 -27912 -14497 4705 22096 31140 28702 15500 -3566 -21268 -30273
738c0273J941J2251J8524J7236R900r30j1636j7923j7664j0526Q1J1135J7677
$$ -30273 -28332 -16081 2443 19679 29579 28649 17013 -910 -18574 -29100 -29019 -17884 -207
751b07J7739J0850N08j0107j7498j7695j1523r01R718J6324J7544J2223J767q822
$$ -207 17532 28382 28890 18783 1285 -16410 -27933 -28834 -19116 -2792 14752 26975 28742 19920
765A9920j6682j6739j2347k630P738J5951J7493J2280L319p522j5301j6557j3110
$$ 19920 3238 -13501 -25848 -28478 -20740 -4789 12704 24984 28303 20781 5480 -11077 -24187
778b4187l961O710J4307J7134J3271M750o495j3993j6665j3194n179N126J3982
$$ -24187 -28148 -21438 -7131 10003 23274 28024 21529 7536 -9129 -22323 -27502 -22376 -8394
791h394J6388J3350N739m526j2786j6210j4198o291M315J2071J6062J4194O651
$$ -8394 7994 21344 27083 22557 9771 -6439 -20637 -26928 -22613 -10542 5520 19714 26365
804B6365l141j1833j5648j4511o891K281J1301J5551J4366P414j588j0752j5309
$$ 26365 23224 11391 -4257 -18768 -25659 -23378 -12077 3474 17840 25254 23666 12914 -2395
817b395j4183q361J337R857J5211J4234Q422n34r366j4715j4297r025P5Q656J4400
$$ -2395 -16578 -24939 -23602 -13745 1466 15700 24122 23588 14222 -493 -14790 -23815 -23740 -15084 -684
832f84J4455R122Q88q216j3925j4571r471j350P802J3872J4147R703J922p065
$$ -684 13771 22893 23781 15565 1640 -12931 -22402 -23752 -15950 -2078 12069 21772 23694 16629
846A6629j3060j4149j0419k630O451J3080J4173J0531K311n639j1915j4186j0936
$$ 16629 3569 -10580 -20999 -23629 -17178 -4098 10075 20606 22917 17278 5363 -8823 -19759
859a9759l463N471J1723J4021J1137L885n042j1316j3562j1173m625L883J1490
$$ -19759 -23222 -17751 -6028 7993 19130 23015 17973 6657 -6905 -18078 -22703 -18820 -7330
872g330J3593J1417M548l221j0276j3586j1746n342K734J0163J3401J1612N703
$$ -7330 6263 17680 22228 19007 8731 -4855 -16601 -21943 -19209 -9046 4355 15967 21670
885B1670k433r738j2808j1841o322K021R221J2976J1936N930j324q363j2316j2123
$$ 21670 19237 9499 -3309 -15150 -21472 -19451 -10230 2746 14682 20612 19288 10925 -1391 -13514
899a3514p337J346Q273J2403J1683P384q68p243j2005j2408p308k64P124J2253
$$ -13514 -20851 -19505 -11232 1171 12854 20238 19370 12127 122 -12286 -19594 -19858 -12734 -481
913d81J2040P649N87o806j1514j1619q593j132O319J1238J2117Q064J114n277
$$ -481 11559 19208 19795 12989 1475 -10144 -18737 -19869 -13550 -2312 9805 17869 18983 13706
927A3706j0490j1992r137k043N722J0707J1600Q963K581m831j0191j1598r365
$$ 13706 3216 -8776 -17913 -19956 -14234 -3527 8073 17036 19617 14786 4595 -7003 -16368
940a6368l108M316J0010J2011Q977L217l853r450j1609r388l767L332R543J1018
$$ -16368 -19476 -15160 -5150 6861 15838 19055 15202 5752 -5857 -15245 -19012 -15680 -6137 4881
954D881R703M273k854q617j1373j0039m380K093Q686J1382R665M698k000p842
$$ 4881 14584 18857 16003 7386 -3987 -14026 -18406 -16313 -7627 3755 13420 18118 16118 8276
968H276j0700j0301n516J909P566J0943R973N090j174o733j0737j0027n960P11
$$ 8276 -2424 -12725 -18241 -16332 -8766 2177 12150 17240 16066 9333 -1404 -11431 -17391 -16680
982a6680O648J0891R935N813J97o164j0502j0448o149k70N800J0070J0240O579
$$ -16680 -10032 859 10794 16607 16804 10640 138 -10310 -16459 -16729 -10929 -859 9381 15960
996A5960P96n337r951j0254o748j441N244R515J0306P153J483m616r122j0244
$$ 15960 16756 11419 1468 -8786 -15534 -16975 -11731 -2216 8090 15243 16726 12110 2988 -7256
1010g256p563j901M537Q447J0478P414K472l668q787j0118p983k666L462Q375
$$ -7256 -14819 -16720 -12183 -3736 6742 14156 16628 12960 4173 -5945 -13928 -16594 -13132 -4757
1024d757J0126Q115K539k566q051j0055q197l401K656P851R647Q030M112k275
$$ -4757 5369 13484 16023 13457 5406 -4649 -12846 -16247 -13591 -5740 3907 11937 16049 13774
1038A3774p023r768q500m090J484O833R746Q674M528j362p009q987q912m798R41
$$ 13774 6751 -3017 -11517 -15607 -14123 -7290 2456 11130 15658 14296 7287 -1700 -10612 -15410 -14469
1053a4469O360R107Q953N136m11o218r039q644n480L84N393Q956Q892N190N17
$$ -14469 -8109 998 9951 15087 14676 8458 -581 -9225 -14705 -14321 -8928 28 8920 14110 14627
1068A4627n109q782r011n542q50M873Q400Q959O196Q27m406q010r046o631j020
$$ 14627 9518 736 -8275 -13817 -14667 -9794 -1394 7565 13761 14588 10182 2172 -6874 -13505 -14525
1083a4525M313P560Q882O633J760l753p782q583o812k264L332P582Q822O860K270
$$ -14525 -10212 -2652 6230 12863 14623 10870 3088 -5495 -12307 -14571 -11239 -3657 5165 12025 14295
1098A4295l116p099q613p009k553K683O734Q491P370K694k144o663q350p064l314
$$ 14295 11179 4080 -4533 -11542 -14095 -11412 -4678 3813 11183 13877 11733 5070 -3280 -10344 -13658
1113a3658J743O159Q344P530L633j643o312p809p557l972J209N643Q199P647L959
$$ -13658 -11915 -5756 2588 10118 13751 12108 5796 -2013 -9570 -13542 -12333 -6690 1509 9156 13115
1128A3115p31n400p895p533m193L92M829P416Q022M619j46m696p664p689m729
$$ 13115 12384 6984 -911 -8444 -12637 -12245 -7416 0 8022 12641 12495 7799 135 -7554 -12283
1143a2283k01M263P594P522N297N36m202p228p630n006j229L404P404P464N735
$$ -12283 -12484 -8221 -627 6895 12192 12728 8526 1298 -6332 -11338 -12567 -9163 -1759 5705 11440
1158A1440J221l583o957p200n992j474L116O362P893N906J673k613o471p819n652
$$ 11440 12661 9078 2121 -5079 -11071 -12545 -9429 -3067 4826 10732 12405 9792 3321 -4498 -10150
1173a0150j957K086O331P489N948K567k396n722p341o305k603J638N672P677N955
$$ -10150 -12107 -10021 -3690 3799 9747 12314 9918 4196 -3145 -9450 -12053 -10415 -4743 2934 8889
1188H889K693j063n483p357o210l220J391M689O979O861L274n34n016p047o517
$$ 8889 11582 10519 5036 -2321 -8531 -11751 -10360 -5671 1308 8169 11443 10909 5893 -1154 -7671
1203g671l622O32M595O549O652L992l91l990o775o693m087k7L975O242O943M020
$$ -7671 -11293 -10661 -6066 483 7135 11127 10736 6746 -29 -6722 -10809 -10836 -6861 -619 6324 10344
1219A0344N09l899o023o521m405q42L306O444N964M927R55l109n958o546m662
$$ 10344 10853 6954 931 -5590 -9995 -10837 -7531 -1087 4877 9804 10759 7650 1692 -4854 -9516
1234i516j310K669N689O583N210J279k318n584o561m848k009K396N558O200N233
$$ -9516 -10826 -8157 -2468 4115 9325 10604 8286 2702 -3859 -8707 -10716 -8320 -2762 3438 8671
1249H671K063k227n069o434n163k309J846M486O491N518K466j510m400o700n146
$$ 8671 10734 8507 3438 -2996 -8159 -10468 -8622 -4136 2355 7873 10339 8829 4429 -2271 -7417
1264g417k816J185M707N946N433K818p85m173o246n410k858L31M002N682N949
$$ -7417 -10233 -9048 -4341 1605 7038 9856 9071 4898 -1348 -6758 -9616 -9285 -5283 399 6348
1279F348L268k81l700n757n745l440P0L538N545N664L458K66l385n341n755l661
$$ 6348 9616 9335 5635 -122 -5867 -9307 -9237 -5699 -154 5510 8968 9234 5849 508 -5247 -8908
1295h908l48K910N381N492L894P75k851n009n518l951p84K022M915N804M309J014
$$ -8908 -9256 -6346 -965 4527 8421 9196 6345 1336 -4182 -8133 -8917 -6895 -1980 3824 8133 9147
1311I147k205m771n691l901j988K195M555N682M391J739j849m398n443m616j585
$$ 9147 6942 2171 -3520 -7421 -9409 -7214 -2659 3023 7414 9153 7304 2906 -2537 -7153 -8738
1326h738J266M239N530M734J810j296l841n381m806k096J060L622N179M933K291
$$ -8738 -7472 -3233 2297 7031 8841 7545 3704 -1677 -6483 -8579 -7519 -3897 1282 6215 8506
1341H506q84l486n268m602k717N99L655M964M873K336j74l051n117m735k868J76
$$ 8506 7622 4136 -1132 -5734 -8451 -7852 -4197 767 5640 7976 7802 4751 -366 -5101 -7969 -7793
1357g793L068M821M589L167J59l005m856m228l547l28K826M608M647L365O69k713
$$ -7793 -4725 96 4685 7852 8011 5006 150 -4078 -7625 -7953 -5127 -519 4128 7493 8162 5449
1373E449m542m829l365l77J997M379M587L496J137k187m201m401l873j016J693
$$ 5449 907 -3922 -7287 -7664 -5667 -1288 3299 6795 7932 5745 1544 -2857 -6730 -7746 -6053
1388f053M137M659L659J250j712l787m755l537j492J504L684M511M110J424j464
$$ -6053 -1916 2743 6402 7652 5940 2153 -2602 -6139 -7631 -6127 -2443 2068 6178 7602 6138
1403F138l224m934l694j714J263L401M183M101J919q26l483m535l845k122R31
$$ 6138 2914 -2020 -5714 -7428 -6165 -2764 1419 5520 7439 6613 3130 -1405 -5250 -7372 -6441
1418f441K910M589L934K298o90l048m141m243k112J71K789M183M173K569k22k662
$$ -6441 -3531 1058 4992 7290 6600 3552 -589 -4832 -6944 -6773 -3984 199 4372 6941 6719 4057
1434D057l917m228k457O6K301L680M427K556L40k244l868m233k886k19K232L681
$$ 4057 140 -4088 -6545 -6479 -4178 -498 3929 6485 6825 4581 713 -3520 -6406 -6625 -4393 -712
1450g12M165K762N36j910l608m236k895p86K030L185M159L187R15j758l572l889
$$ -712 3453 6215 6751 4841 1233 -3003 -5898 -6684 -4654 -1469 2690 5877 6792 5034 1462 -2427
1466b427l359p72J470L430M027K870J358j078l806l757k872j476J167L063L737
$$ -2427 -5786 -6558 -5088 -1658 2369 5239 6597 5519 1713 -2044 -4916 -6392 -5225 -2162 1575
1481A575L330J700j120k951m005l618j161Q69L191L366L417J553m15l026l479
$$ 1575 4905 6605 5485 2534 -1471 -5089 -6250 -5381 -2190 1176 4593 6146 5731 2705 -774
1496g74l532j690L67K699L543L726J710m14k396l710l319k216M66K042L761L293
$$ -774 -4306 -5996 -5629 -2930 613 4339 6049 5635 3239 -471 -3790 -6006 -5540 -3498 263 3556
1512C556K133L66k301l495l537k658M33J827L548L359K232M76j951l349l635k409
$$ 3556 5689 6055 3754 259 -3278 -5936 -5503 -3676 -128 3231 5463 5939 3988 639 -2996 -5405
1528e405j75J515L305L288K525P26j449l294l600k342q53R63L272L706L036N32
$$ -5405 -5580 -4065 -760 2528 5053 5779 4330 1036 -2564 -4906 -5759 -4796 -1524 2182 5218 5750
1544E750j311k960l428k676j274J303K848L557K465J487j196k563l659k669j516
$$ 5750 4439 1479 -1949 -4625 -5899 -4596 -1748 1809 4274 5761 4565 2002 -1657 -4326 -5842
1559e842J058K544L671L060J117o19k721l320k891j689Q82K494L097L127J161
$$ -5842 -4784 -2240 1431 4491 5608 4989 2268 -1052 -3943 -5632 -4750 -2256 841 3968 5129
1574E129K56k679l353k869j814N43K047L243K939J443K91k054l205l323j647l45
$$ 5129 5385 2706 -647 -3516 -5330 -4787 -2740 503 3442 4885 5176 3122 -83 -3406 -5053 -5398
1590e398K513K702L310K148%j783l118l432k100l0J714L113K950K289J47j439
$$ -5398 -2885 -183 3127 5275 5275 3492 374 -3058 -5158 -5188 -3474 -361 2589 4878 5025 3586
1606C586k805l283k132n81J524K665L080K303P70j295k652l553j998o96J240K538
$$ 3586 781 -2502 -4634 -5215 -3691 -1026 2054 4357 5127 3832 1180 -2373 -4371 -5067 -3827 -1289
1622a289L133K433P82j205k395l008k561q70O53K729K772K809P94p15k070k998
$$ -1289 1844 4277 5059 3854 1459 -1549 -4110 -4980 -4327 -1598 1174 3983 4777 4062 1992 -1006
1638a006k928j166P74K439K901K763R80l60k407k630k546j574N18J654L122K882
$$ -1006 -3934 -5100 -4326 -1887 1014 3777 4757 4397 1990 -640 -3186 -4760 -4242 -2588 534 3416
1654C416J660m48k068k750k643j730N3K086K717K805J386m9j823k457k911j843
$$ 3416 5076 4628 2560 -190 -2833 -4563 -4510 -2424 293 3098 4484 4435 2612 155 -2756 -4599
1670d599L53J218K412L206J698L95j739k371k620k180m18J091K806K876J879N77
$$ -4599 -4246 -3028 -616 2590 4288 4683 2944 573 -2047 -4227 -4645 -3554 -748 2128 4007 4584
1686D584j228k544k758k048n56Q38K769K627K295N81r64k255k839j929q25O66
$$ 4584 3356 812 -1946 -3994 -4550 -3712 -943 1684 3979 4560 3596 1341 -1498 -3427 -4252 -3586
1702c586J973K853K429Q54q94k087k685k059j095M63K478K312K328R26l92j787
$$ -3586 -1613 1240 3669 4523 3629 1542 -1143 -3202 -4297 -3834 -1356 956 3284 4210 3818 2031
1718B031k913k431p54K9K147K554K159J627m66j813k531k561j223K49J492K808
$$ 2031 -882 -3313 -4067 -4038 -1891 663 2822 4449 3983 2170 -361 -2922 -4145 -3896 -2404 404
1734D04K282J407J28j925k311k600j415l5J594K363K292J603M58j272k397k839
$$ 404 2686 4093 4221 2296 -15 -2615 -4030 -4065 -2471 -108 2184 3787 4245 2973 576 -2263
1750b263j267n45J151K472K524J414J38o58k048k802j810l78J151J868K703J906
$$ -2263 -3530 -4075 -2924 -452 2072 3486 3624 2966 918 -1884 -3694 -4072 -2921 -1053 1650 3556
1766C556N11q03k365k166j926p83P62J876K451J976P14n58j756k557j996n32L12
$$ 3556 4067 3264 899 -1267 -3193 -3976 -3214 -1338 1113 3089 3803 3245 1489 -1068 -3064 -3596 -3284
1783c284K024K324J925P72l83j669k537k294q72N34J623K627K021P02J90j696
$$ -3284 -1260 1064 2989 3761 3378 1709 -828 -3122 -3994 -3460 -1837 790 2811 3513 3703 2007
1799B007k368k198j157J94J200K364K512J183j12j710j999j986j433L4J239J812
$$ 2007 -361 -2559 -3716 -3522 -2322 42 2554 3737 3625 1915 -84 -2070 -3503 -3469 -2230 -418
1815d18K432J471p9r14k189k223j528j51J251J902K366J362J80p87k052k129j705
$$ -418 2014 3485 3406 2492 303 -1920 -3448 -3599 -2348 -446 1920 3282 3462 2675 623 -1506 -3211
1832c211m08J145J698K033J842L43o88j868k118j743m20O69J674K063J804O18
$$ -3211 -3619 -2474 -776 1257 3099 3442 2754 886 -1232 -2975 -3395 -2726 -1052 1011 2815 3433
1848C433m42j902k056j808p82Q27J396K461J401J048m61j635j861k248r38N33
$$ 3433 2991 1089 -967 -2775 -3557 -2730 -1334 1127 2528 3576 3115 1480 -381 -2629 -3567 -3034
1864c034J334J892K146J095k85j610j725k024j143O8J520K002J976J078J30j590
$$ -3034 -1700 192 2338 3433 3148 1538 -187 -2211 -3354 -3286 -1766 236 2212 3290 3420 1830
1880A830j976j814j322p1J362J967J784J065K91j430j514j797j336j92J013J780
$$ 1830 -146 -1960 -3282 -3353 -1991 -24 1760 2825 3116 1686 172 -1625 -2961 -3153 -2140 -360
1896c60J764J478K83q47k004j665j405l90P28J863K090J045N55q77j429k050j334
$$ -360 1404 2882 3165 2318 314 -1351 -2756 -3146 -2418 -555 1535 2580 3135 2258 829 -1221 -2555
1913b555m75P96J471J847J488L93m41j395j897j573o64J57J667J999J462O80m13
$$ -2555 -3030 -2234 -763 1084 2572 2965 2524 1129 -768 -2341 -3005 -2848 -1181 818 2280 2960 2547
1930B547j486j616j693n98M53J076J825J516R13l15j325j232k068p25J71J085
$$ 2547 1061 -555 -2248 -2846 -2393 -1317 508 2024 2937 2622 1297 65 -2003 -2728 -2557 -1472
1946a472J838J432O81lq82j625j959q08K61Q40J756J456J322k5j151j665j610
$$ -1472 366 1798 2479 2476 1594 -31 -1990 -2798 -2537 -1697 59 1515 2837 2812 1661 -4 -1614
1963a614j024k97J090J574J728J092P1o21j797j446r93n48O39J991J279J129M60
$$ -1614 -2638 -2935 -1845 -271 1457 2549 2620 1999 202 -1244 -2237 -2785 -2146 -155 1124 2253 2713
1980B713r55j427j438j147m93P86J249J919J136R1k06j626j401j305l38L18J054
$$ 2713 1758 331 -1107 -2254 -2747 -1961 -712 1207 2343 2434 2228 602 -799 -2104 -2442 -2124 -1070
1997a070J758J307N94p24r74j497j242o43M24J014J406J815L95m23j096j570j164
$$ -1070 688 1995 2589 1865 891 -606 -1848 -2491 -2067 -1053 353 2168 2563 2140 1044 -526 -1690
2014a690o50M6J181J600J281O28l05q63j626q23q96q2J029J232J275P49m2o99
$$ -1690 -2340 -2294 -1113 487 1768 2396 2091 1228 -398 -1221 -2117 -2199 -1170 62 1337 2086 2044 1345
2032A345j393j420p95K5R77Q37J745Q46J64j153p65j634p99j66P70J207J232J020
$$ 1345 -48 -1468 -2263 -2238 -1261 -424 1321 2167 2331 1178 413 -1221 -2020 -2186 -1416 -209 1023 2043
2050B043N20j113j267j270q78o5M70J317J102J166J38m71j248j098j369k77M62
$$ 2043 2563 1450 183 -1087 -1965 -2030 -1560 -243 859 2025 2163 1692 444 -654 -2023 -2300 -1838
2067a838J340J310Q62M97n55j081j258j100k79J54J239J254J072O02l60j151j245
$$ -1838 -498 812 1674 2171 1616 535 -723 -1823 -2102 -1948 -709 545 1617 2219 1859 708 -537
2084e37r03n97J82R46J378J128O18j91j231j249j172m63K99O74J174J384K77L91
$$ -537 -1440 -2037 -1855 -909 469 1597 2215 2024 793 -456 -1628 -2091 -1792 -1118 56 1440 1717 2108
2102B108j269j039j036r11K07O52J254J143Q42J3r08j182j020o37j9Q19R29J105
$$ 2108 839 -200 -1236 -2147 -1940 -1288 -34 1109 1951 1964 1056 -126 -1146 -1783 -1802 -983 -54 1051
2120A051P48J68r56r80j016q82K14m2J635J036P22Jl57j027r88p87l29M46Q08
$$ 1051 1799 1967 1011 31 -985 -1867 -1653 -1695 -60 976 1698 1699 1342 315 -673 -1460 -1789 -1343 -535
2139e35J442O23L87p46r34o93j099n49P60J101J024R94j18J28j180j208q68q2
$$ -535 907 1530 1917 1171 237 -456 -1555 -2104 -1344 -243 781 1775 1657 1785 605 -603 -1471 -1553
2157a553Q3R30Q74J090L75j62r49r41j117k45%P44J351O82O18l93n18j063r88
$$ -1553 -1470 -540 334 1424 1799 1637 688 -253 -1370 -1615 -1615 -871 480 1162 1780 1387 869 -194 -1182
2176a182k43l44O83J176P69O69K31j001r46p60p24r0Q57J000Q91L32J35m81r46
$$ -1182 -1425 -1769 -1086 90 859 1528 1759 758 -188 -948 -1672 -1762 -905 95 986 1318 1453 972 26
2195B6r07o68O4O26P65J025N77J04n38r00r14p33j70M56J042Q42P29k7k98r15
$$ 26 -881 -1549 -1485 -859 -94 931 1508 1612 1074 174 -740 -1473 -1643 -1187 -145 697 1426 1399 1101 186
2215A86j053o18p8J4J461P26O44J04j65r06p31r31m58N35M06J232P07P13o08p06
$$ 186 -867 -1485 -1563 -1549 -88 638 1282 1386 1221 315 -416 -1347 -1805 -1270 -864 368 1075 1788 1180 474
2235D74r23q05l00N63O16P82O77O22m95n19j112j012o2j11R46J108L93Q08k41
$$ 474 -449 -1254 -1554 -991 -375 407 1084 1706 1211 692 -420 -1432 -1494 -1605 -659 449 842 1650 1409
2254A409q20r23o30m28K41J81J339M37N22K3n94p21q93o44K94L57R39J067nJ91
$$ 1409 589 -334 -964 -1392 -1151 -970 369 806 1328 1351 757 36 -857 -1501 -1207 -850 89 1156 1151 1342
2274A342o10q92n86p62K98J40Q22J131L65L73n20r74o95q88o9Q24P73M32O30J96
$$ 1342 732 -160 -746 -1508 -1210 -1070 -248 883 1248 1621 1101 127 -568 -1456 -1525 -701 72 504 1134 1330
2294A330m60p07p73n03m84P13M73R84L02N89m15p92p28o95K9kQ56O41O02N86j88
$$ 1330 870 163 -610 -1113 -1597 -884 -411 573 875 1464 1049 257 -471 -1166 -1137 -1139 -283 358 960 1546 1358
2315A358q51j044m36k40j6Q95O47O18O28n54k69o93j003m63k6Q46Q46O80L36j31
$$ 1358 507 -537 -973 -1213 -1229 -334 313 931 1559 1005 736 43 -960 -1423 -1449 -603 243 923 1259 1128
2335A128p41n26n74p37M26M88P66M19N21J63n71r22r67j06K30J73P84Q74M04J83
$$ 1128 387 -139 -713 -1450 -1024 -536 230 649 1170 1333 762 -160 -1127 -1233 -1003 -830 -46 828 1232 1415
2355A415p72n82o41l86O1q2R79N94O15l00o5p52p68m19k45M02P23N19O82L21l07
$$ 1415 643 61 -580 -966 -905 -987 -8 586 1201 901 836 84 -684 -1103 -1348 -946 -223 296 978 1299 992
2376I92r74l64n99j49J94N28M66N32M68p6l38j386p0k88K53L42Q67O81J31k12
$$ 992 18 -346 -945 -1094 -900 -372 94 626 1094 1018 680 -706 -776 -1064 -811 -469 398 1079 1210 998
2396I98n05q31o69q6K05M75O53O36M74m33k62n71r05m83K88P12L20M81N87Q3p13
$$ 998 493 -338 -1007 -1093 -888 -413 240 876 1350 917 655 84 -821 -1304 -1016 -304 16 497 1084 1167 454
2417D54m36p69j47p5N62N79K85P38o3n49q59m02k24n7J97O13O64M10P6o17l60
$$ 454 18 -751 -898 -973 -411 168 453 1191 1128 579 -280 -682 -906 -963 -766 -153 511 921 997 380 20
2438B0p43k18j68M30P21L43M37K92l03o68p64j31k80J63P02N92M79K74o55k44
$$ 20 -723 -941 -1109 -679 42 385 822 1114 811 143 -621 -752 -1032 -869 -167 425 904 1178 523 279
2458B79q12j40n13O16K45O73M62M45m74n37n75n52j44J39P67L52M38K26j24n93
$$ 279 -533 -673 -1186 -570 -325 348 810 1255 781 244 -331 -883 -1027 -888 -121 231 669 895 771 178
2478A78n31l88m4nM37L51R32L43l49k33q63p24l55K67N87N28P20K6p3k40q69l62
$$ 178 -353 -741 -785 -790 -353 -2 930 1273 924 691 -172 -896 -1251 -984 -397 131 851 877 804 564 -305 -667
2500f67l77K11O73K98L78L09J55o89j86o97j64l39P07J73Q59J82K80n46o47j04
$$ -667 -1044 -833 -160 138 516 825 980 291 105 -592 -756 -1095 -388 -215 644 826 1106 560 -87 -191
2520a91m69k38N89O3P74L01P6m71k53n41m84N28n35Q55M03L88o4j06l69n01j96
$$ -191 -660 -898 -309 -246 528 829 905 434 181 -360 -844 -316 -851 4 407 795 731 625 256 -245 -441
2541d41l84L11J82O87M05K77m89k00n62o35J27J7M39M49O07j83r0k05m57l72l94
$$ -441 -825 -514 -332 355 760 1037 548 348 -214 -849 -722 -705 -266 183 790 607 517 312 -145 -517 -911
2562i11K96K85N52K88K90j13m90r7o31j83J99K83L34M46M07l91j20l29m77l23
$$ -911 -615 -330 222 510 800 687 197 100 -531 -714 -515 -232 102 548 955 564 444 115 -362 -685
2582f85N7M46K29M44N6R3r5m26p22r1k09P43P7M88J53J58k31o13m12rR2j52N70
$$ -685 -628 -182 47 491 547 640 545 119 -603 -694 -903 -160 -83 405 558 716 485 -128 -540 -549 -457 -609 -39
2605c9L22R5J79L7m14n48m05m3K91K96O56R0oQ4m15m45n33K47k33N70N58J92M23
$$ -39 283 378 557 594 180 -368 -773 -816 -525 -229 427 517 511 595 180 -265 -798 -551 -784 -214 344 536 959
2628I59l88m54m63m07k94O64J08M30N51R2k10j70m80m74k19l0L05P02K87K34p4
$$ 959 571 117 -346 -753 -1047 -383 -275 155 706 798 588 418 -62 -536 -755 -785 -480 222 509 743 669
2649F69k62q56l48L08j06N6P52J93K66m4n33l61j04k48MM18J96O12J23k74l58
$$ 669 407 -449 -797 -489 -595 -539 213 406 672 628 95 -266 -370 -618 -614 -196 0 612 735 461 103
2670A03l11j75k51J7M22M98K00K16p2k26k86k54n46Pr5P03N92j2L94l99m31o57
$$ 103 -208 -383 -634 -617 -195 303 503 719 647 421 135 -119 -665 -658 -753 -50 542 530 924 525 94 -563
2692e63J17j10J75K47M70q6M69l36k61n38j11k20J58L62L89M56km4o53k67j64
$$ -563 -446 -556 -381 -134 336 250 719 383 122 -416 -527 -747 -589 -227 162 618 616 572 -81 -348 -512
2713e12k57N40J75J63N32p6j0n85J54p62J74K9N90j25O53k02N1j16k84m53l49
$$ -512 -769 -229 -54 109 641 565 555 -30 124 -638 -464 -435 155 30 683 481 532 416 132 -321 -670
2734f70J55Q7N27L51P0N08q11n66k92P9L09j06M75M10R1k12n1l51m91Pk57J96
$$ -670 -515 -428 99 450 520 1028 217 -349 -641 -562 -253 -359 116 526 617 405 354 3 -488 -481 -738 -542
2756e42M74K29L81J70k34m11n90j79J97M9O52l8L08J87k74j57l66l62j43N00j21
$$ -542 -68 161 542 712 478 67 -523 -702 -505 -456 196 158 466 653 379 222 -144 -506 -649 -149 -270
2777b70O98Q6K19m33k1n59k45k28L72K11N98J61p6k1k23n05k65k54M20j4N52L15
$$ -270 428 514 733 300 279 -280 -525 -753 -381 -170 428 589 513 492 269 -236 -501 -755 -335 -349 203 518
2799E18k55L56n79k72l47K03k93N51L95K71K6k55K61n96l64l05L17R4L51M11j0
$$ 518 263 619 40 -232 -579 -376 -669 -118 277 548 574 319 580 -16 -380 -685 -368 -274 77 488 478
2820D78J57l37m29k13k83M73N1K48K56L15j75m23P2m26k64Q9J40L72M4M43q9j70
$$ 478 635 298 -131 -344 -627 -154 -103 145 401 716 541 118 190 -236 -500 -411 -271 101 145 588 499 329
2842C29r6n82k81J06L84k01O64J87j03M9k93m37k36P5r9M15L59J96K71k18n09
$$ 329 233 -349 -630 -524 -140 -341 323 510 407 456 163 -274 -510 -435 -534 -119 240 436 707 489 -20
2863b0k36j04n6L2M19J06K22K6J12o64pp2k35K66K75K07L27r6K21n52l67j92q1
$$ -20 -256 -360 -416 -384 35 141 363 389 501 -163 -170 -242 -477 -211 64 271 598 502 723 171 -196 -388 -469
2886d69j84M30J64N52J05L3l66n37j31j78J92j2J46N48m4L21l07j93k50k57j55
$$ -469 -653 -223 -59 493 598 631 265 -272 -403 -581 -389 -401 -255 293 249 570 263 70 -180 -437 -592
2907e92M04Q7M51J18m1J0l25n07j44R3pM44K20P5K61m41j48k05l95K31K58K27
$$ -592 -188 -101 350 468 427 437 112 -395 -539 -446 -453 -9 211 286 547 106 -42 -247 -642 -411 -153 74
2929G4M64l34K01J87o02k69j06n0L32O6J95J31Q5j67j06J19n80j84n3M07M39M3
$$ 74 538 204 405 592 -10 -279 -385 -435 -103 -37 158 289 374 207 101 220 -360 -544 -597 -190 249 292
2951B92J74r1k99j23k7l60QJ66N20O4K85k87J38o02j18k4l05K23N30K27J59L2
$$ 292 466 375 76 -47 -74 -434 -426 -260 260 324 609 322 460 -142 -260 -284 -589 -366 164 391 550 582
2973E82j35l63j83l86M84j11j41M17M35p5l65k52l02L22j64k25M32L01k28K27
$$ 582 447 84 -99 -485 -1 -112 -253 164 599 524 159 -93 -395 -73 -237 -462 -30 271 43 270
2993B70j1k20k58O9l01J46L28k58P07m0l39o5j58j62j81N7L64J48M96j84k15J79
$$ 270 259 39 -219 -150 -451 -305 23 -235 472 432 93 28 -130 -292 -473 -416 -52 96 592 408 193 372
3015C72m36j36j43L3K14L02J42j46K58j50m94j96K9J06J60K78J83j81N8J71n54
$$ 372 -64 -200 -343 -310 -96 206 348 202 460 310 -184 -380 -351 -245 -85 193 376 195 253 424 -130
3036a30p0m7N6j02P3L98K47k76J15l11j33r7m8J02M04m4K67J60l67k97M2n1n7
$$ -130 -200 -247 -191 -293 -220 178 425 149 264 -47 -180 -277 -325 -223 181 137 404 564 197 -100 -58 -109 -166
3059a66K2K06J67J63r3j98j29j72O5k47j39J48L21O79j09Qm09k52M6k37M7K87
$$ -166 -144 62 229 392 299 101 -28 -200 -135 -382 -521 -373 -52 627 518 526 117 -135 -89 -326 -279 8
3081Hk1L57j00K38m92k16j00J62k69M29k34N09Q2l6j05k51m5k34J7L62P4J01m3
$$ 8 -13 344 244 482 -10 -226 -326 -164 -433 -4 -238 271 353 317 212 -39 -84 -318 -301 61 135 236 193
3104A93K10j68j84l85N6J22j66K40L10K30k05M3m27j50J19j35J36J25q2M79l58
$$ 193 403 235 51 -334 -278 -156 -322 -82 228 458 253 296 -131 -281 -162 -297 -161 -36 -118 361 3
3125CJ19nk07jk94j76M35J71J10N83p06K4j57j10l0J09L47oJ72R9l53j9k04l55
$$ 3 122 117 -90 -91 -385 -561 -126 45 155 738 32 56 -101 -211 -241 -132 215 209 381 480 127 108 -96 -451
3149d51K4O0J18M81r6j5N0j35k01j16R2O2J26m1J87K62l06J26l48j22q5L8K97
$$ -451 -427 -367 -249 232 136 121 171 36 -165 -281 -189 -127 -1 -42 145 407 101 227 -121 -243 -328 -290 7
3172Gn9J45M47l01n5m04j9j28R8L09k19M72j1Nl17q7J4k25J8L48r1L06j53L80
$$ 7 -52 93 540 239 184 -220 -239 -367 -269 40 -179 293 282 287 -30 -117 -103 -328 -310 38 -53 253 100 480
3196D80l65l49M5P5m7K28Q1j10L00J22m43J20k90j55k8m1L30l3J11J84j91J5j15
$$ 480 115 -234 -189 -114 -161 67 148 38 338 460 17 137 -153 -308 -336 -377 -47 -80 31 215 24 39 -76
3219g6j06K06j32N2K69N8k99R1J28j47n29O32j87m7L08m7K02Q1l92k10J64n06
$$ -76 -182 24 -108 -56 213 271 -28 63 191 44 -485 147 -40 -87 221 174 376 457 65 -145 19 -487
3241d87K11Q2M29Q5k15J55k09l0k71P1MK6R2J85j39L13j80j00J38l33J53n0j0
$$ -487 -276 -194 235 320 105 260 51 21 -250 -179 -175 -149 -57 128 -11 302 122 22 160 -173 -20 -70 -80
3264h0K88j31k7J72k41K9k71O0N3m0L02L9k6K52m22J16N3l15K33qJK0K18J0n24
$$ -80 208 77 50 222 -19 10 -261 -201 -148 -188 114 153 127 379 -43 73 126 -189 44 36 37 57 275 285 -239
3289b39r4j4m0K35J45K60N7k2j38J37k01k60l4K10k59L44N1J93k65m1M4l6k30
$$ -239 -333 -347 -387 -152 -7 253 310 288 150 287 86 -174 -208 2 -257 87 138 331 66 25 69 33 -197
3312a97o2M05r0L02m47ML69l70K11j59l40L67Q8K17j97J78j89q2k39k77K57J77
$$ -197 -259 146 56 358 -89 -85 284 -86 125 -34 -374 -7 81 298 101 279 90 8 -231 -508 -251 -74
3334g4K6K74R9nl88M7l69J96J08J00j29M0n3M09J66l58p7j76j31J91J03q4M38
$$ -74 -48 226 325 320 -68 -21 -390 -194 -86 14 -115 -75 -128 281 447 89 12 -164 -295 -104 -1 -85 353
3357C53k22J14m7k89K1j94M0L93pL6j24k4J9j55m1k8p5K97m3n2K59N4k44ql87
$$ 353 131 245 198 -91 -70 -264 -224 169 162 198 74 50 69 -86 -127 -155 -230 67 24 -28 231 285 41 33 -354
3382c54q1K20L6K39r9L09j03j65j05m5J31l31M23K1j87K37o8k7r8J75P8k20k15
$$ -354 -435 -215 -179 60 -39 270 167 2 -103 -148 -17 -348 75 96 -91 146 78 51 -47 128 206 -14 -229
3405b29J22K53K85m76K80o0j23k68j0k0L69M2nm2j3j85p4k67O17l02J77k4R5J79
$$ -229 -107 146 431 -45 235 175 52 -216 -226 -246 123 165 160 118 105 -80 -154 -421 196 -106 71 47 142 321
3429C21j86P9m40K53j85J75k50L4M72Q1l87J81k38p5J91k26j89L84L42k97K07
$$ 321 135 214 -226 27 -158 17 -233 -199 273 354 -33 148 -90 -165 26 -200 -389 -5 337 40 247
3450B47n42M4J67j17R2K72j87J99J1O1k72M2O4l05K44o3K92j9M4j75o0m5p8j61
$$ 247 -295 -251 -84 -201 -109 163 -24 175 186 247 -25 17 81 -224 20 -43 249 230 274 99 39 -6 -84 -245
3474b45K51n0K95k59N09j23l51J36l90qJ86J45k57M14j95k0K56l27n0J45l64M77
$$ -245 6 -44 251 -8 501 378 27 163 -227 -235 -49 96 -161 253 58 38 294 -33 -83 62 -302 175
3496A75l11J88K3K61J42o86L37l79J45j36J49J48q6J62r9J33k57N0k37J99L1r9
$$ 175 -136 52 75 336 478 -208 129 -250 -105 -241 -92 56 -30 132 33 166 -91 -41 -278 -79 -48 -147
3518a47K84K35k69P7l29j23N5J62j1K33J06j48m2Rk43M8q3k31K36O6K21J80k11
$$ -147 137 372 103 180 -149 -272 -217 -55 -66 167 273 125 83 92 -151 -103 -186 -417 -181 -115 106 286 75
3541G5P6j2j2k07j20O3O2P7J04k95M10p7j06l27L65K2Q1N7p6Q3l20J07j68J17
$$ 75 151 139 127 -80 -200 -137 -75 2 106 -189 221 144 38 -289 76 98 179 236 160 243 -77 30 -138 -21
3565b1J56j79O1q9K69M5P5k01n3l46l2M58r9o2P3J18j91j34L17j58l5p5Q1RQ1
$$ -21 135 -44 17 -72 197 242 317 116 63 -283 -315 143 44 -18 55 173 -18 -152 165 7 -28 -103 -22 -13 68
3590F8L24m99J29r9J56k50K34k73L55M9k13M7L09m87J74p40L57K08q0M58p2R6
$$ 68 392 -107 22 -77 79 -171 63 -210 145 194 -19 28 337 -150 24 -716 -359 -151 -231 227 155 251
3612B51k1m47K10k3l27L13m7L48j12jJ2J53l52Q1J01N3k01K65k77K10m45M69n3
$$ 251 230 -217 -7 -30 -357 -44 -91 257 145 144 156 309 -43 38 139 192 -9 256 -21 189 -256 213 160
3635A60jk63j37K64J40k33J88J38k64K52l64J82k17N1K30r7l11K68j2K29m17L8
$$ 160 159 -104 -241 23 163 -70 118 256 -8 244 -120 62 -155 -104 126 29 -282 -14 -26 203 -214 -176
3657a76j21N1N50m91K29K02j48k73J78j93L59l41J17lO8J83R4l48L2j98j11K92
$$ -176 -297 -246 304 -187 42 244 96 -177 1 -192 167 -174 -57 -60 8 191 285 -63 -31 -229 -340 -48
3679d8k31L77k05n3L14k53J19k39M5J36k54K87J30n0Q2j22O5j97l4J53J0p5K59
$$ -48 -279 98 -107 -160 154 -99 20 -219 -174 -38 -292 -5 125 75 157 35 100 -97 -131 22 32 -43 216
3702B16O8l11k2qK5Q5j28n2LJ53J83lj4p9k56K01M2k80o4L15J98m2j32l90M21
$$ 216 284 -27 -49 -57 -32 53 -75 -127 -124 29 212 209 195 116 -140 61 103 -177 -241 74 272 230 98 -292 129
3727A29l31j33Q1L56j48J24J38j78j00l0j82L05J02j29J11j71J67k35J09j49L54
$$ 129 -202 -335 -254 102 -46 78 216 38 -62 -92 -274 31 133 4 115 -56 111 -124 -15 -164 190
3748A90k09L6k5Q3n1P7k8j88K24l53K35l25P1K19K27k01j40M4O9o5J33Nj23L51
$$ 190 -19 17 -8 75 24 101 73 -115 109 -244 -9 -334 -263 -44 183 -18 -158 -114 -45 -110 23 28 -95 256
3772B56m2l17N9J08m3O6J28m39%J34K0O8L6n9j89J54k23P9K08N3M0J0P4K9k66
$$ 256 214 -103 -44 64 21 87 215 -224 -224 -90 -70 -2 34 -25 -214 -60 -283 -204 4 57 97 107 181 210 -56
3797e6R1q7R9R7k87K85q0K79k23Lk23P0k09j16M16l9n1j72L44O5l41K8qK33m9
$$ -56 35 -52 47 144 -143 142 62 341 118 121 -102 -32 -241 -357 59 20 -31 -203 141 206 -135 -107 -115 118 69
3822F9k22M25j25j68PJ49l05L78m21K20J62j34j46K00J19j83N0k83J59k26O9L14
$$ 69 -153 272 147 -21 -14 135 -170 208 -213 7 169 35 -111 89 208 25 75 -208 -49 -275 -206 108
3844A08K85l05J06l47M39o06J90K11l7J07j46J95j31L7j36l6J83k0k03J69J11
$$ 108 393 88 194 -153 286 -320 -130 81 44 151 5 200 69 106 -30 -66 117 97 -106 63 174
3865A74j02R0j88Q4j00l03J31J84R0j43K11l4n5j91M10l41K4Q2j7j51K05J45l26
$$ 174 72 162 -26 58 -42 -345 -214 -30 60 -83 128 94 39 -152 258 -83 -59 23 6 -145 60 205 -121
3888a21K75o2N0j23l79L73L62k74l4K51l69Mj45J2K81jJ3l5J05j33J00k61J15
$$ -121 154 92 142 19 -360 13 375 101 67 318 -51 -47 -192 -180 101 100 113 78 183 50 150 -111 4
3911DJ51k41N2o6Q5P2P2k51m5j90K50K9L7J24N9k56j55M30m08L47%N6n9l28M44
$$ 4 155 -86 -34 -100 -15 57 129 -122 -167 -357 -107 -78 -41 83 142 -114 -269 161 -247 100 100 156 97 -231 213
3936B13k54l3N00l19j54J2j69K72j4k29J47L2j90L93k80j06Q0j4J99j2j46J88
$$ 213 -41 -74 426 107 -47 -35 -204 68 54 -175 -28 4 -186 207 -73 -179 -99 -113 86 74 -72 116
3958A16m5M7m7m2K59o06N9M50o7K87k28l56J62J97k14K20k60j96M37j90J60j25
$$ 116 71 118 71 29 288 -318 -259 191 124 411 183 -173 -11 186 -28 192 -68 -264 173 -17 143 18
3980A8r9J18r2J29l65K99K12K06j35l38j03K37l17M76m12J27P0N5J43j16j11J69
$$ 18 -81 37 -55 74 -291 8 220 426 291 -47 -150 87 -230 246 -166 -39 31 86 229 113 2 171
4002A71k61J22Ok16K55k01J14K84K36o47L89l76J54m8K72m99K09K71j86j53M7
$$ 171 -90 32 38 -178 77 -124 -10 274 510 -137 252 -124 30 -18 254 -245 -36 235 49 -104 -57
4023e7K06l42K72q4J23K35l20j19L4P0j49J24n7l8K87J29j75j12L3j49k5K48J68
$$ -57 149 -193 79 -5 118 353 33 -86 -52 18 -131 -7 -64 -102 185 314 139 27 60 -89 -114 134 302
4046C02j48L0l20K25j6j62J58p5l6O5j15K40K07j08k62K81l08l0o2J7Q3J55r3
$$ 302 154 184 -136 89 73 -89 69 -6 -42 23 -92 148 355 247 -15 266 -42 -72 -134 -117 -34 121 28
4069B8J3K33j79r4o6J51l30M48k58k11R2J89J30k24R8j02N6J16K4L71n23K64j85
$$ 28 41 274 95 1 -65 86 -244 204 -54 -265 -173 16 146 -78 20 -82 -26 90 114 485 -38 226 41
4092D1K71Qk59k99R3M6L24m3j82l1L9J23l14J82J8k53J73J38J36k59k6K02l88
$$ 41 312 320 61 -238 -145 -99 225 182 0 -31 8 131 -183 -1 17 -236 -63 75 211 -48 -74 128 -260
4115b60J5L39m13K26J17K20k55j07J5R9k40o6K14Q1P6J43k70k2Q0r9M0R8J60l99
$$ -260 -245 94 -319 -93 24 244 -11 -118 -103 -4 -244 -310 -96 -15 61 204 -66 -88 -8 -107 -67 31 191 -208
4139b08J89m6K71m18N9J57k62J75rJ67l22K97q9p0K76j68j45p9L95j21J03Mq3
$$ -208 -19 -65 206 -212 -153 4 -258 -83 -92 75 -247 50 -39 -109 167 -1 -146 -225 170 49 152 156 73
4162G3j43K5j6J27qK71m40K34L0j19JJ39m93L44j30K61J0n4j61Q0m0Q4N9k55R8
$$ 73 -70 -45 -61 66 58 329 -111 123 153 34 35 174 -319 25 -105 156 166 112 -49 31 -9 75 134 -121 -23
4187b3Q5j59J56J57j52N9j9L4k67l1J48jJ56l12K31K47n05k9j59L39j9k10L42
$$ -23 62 -97 59 216 64 123 104 138 -129 -160 -12 -13 143 -169 62 309 -196 -225 -384 -45 -64 -274 68
4210F8R1j30L10k69j24J6m4L9n1m5J62J4j53J5L28m50K05P6l96O83j93J57k93
$$ 68 159 29 339 70 -54 -38 -82 -43 -94 -139 23 37 -116 -101 227 -223 -18 58 -338 345 152 309 16
4233A6J26M9m44J44L48k44O7J37j94J67L4j87l01L61M1j70l49N05P2r3j21j14
$$ 16 142 191 -253 -109 239 -5 62 199 5 172 206 19 -282 79 120 -50 -399 106 178 85 -36 -150
4255a50K29j03Q1k01K05k15K60j67j12K60k84J75o1Q6K46Rj37rK4j34J2l50J03
$$ -150 79 -24 57 -144 61 -154 106 -61 -173 87 -197 -22 -83 3 249 258 121 112 136 2 14 -336 -233
4278b33k6L66J7o1J04o9J0r9j38N0J11l01L76J92k16k12J64n7n3J04j08o2K19
$$ -233 -259 107 124 63 167 98 108 9 -129 -79 32 -269 107 299 83 -129 35 -22 -75 29 -79 -141 78
4301G8Ml2p6L73k55k18J41p7q5J12K97j81k11J45k37L06j99M8j1q5K57K32m02
$$ 78 82 50 -26 347 92 -126 15 -62 -147 -35 262 81 -130 15 -222 84 -115 -67 -78 -163 94 326 -76
4324g6M38l53j29K82j71m6J44J67m39N77k78j92q7K06m5j59J72j45k3L12j30O9
$$ -76 362 9 -120 162 -9 -55 89 256 -183 394 116 -76 -163 43 -2 -161 11 -134 -157 155 25 94
4346I4K1l13L2k11K02K46P7k01J21j37m1L48n40J67K64J74l00J62M0K0qk75o8
$$ 94 115 -198 -166 -377 -175 71 148 -53 68 -69 -110 238 -302 -135 129 303 3 165 205 225 217 -58 -126
4369a26R8K9j18N07l31J09m00K0K83j7k8j77N8J81NJ77j44k07J41J36j84j39K34
$$ -126 -28 1 -117 390 59 168 -232 -212 71 54 26 -151 -93 88 93 270 126 -81 60 196 12 -127 107
4392A07k25k70L09j26L49j12j62l1Q7J5r5L43k57K06J35n26L69k64J33J19k56
$$ 107 -118 -388 -79 -205 144 32 -130 -161 -74 -59 -154 189 -68 138 273 -253 116 -148 -15 104 -152
4413a52R5J91J27k69q5q5lJ2l08N14o2NJ43n3K71k87M6j90j27K26r1K79p9q0j70
$$ -152 -57 134 261 -8 -93 -178 -181 -169 -477 37 -25 -20 123 70 341 54 100 -90 -217 9 -82 197 118 38 -132
4438a32P4o2J00M5n9J48m3R3k64q8K91j13j04K1J74J21J3k45J94l2k24j84K50
$$ -132 -58 -120 -20 25 -34 114 71 164 -100 -188 103 -10 -114 -93 81 202 215 -30 164 132 -92 -276 -26
4461b6J18m12M37j82J42Q7j03m5j56J6K23j75L77j6k8k3pL8k37j30qK55n11K48
$$ -26 92 -320 117 -65 77 164 61 16 -140 -124 99 -76 301 285 257 234 227 265 28 -102 -110 145 -366 -118
4485a18J74%k1J91k10Lp5m2K6Q4J49k58J43R4m31L45p4j2K68j89L3q7Q4j34O1
$$ -118 56 56 35 226 16 19 -56 -98 -72 12 161 -97 46 140 -291 54 -20 -32 236 47 80 -7 77 -57 4
4510Dk03L24m59K25K30j22j92L75R7n30K27k31K65Q1k87J72L51n7r1j51R4l66
$$ 4 -199 125 -334 -109 121 -1 -193 182 279 -251 -24 -255 10 91 -196 -24 327 270 179 28 122 -244
4532b44K21l5q2K68%p5m2j9j29p2L5N2O8O9K83k49j87M7p8P4j42J29q8J13R3n2
$$ -244 -23 -58 -140 128 128 53 11 -8 -137 -209 -174 -122 -54 15 298 49 -138 -91 -169 -95 -237 -108 -196 -83 10 -42
4558d2M9j14j56K14m8K54%j13j13R2Q7J67m03j21J35J18mj67J57J27K1j39j17
$$ -42 7 -107 -263 -49 -97 157 157 44 -69 23 110 277 -126 -247 -112 6 2 -165 -8 119 140 1 -116
4581a16j43K72j89L57k6j97J40J53O3l27j93L06j78J7j11L79j14p9M7K1J64l99
$$ -116 -259 13 -176 181 155 -42 98 251 314 -13 -206 100 -78 -61 -172 207 93 14 61 82 246 -153
4603a53oQ3L10k6k30K90k83j26J29N6j32K9k55K37N0LK6L45k55j53n8k31M75K9
$$ -153 -159 -76 234 208 -22 268 -15 -141 -12 44 -88 -59 -314 -77 -27 -24 2 347 92 -61 -119 -350 125 154
4627A54q2n5P6p8r3k98K69L02k39L67r2k40q1M4j02J57q6k6J16j58K89M1k29k41
$$ 154 72 17 93 15 -78 -376 -107 195 -44 323 231 -9 -90 -46 -148 9 -77 -103 13 -145 144 185 -44 -285
4651b85K46K10q9k04J29J35j91K0M33l54N4o3q7K13n9q5L4l06P5K14k7M8j43k12
$$ -285 -39 171 82 -122 7 142 -49 -29 404 50 104 41 -46 167 108 23 57 -249 -174 40 13 61 -82 -294
4675b94K26j87K74m1L45l85J42j62kl0R8m3N56l93j0m7J04m25n9M45L2j00l03
$$ -294 -68 -255 19 -22 323 -62 80 -82 -84 -114 -16 -59 497 104 94 47 151 -274 -333 112 144 44 -259
4698b59j04L88Q5j78q4j81L59k73J4M5K63j37P6M8K9m25L69Qj29j2K57J21k83
$$ -259 -363 25 110 -68 -152 -333 26 -247 -233 -188 75 -62 14 62 91 -334 35 43 -86 -98 159 280 -3
4721cK09k82j12j11L11Ln2J91j23n9j78K98rk57M35l64Oj67M68m31J78j9P3Q2
$$ -3 206 -76 -188 -299 12 15 -37 154 31 -28 -206 92 83 -174 261 -103 -97 -264 204 -227 -49 -68 5 87
4745H7k75K86k30K6p5L40k44K76n23M2J0L93l15j4K89j2j18O2j33j65K31J63j98
$$ 87 -188 98 -132 -106 -181 159 -85 191 -332 -290 -280 113 -202 -216 73 61 -57 5 -128 -293 -62 101 -97
4768i7M19j28Qj83q1J63j14l20M56J87n86K74O7j14R4J25k99r4m6L53j2MJ18k8
$$ -97 322 194 202 19 -62 101 -13 -333 123 310 -276 -2 65 -49 45 170 -129 -223 -269 84 72 76 194 166
4792A66j14N9j66j6K02j04J07m2l66L37J97k01p1N7r6N4J39pj69J32N6J3k92Q3
$$ 166 52 111 -55 -71 131 27 134 92 -274 63 260 59 -12 45 -51 3 142 135 -34 98 154 167 -125 -42
4816d2O4k13K29R6j37K40k17K1J47j65Q1Q6K01k31j5k98L10M7l51N3J8J65k6l
$$ -42 22 -191 38 134 -3 237 20 41 188 23 104 190 391 160 145 -153 157 204 -147 -94 -76 89 63 60
4840F0j87P5L37k89K2L3N1j35j13L40LMj88o1L4LK56k97K26j45P7n2J66k23k0
$$ 60 -127 -52 285 -4 18 51 102 -33 -146 194 197 201 13 -48 -14 -11 245 -52 174 29 106 54 220 -3 -23
4865b3j65K77J84j47J30l72L32k96k0J09j27K84j26r4K01oj24K50k93l8K07p11
$$ -23 -188 89 273 126 256 -116 216 -80 -100 9 -118 166 40 -54 147 141 17 267 -26 -64 143 -568
4887e68K96pP7L22L1j99m20L65J15%k20OL53Qk87J0J87Q5j27M5k71M5j2K06J20
$$ -568 -272 -279 -202 120 151 -48 -468 -103 12 12 -208 -202 151 159 -128 -118 69 154 27 72 -199 -154 -166 40 160
4912A60l30L00k66pJ82j74o4J55J70L03l51JK24k71J96k85l9L5K49k25On0l9K23
$$ 160 -170 130 -136 -143 39 -135 -199 -44 126 429 78 79 303 32 228 -57 -96 -61 188 -37 -31 -81 -120 103
4936A03m37J94nK0J39J18o0J72j44m8k18K55J08k42Q1R2K91m57j4LP0m4o9k9L00
$$ 103 -334 -140 -145 -125 14 132 72 244 100 52 -166 89 197 -45 36 128 419 -38 -52 -49 21 -23 -92 -121 179
4961A79J56n63M48l39K44l36K41J34k66K79k40K64j71ol23L49l4k2O3j28L42j85
$$ 179 335 -228 220 -119 125 -211 30 164 -102 177 -63 201 30 24 -299 50 16 -6 57 -71 271 86
4983H6L8m5k19L40l05j11J73Q8K0J21l27mP3p3r8%L52M5J90j46n5j10J4P9l7j61
$$ 86 124 79 -140 200 -105 -216 -43 45 65 186 -141 -145 -72 -145 -243 -243 109 154 344 198 143 33 47 126 89 -72
5009g2jmj31L78j09J66k74j48J58n5K9L8K27k14j01l7J06k15M27m67J25K39j04
$$ -72 -73 -77 -208 170 61 227 -47 -195 -37 -92 -63 -25 202 -12 -113 -150 -44 -259 168 -299 -174 65 -39
5032c9M06k90K5J06j64J17n5k71j03M99k55K53j88J30l59J69M7j45J53J7j95L58
$$ -39 367 77 102 208 44 161 106 -165 -268 231 -24 229 41 171 -188 -19 28 -117 36 53 -142 216
5054B16J1j53l33J60J27r3l2J78k08L36l59K46p7o6K3L5K3k00P9J5J5L28l70R5
$$ 216 227 74 -259 -99 28 -65 -97 81 -127 209 -150 96 19 -47 -24 11 34 -166 -87 -72 -57 271 -99 -4
5078dQ8l18J02J95q7J06K00k56k09K79q1l39M88l7J2j96J21k07N4K37q1m36K97
$$ -4 84 -234 -132 63 -24 82 282 26 -183 96 15 -324 164 127 139 -57 64 -143 -89 148 67 -369 -72
5101g2J39j28J23m2pJ06N2j53j02oJ65j83K47m2J7m44M91l41O3M7L33j71Lk3M
$$ -72 67 -61 62 20 13 119 171 18 -84 -90 75 -108 139 97 114 -330 161 -180 -117 -70 263 92 95 72 76
5126G6J49k42r1QJ89j92k23N98R3k73k1K5k00O7j29J09K08Q7k95j57J73K63l37
$$ 76 225 -17 -108 -100 89 -103 -326 272 365 92 71 96 -104 -37 -166 -57 151 238 -57 -214 -41 222 -115
5149a15j29J20J02M8R4q4j07L50j27J1l80K26n3m9j23K49k62J74J30n9K41l00
$$ -115 -244 -124 -22 26 120 36 -71 279 152 163 -217 9 -44 -93 -216 33 -229 -55 75 16 257 -43
5171d3k18J06K44q1k6J98j60j02J21l17J57j30K79J15k57L56p2q0m2k69N4O9K7
$$ -43 -261 -155 89 8 -18 180 20 -82 39 -278 -121 -251 28 143 -114 242 170 90 48 -221 -167 -98 -71
5194g1o4J91P1j34j64M3k0J93R8L9k42K76j79P6k84J23Q3k59J84K51j71j47J67
$$ -71 -135 56 127 -7 -171 -128 -148 45 143 182 -60 216 37 113 -171 -48 35 -224 -40 211 40 -107 60
5217F0ok08K03Km50L73j23K24j2l8j31J94J7m2j97K59j68J53j68nK21q1j78J6
$$ 60 54 -154 49 51 -399 -26 -149 75 63 25 -106 88 105 63 -134 125 -43 110 -58 -63 158 77 -101 -85
5241h5K77m78J17K38j43N64n11J77l46K29k30L05j24j61J82J65j82M19m34j09
$$ -85 192 -286 -169 69 -74 490 -21 156 -190 39 -191 114 -10 -171 11 176 -6 413 -21 -130
$$ [...]
8191B20
##END NTUPLES=NMR FID
##END=
