##TITLE=1H_DE-80H3_C
 200.13MHz, D2O,
 8 sc
 
 19ns.2.2025
##JCAMPDX= 6.0         $$ Bruker NMR JCAMP-DX V2.0
##DATA TYPE= NMR FID
##DATA CLASS= NTUPLES
##ORIGIN= UXNMR, Bruker Analytische Messtechnik GmbH
##OWNER= pz
$$ XWIN-NMR		Version 3.5
$$ Wed Feb 19 15:12:16 2025 Russian Standard Time (UT+4h)  new_Human@DPX200
##.OBSERVE FREQUENCY= 200.1313
##.OBSERVE NUCLEUS= ^1H
##.DELAY= (6, 6)
##.ACQUISITION MODE= SIMULTANEOUS
##.ACQUISITION SCHEME= undefined
##.AVERAGES= 8
##.DIGITISER RES= 18
##SPECTROMETER/DATA SYSTEM= spect
##.PULSE SEQUENCE= zg30
##.SOLVENT NAME= D2O
##.SHIFT REFERENCE= (INTERNAL, D2O, 0, 14.3821)
##AUDIT TRAIL= $$ (NUMBER, WHEN, WHO, WHERE, WHAT)
$$ ##TITLE= Audit trail, XWIN-NMR		Version 3.5
$$ ##JCAMPDX= 5.01
$$ ##ORIGIN= Bruker BioSpin GmbH
$$ ##OWNER= new_Human
$$ C:/Bruker/XWIN-NMR/data/yarkov/nmr/H-C/1/audita.txt
$$ ##AUDIT TRAIL=  $$ (NUMBER, WHEN, WHO, WHERE, WHAT)
(   1,<2025-02-19 15:07:56.07 +0400>,<new_Human>,<DPX200>,
      <created by zg, POWCHK disabled, PULCHK disabled
       configuration hash MD5:
       00 E9 B6 7A A2 85 ED C7 34 08 36 98 17 FE 4E 26
       data hash MD5: 16K
       EC 6D C0 D9 B0 22 9A FE 5D 34 E4 6C 30 B3 C5 18>)
$$ ##END=
$$ 
$$ hash MD5
$$ E0 FD BC F6 5C 71 C5 60 24 91 95 AC A0 72 72 BD
##$RELAX= 
##$RELAX= 
##$RELAX= 
##$RELAX= 
##$RELAX= 
##$RELAX= 
$$ Bruker specific parameters
$$ --------------------------
##$DU= <C:/Bruker/XWIN-NMR>
##$EXPNO= 1
##$NAME= <H-C>
##$PROCNO= 1
##$TYPE= <nmr>
##$USER= <yarkov>
##$AMP= (0..31)
100 100 100 100 100 100 100 100 100 100 100 100 100 100 100 100 100 100 
100 100 100 100 100 100 100 100 100 100 100 100 100 100 
##$AQSEQ= 0
##$AQ_mod= 1
##$AUNM= <au_zg>
##$AUTOPOS= <>
##$BF1= 200.13
##$BF2= 200.13
##$BF3= 200.13
##$BF4= 200.13
##$BF5= 200.13
##$BF6= 200.13
##$BF7= 200.13
##$BF8= 200.13
##$BYTORDA= 1
##$CFDGTYP= 0
##$CFRGTYP= 5
##$CHEMSTR= <none>
##$CNST= (0..31)
1 1 145 1 1 1 1 1 1 1 1 1 1 1 1 1 1 1 1 1 1 1 1 1 1 1 1 1 1 1 1 1 
##$CPDPRG= <>
##$CPDPRG1= <>
##$CPDPRG2= <>
##$CPDPRG3= <>
##$CPDPRG4= <mlev>
##$CPDPRG5= <mlev>
##$CPDPRG6= <mlev>
##$CPDPRG7= <mlev>
##$CPDPRG8= <mlev>
##$CPDPRGB= <>
##$CPDPRGT= <>
##$D= (0..31)
0 0.7 0 0 0 0 0 0 0 0 0 0.03 0 0 0 0 0 0 0 0 0 0 0 0 0 0 0 0 0 0 0 0 
##$DATE= 1739963275
##$DBL= (0..7)
120 120 120 120 120 120 120 120 
##$DBP= (0..7)
150 150 150 150 150 150 150 150 
##$DBP07= 0
##$DBPNAM0= <>
##$DBPNAM1= <>
##$DBPNAM2= <>
##$DBPNAM3= <>
##$DBPNAM4= <>
##$DBPNAM5= <>
##$DBPNAM6= <>
##$DBPNAM7= <>
##$DBPOAL= (0..7)
0.5 0.5 0.5 0.5 0.5 0.5 0.5 0.5 
##$DBPOFFS= (0..7)
0 0 0 0 0 0 0 0 
##$DE= 6
##$DECBNUC= <off>
##$DECIM= 32
##$DECNUC= <off>
##$DECSTAT= 4
##$DIGMOD= 1
##$DIGTYP= 9
##$DL= (0..7)
0 120 120 120 120 120 120 120 
##$DP= (0..7)
150 150 150 150 150 150 150 150 
##$DP07= 0
##$DPNAME0= <>
##$DPNAME1= <>
##$DPNAME2= <>
##$DPNAME3= <>
##$DPNAME4= <>
##$DPNAME5= <>
##$DPNAME6= <>
##$DPNAME7= <>
##$DPOAL= (0..7)
0.5 0.5 0.5 0.5 0.5 0.5 0.5 0.5 
##$DPOFFS= (0..7)
0 0 0 0 0 0 0 0 
##$DQDMODE= 0
##$DR= 18
##$DS= 0
$$ [...]
##$SUBNAM0= <"">
##$SUBNAM1= <"">
##$SUBNAM2= <"">
##$SUBNAM3= <"">
##$SUBNAM4= <"">
##$SUBNAM5= <"">
##$SUBNAM6= <"">
##$SUBNAM7= <"">
##$SUBNAM8= <"">
##$SUBNAM9= <"">
##$SW= 18.0517328524113
##$SWIBOX= (0..15)
0 0 2 0 0 0 0 0 0 0 0 0 0 0 0 0 
##$SW_h= 3612.71676300578
##$TD= 16384
##$TD0= 1
##$TE= 0
##$TE2= 300
##$TE3= 300
##$TEG= 300
##$TL= (0..7)
0 120 120 120 120 120 120 120 
##$TP= (0..7)
150 150 150 150 150 150 150 150 
##$TP07= 0
##$TPNAME0= <>
##$TPNAME1= <>
##$TPNAME2= <>
##$TPNAME3= <>
##$TPNAME4= <>
##$TPNAME5= <>
##$TPNAME6= <>
##$TPNAME7= <>
##$TPOAL= (0..7)
0.5 0.5 0.5 0.5 0.5 0.5 0.5 0.5 
##$TPOFFS= (0..7)
0 0 0 0 0 0 0 0 
##$TUNHIN= 0
##$TUNHOUT= 0
##$TUNXOUT= 0
##$USERA1= <user>
##$USERA2= <user>
##$USERA3= <user>
##$USERA4= <user>
##$USERA5= <user>
##$V9= 5
##$VALIST= <valist>
##$VCLIST= <CCCCCCCCCCCCCCC>
##$VD= 0
##$VDLIST= <DDDDDDDDDDDDDDD>
##$VPLIST= <PPPPPPPPPPPPPPP>
##$VTLIST= <TTTTTTTTTTTTTTT>
##$WBST= 1024
##$WBSW= 4
##$XGAIN= (0..3)
0 0 0 0 
##$XL= 0
##$YL= 0
##$YMAX_a= 146839
##$YMIN_a= -132799
##$ZGOPTNS= <>
##$ZL1= 120
##$ZL2= 120
##$ZL3= 120
##$ZL4= 120
##$ABSF1= 10
##$ABSF2= 0
##$ABSG= 5
##$ABSL= 3
##$ALPHA= 0
##$AQORDER= 0
##$ASSFAC= 0
##$ASSFACI= 0
##$ASSFACX= 0
##$ASSWID= 0
##$AUNMP= <proc_1d>
##$AZFE= 0.1
##$AZFW= 0.1
##$BCFW= 1
##$BC_mod= 2
##$BYTORDP= 1
##$COROFFS= 0
##$CY= -3
##$DATMOD= 1
##$DC= 2
##$DFILT= <>
##$DTYPP= 0
##$F1P= 0
##$F2P= 0
##$FCOR= 0.5
##$FTSIZE= 0
##$FT_mod= 4
##$GAMMA= 1
##$GB= 0.15
##$INTBC= 1
##$INTSCL= 1
##$ISEN= 128
##$LB= 0.25
##$LEV0= 0
##$LPBIN= 0
##$MAXI= 10000
##$MC2= 0
##$MEAN= 0
##$ME_mod= 0
##$MI= 1.114404
##$NCOEF= 0
##$NC_proc= 0
##$NLEV= 6
##$NOISF1= 3.799351
##$NOISF2= 2.8
##$NSP= 1
##$NTH_PI= 0
##$NZP= 0
##$OFFSET= 14.38212
##$PC= 1
##$PHC0= -1001.642
##$PHC1= 31.19221
##$PH_mod= 1
##$PKNL= yes
##$PPARMOD= 0
##$PSCAL= 0
##$PSIGN= 0
##$REVERSE= no
##$SF= 200.129724274929
##$SI= 16384
##$SIGF1= 3
##$SIGF2= 2
##$SINO= 400
##$SIOLD= 16384
##$SREGLST= <1H.CDCl3>
##$SSB= 0
##$STSI= 0
##$STSR= 0
##$SW_p= 3205.1282051282
##$SYMM= 0
##$S_DEV= 0
##$TDeff= 0
##$TDoff= 0
##$TI= <>
##$TILT= no
##$TM1= 0
##$TM2= 0
##$TOPLEV= 0
##$USERP1= <user>
##$USERP2= <user>
##$USERP3= <user>
##$USERP4= <user>
##$USERP5= <user>
##$WDW= 1
##$XDIM= 8192
##$YMAX_p= 0
##$YMIN_p= 0
$$ End of Bruker specific parameters
$$ ---------------------------------
##NTUPLES= NMR FID
##VAR_NAME=  TIME,          FID/REAL,        FID/IMAG
##SYMBOL=    X,             R,               I
##VAR_TYPE=  INDEPENDENT,   DEPENDENT,       DEPENDENT
##VAR_FORM=  AFFN,          ASDF,            ASDF
##VAR_DIM=   8192,          8192,            8192
##UNITS=     SECONDS,       ARBITRARY UNITS, ARBITRARY UNITS
##FACTOR=    0.0002768,     1,               1
##FIRST=     0,             0,               0
##LAST=      2.2672688,     0,               0
##MIN=       0,             -132799,         0
##MAX=       2.2672688,     146839,          0
$$ Real data points
##PAGE= N=1
##DATA TABLE= (X++(R..R)), XYDATA
$$ [...]
297A4866r233j0902q859l614K860Q375J0747Q979L938k504p722j0210q754m081
$$ 14866 5633 -5269 -14128 -17742 -14882 -6507 4240 13219 17157 14653 6931 -3279 -12033 -16114
311a6114J886O851R539Q778M626j440o773r185q261m300Q10N654Q628Q499M911
$$ -16114 -14228 -7377 2162 10940 15566 14126 7353 -1832 -10093 -14393 -13583 -7929 699 9198 14109
326A4109o44n603q157p881m815k8M712P720P778N096L76m386p419p509m865n37
$$ 14109 13465 7862 -295 -8176 -12991 -13019 -8307 -587 7191 12287 12663 8277 858 -6651 -11516 -12053
342a2053L757O608P408N296J072l713o571o999m905j245K884O009O771N165J628
$$ -12053 -8296 -1688 5720 11016 12088 8375 1804 -5195 -10100 -11345 -8461 -2452 4319 9484 11112
357A1112k705n750o524m853j642K221N091O212N057J970j942m971o122m834j933
$$ 11112 8407 2657 -3867 -8720 -10362 -8141 -3050 3162 8219 10189 8247 3276 -2846 -7680 -9613
372i613J490M425N710M929K384j250m192n657m654k204Q77L763N105M659K609
$$ -9613 -8123 -3698 2012 6941 9325 8075 3883 -1774 -6428 -8632 -7755 -3992 1113 5772 8381
387H381o50l650m974m575k422N34L160M542M483K752j41k957m548m377k539M8
$$ 8381 7731 4081 -893 -5468 -7890 -7356 -4196 346 4829 7581 7440 4483 -65 -4442 -6981 -6933
403f933K444M141M192K751K80k348m020m131k697k76K036L663M027K746N81j718
$$ -6933 -4489 -348 3844 6595 6875 4527 507 -3624 -6321 -6597 -4561 -898 3129 5875 6456 4738
419D738l627l922k755n89J547L192L641K827Q58j284l001l691k720r50J270K819
$$ 4738 1111 -2811 -5566 -6155 -4608 -1416 2225 5052 5910 4626 1625 -2066 -4786 -5736 -4466 -1647
435a647L380K655J082q72k583l397k821j106Q99K328L166K693J228o31k175l002
$$ -1647 1733 4388 5470 4598 2015 -1382 -4203 -5309 -4410 -2082 1084 3777 5005 4374 2199 -803
451h03k717j288N61K068K842K541J237j85j846k771k615j494L32J704K553K457
$$ -803 -3520 -4808 -4247 -2179 663 3204 4441 4256 2410 -361 -2976 -4470 -4138 -2434 119 2576
467B576J448q3j388k351k561j533j3J455K340K269J467N9j092k145k346j562k61
$$ 2576 4024 3941 2553 202 -2359 -3892 -3905 -2450 -110 2159 3626 3685 2593 448 -1898 -3460 -3721
484c721J099K095K189J476L82r05j826k226j571m49Q62J807K093J464M43o66j659
$$ -3721 -2622 -527 1662 3138 3520 2615 789 -1437 -3008 -3457 -2595 -788 1305 2769 3212 2546 887
501H87j969j520o33N89J753J831J510N93n13j406j882j447o30L46J321J778J442
$$ 887 -1082 -2602 -3235 -2646 -893 938 2448 3041 2528 1122 -760 -2207 -2837 -2491 -1170 608 2050
518B050P27l98j200j586j483p73K52J154J619J401P52j58r45j521j523p67J12
$$ 2050 2777 2379 1179 -407 -1890 -2663 -2411 -1257 362 1763 2515 2357 1412 -109 -1632 -2399 -2287
535b287Q75J474J380P28K0q48j368j290q20q6Q32J241J288R23M4o70j203j250
$$ -2287 -1412 62 1442 2170 2190 1342 -26 -1316 -2136 -2222 -1390 -149 1139 2062 2106 1436 233 -1017
553a017r37j29N81J179J220Q74J91n91r52j166q77k86N42R25J127Q88K95m85r28
$$ -1017 -1954 -2083 -1502 -323 897 1771 1962 1371 419 -747 -1624 -1910 -1368 -443 684 1572 1867 1382 454
572D54j042q49l75L13R50J010Q71L76l44p14j043q42m19K95P34Q94Q90M04j76
$$ 454 -588 -1437 -1812 -1499 -549 461 1332 1708 1364 650 -393 -1235 -1654 -1359 -625 269 1159 1563 1387
591A387p40r37p72m02J11N82R50Q04M03o8n88p71q39m71J30N45O91P13N45Km92
$$ 1387 647 -290 -1062 -1464 -1353 -771 179 983 1386 1318 730 -41 -880 -1351 -1221 -676 15 728 1273 1275 783
612G83p98p65m19l6L73P76P63M70P5m07o78p49m17j12L51O00P18M93P6k65o27
$$ 783 -15 -780 -1199 -1235 -862 -86 677 1147 1222 815 137 -612 -1029 -1141 -790 -190 528 1021 1097 832 205
633B05p06m43r8K82M99O11M74J79j48m98o71m84j22J63M02O61L92K36j65m23n97
$$ 205 -501 -944 -1042 -760 -261 350 824 1003 855 357 -314 -798 -920 -757 -355 306 698 934 769 346 -251
654b51m05j98R8M26N50M64J39m7m12n13m38k44J08L19M86M13J72O0l37l91n09
$$ -251 -656 -854 -756 -330 220 684 823 776 364 -149 -587 -831 -723 -404 82 495 667 727 390 -1 -510
675e10k55O8K90M17M02K56K8k17m96m69j78m6K55L57M16L29L9k06m03l81k82k6
$$ -510 -765 -697 -407 10 412 668 696 479 -17 -486 -664 -710 -455 -98 318 647 686 480 77 -304 -586 -612
697f12J14M03L92L01j6j35l37l80k71n4J21L10L00L66N2j28l21k91k59j03J17
$$ -612 -498 -95 297 598 582 447 110 -270 -541 -595 -474 -164 136 502 554 426 105 -186 -445 -548 -431
718d31K47L25K75O7l6k95k32l26r3M8K46K88L25P2p1j92k87k57j14L8J82K90K38
$$ -431 -184 141 416 483 447 152 -80 -406 -499 -451 -205 83 408 480 409 217 -70 -327 -441 -403 -221 69 307
741C07Q0N6k15k64k33j05l5J75K34K63O0N1j32k32k35j28K1P9J73K69J64j4j09
$$ 307 387 443 228 -36 -269 -374 -409 -234 0 263 323 374 242 10 -225 -353 -332 -253 -80 189 353 339 230
764B30j85k88j11j5J10K08K48J03M6p0j78k41j73o5Q3J79K36J99l7n0j51j27k09
$$ 230 45 -243 -354 -369 -259 -51 197 300 346 276 98 -143 -316 -381 -298 -119 117 316 279 229 78 -49 -258
787b58k1Q3J09J50J51P2J0j67k38j49nj9K13Q9J32J00j9q5j74j16j55J05O7K04
$$ -258 -279 -196 -87 63 214 286 296 129 -109 -258 -263 -282 -69 20 152 252 233 148 -26 -142 -297 -192 -125 79
811G9P2P9Jj24j06j48j22j0J05J61J30N4j9j8j81p4r6K1R7L5J41J09k3j1j50j40
$$ 79 151 230 231 107 1 -147 -269 -279 -174 -13 117 171 152 134 -47 -121 -217 -196 -99 -64 77 186 163 152 2 -138
837a38n3j0Q7O0J48P9M8o3j44q3q2n0M6O5J77P2L5n8p6j63m6k9N6L8J99K2N0J0
$$ -138 -191 -201 -114 -54 94 173 221 158 14 -69 -151 -201 -155 -90 87 159 194 136 60 -103 -149 -178 -122 -84 115 137 187 197
865A97j67n3o8q2j1J48N5P1O8m9j23k2o5j8J9J9M4J42L0l5n0j01o7LN5PL0J8J23
$$ 197 30 -23 -91 -173 -184 -36 19 90 158 109 -14 -36 -101 -119 -100 -81 -37 105 135 100 50 -51 -118 -115 -60 -53 -23 -5 118
894A18nm5J4j82j1QK6L6J05N2k9j3l5p2m9K2k6L9Q6K4J7J1q6n8n3M9m8M3R2M4
$$ 118 113 68 82 -100 -111 -103 -77 -41 64 116 87 74 39 -33 -82 -60 -86 -47 39 63 80 91 5 -53 -106 -57 -105 -62 30 74
924G4K4k2n5j27J1k8j9R2P3K9M5Km6j00J2j1qP1M6m4L0L7m0n3l2k9J6oP1J5O8
$$ 74 98 76 21 -106 -95 -123 -142 -50 23 52 97 99 53 -47 -35 -46 -54 17 63 19 49 86 46 -7 -39 -68 -52 -58 13 28 96
955I6mn5o5Pj03Q4p0P7J5O7L5q3J0m1j4m5P0j0Q4K9l1j9k6k6j1k3JMN4Rk8j8K8
$$ 96 92 37 -28 -21 -124 -40 -110 -33 -18 49 84 1 11 -30 -44 -89 -19 -29 55 84 53 34 8 -18 -29 -52 -51 -47 7 16 -12 -30 -2
988bj8J4pk0N3m%K3OJm2l7j6KM4J5J8J5nlJ0l7j29M2jJ03L0m9Nj8rm9jjJM2R2
$$ -2 -20 -6 -13 -33 20 16 16 39 45 46 4 -33 -49 -47 -3 12 30 45 40 37 47 10 -119 -77 -78 25 55 6 11 -7 -16 -65 -66 -67 -66 -24 68
1025F8J6m8K1jm7J4J2m1J9K8J6K3k8p5l2l8P8j9N3j2P7q2N6p3k0No6R0q4J12L2
$$ 68 84 36 57 56 9 23 35 -6 13 41 57 80 52 -23 -55 -93 -15 -34 19 7 84 2 58 -15 -35 -30 -96 -6 -90 22 54
1056E4j8n7j4J9klj9J4N0J0J4K3p0M3j04K6oJ3L7j5K4M8r2j1K1Ll3M3m9RN8L5
$$ 54 36 -21 -35 -16 -18 -21 -40 -26 24 34 48 71 1 44 -60 -34 -40 -27 10 -5 19 67 -25 -36 -15 -12 -45 -2 -51 -42 16 51
1088E1l0jm6o7K9N5Jj0K7k7O0K1n4m0J7Rk1Q8m9L9J5j10K1nl5P3L7l1KL1k9k6
$$ 51 21 20 -26 -93 -64 -9 -8 -18 9 -18 42 63 9 -31 -14 -5 -26 62 13 52 67 -43 -22 -27 -62 11 48 17 19 50 21 -5
1120en9k4J01k2K6l7P2o4K3m7J7K4PJ6o6N9k7M3nk9Jj9m1M7K5o0P4j0Qk0Lm0l1
$$ -5 -64 -88 13 -9 17 -20 52 -12 11 -36 -19 5 12 28 -38 21 -6 37 32 3 4 -15 -56 -9 16 -44 30 20 28 8 11 -29 -60
1153f0Q4J6p3M2JJ7m4lL2lo0M6l9N9m1N2k7J0j9n5O7k7K3j6K3RKOl3j6K6k5L7
$$ -60 24 40 -33 9 10 27 -17 -20 12 9 -51 -5 -44 15 -26 26 -1 9 -10 -65 2 -25 -2 -18 5 14 16 22 -11 -27 -1 -26 11
1186A1J4k7P7p9N8o7J1j7O3j6j6rk1OJ9J3n4J01p6M9k9L2o1P0m4N4n2k2N2J2j1
$$ 11 25 -2 75 -4 54 -13 -2 -19 44 28 12 3 -18 -12 7 20 -34 67 -9 40 11 43 -18 52 8 62 10 -12 40 52 41
1217D1o9R7j34J01rm9K9qJ3k7K2lKm1M5k8M2k4jj4K2m1J1K8ok3K4j1k4j2M3mk3
$$ 41 -28 69 -65 36 27 -22 7 -1 12 -15 7 4 6 -35 10 -18 24 0 -1 -15 7 -34 -23 5 -1 -24 0 -11 -35 -47 -4 -8 -31
1250c1M0M5q2K2J3kJ4j03P2qJ2l7j3L0J0J7j2J%l0J8K9l3K4%nL1k4L0j8n2K0R0
$$ -31 9 54 -28 -6 7 5 19 -84 -12 -20 -8 -45 -58 -28 -18 -1 -13 -12 -12 -42 -24 5 -28 -4 -4 -9 22 -2 28 10 -42 -22 68
1283F8k7o3nN6j0l0R5j07J2L6o4M7J4j4j4j9k8K3K2j0M8o3P5ln8M8j3m3O0m9n
$$ 68 41 -22 -27 29 19 -11 84 -23 -11 25 -39 8 22 8 -6 -25 -53 -30 -8 -18 30 -33 42 39 -19 29 16 -27 33 -16 -21
1314b1l3M8l8K0J02l9n7L2J7J4M7o4l9QJ1L1n8P3p7K8J6Ro1J5P5r4lJ5L8o7N4
$$ -21 -54 -6 -44 -24 78 39 -18 14 31 45 92 28 -11 -3 8 39 -19 54 -23 5 21 30 -31 -16 59 -35 -38 -23 15 -52 2
1345BjJ7K2j9Ol7l6KJ17l9p0l2N0M5Nknl5j4J11j42MO0Mk2J6oL6K5o6mJ2k6j9
$$ 2 1 18 40 21 27 -10 -46 -44 73 34 -36 -68 -18 27 32 30 25 -10 -24 87 -55 -51 9 13 -9 7 1 37 62 -4 -8 4 -22 -41
1379d1P2Qn6K4l1K1j0jJ6J0oNOLo3J3M7l6O2l5J0o8Q1K9m7L3l1J0L4n1K2j9L5
$$ -41 31 39 -17 7 -24 -3 -13 -14 2 12 6 11 17 20 -43 -30 17 -19 43 8 18 -50 31 60 13 46 15 25 59 8 30 11 46
1412D6KJ1l3n9%PM4k8L4n2k2N7l7P5l8m2J6nK8k8J5Mm2R3n7k4L5Jk1k3Q5q6K9
$$ 46 48 59 26 -33 -33 -26 18 -10 24 -28 -50 7 -30 45 7 -35 -19 -24 4 -24 -9 -5 -47 46 -11 -35 0 1 -20 -43 42 -44 -15
1445a5K0nlj8J0JJ5K8%p2L2m0P5o3L6O8p6K4J4k8l2j5M2N9n4l7J8JJN3j09O6N4
$$ -15 5 0 -3 -21 -11 -10 5 33 33 -39 -7 -47 28 -35 1 69 -7 17 31 3 -29 -44 -2 57 3 -34 -16 -15 -14 39 -70 -4 50
1478E0o1rk7OK3K%J9q3J06j6j8Q3j06K7p1P3j1j2NR5n8n9P5n3J6K2K7m0J6L0n8
$$ 50 -11 -20 -47 -41 -18 -16 -16 3 -80 26 10 -8 75 -31 -4 -75 -2 -13 -25 -20 75 17 -42 33 -20 -4 18 45 5 21 51 -7
1510gK5j4k1O4k9m2J7k2oL1pj7J9j8J1lk2O1k9K2n8N2K1l6m4O7M5j26M9K1rl0
$$ -7 18 4 -17 47 18 -24 -7 -29 -35 -4 -11 -28 -9 -27 -16 -19 -41 20 -9 13 -45 7 28 -8 -52 15 60 -66 -17 4 -5 -35
1542c5N1o5P3j0j1pJ2J3J5l3ok3j6%O4Jl1k9N2J4Lm4K8k8N1pJq3N2k4J8J5L4K3
$$ -35 16 -49 24 14 3 -4 8 21 36 3 -3 -26 -42 -42 22 23 -8 -37 15 29 32 -12 16 -12 39 32 33 -50 2 -22 -4 11 45 68
1576F8m8lj7k5N1l0k5L5L7J7j20N3mmm4M9K2Qo2P1l1l8O9j3m6j4M5k1OL5j0l2
$$ 68 20 17 0 -25 26 -4 -29 6 43 60 -60 -7 -11 -15 -59 -10 12 20 -42 29 -2 -40 29 16 -30 -44 1 -20 -14 21 11 -21
1608b1K2K8j6p7R6m8nK5kk7M5n5M4j5nk1j0J06q8k6M2K1j9J7j3O1m6j6J1q0O8
$$ -21 1 29 13 -64 32 -16 -21 4 2 -25 20 -35 9 -6 -11 -32 -42 64 -24 -50 -8 13 -6 11 -2 59 13 -3 8 -72 -4
1639dol9JoL9L8m7n3P1o7P3j9P0q3O1q4P7Jj6Ro1L5l1JP0K3m0j4j1JP2n4mO5r5
$$ -4 -10 -49 -48 -54 -15 23 -24 -77 -6 -73 0 -19 51 -32 29 -55 22 23 7 16 -45 -10 -41 -40 30 53 13 -1 -12 -11 61 7 3 68 -27
1674b7L2m4K4O9o0K3l9N6q8K9J0Pj0J0K5m7m6M6J1J00p3l8O2L3p1j5m6L4J5N4
$$ -27 5 -39 -15 54 -6 17 -22 34 -54 -25 -15 -8 -18 -8 17 -30 -76 -30 -19 81 8 -30 32 65 -6 -21 -67 -33 -18 36
1704C6J3r1K9l0OO0k4J4J1k6M0j6k7Qk3J4l0J03o4o9M7K5JOj9m5P4k8Pk8rRK9
$$ 36 49 -42 -13 -43 -37 23 -1 13 24 -2 38 22 -5 3 -20 -6 -36 67 3 -66 -19 6 7 13 -6 -51 23 -5 2 -26 -35 -26 3
1737Cm0K3qN7j9k2o2N4P2j26M6kK0L2J4m9mQL0JK1k5n2K6L6n4M7n1M9l4o2P1J6
$$ 3 -37 -14 -22 35 16 -6 -68 -14 58 -68 -22 -24 -4 28 42 -7 -11 -3 27 28 49 24 -28 -2 34 -20 27 -24 25 -9 -71 0 16
1770A6l9K0pJ9l5L4Jm3L9J3m6P4Ln4l2K4J2K5Pm6L4K7j5m0j4j1R7o0J6m7O8o1
$$ 16 -23 -3 -10 9 -26 8 9 -34 5 18 -28 46 49 -5 -37 -13 -1 24 31 -15 19 46 31 -9 -23 -34 63 3 19 -28 40 -21
1802b1L8j4M5q1R8r0PPj1N6p1K6%J9Ln7JO3m5J6N1L4q0J4qJ7j5K8k0l6O1j6j1
$$ -21 17 3 48 -33 65 -25 -18 -11 -22 34 -37 -11 -11 8 11 -46 -45 18 -27 -11 40 74 -6 8 0 17 2 30 10 -26 35 19 8
1835Hk0K5j3PL7n1nL7j8J1j2k4KOj4K7o1J5Mj0L9p4P9K2l4o5N9O1l2j3m8l8J43
$$ 8 -12 13 0 7 44 -7 -12 25 7 18 6 -18 -16 -10 -24 3 -58 -43 -39 -49 -10 -84 -5 17 -17 -82 -23 38 6 -7 -55 -93 50
1868E0K5q8l2QO8k4n1pN9J1%l1j1Q6n1j8j7N8m2J0L7m4qqO2j22R3o1L9n9J06o3
$$ 50 75 -13 -45 -37 31 7 -44 -51 8 19 19 -12 -23 63 12 -6 -23 35 -7 3 40 -4 -12 -20 42 -80 13 -48 -9 -68 38 -25
1900b5rK7n2O8JO0p8J3ol2N8q1%N2Q7m4k1k9K8p5J1M7RJ1j8j6N0k8n8P2j7j1L
$$ -25 -34 -7 -59 9 10 70 -8 5 -1 -33 25 -56 -56 -4 83 39 18 -11 17 -58 -47 0 9 20 2 -14 36 8 -50 22 5 -6 -3
1933cK8J4l5K4o2N1m2L7m4j9M2K7l4J1m3K1kN3k0n3O8m8QK4O3r3K5k0J1j3K6K7
$$ -3 25 39 4 28 -34 17 -25 12 -32 -51 -9 18 -16 -5 -48 -27 -29 24 4 -49 19 -29 -21 3 66 -27 -2 -22 -11 -24 2 29
1965B9j9K3m3JJ2m2KL7Mj6PjrJ8l9N9m4J8n2L5J1Q4j34J00k7Nl9k0M4k6Lj7N4
$$ 29 10 33 -10 -9 3 -39 -37 0 4 -12 -5 -6 -15 3 -36 23 -21 -3 -55 -20 -9 75 -59 41 14 19 -20 -40 4 -22 -19 -36 18
1998A8K7Jq5L0JoK6K7m8O5l9LJ2mk9ojO4m7M4j0o5N5k6N7m9n2P1o4K7J%p8Q7J7
$$ 18 45 46 -39 -9 -8 -14 12 39 -9 56 17 20 32 28 -1 -7 -8 56 9 53 43 -22 33 7 64 15 -37 34 -30 -3 -2 -2 -80 7 24
2033B4m8qj1L9L2ll2K9om0J7mKL2l9J26j04K2n6KP4jk3k4m9M3K6J9j11P3MJ2L7
$$ 24 -24 -32 -43 -4 28 25 -7 22 16 -24 -7 -11 -9 23 -16 110 6 28 -28 -26 48 47 24 0 -49 -6 20 39 -72 1 5 17 54
2066E4o8J5Ml7oPN7k6k4O8j01L3j4L3rOL5k5j8K1l2M2o4O5n7N1OK4j19Q1k0M3
$$ 54 -14 1 5 -32 -38 -31 26 0 -24 44 -57 -24 -38 -5 -14 -8 27 2 -16 5 -27 15 -49 16 -41 10 16 40 -79 2 -18 25
2098B5mj8J7l1O2k9jk7J6k2J0K8Jl3L5L9o4l7j3L9j5M5l5K1j0K6K5m8l6R1p0M0
$$ 25 21 3 20 -11 51 22 21 -6 10 -12 -2 26 27 -6 29 68 4 -33 -46 -7 -22 23 -12 9 -1 25 50 2 -34 57 -13 27
2130B7l7mK3lP6p7K1n0K1P9m4rl5NmL8m9j6J5M3K7q7lRP9o8j9PJ22n9ol1kJJ3
$$ 27 -10 -14 9 6 82 5 26 -24 -3 76 32 23 -12 -7 -11 27 -22 -38 -23 20 47 -40 -43 -34 45 -23 -42 -35 87 28 22 -9 -11 -10 3
2165Ck2M4l2M4nk3J4k1J1j2RJ0J3%Ro6N0k5L1l5pj9O0n4j3J7nMl0L0O8p7L3Ok2
$$ 3 -19 25 -7 37 32 9 23 2 13 1 10 20 33 33 42 -24 26 1 32 -3 -10 -29 31 -23 -36 -19 -24 -20 -50 -20 48 -29 4 10 -12
2200a2J2M1m0k0J2M6m7Pj9k7M8j9oK6M7p1N2Ok7K0j8Po5J7K9K8r1M2N3Mj6qL6
$$ -12 0 41 1 -19 -7 39 -8 -1 -20 -47 1 -18 -24 2 49 -22 30 36 9 29 11 18 -47 -30 -1 27 -64 -22 31 35 19 11 47
2233D7m9k2j8llL8K4l9nj6L2j4O7m1m0L1P2m3j5L3l3J0rl0j2J07l4j8j2N8o1N1
$$ 47 -2 -24 -42 -45 -48 -10 14 -25 -30 -46 -14 -28 39 -2 -42 -11 61 18 3 36 3 13 4 -26 -38 69 35 17 5 63 2 53
2265E3l6%j1PO0r8P3lp1K8J5m4%J4Qo2J01o1K5Jn2Q7k2LRrJ5k3Q1q5K7j8j6k4
$$ 53 17 17 6 13 73 -25 48 45 -26 2 17 -27 -27 -13 -5 -67 34 -27 -2 -1 -53 34 12 15 24 15 30 7 88 3 30 12 -4 -28
2299b8M8Pk6l5N9kr5J11o8N2m0L6m0NLJ8%L1j6l8L0oq5j0P5J6j1L0j7n1M9JL8
$$ -28 20 27 1 -34 25 23 -72 39 -29 23 -17 19 -21 -16 -13 5 5 36 20 -18 12 6 -79 -89 -14 2 -9 21 4 -47 2 3 41
2332D1k2p4K3L4O5l0l5l1R4r9mL7M6l6m5O1j5l7K7m3K9k9J04r8K2M1l5j4lJ8l1
$$ 41 19 -55 -32 2 67 37 2 -29 65 -34 -38 -1 45 9 -36 25 10 -27 0 -43 -14 -43 61 -37 -15 26 -9 -23 -26 -8 -39
2363c9O5K0o0j7j0N0k8j3Q8o7N0k7Q3j42Q5qp9N4k1L2K0k9l4L5l9P1m8k1O6ko6
$$ -39 26 46 -14 -31 -41 9 -19 -32 56 -11 39 12 95 -47 38 30 -49 5 -16 16 36 7 -27 8 -31 40 -8 -29 37 35 -31
2394c1N2pnO4o9k2O3m7j3M7rlm0N3lk4Kok7P8o1l0k6O1M0k1J7M5l4l0M8m8K4k
$$ -31 21 14 9 73 4 -18 45 -2 -15 32 23 20 -20 33 30 6 8 2 -25 53 -8 -38 -64 -3 37 16 33 78 44 14 62 14 38 36
2428C6qj5l1l9N1O7m6k0N8j04L3K9n6P2l5M3l8O2m4P4j19P5r2O5j4K3jn9N1m2
$$ 36 28 13 -18 -57 -6 61 15 -5 53 -51 -18 11 -45 27 -8 35 -3 59 15 89 -30 45 -47 18 4 27 26 -33 18 -24
2458b4pO4j7nn6L5qrJ2N5l7o2L5oN6k4Kj6K4j9K5rN1p9M0K0p1N1%J6m8op0J04
$$ -24 -31 33 16 11 -45 -10 -18 -27 -15 40 3 -59 -24 -30 26 2 4 -12 12 -7 18 9 60 -19 21 41 -30 21 21 37 -11 -17 -87 17
2492A7m2Jn9R1Nm7kN8pJ4n1M3k3pJ7kJ8j7m3M5J4L1o7JK9K0j07P9ROlOm2QL8m9
$$ 17 -25 -24 -83 8 13 -34 -36 22 15 29 -22 21 -2 -9 8 6 24 7 -36 9 23 54 -13 -12 17 37 -70 9 18 24 21 27 -15 -7 31 -18
2528a8Kn1P2nMp6Q7l7O1p3J2K2J3Ln5R0n0j9mK0J8Plj5M3p0PK0M1o8J0M7mp7K3
$$ -18 -16 -67 5 0 4 -72 15 -22 39 -34 -22 0 13 16 -39 51 1 -18 -22 -2 16 23 20 5 48 -22 -15 5 46 -22 -12 35 31 -46 -23
2563b3j6kR6p2N1j7K4o2m7N2K0K7m7L0l8kL0L4k2N5r4L2j6N1m1M8o8j5N5PJ5k6
$$ -23 -39 -41 55 -17 34 17 41 -21 -68 -16 4 31 -16 14 -24 -26 4 38 16 71 -23 9 -7 44 3 51 -17 -32 23 30 45 19
2595A9o6N8J3J5K5r7K1J%J4k0M3Pm3O6m3m0j3NQqJ4M7No0L8j2l5N3j8j4QJ6k2
$$ 19 -47 11 24 39 64 -33 -12 -11 -11 3 -17 26 33 -10 56 13 -27 -40 -35 -27 -35 -21 26 31 -29 9 -3 -38 15 -3 -17 -9 7 -15
2629a5L2n4L5oN1N2o2j5N6n3o1L0O4n8mN5p4K9k1P5j07O5k1M2l4m1L0J0l8KPL8
$$ -15 17 -37 -2 -8 43 95 33 18 74 21 -40 -10 54 -4 -8 47 -27 2 -19 56 -51 14 -7 35 1 -40 -10 0 -38 -36 -29 9
2661Ij1qpJ1l8M9o7L9K1jPn1K5L0MnpJ7oPJ9j9m2J2N3p9K7lK9O7q8mL8pJ0q2L5
$$ 9 -2 -10 -17 -6 -44 5 -62 -23 -2 -3 4 -47 -22 8 12 7 0 17 11 18 37 18 -24 -12 41 -38 -11 -14 15 82 -6 -10 28 21 31 -51 -16
2698a6m4O1On7P0jl5P4o4n4J02m1j1K5j9L5L3q4k8N0m5L2K4k1%N2p0N2Pp0L9J5
$$ -16 -60 1 7 -50 20 19 -16 58 -6 -60 42 1 -10 15 -4 31 64 -20 -48 2 -43 -11 13 -8 -8 44 -26 26 33 -37 2 17
2730A7l4M8ok0l9rN9q7K2j3O3pJ4k0k0L5Kj3L1m9K1M7o8M1O2q1j0%K1pk1L0l9
$$ 17 -17 31 25 5 -34 -43 16 -71 -49 -62 1 -6 8 -12 -32 3 5 -8 23 -26 -5 42 -26 15 77 -4 -14 -14 7 0 -21 9 -30
2763c0M0m6J04p5%J8P1q3L6Qq6J31o4Lk3o1L7L5m3M1o1O0n9J1J3lj8P3j8o6K8
$$ -30 10 -36 68 -7 -7 11 82 -1 35 43 -43 88 24 27 4 -57 -20 15 -28 13 -48 12 -47 -36 -23 -26 -44 29 11 -55 -27
2794b7pMM1j5N1k7Pm1l4N1n7M8L8m9k4L6J6L2ln5o5J21k1n4j2P6o2M6l5m8R4n3
$$ -27 -34 -30 11 -4 47 20 27 -14 -48 3 -54 -6 32 -17 -41 -5 11 43 40 -15 -80 41 20 -34 -46 30 -32 14 -21 -69 25 -28
2826b8L2k2J8mj7J6L6l9j7KrK0J2j8L8KJ7o6lL0R2j46R0p1O0l4%L4j12O5nO7o7
$$ -28 4 -18 0 -4 -21 -5 31 -8 -25 -23 -32 -12 0 -18 20 22 39 -27 -30 0 92 -54 36 -35 25 -9 -9 25 -87 -22 -27 40 -27
2859b7j9J8J4J6j5L2k1K4l1J5n1M8k3%oL8Mk1l6M7Qk7j1J1l9M2Jj3J6l7P0p8K4
$$ -27 -46 -28 -14 2 -13 19 -2 22 -9 6 -45 3 -20 -20 -26 12 16 -5 -41 6 14 -13 -24 -13 -52 -10 -9 -22 -6 -43 27 -51 -27
2892b7j2O1m8O7m2K0kn9N4NkJqN0n0J1J9l5qJ6ol8o0M8K2M1n1L4Nm4R9l3o5N0
$$ -27 -39 22 -26 41 -1 19 17 -42 12 17 15 16 8 58 8 19 38 3 -5 11 5 -33 -93 -45 -23 18 -33 1 6 -38 61 28 -37 13
2926A3j0L1j5l7JrN5k4m4P7k6K5m6j9L2J2k3l1L2J6q1N1J1L1m9OQ3o3m5K6L0k7
$$ 13 3 34 19 -18 -17 -26 29 5 -39 38 12 37 -9 -28 4 16 -7 -38 -6 10 -71 -20 -9 22 -27 -21 62 -1 -46 -20 10 -17
2958a7J5M0o1%M4p1Q6q9K9J4N3p3N9%j7%QK3l2L5m8JJ9oj1RM7l7p4M2N9o9L0k9
$$ -17 -2 38 -23 -23 21 -50 36 -53 -24 -10 43 -30 29 29 12 12 20 43 11 46 -2 -1 18 12 1 10 57 20 -54 -12 47 -22 8 -21
2992b1MP1j00Mk5R8o6M7K5Kmq1L2j4R2q0jL4rNn9%J5%N5J2m9L2opK4l2j9K7K1
$$ -21 -17 54 -46 -42 -67 31 -35 12 37 39 35 -46 -14 -28 64 -16 -17 17 8 13 -46 -46 -31 -31 24 36 -13 19 13 6 30 -2 -21 6 27
3027B7l4L3p2M9KMn0N7Kk3P3o0m2O4p8R4p9j7P5Mom2k1J21r8K9k1N3J7ln0joJ7
$$ 27 -7 26 -46 3 5 9 -41 16 18 -5 68 8 -34 30 -48 46 -33 -50 25 29 23 -19 -40 81 -17 12 -9 44 61 58 8 7 1 18
3061A8o3M5J1L0m6M6q6K9L6m4P2p1J8k7OL1n3L1J0m1J9O5Ol6K3K6j18R6p6J7N8
$$ 18 -45 0 11 41 -5 41 -45 -16 20 -24 48 -23 -5 -32 -26 5 -48 -17 -7 -48 -29 36 42 6 29 55 -63 33 -43 -26 32
3092C2l2pk3L3k4M8K3l4l7N6n8L3J2L4l7mK1J2q5M5p8J39j32P4lnJ9n4k0M1ml9
$$ 32 0 -7 -30 3 -21 27 50 16 -21 35 -23 10 22 56 19 15 36 48 -37 8 -70 69 -63 11 8 3 22 -32 -52 -11 -15 -54
3124e4R1m7k6O3pq9Q8k5N5q0k9J4L9N2m5k9J2k0J7M2j5klJ1j7l4L9k8J0%N3n0
$$ -54 37 -10 -36 27 20 -69 19 -6 49 -31 -60 -46 -7 45 0 -29 -17 -37 -20 22 7 5 2 13 -4 -38 1 -27 -17 -17 36 -14
3156a4Pk9N6o7RL4m1jJ25j00PPl0P%J9K5N1j03K8O2k7j6Oj0Pj8k0K4j3M8O6q1
$$ -14 -7 -36 20 -47 -38 -4 -45 -46 79 -21 -14 -7 -37 -30 -30 -11 14 65 -38 -10 52 25 9 15 5 12 -6 -26 -2 -15 33 99 18
3189A8J5Pj25Q6J8MP7j26Nk2N8k3kJ1J1j9l0J7M7n1j0nm1J01q1J01o5OQqN5n5
$$ 18 33 40 -85 1 19 23 100 -26 -21 -43 15 -8 -10 1 12 -7 -37 -20 27 -24 -34 -39 -80 21 -60 41 -24 -18 -10 -18 37 -18
3221a8K9j5M6rl8J0k7jN3k2mk4Qqk3K7K8k3k3K4LL6j8n3L3L1k1m2P3Ok0j8m8Q
$$ -18 11 -4 42 33 -5 5 -22 -23 30 8 4 -20 -12 -20 -43 -16 12 -11 -34 -10 -7 29 11 -42 -9 22 1 -41 32 38 18 0 -48 -40
3255d0O3mOk8M7l9om7L4N3l6RK0m1k4kO0l3p%j4O1Ml2l9O2o6%N2k6K3k2L2l5L
$$ -40 23 19 25 -3 44 5 -1 -48 -14 39 3 12 32 -9 -33 -35 25 -8 -15 -15 -29 32 36 4 -35 27 -39 -39 13 -13 10 -12 20 -15 -12
3290a2L3J8p8N7m1MK2j3k1QL4l3N3o0M3J1J4k4m2O7n5O6k7Mjk8J1k8l2M7m6M8
$$ -12 21 39 -39 18 -23 -19 3 -10 -31 -23 11 -22 31 -29 14 25 39 15 -27 40 -15 51 24 28 27 -1 10 -18 -50 -3 -49 -1
3322aL0l1jP5m8j7Mk1k8K7K9k2L2m2j0Pmn0R8j9m8P0n3N9m4L6jk5P8j00L9n8N1
$$ -1 29 -2 -3 72 24 7 11 -10 -38 -11 18 -4 28 -14 -24 -17 -21 -71 27 8 -40 30 -23 36 -8 28 27 2 80 -20 19 -39 12
3355A2K9j9LKpn4R7n5j1k4O5l6J7l3pL6q7Q2%J8p6M6M7o3M0o5l5J39o8L6k8Ok8
$$ 12 41 22 25 27 20 -34 63 8 -3 -27 38 2 19 -14 -21 15 -72 10 10 28 -48 -2 45 -18 22 -43 -78 61 -7 29 1 7 -21
3388b1N3m0j3M0nL3j6qp9N5M3j5j6J8o4L1J7jJ0ok0L3L9j15L0K1PJ6r1N4OJ3p
$$ -21 32 -8 -21 19 14 47 31 23 -56 -1 42 27 11 29 -35 -4 13 12 22 16 -4 29 68 -47 -17 4 11 27 -64 -10 -4 9 2
3421BQk2M1mn3L2rN4n8ll8J12n2J8r9P0N9k7Pl9j8J02l9k7ln4K9J9r8J12qNj1
$$ 2 10 -12 29 25 -28 4 -5 49 -9 -12 -50 62 10 28 -71 -1 58 31 38 -1 -19 83 44 17 14 -40 -11 8 -90 22 14 19 8
3454HK0Kp2M0l4L7L8n9JM9l3m5L3nmJj3N1J7m2K1M2j3Pj1Mq9L3k3L5R5p9n2P4
$$ 8 28 30 -42 -2 -36 1 39 -20 -19 30 -3 -48 -15 -20 -24 -23 -36 15 32 -10 11 53 40 47 36 40 -49 -16 -39 -4 91 12 -40 34
3488C4r1P8rL9n7K7k1J8K1m6j1M1l9l4K7L9%ppL0q0J0N7j6l3K9M9k8k0m4K9Rl6
$$ 34 -57 21 12 51 -6 21 0 18 39 -7 -18 23 -16 -50 -23 16 16 9 2 32 -48 -38 19 3 -30 -1 48 20 0 -44 -15 -6 -42
3521d2J08j2m2J2q4P1l3O2j11P2K5j6n1L6k2Q6m6j9l5RoP7n1l9J0J2%P2j1jn1
$$ -42 66 54 12 24 -60 11 -22 40 -71 1 26 10 -41 -5 -27 59 13 -6 -41 -32 -38 39 -12 -51 -41 -29 -29 43 32 31 -20
3552b0L8q1J5j%j0J16o7J6O2j24N3o8N3j1L2L3p4M2pN1l4K7n9lL4jk3J3L3o8J3
$$ -20 18 -63 -48 -49 -49 -59 57 -10 6 68 -56 -3 -71 -18 -29 3 36 -38 4 -3 48 14 41 -18 -21 13 12 -11 2 35 -33 -20
3584b0J8k2lK0qM7jk1m2JJ8p5N6P1K8r2K1rKm1K3K8%o0J00j8n1K3K9l4K6k3P6
$$ -20 -2 -24 -27 -7 -15 32 31 10 -32 -31 -13 -88 -32 39 67 -25 -4 -13 -11 -52 -29 -1 -1 -61 39 21 -30 -7 22 -12 14 -9 67
3617F7p5J0l2Q1j9q0L0L8J7n3l9O7Rn2N3q9N3K1p2N0O0l7J0q0P2mK2o4K3L7K3
$$ 67 -8 2 -30 51 32 -48 -18 20 37 -16 -55 12 21 -31 22 -67 -14 7 -65 -15 45 8 18 -62 10 6 28 -36 -13 24 47
3648D7o1k8O2j7m7J10o3k9O7k5k7O3J8n7j3L9l7k5P2k1L2o2J3L1o4MQ%n4P5L5
$$ 47 -14 -42 20 3 -44 66 3 -26 41 16 -11 52 70 13 0 39 2 -23 49 28 60 -2 11 42 -22 -18 -10 -10 -64 11 46
3679D6p6N4j14Q8k5J2QJnJ9Jl5N4o6O0Oo6O5j0k4l0LL1L6o4k3R4n7M8k1mM8o5
$$ 46 -30 24 -90 -2 -27 -15 -7 -6 -11 8 9 -26 28 -38 22 28 -38 27 17 -7 -37 -34 -3 33 -31 -54 40 -17 31 10 6 54 -11
3712a1J2j2qM0N1q1J3l3PnL1Ll4l9K6N8oK2q1N0J0N0j05Q4k0n5J5oJ9M9m3Olk5
$$ -11 1 -11 -19 21 72 -9 4 -29 -22 -27 4 7 -27 -66 -40 18 12 34 -47 3 13 63 -42 42 22 -33 -18 -24 -5 44 1 7 4 -21
3746b1J5o7O0J1L3l7J8J6m3M2rn9oO6m9M0q1J06l9P1j12N5L7l4l7rJ3O%L1m0K4
$$ -21 -6 -73 -13 -2 31 -6 12 28 -15 27 18 -41 -47 19 -30 10 -71 35 -4 67 -45 10 47 13 -24 -33 -20 -14 -14 17 -23 1
3778AK7q5O4jl0Oo4J00k5nMO7k3k8Rj7J8ok3K0ln0J4O8j2l5J8k4j3j5P7jm7m8
$$ 1 28 -57 7 6 -24 -18 -82 18 -7 -12 -8 59 36 8 17 0 18 12 -11 9 6 -44 -30 38 26 -9 9 -15 -28 -43 34 33 -14 -62
3812f2P1J1k0M0p4K3K0JKK5m7L2Pn5K9j7J0nJ4J0lJ1prl6k2L9j6M6M0o5j9Rj8
$$ -62 9 20 0 40 -34 -11 9 10 12 37 -10 22 29 -26 3 -14 -4 -9 5 15 12 23 16 7 -29 -51 -12 -28 18 58 -7 -26 -17 -35
3846c5L6K9k6k0j4O1n5QPk2M7qk8K9m8N6j1L7j3p0J8O8k5j7K7Qon2K1J4pm5P5
$$ -35 1 30 4 -16 -30 31 -24 -16 -9 -31 16 8 -20 9 -39 17 6 43 30 -40 -22 46 21 4 31 39 33 -19 2 16 9 -36 39
3879C9Kl8k4ok1j5P9n1o5N5J2K3nJ6q6Q2L7l3oJ9lM4p6L8Ojn7R0lj21j6P1M1l7
$$ 39 41 3 -21 -27 -48 -63 16 -35 -100 -45 -33 -10 -15 1 -85 -3 34 1 -5 14 11 55 -21 17 23 22 -35 55 52 -69 -85 -14 27 -10
3913a0oONM8m6M5m2rKj5J6NK5m7j9R3j06L4K1j2k2NK2K2m2Qj3O4n1l1K9J8n%K3
$$ -10 -16 -10 -5 43 -3 42 0 -9 -7 -22 -6 -1 24 -23 -42 51 -55 -21 0 -12 -34 -29 -7 15 -27 -19 -32 32 -19 -50 -21 -3 -8 -8 15
3948A5J1l7N1J2k0m1j4L5qmJ9Rqj3n8O4rPp0R7l9j3j9J6l4kM8Lk2RKkm6L5K8L5
$$ 15 26 -11 40 52 32 -9 -23 12 4 0 19 28 20 7 -51 13 4 11 -59 38 -1 -14 -33 -17 -51 -53 -5 -2 -24 -15 -13 -15 -61 -26 2 37
3984C7k6Jj4J4N3p1JK6j1qN0l2km2K3N4q4N4ok3N5o2L2J1m7O9k4n5J6N7o3P5j24
$$ 37 11 12 -2 12 65 -6 -5 21 10 2 52 20 18 -24 -1 53 -31 23 17 -6 49 -13 19 30 -17 52 28 -27 -11 46 -17 58 -66
4017f6O7l4JK6M1k6kM0l1m2PO1l5N8o7J0K6M2n0K4Pl4n6M6NL5o8M0m2Ql1oJ04
$$ -66 1 -33 -32 -6 35 9 7 47 16 -26 -19 42 7 65 -2 8 34 76 26 50 57 23 -33 13 18 53 -15 25 -17 -9 -40 -46 58
4050E8p8N1m1N1j1j8J4l4o5L4JM6j0J6j4pJ2jK4l3lqJK4rN2n3j2kJ6J9m6NL9o7
$$ 58 -20 31 -10 41 30 12 26 -8 -73 -39 -38 8 -2 14 0 -7 5 4 28 -5 -8 -16 -15 9 0 52 -1 -13 -15 1 20 -26 -21 18 -49
4085d9M8J4mRk4l9m4P5J1l0QJ6k9M0l7J2L3K7p0k8R1m3Pm0J9JK8J8l5K7j0m1J9
$$ -49 -1 13 9 18 -6 -45 -89 -14 -3 -33 -25 -9 -38 2 -35 -23 10 37 -33 -61 30 -13 -6 -46 -27 -26 2 20 -15 12 2 -39 -20
4118b0K8M8p4P8p0j8L0J6Oml7J0%pK3mM2r8N7Qj0j6j8j1M1j2J3O3k5r6L4OL9j1
$$ -20 8 56 -18 60 -10 -28 2 18 24 20 -17 -7 -7 -14 9 5 47 -51 6 14 4 -12 -30 -41 0 -12 1 64 39 -57 -23 -17 22 11
4152A1%Ll6L8k7k9j4R7j5J3n7J2L4Kl3R1o1q6K4J1L8r2N6%ol6J22q0L0qk4nJ3
$$ 11 11 14 -22 16 -11 -40 -54 43 28 41 -16 -4 30 32 -1 90 29 -57 -33 -22 16 -76 -20 -20 -26 -62 60 -20 10 2 -22 -27 -14
4185a4j6J2N8j22M9L6M3q5oL6m8KM8m4J4N9J6qm3J2L8k9k1jJ4J3rk9N9l6m8L6
$$ -14 -30 -18 40 -82 -33 3 46 -39 -45 -9 -57 -55 -7 -51 -37 22 38 30 -13 -1 37 8 -13 -14 0 13 4 -25 34 -2 -50 -14
4217a4n1R8l1k6M1M7m1lm6k7j8R8lm3N8r3L7pLm0O1K8Pj09J19n2j0J9PJ8n9OM5
$$ -14 -65 33 2 -24 17 64 23 20 -26 -53 -71 27 24 -19 39 -54 -17 -24 -21 -61 0 28 35 -74 45 -7 -17 2 9 27 -32 -26 19
4250A9Jj4j1k6K6M4l4N5j15nM2R0j00kL4NL4k9m0j1R3o3N2o1J6lm9N0k7M4k1m
$$ 19 20 6 -5 -31 -5 39 5 60 -55 -60 -18 72 -28 -30 4 9 43 14 -26 -37 56 -7 45 -16 0 -3 -52 -2 -29 15 -6 -10
4282a0J3k9OL2pJ3l6K9m6J9R4q8L1jrmj1O3l3j4k9M0N1q2k7L2l8M2m6N5k6NJ9
$$ -10 3 -26 -20 12 5 18 -18 11 -35 -16 78 -10 21 20 11 7 -4 59 26 12 -17 23 74 -8 -35 -3 -41 1 -45 10 -16 -11 8
4315HK3j1l9M5n6N0l7l7J34o2p1N6j5nl1Q1k9N5j8o4oP1qk6K0k1m6N5Nn4K3l7
$$ 8 31 20 -19 26 -30 20 -17 -54 80 18 -53 3 -12 -17 -48 33 4 59 41 -23 -29 42 34 8 28 7 -39 16 21 -33 -10 -47
4347d7J3L6k4kR7m3n4J9J0n3N7j9L4m3r%PN0k7kk8O2n0K8l0K5n2O8j9L4j30O5
$$ -47 -34 2 -22 -24 73 30 -24 -5 5 -48 9 -10 24 -19 -28 -28 -21 29 2 0 -28 34 -16 12 -18 7 -45 23 4 38 -92 -27
4379b7K3J2k4m2J21r2M0k5K1k7K7OJ8pk8MLn4P7nK9p2M5rlk6M9j8%Nn0N0n1jN2
$$ -27 -4 8 -16 -58 63 -29 11 -14 7 -20 7 13 31 24 -4 0 3 -51 26 21 50 -22 23 14 11 -15 34 16 16 21 -29 21 -30 -31 21
4414B1l1J5rN0q9KP1l3j0N6o3M1j00N5kmM6n9O1n2j0P6o3L9k4R7q3L7n7RJ2j9
$$ 21 -10 5 -4 46 -43 -41 30 -3 -13 43 -20 21 -79 -24 -26 -30 16 -43 18 -34 -44 32 -31 8 -16 81 -2 35 -22 -13 -1 -20
4446b0L6l6Rkl1lL4K8M5k9o4M8L9q2L4J1Pk3Ol4P5q3L2LJ2oK9m7K0p4J0j9N0Q4
$$ -20 16 -20 -11 -13 -44 -47 -13 15 60 31 -33 15 54 -28 6 17 24 1 7 -27 48 -35 -3 0 12 6 35 -12 8 -66 -56 -75 -25 59
4480E9n5k7Nk3L4lK1m5QpP5m1o4N1j9K9j0N5q1L1K2k0J7k1J9om6K3k7K3J7%K8
$$ 59 4 -23 -18 -41 -7 -10 11 -34 -26 -33 42 1 -63 -12 -31 -2 -12 43 -38 -7 15 -5 12 -9 10 4 -42 -19 -46 -23 -6 -6 22
4513B2n3oQL2J2l5K7j1l6L8J6n7K6LQL9K7n2J0Rl0Kk0K2K0km0O9n7J5l9kM8o9
$$ 22 -31 -37 -29 3 15 -20 7 -4 -40 -2 14 -43 -17 -14 -6 33 60 8 18 27 -3 -1 -21 1 21 19 -21 48 -9 6 -33 -35 13 -56
4547e6J08p0M7l5J5n2N9kJ7o4M3L4jqp5L6L1l3mRJ2K2k0j1j8om8Q4Ll3O4n7lJ9
$$ -56 52 -18 29 -6 9 -43 16 14 31 -33 10 44 43 35 -40 -4 27 -6 -10 -1 11 33 13 2 -16 -22 -70 14 17 -16 48 -9 -12 7
4581GpN5m7K6k2Rm7J1j1K3j8N1k7J2o5M6M6o0RL2l2J0Rn0L4k5M1m2mJ2K0k2N1
$$ 7 0 55 8 34 12 21 -26 -15 -26 -3 -21 30 3 15 -50 -4 42 -18 -9 23 -9 1 10 -40 -6 -31 10 -32 -36 -24 -4 -26 25
4614B5m0m3O8K0k3K4k4Lj0pL4%n0%J4k3K7oN5pLK0n0On8O4k3k9Q4o3M7l7L7n5
$$ 25 -15 -58 10 30 7 31 7 10 0 -7 27 27 -23 -23 -9 -32 -5 -11 44 37 40 60 10 16 -42 22 -1 -30 54 -9 38 1 38 -17
4648a7j4Q0q9NJ5pj3L4l8K4K5m4O9j5On5j1L7KM9k5J3j6l2L4l3N0l7K0m6pj1L8
$$ -17 -31 49 -40 -35 -20 -27 -40 -6 -44 -20 5 -39 30 15 21 -34 -45 -8 -6 43 18 31 15 -17 17 -16 34 -3 17 -29 -36 -47 -9
4681il8Q2l4JJ0k4J3K4j0j1M2p7M7k2K7l3JK0Rl4K4K0m6L6k0l0M8o4L9L0l8J7
$$ -9 -47 35 1 2 12 -12 1 25 15 4 46 -31 16 -6 21 -12 -11 9 18 -16 8 28 -18 18 -2 -32 16 -48 -9 21 -17 0
4713@pk0K4pn3O9Qqk3j6P1k8j5pM4j0m6k6P4j6J7p2K5M8o8K4J0m7N5o2P1k6J5
$$ 0 -7 -27 -3 -10 -63 6 14 6 -17 -33 38 10 -5 -12 32 22 -24 -50 24 8 25 -47 -22 26 -42 -18 -8 -55 0 -62 9 -17 -2
4746bJ8J7n8J1K9k1j3OJ4J3n1MO8n2L1pJ0n8L5k9J4L4M4p5mL4kl5M5l6P5ro0N8
$$ -2 16 33 -25 -14 15 -6 -19 -13 1 14 -37 -33 35 -17 14 7 17 -41 -6 -35 -21 13 57 -18 -22 12 10 -25 20 -16 59 50 -10 48
4780D8r2j3jN5k5J7j5N2p6O3o6L4K0j6R2j11M0l0J8j0J7qLnJ8LkL1po5LL9n7R2
$$ 48 -44 -57 -58 -3 -28 -11 -26 26 -50 13 -53 -19 1 -15 77 -34 6 -24 -6 -16 1 -7 -4 -9 9 12 10 41 34 -31 -28 11 -46 46
4814D6j4M2om6j1n9O7K7j01M7kL0J4Kq1K1jK0j0rQN5Pk3l7O1j1l8j4K9mk8L4K4
$$ 46 32 74 68 22 11 -48 19 46 -55 -8 -10 20 34 36 -45 -24 -25 -5 -15 -24 -16 39 46 23 -14 47 36 -2 -16 13 9 -19 15 39
4848C9l7O0j23L2M5Mj6j1PjJ3k7K8J9J1q2Q1r5R1o0R7j15j5M4M8Pm0j6J1k3L8
$$ 39 2 62 -61 -29 16 20 4 -7 0 -1 12 -15 13 32 43 -39 42 -53 38 -22 75 -40 -55 -11 37 44 4 -12 -1 -24 14
4879A4o9O1NJ9l8L5j6mL4m9Plm6O8%N0k1r3lL9RJ2RMj9QJ5p5L0M2p1J6M0m0M3
$$ 14 -55 6 11 30 -8 27 11 7 41 -8 -1 -4 -50 18 18 68 47 -46 -49 -10 -1 11 20 24 5 13 28 -47 -17 25 -46 -30 10 -30 13
4914A3k6LL2k7J7mj3K2K4q1O3l0N9j3m1N7n7J0J7l9L9K6q9J1K8n2M3k4j5J45p3
$$ 13 -13 -10 22 -5 12 8 -5 17 41 -40 23 -7 52 39 -2 55 -2 8 25 -14 25 51 -38 -27 1 -51 -8 -32 -47 98 25
4945B5n4K2m1N7n1O3m5O2lPl4l0M3k9P4o6J0l8M9k1JK4j9K5npk9JJ2n3J8j2N4
$$ 25 -29 -7 -48 9 -42 21 -24 38 35 42 8 -22 21 -8 66 0 10 -28 21 0 1 25 6 31 26 19 -10 -9 3 -50 -32 -44 10
4978A0K2j8n6L7mK6j8ML9l1k6L7J0o3QJ7mk8M8J5m0MK1K4m0J9k1L5k4l6M0pn6
$$ 10 32 14 -42 -5 -9 17 -1 3 42 11 -15 22 32 -31 -23 -6 -10 -38 10 25 -15 -11 10 34 -6 13 -8 27 3 -33 7 0 -56
5011e6Q4o8N0J3k8j6L6N7j12J5P5q7N0K8r9M5k8J2JN8k1k1J1J3l0L0n3J5Q7m1
$$ -56 28 -40 10 23 -5 -21 15 72 -40 -25 50 -37 13 41 -58 -13 -41 -29 -28 30 9 -12 -1 12 -18 12 -41 -26 61 20
5041B0J8ko1J03j08OP0o2J0M3l0k7JNk8L6J2M5n5Mm5J19o1k3l2P2l0k6K7J8Pn7
$$ 20 38 36 -25 78 -30 -24 46 -16 -6 37 7 -20 -19 -14 -42 -6 6 51 -4 0 -45 74 13 -10 -42 30 0 -26 1 19 26 -31
5073c1j3M8j9j2k0M6l0j8O8m4MM0o9L1ML3o1j5L3j2K0pJ08j06LK1j6PJ9m2N2k2
$$ -31 -44 4 -15 -27 -47 -1 -31 -49 19 -25 -21 19 -50 -19 -15 18 -43 -58 -25 -37 -17 -24 84 -22 -19 2 -14 -7 12 -30 22 0
5105@nk3Q1n9K4Jj9J8m5R3n0j6k3N1p7L5P1l9o3L3OM0l4J4qmk6N6Pn4ML3nL7k9
$$ 0 -5 -28 53 -6 18 19 0 18 -27 66 16 0 -23 28 -49 -14 57 18 -45 -12 -6 34 0 14 6 2 -24 32 39 -15 -11 22 17 54 25
5140B5kn1L0k2O2l3k5M8p5Q3n3M8k5J6j0rK1j0m8O1n7L4qp4R5n6N2n3N2k1j7K4
$$ 25 23 -28 2 -20 42 9 -16 32 -43 40 -13 35 10 26 16 7 28 18 -30 31 -26 8 0 -74 21 -35 17 -36 16 -5 -22 2
5172Bjk2RP8q0qQK9jk6L6jn9%M9j4J1j2K7n5L8L5n9l5L5L9kMq1K1rJM3L8k8n6
$$ 2 1 -21 -12 66 -14 -22 -14 15 14 -12 24 23 -36 -36 13 -1 10 -2 25 -30 8 43 -16 -51 -16 23 21 25 -56 -35 -44 -43 0 38 10 -46
5208d6J8pj2N9Rn2N5j3l4K8k2O3j1l3j0O1k3j2ml6M5JRJ1nm9m3Q4q6M0OjL2r7
$$ -46 -28 -35 -47 12 21 -31 24 11 -23 5 -17 46 35 2 -8 53 30 18 14 -22 23 24 33 44 39 -10 -53 31 -55 -15 -9 -10 22 -75
5242g5Q5l3L1nk1J9j3L2Kl4N6l4j1L4m0M4n2jJ1Qm3L7J8n3J1j6N1O1l7J9k0p0
$$ -75 10 -23 8 3 -18 1 -12 20 22 -12 44 10 -1 33 -7 37 -15 -16 -5 3 -40 -3 15 -38 -27 -43 8 69 32 51 31 -39
5274c9K9j2RK1q8P3k5M7L3jn3j9mJ5J7n0%j4P3Mj6Rp8J5Q1l6K0j9L0l5PL8l8M4
$$ -39 -10 -22 -13 8 -80 -7 -32 15 48 47 -6 -25 -29 -14 3 -47 -47 -61 12 16 0 9 -69 -54 27 -9 11 -8 22 -13 -6 32 -6 38
5308C8p6j1K4L3l8K4K6Mr4O1K2J0l9j1L8k0rM7kl3k7j9J1K1K4j6kJ7Qk7kQNK1
$$ 38 -38 -49 -25 8 -30 -6 20 24 -70 -9 13 23 -16 -27 11 -9 -18 29 27 -6 -33 -52 -41 -20 4 -12 -14 3 11 -16 -18 -10 -5 16
5342A6JMn1O2l7j1M4M7j02O3kn0L1KqJ0k8qL5qj3J5l2K7o1M6l9L4J4K0o2P5m5
$$ 16 17 21 -30 32 -5 -16 28 75 -27 36 34 -16 15 17 9 19 -9 -17 18 10 -3 12 -20 7 -54 -8 -47 -13 1 21 -41 34 -11
5375a1k1J1LkN7j1l2j7j3J07m0k4M2o3J1L8L2o7N7p0%j6M1k1j8MqP1m2k1O5q3
$$ -11 -32 -21 -18 -20 37 26 -6 -23 -36 71 31 7 49 -14 -3 35 67 0 57 -13 -13 -29 12 -9 -27 -23 -31 40 -2 -23 42 -41
5407d1L5j8P1k7j3k4j4O5jl7J6nm7P2o3M8l9J1knj1R0n0K0o9N0K1o3P7o6M8m9
$$ -41 -6 -24 47 20 7 -17 -31 34 33 -4 12 7 -40 32 -31 17 -22 -11 -13 -18 -29 61 11 31 -38 12 33 -30 47 -19 29 -20
5439b0J3M1jrk4k2K7n7N2jj3K2j8k6O6m1Kj8j4N2pj8j8mK5N0l5l0K5L8l7l0K5
$$ -20 -7 34 33 24 0 -22 5 -52 0 -1 -14 8 -10 -36 30 -11 -9 -27 -41 11 4 -14 -32 -36 -11 39 4 -26 -1 37 0 -30 -5
5472eK6k8L2n2L2j0JKL2m4L7N2q6J6L0n8M7Mnm6oQ9q6Q1o3j6L1J3m5K3l4Q8n1
$$ -5 21 -7 25 -27 5 -5 -4 -2 30 -14 23 75 -11 5 35 -23 24 28 23 -23 -29 60 -26 55 -8 -24 7 20 -25 -2 -36 52 1
5505Al5k7N0M3o2oP4m4loj5J3k3JM7PK3j18R4j3L1PK4j4q3M7j3N1o4J1RN3o9N0
$$ 1 -34 -61 -11 32 -30 -36 38 -6 -9 -15 -30 -17 -40 -39 8 15 38 -80 14 1 32 39 63 49 -34 13 0 51 -13 -2 7 60 -9 41
5539D1o7N9n3L0o6N5ml7K7J8k2P9o7L2r1M4M9l4J2j3MN3K1n3j1l5Q5o0L6l9qK9
$$ 41 -26 33 -20 10 -56 -1 -5 -42 -15 3 -19 60 -7 25 -66 -22 27 -7 5 -8 -4 49 70 17 6 -29 56 -4 32 -7 -15 14
5571A4K8jn4m8P2k0K6l9J2J5J6qON9n3K3n1J8M6q3k7J07n0m7L3K0OMpmNMk3JN
$$ 14 42 41 -13 -61 11 -9 17 -22 -10 5 21 13 19 78 25 48 -3 15 61 -22 -49 58 8 -39 -6 14 20 24 17 13 18 22 -1 0 5
5606ENl5L2l3J3MJ9lLK1n0N8J9m1K9l1K4o4M7lj0J4q6P2n6Q4p9L4k5M0ll2M0K1
$$ 5 10 -25 7 -26 -13 -9 10 7 10 31 -19 39 58 17 46 15 39 -25 22 19 9 23 -63 9 -47 37 -42 -8 -33 7 4 -28 12 33
5640C3p4J9PlL1M7q1N4l6K0p6O5%j1%N3k2k3K1n9P2k6m6l5L5P6k7l3jj0M8k2m9
$$ 33 -41 -22 -15 -18 13 60 -21 33 -3 17 -59 6 6 -5 -5 48 26 3 24 -35 37 11 -35 -70 -35 41 14 -19 -20 -30 18 -4 -53
5673e3O8pj8O8k8n6jO7p3R9q8N2qpJ4J4o6J7o6R5l6Pm0M8J9j1j8L0%j3k3qJ4K
$$ -53 15 8 -10 58 30 -26 -27 40 -33 66 -22 30 22 15 29 43 -23 -6 -72 23 -13 -6 -46 2 21 10 -8 22 22 9 -14 -22 -8 -6
5707fj0j2L9Rk1k2jl9O6M1n2l9Q9p5Q7k9j7KkQK7o3j6L8N4Jp9L8JJ8m5k7K2L4
$$ -6 -16 -28 11 20 -1 -23 -24 -63 3 44 -8 -47 42 -33 54 25 8 10 8 16 43 -20 -36 2 56 57 -22 16 17 35 -10 -37 -15 19
5741A9Jj0KL4k9m5O8m4L1n2M7p7O7m9K9LlKl6M5m3J4J6K1o6L8L9rL2k1j2N6p7
$$ 19 20 10 12 46 17 -28 40 -4 27 -25 22 -55 12 -37 -8 -5 -8 -6 -42 3 -40 -26 -10 11 -55 -17 22 13 45 24 12 68 -9
5774il4M0L6j2QL6r2L4j6lopQ3j5j7j5J1o6O0Pp2P7l8%PK2kpj3l7M7j0L2n9j2
$$ -9 -43 -3 33 21 29 65 -27 7 -9 -12 -18 -25 58 43 26 11 22 -44 16 23 -49 28 -10 -10 -3 19 17 10 -3 -40 7 -3 29 -30 -42
5809d2QQl3J03l5l9L1L5L1n2j1L0k0j5M2K1l7j1k8MJ6k9N8l3J7k3J2K6n3L4K1
$$ -42 -34 -26 -59 44 9 -30 1 36 67 15 4 34 14 -1 41 62 25 14 -14 -10 6 -23 35 2 19 -4 8 34 -19 15 36
5840C6j4l9J7Ll7O4m3Rl2N1m4Q7q5L5J3l7M2rJ2o7O8l7M1k3K4m2J3MJ2JQk2l5
$$ 36 22 -17 0 3 -34 30 -13 -4 -36 15 -29 58 -27 8 21 -16 26 17 29 -38 30 -7 34 11 35 -7 6 10 22 23 31 9 -26
5873b6K5KK5l4L5Km1n2M3K3M6o0K1JojJ4m1L8k1L1k1L9n5mL7j3jMl4M5M1n0l7
$$ -26 -1 1 26 -8 27 29 -12 -64 -21 2 48 -12 9 10 4 3 17 -24 14 -7 24 3 42 -13 -17 20 7 6 10 -24 21 62 12 -25
5907b5J7M2k8L6Km6Rj9O0n5J5L7m8k1M4n2jJ4j4L3J4J5q1K4K8j9J8l8L0ol0M3
$$ -25 -8 34 6 42 44 -2 7 -12 48 -7 8 45 -3 -24 20 -32 -33 -19 -33 0 14 29 -52 -28 0 -19 -1 -39 -9 -15 -45 -2
5939bl4R3o4qQL0rL8k7%j6l9K0N7r5R4n8N2%k6n2J6M9J2l2n5k8L6O0m1N6o7Q4
$$ -2 -36 57 -7 -15 -7 23 14 52 25 25 9 -30 -10 47 -48 46 -12 40 40 14 -38 -22 27 39 7 -48 -76 -40 20 -21 35 -32 52
5972E2%l8k4M2k5K1L1n6j1mPJ1k1k1L5rK8K3Qr6L6M2j6j7l8K0J0O6Nl5n6N9j4
$$ 52 52 14 -10 32 7 28 59 3 -8 -12 -5 6 -15 -36 -1 -10 18 41 49 -47 -11 31 15 -2 -40 -20 -10 56 61 26 -30 29 15
6005A5k4m6N0j8k9j4M5O5m6l3N1m6K0L2k3QJ3k7RM9nn2J5J0k4k2K6o9N0O5j6n8
$$ 15 -9 -55 -5 -23 -52 -66 -21 44 -2 -35 16 -30 -10 22 -1 7 20 -7 2 51 46 -6 9 19 -5 -27 -1 -70 -20 45 29 -29
6037b9M7k6M1j4k6RL6Nn5m1O4Mm3J6l8P6J9n0K9j1j7j3Pj7O3n1O4Kn4o3P9n3M1
$$ -29 18 -8 33 19 -7 2 38 43 -12 -53 11 15 -28 -12 -50 26 45 -5 24 13 -4 -17 -10 -27 36 -15 49 51 -3 -66 13 -40 1
6070Ak5mL8nM9ln3l2N5j4L5l7K0k0l5L9jLj3o6Q7nl1l7N3l3K3K3n8R6o9l4O0J6
$$ 1 -24 -28 10 5 54 51 -2 -34 21 7 42 5 25 5 -30 9 8 11 -2 -68 19 14 -17 -54 -1 -34 -11 12 -46 50 -19 -53 7 23
6104B3l3%J5qL7lJ5rL2p7L5lj0m5P2n8K6oj9k1Q0pLk8p6Q1r3O6L3l4m0K8L5k7
$$ 23 -10 -10 5 -3 34 31 46 37 69 -8 27 24 14 -31 41 -17 9 3 -16 -37 43 36 39 11 -65 16 -77 -11 22 -12 -52 -24 11 -16
6138a6n4N9QN8n5j0M3j1k9O0Ml1l3J2M2n4j5j4J8k4O1l8N6q3O1jl7qN5pm5k4N8
$$ -16 -70 -11 -3 55 0 -10 33 22 -7 53 57 26 -7 5 47 -7 -22 -36 -18 -42 19 -19 37 -46 15 14 -23 -31 24 17 -28 -52 6
6171Fn9M8Nk7M7k7jK3o1L9J09p4l8%lJ0J4kj7pJ5J9k2j3qN1jJL0j6j7KL0k7J6
$$ 6 -53 -5 0 -27 20 -7 -8 15 -46 -7 102 28 -10 -10 -13 -3 11 9 -8 -15 0 19 -3 -16 -24 27 26 27 57 41 24 26 56 29 45
6206D5p6N3Lk1j7P2n5ol0Qk1P8K9l6k6q7J10Ol4m3N7K0K6q5k1R3n2K7J3l5k9P1
$$ 45 -31 22 25 4 -13 59 4 -2 -32 -24 -45 33 62 26 0 -87 23 29 -5 -48 9 29 55 -30 -51 42 -10 17 30 -5 -34 37
6238C7l1n2J07m4mpK2lK3n3K5j7J5L4r5P6n3j7kJ8m3K8k2L2J0OK8k5n0R5l5j3
$$ 37 6 -46 61 17 13 6 28 25 48 -5 20 3 18 52 -43 33 -20 -37 -39 -21 -64 -36 -58 -26 -16 -10 18 -7 -57 38 3 -10
6270a0l3L6M8o6K5KNj1O1j7n3K8L7KJ4m4L4j21Q4o0NM3K7k0j8L8o3J8K8l0m0O6
$$ -10 -43 -7 41 -25 0 2 7 -4 57 40 -13 15 52 54 68 24 58 -63 21 -39 -34 9 36 16 -2 36 -27 -9 19 -11 -51 15
6302A5Kk2pJ1J0PJpk6K5rlN4o5J5Nj1K3J7k2k4k1K5O4m1j7J7j1Pj8k4L2k2L3K2
$$ 15 17 -5 -12 -1 9 16 17 10 -16 9 0 -3 51 -14 1 6 -5 18 35 13 -11 -32 -7 57 16 -1 16 5 12 -6 -30 2 -20 13 35
6337C5o2jM1kl8N9J1p9j3M3K1p0O5l9P5lo5pJ3N4j6n1l7J0P1j7J3j9j3Pj2j1K7
$$ 35 -27 -28 13 11 -27 32 43 -36 -49 -6 15 -55 10 -29 46 43 -22 -29 -16 38 22 -29 -66 -56 15 -2 11 -8 -21 -14 -26 -37 -10
6370a0L3k6k1O9n0L8j4o1Q2j0qn5M7m2kL1Oj8p5J6Q7l8K0k2M0n4%Q3j8j8Ml0l2
$$ -10 23 -3 -24 45 -5 33 19 -42 40 30 22 -33 14 -28 -30 1 7 -11 -86 -70 17 -21 -1 -23 17 -37 -37 46 28 10 14 -16 -48
6403d8K6LOk0R9q5M0k6m2J11o8NK9m7J1l0N4m3N3o3J3m6O7k4K6L4p4L3m4M3M1
$$ -48 -22 -19 -13 -33 66 -19 21 -5 -47 64 -4 1 30 -17 -6 -36 18 -25 28 -35 -22 -68 -1 -25 1 35 -39 -6 -50 -7 34
6434C4k0QJ1j9m2j1K1kRK6l4M4PM8j08K3M5l0M5o0pM2l9rK2qK6Kp4Q2L8l1J3r5
$$ 34 14 22 33 14 -28 -39 -18 -20 -11 15 -19 25 32 80 -28 -5 40 10 55 -5 -12 30 -9 -18 4 -4 22 24 -50 32 70 39 52 -43
6468d3PP8o0L8l8m1P4K5q2N4m1rk2P9n6lJ03m7MJ0K3q8R0o0k7P1k1l0JLJ7k4R
$$ -43 -36 42 -18 20 -18 -59 15 40 -42 12 -29 -38 -60 19 -37 -40 63 16 20 30 53 -35 55 -5 -32 39 18 -12 -11 -8 9 -15 -6
6501fkM1lmn6L0k1J9n6P1J8m5j6K9k1LK3jo3N2lQn0J05o0Rj0j7K4oK3Oj4NK3l8
$$ -6 -8 33 30 26 -30 0 -21 -2 -58 13 31 -14 -30 -1 -22 -19 4 3 -60 -8 -11 -3 -53 52 -8 1 -9 -26 -2 -8 15 21 7 12 35 -3
6537cN3o2O6l5l8RL3o9J48j18O3lk0%k7K7rrJ1p5M5j2Q8j33O5j2j5K3n9R6k9L6
$$ -3 50 -12 54 19 -19 -10 23 -46 102 -16 47 44 24 24 -3 24 15 6 17 -58 -13 -25 63 -70 -5 -17 -32 -9 -68 28 -1 35
6569C5k5l4KM6J4l4%j6OJ4j2J3Mm6K7J1O2r9j4J5M2M0r3O0J6l9L1jJ3kJ9m5j7
$$ 35 10 -24 -22 24 38 4 4 -12 -6 8 -4 9 13 -33 -6 5 67 -32 -46 -31 11 51 -42 18 34 -5 26 25 38 36 55 10 -7
6602gK2m5M1k5L4L6n9k9K5l2M2J1k6M9j02M3Q9r8M8qk1Mk8J1M7K6j09M8oO4j09
$$ -7 15 -30 11 -14 20 56 -3 -32 -7 -39 3 14 -12 37 -65 -22 67 -31 17 9 -12 -8 -36 -25 22 48 -61 -13 -19 45 -64
6633f4J09m0L6l8JM0l5LPm0l5J2oK7P2l0Rk7j2l0L3JJ4K3jp6N6L6k2K4j5j1m4
$$ -64 45 5 41 3 4 44 9 12 19 -21 -56 -44 -50 -23 49 19 28 1 -11 -41 -8 -7 7 30 29 -47 9 45 23 47 32 21 -23
6666b3rM6MLl4N0m5J1K3k4k3O8j0j9Rn6J8L1p1O6k6lL0o3L7k2L4jL6k5pl1pM9
$$ -23 -32 14 18 21 -13 37 -8 3 26 2 -21 47 37 18 27 -29 -11 20 -51 15 -11 -14 16 -47 -10 -32 2 1 37 12 5 -26 -33 16
6700A6qP%k6K2mK4L2l4m5J8j9Jk1M3J9K7m8L7r7N0K5l1k7L2ml9J2O8l5pK7m2K4
$$ 16 8 15 15 -11 11 7 31 63 29 -16 2 -17 -16 -37 6 25 52 4 41 -56 -6 19 -12 -39 -7 -11 -50 -38 30 -5 -12 15 -27 -3
6734ckrM4m2Mll2K3L2Mm5K4NK4j9k1L5K0jj2J4l7k9lj2N3k5j4rN8Mm0J0K2J2j4
$$ -3 -5 -14 30 -12 -8 -11 -43 -20 12 16 -29 -5 0 24 5 -16 19 39 38 26 40 3 -26 -29 -41 12 -13 -27 -36 22 26 -14 -4 18 30 16
6770A6n0JRJ9OMoL2p9L2K6J3m7P1m3j2mMKN2knk7l6O8m2L6j9j5k5K5nl0M9k2l7
$$ 16 -34 -33 -24 -5 1 5 -1 31 -48 -16 10 23 -24 47 4 -8 -12 -8 -6 46 44 39 12 -24 44 2 38 19 4 -21 4 -1 -31 18 -4 -41
6806d1O8m4j2K9L9j8K0n5LLj8jk2J00q9J1M2L1k2n7L5M2Op1k2Q7p0J4N5o3n1M3
$$ -41 27 -17 -29 0 39 21 41 -14 -11 -8 -26 -27 -49 51 -38 -27 15 46 24 -33 2 44 50 -21 -43 44 -26 -12 43 -20 -71 -28
6838b8K9J7m7J8l5M5mL0m0L3OM6o7kkj2L5Nj6q7O2m0O0Nj8m4P5Mj0m2k4L3K3L6
$$ -28 1 18 -29 -11 -46 -1 -5 25 -15 18 24 70 3 1 -1 -13 22 27 11 -76 -14 -54 6 11 -7 -51 24 28 18 -24 -48 -15 8 44
6872D4n8J2j4L8l5N7p9N7k8n8Q8Rl5L4l4J7KL6q6LK8PK1l%pn8P4p6N0K7m3ok4
$$ 44 -14 -2 -16 22 -13 44 -35 22 -6 -64 24 33 -2 32 -2 15 17 53 -33 -30 -2 5 26 23 23 16 -42 32 -44 6 33 -10 -16 -40
6906d0N4Lk4k0lJ3j6l2J15o9j8N5j9K6k0K7k9Lm1N6n6L5n2N6j9n2J3N9O0q8j3
$$ -40 14 17 -7 -27 -30 -17 -33 -65 50 -19 -37 18 -1 25 5 32 3 6 -35 21 -35 0 -52 4 -15 -67 -54 5 65 -23 -36
6937c6K3J5m5J4k2P0j0m5R2m9l5PJ0l9K3L6L2mo8R1m2l1Q3p5J7k4jj4Q5k5m3K3
$$ -36 -13 2 -43 -29 -51 19 9 -36 56 7 -28 -21 -11 -50 -27 9 41 37 -31 60 18 -13 70 -5 12 -12 -13 -27 58 33 -10 13
6969A3k6nL7o6L5M0m4pqL8m0qP4p2Oj6J9M3j6j3m3O9n5M4l2N4L7n6Rn7J00m0o6
$$ 13 -13 -18 19 -47 -12 28 -16 -23 -31 7 -33 -41 33 -39 -33 -49 -30 13 -3 -16 -59 10 -45 -1 -33 21 58 2 11 -46 54 14 -52
7002e2J13n6o9M0K8n6M6rJ9n3j2N9nl3Q6n0nk4L1l2pL2KK5q1L1n7O5K3L6nj7l1
$$ -52 61 5 -64 -24 4 -52 -6 -15 4 -49 -61 -2 -7 -40 46 -4 -9 -33 -2 -34 -41 -9 -7 18 -63 -32 -89 -24 -1 35 30 13 -18
7035a8pJ0kM0o4Q7j6j4j5M0Mo9K4N3j1m3n3N9O9m0K7p9M0O1o1kn0j2Qk2Q2n1J
$$ -18 -25 -15 -17 23 -41 46 30 16 1 41 45 -24 0 53 42 -1 -54 5 74 34 61 -18 22 83 22 20 -30 -42 -34 -56 26 -25 -24
7068b4M7J1l3Jn2P3j3n0O3Mk6J1j9k5J7jM1K1k9k5K9Mn1O5j2nj3nK2J2L5q5N0
$$ -24 23 34 1 2 -50 23 10 -40 23 27 1 12 -7 -32 -15 -16 25 46 17 -8 21 25 -26 39 27 22 9 4 26 38 73 -12 38
7101C8n3J8l8N3k3J4k1m0J4M7on4O7p3J5J5j2Q9q6N4o8R2Mm3K7K5r2L8N2j0q8
$$ 38 -15 3 -35 18 -5 9 -12 -52 -38 9 3 -51 16 -57 -42 -27 -39 50 -36 18 -50 42 46 3 30 55 -37 1 53 43 -45
7132d5M2k0L2N8o7K2M6o7J2jPl1j5K7rNJ2On5NJ9QrK2k6K%Kl7L9kj1%N5K0r7J05
$$ -45 -3 -23 9 67 0 22 68 1 13 12 19 -12 -27 0 -9 -4 8 14 -41 -36 -17 -9 -18 4 -22 -20 -20 -18 -55 -16 -18 -29 -29 26 46 -51 54
7169E4pj7k6M7nPo0NN2q8L8K6j9lO4o7K1k8nJO3o5K0j8K2J1kkn3M2j1j1K9Ko4
$$ 54 47 30 4 51 46 53 -7 -2 50 -38 0 26 7 4 68 1 22 -6 -11 -10 53 -12 8 -10 12 23 21 19 -34 8 -3 -14 15 17 -47
7204d7O5mj5K0o3J08j04Q5mJ8j1p1K6Oln8Q7j2m6P5k4m9j2M5k3j5P0n4K5n3Q3
$$ -47 18 14 -1 19 -44 64 -40 45 41 59 48 -23 3 9 6 -52 35 23 -23 52 28 -21 -33 12 -11 -26 44 -10 15 -38 45
7235D5l9O9n6m5l8Q5ml3M3p8J10j02M8n9K8l6N8P2q0k3O0k1K0qJ4K4n0QQk9J7
$$ 45 6 75 19 -26 -64 21 17 -16 27 -51 59 -43 5 -54 -26 -62 -4 68 -12 -35 25 4 24 16 30 54 4 12 20 -9 8
7266HJ3j1l0P3m4m7M5k0J8l5QlM9r6O8n1N0%l7L6j1K8%M4o2j3O5q7K4M6n7M0J0
$$ 8 21 10 -20 53 9 -38 7 -13 5 -30 -22 -25 24 -72 -4 -55 -5 -5 -42 -6 -17 11 11 55 -7 -20 45 -42 -18 28 -29 11 21
7299B1p9K8j7lM1L9Pl5K4K7p0J1J3pMj6j2K4j7M3j9o0Q0j7j6L2j8L5m7K4k0k8
$$ 21 -58 -30 -47 -50 -9 30 37 2 26 53 -17 -6 7 0 4 -12 -24 0 -17 26 7 -53 27 10 -6 26 8 43 -4 20 0 -28
7331b8J5Jj7L5Mmpm2O5j9j5M8mn5J10o3k1m5M7N2l4q5P3J3Nk3J3M5l6L3p2K4K4
$$ -28 -13 -12 -29 6 10 6 -1 -43 22 3 -12 36 32 -23 87 24 3 -42 5 57 23 -62 11 24 29 6 19 64 28 61 -11 13 37
7364C7l0L4j1k8n2M4j7O0j9nJ3j6qk0O0o1M6m2mmj0J8j1L6jk2L4%N0n3Kk4M7o
$$ 37 7 41 30 2 -50 -6 -23 37 18 13 26 10 2 -18 42 -19 27 -15 -19 -23 -33 -15 -26 10 9 -13 21 21 71 18 20 -4 43 37
7398C7m4%k4J8LkJ3Nn2M6j6j9M9l4O9n5J0k1N5rk0m2O4n9M9M9l1n6N2l7M8k8k9
$$ 37 -7 -7 -31 -13 -10 -12 1 6 -46 0 -16 -35 14 -20 49 -6 4 -17 38 29 9 -33 31 -28 21 70 39 -17 35 -2 46 18 -11
7431a1M7l4N5m6J8j5j4n3J04k3k7pK1l8J2J6J8l1%l8J8Jj0Q3l6nk2KPqM0m0Q4
$$ -11 36 2 57 11 29 14 0 -53 51 28 1 -6 15 -23 -11 5 23 -8 -8 -46 -28 -27 -37 46 10 5 -17 -15 -8 -16 24 -16 68
7464F8r4l1N9N4r1N7%k4R5j17N4MoQLl2K6l3l%lk5PJ9O2j16P4N6j06RlK9L0k5
$$ 68 -26 -57 2 56 -35 22 22 -2 93 -24 30 34 28 36 39 7 33 0 -3 -3 -6 -31 -24 -5 57 -59 15 71 -35 -26 -29 0 30 5
7498EjOm8N7n4L4K1pj8O6n2M2o0nO9l0%m3K4J6J4j6Ll1k3L3l0Q9m5N6l6n2J2j
$$ 5 4 10 -38 19 -35 -1 20 13 -5 61 9 51 -9 -14 55 25 25 -18 6 22 36 20 23 -8 -31 2 -28 61 16 72 36 -16 -4 -5
7532eJ5nr5O8Q5r6N6k8J8Qkl6lk0L6pk2K1K6k4j3M6L6k3o6M7J2j8j0Lk0L6l6J1
$$ -5 10 5 -90 -22 63 -33 23 -5 13 21 19 -17 -20 -40 -4 -11 -33 -12 14 -10 -23 23 59 36 -30 17 29 11 1 4 -16 20 -16 -5
7566em4NJ3mK3k4N6l7J4p0K3R2n8j6j7L5L7k2J7l1J4Pj7rOkM0k6L7k7k4k3rk3
$$ -5 -49 -44 -31 -35 -12 -36 20 -17 -3 -73 -50 42 -16 -32 -49 -14 23 1 18 -13 1 8 -9 -18 -12 -14 26 0 37 10 -14 -37 -46 -69
7600f9N5j2J30j16j3O1o7J04n9k3k9N6k5o5J09n9J2L8J5o8J1O4o7Mn0JP3m5m1
$$ -69 -14 -26 104 -12 -25 36 -31 73 14 -9 -38 18 -7 -72 37 -22 -10 28 43 -25 -14 50 -17 -13 -63 -62 11 -34 -75
7629g5Q2K7jPJ9l8PJ2j7j4J8nM7o0n0N4J8j3K1pRp4N9k7mJ3o0l2N4Ol3N3K9K3
$$ -75 7 34 33 40 59 21 28 40 23 9 27 22 69 9 -41 13 31 18 39 32 41 -33 26 -1 -5 8 -52 -84 -30 -24 -57 -4 25 48
7663D8n6l3J8J4pk4L7Rm4K7M8m0rm2M5O0p7NL2K7j4J0J8o7LNm0Q7m1o1P5L1j0
$$ 48 -8 -41 -23 -9 -16 -40 -3 6 -38 -11 37 -3 -12 -54 -9 51 -26 -21 11 38 24 34 52 -15 -12 -7 -47 40 -1 -62 13 44 34
7696C4l0K0l9j3J3K4K7m0K3Rm3K4j1j9K2J3l3k4L9j9nL0JKj2OJ8mL9l3J0M0n3
$$ 34 4 24 -15 -28 -15 9 36 -4 19 28 -15 9 -2 -21 1 14 -19 -43 -4 -23 -28 2 3 5 -7 -1 17 13 52 19 29 69 16
7729A6M5o5p2M1N8p0J10k1K4n5p8J5O0qkM0j3k7k0M4j0Kk1LL5p5N4j5J0Om2K7
$$ 16 61 -4 -76 -35 23 -47 63 42 66 11 -67 -52 8 0 -2 38 25 -2 -22 22 12 14 -7 -4 31 -44 10 -5 5 11 -31 -4
7761dK6K2m0O3q6N9p4mJ13q0K5NOn3J8RJ0k0j1Nk0j2M0K4n8j8K6L3k6mJ9k1N9
$$ -4 22 44 4 67 -19 40 -34 -38 75 -5 20 25 31 -22 -4 5 15 -5 -16 -11 -31 -43 -3 21 -37 -55 -29 4 -22 -26 -7 -28 31
7794C1p4M8Q%LqK7m7J9jm1R0m6%L1n1O1l1J9j4j6L0k5J9j3rj8k0M7j0J6l8Q1l3
$$ 31 -43 5 13 13 16 8 35 -12 7 6 -35 55 9 9 40 -11 50 19 38 24 8 38 13 32 19 10 -8 -28 19 9 25 -13 68 35
7828C5m3L7n6K8n1L5K7l8M7j9J1M2o3pM4n0j9N4QKj4N4l0k4l9L0m5K9L2j0L7o1
$$ 35 -8 29 -27 1 -50 -15 12 -26 21 2 13 55 -8 -15 29 -21 -40 14 22 24 10 64 34 10 -29 1 -44 -15 17 7 44 -17
7860a7L3Jjj1K8Mn1J4mjm3O0j8L4k9lk2jQ2q3jL5p0P6o6R3m5l0N7j7L3j5J0o0
$$ -17 16 17 16 5 33 37 -14 0 -4 -5 -48 12 -6 28 -1 -4 -26 -27 55 -28 -29 6 -64 12 -54 39 -6 -36 21 4 37 22 32 -28
7894b8J0O4l2JOQqp7O4K8ok3K6n4M5j1K9j7l8l7L1J4qk7L6%K4L4j14K8O4l1k5
$$ -28 -18 46 14 15 21 29 21 -56 8 36 30 7 33 -21 24 13 42 25 -13 -50 -19 -5 -13 -40 -4 -4 20 54 -60 -32 32 1 -24
7927b4L6j7K8Nj0pk0k7L1k9R5Ko5m3R9l9qm7M9J9J6J0m4Nk9l7J07p1l0P7m5%j4
$$ -24 12 -5 23 28 18 11 -9 -36 -5 -34 61 63 -2 -45 54 15 7 -40 9 28 44 54 10 15 -14 -51 56 -15 -45 32 -13 -13 -27
7960b7P4j5p9K5QL1k5K6K0l5J1n6M6N5q1J2O6o1K9Ql5P8n8LK0lk3L4q1N7j2p0
$$ -27 47 32 -47 -22 -14 17 -8 18 38 3 14 -42 4 59 -22 -10 56 -5 24 32 -3 75 17 20 40 37 14 48 -33 24 12 -58
7992e8N6K2nk9L3j4NoJ9o0j3L9OLkj4K7nm1M3pjK8j3J9K3q5M2o4N7m5M3KKpm5
$$ -58 -2 20 15 -14 19 5 10 4 23 -37 -50 -11 -5 -2 -4 -18 9 4 -37 6 -1 -2 26 13 32 55 -30 12 -52 5 -40 3 5 7 0 -45
8028d5J10q1O6p2N4pl0P3o5J5k3l9j0KN2J1k3M5L0o5k2J1L0q1Q2L9o0K8j9J3j4
$$ -45 65 -16 50 -22 32 25 -5 68 3 18 -5 -44 -54 -52 0 11 -12 33 63 -2 -24 -13 17 -64 18 57 -3 25 6 19 5
8059ElJ0Qr0R8J4l9j1K2n5O5m0K8K8m3M0Nl6p5Q2PJ3o7jJ4MJ8n1O2jj6j1N1j5
$$ 5 2 12 20 -70 28 42 3 -8 14 -41 24 -16 12 40 -3 37 42 6 -69 13 20 33 -34 -35 -21 -17 1 -50 12 11 -5 -16 35 20
8093B0n0NnN1r8P1l8N2rOK7n2K5K9jMo9k4O6j%L8j6J0n8OJ7l0k2P3J1j5p4J2L6
$$ 20 -30 -25 -30 21 -77 -6 -44 8 -1 5 32 -20 5 34 33 37 -32 -56 10 9 9 47 31 41 -17 -11 6 -24 -46 27 38 23 -51 -39 -3
8128clk2m1M7k1R8o4N0kp8M8k7K9j8kJ8k4L9m6O4l0J0prJ5k5k5J6mj2N1K6k3n2
$$ -3 -6 -28 -69 -22 -43 55 -9 41 39 -39 9 -18 11 -7 -9 9 -15 24 -22 42 12 22 15 6 21 -4 -29 -13 -17 -29 22 48 25 -27
8162b7N1J1l1Qm6M2l0j6M3j4l3LLJ5J7O8q2K8j1K9lk2j3OL0k3K0n6K6
$$ -27 24 35 4 12 -34 8 -22 -38 5 -9 -42 -39 -36 -21 -4 64 -18 10 -1 28 25 3 -10 -4 26 3 23 -33 -7
8191g
$$ Imaginary data points
##PAGE= N=2
##DATA TABLE= (X++(I..I)), XYDATA
0@%%%%%%%%%%%%%%qJ6j6J6j6J6k4L2l2M0m8N6p2Q0q8J04j20J36j52J76k00K24
$$ 0 0 0 0 0 0 0 0 0 0 0 0 0 0 0 -8 8 -8 8 -8 8 -16 16 -16 24 -24 32 -40 40 -48 56 -64 72 -80 96 -104 120
36A20k56K88l20L57l97M40m88N44o04O65p33Q08q92R83j083J193j314J450j602
$$ 120 -136 152 -168 189 -208 232 -256 288 -316 349 -384 424 -468 515 -568 625 -689 761 -841
55h41J773j966K187k444K745l101L537m084M787n737P098r220J3024k2013Q5220
$$ -841 932 -1034 1153 -1291 1454 -1647 1890 -2194 2593 -3144 3954 -5266 7758 -14255 70965
70G0965P5874r2289o9944p8144l2727p75N7549P6439P8666L8100l292n1524p2238
$$ 70965 146839 54550 -15394 -93538 -126265 -127040 -69491 6948 85614 123714 120422 68898 -3340
83c340p3766l8582K896M3261O2692P0186M7805N408m3477o7525o6574m0796n667
$$ -3340 -77106 -115688 -112792 -69531 -6839 63347 111152 116560 73083 5558 -61016 -101812 -107479
96a07479L3566N9969O6674M6145Q463l3657o0333o3344m1298p467K7026N2156
$$ -107479 -73913 -13944 52730 98875 107338 73681 13348 -49996 -91294 -98761 -71735 -19579
108a9579O0283M4682J1605k5253n0836n7480m2422j2014K0946M4988N3017M3286
$$ -19579 40704 85386 96991 71738 20902 -36578 -79000 -91014 -70068 -25080 27937 71223
120G1223J7856j5980m5016n4851m1264j4415J3810L7262M9994M3820J9240j2337
$$ 71223 89079 73099 28083 -26768 -68032 -82447 -68637 -31375 18619 62439 81679 69342
132F9342l7952m8625m1007j8569J0103L4313M4997L9259K0386n686l1027m4746
$$ 69342 31390 -17235 -58242 -76811 -66708 -32395 12602 51861 72247 66561 35534 -9212
144i212l9482j9242N738K7326L9388L7714K2393j765k5516l9407l7537k1951J043
$$ -9212 -48694 -67936 -62198 -34872 4516 42230 64623 62858 37342 -2065 -39602 -61553 -60510
157f0510K3167L6395L5824K2648J674k0462l5158l5799k2647j687J8942L2037
$$ -60510 -37343 -948 34876 57524 59198 38736 3578 -32221 -54868 -56555 -37613 -5576
169e576L3234K2668M335j5980l0661l2942k2916m783J4723K8151L0997K2795O720
$$ -5576 27658 50326 54661 38681 8020 -24922 -47838 -52621 -37898 -9747 21250 44045 50765
182E0765j2201k6496l0597k3168p233J1131K4739K8499K2414Q568q800k2745k7993
$$ 50765 38564 12068 -18529 -41697 -48930 -37799 -13060 15439 37853 46421 37621 14876 -13117
195a3117k2728q959P974K1288K6142K1925R817n860j9362k5449k2062j0484M972
$$ -13117 -35845 -44804 -36830 -15542 10600 32525 42342 36482 17120 -8329 -30391 -40875 -35903
208c5903J8283K4027K1061J0740l302j6044k2833k1232j1395K623J5184K1482
$$ -35903 -17620 6407 27468 38208 34906 18862 -3971 -25203 -36598 -33975 -18791 2691
220B691K0126J1582j222j3333k0391k0178j2093K75J2403J9421J9217J2099O54
$$ 2691 22817 34399 33177 19844 -547 -20725 -32818 -32543 -20140 -719 18498 30597 31251
233C1251j0651j8138j8878j2523j375R865J7053J8037J2436K145q619j5981j7431
$$ 31251 20600 2462 -16416 -28939 -30314 -20449 -3396 14641 27077 29222 20603 4622 -12809
246a2809j2560l098P654J5146J6923J2299L400o246j3813j6164j2631m121N600
$$ -12809 -25369 -28467 -20813 -5667 11256 23555 26955 20709 6896 -9268 -21899 -26020 -20420
259b0420J2945J5397J2277M717m597j2081j4943j2195m983L787J1089J4187J2027
$$ -20420 -7475 7922 20199 24916 20319 8238 -6705 -18900 -23883 -20096 -9007 5180 17207
272A7207N526l056j0300j3497j1788n761K319R424J2776J1636N917j541q580j2191
$$ 17207 22733 19677 9377 -4120 -15908 -21669 -19350 -9926 2850 14486 20403 18862 10282 -1909
286a909j1392o186J265P786J1404J0833O718l46p166j1190j0705o426K9O270J0081
$$ -1909 -13301 -19487 -18222 -10436 968 11801 18519 18173 11007 -183 -10888 -17314 -17285 -11015 -934
301i34J0369O931N53n679r775j0085o700r51N166R019R552O780J629m335q663
$$ -934 9435 16366 16919 11240 1465 -8620 -15320 -16271 -11105 -2086 7466 14246 15875 11540 2877
316B877r650o906j499M067P773Q761O841K468l227p650q874o627k245K919O810
$$ 2877 -6773 -13679 -15178 -11111 -3338 5423 12264 14732 11505 3855 -5019 -11646 -13891 -10972 -4162
331d162Q097O727K779k260o425q112o736k808K046N903P432O412L247j269n374
$$ -4162 3935 10662 13441 11181 4756 -3356 -10092 -12900 -10854 -4951 2481 8893 12140 10871 5497
346E497p496o545l015J160M981O772O150L415o51m476o775o141l471O86M083O157
$$ 5497 -1999 -8544 -11559 -10399 -5418 1354 7504 10919 10268 5792 -983 -7124 -10595 -9909 -5826 331
362C31N920L537O9l710n933n962l580ML371N445N488L625N09k878n183n745l727
$$ 331 6251 9788 9857 6147 214 -5748 -9328 -9324 -5953 -508 4980 8605 9114 6236 1053 -4692 -8419
379h419m92K830M875N178L693R42k300m629n195l785r49K141M249M866L598J206
$$ -8419 -8911 -6081 -1206 3972 7665 8607 6307 1678 -3517 -7302 -8251 -6110 -1861 3005 6603 7809
395G809j674l856m868l759j250J582L688M496L632J459j173l343m414l689j652
$$ 7809 6135 2279 -2589 -6348 -7598 -6016 -2328 2168 5800 7259 6086 2743 -1671 -5360 -7012
410g012J041L221M081L520J668p80k727m002l562j837O80K686L843L326J777l99
$$ -7012 -5971 -2750 1331 4851 6519 5739 3012 -990 -4552 -6389 -5709 -3023 820 4146 5923 5524
426E524k334l510l463j973J72K240L413L313J908k9j914l150l169k155p5J892
$$ 5524 3190 -320 -3783 -5756 -5584 -3344 69 3382 5290 5261 3347 197 -2972 -5127 -5202 -3310
442c310K998L105J954J99j530k767l069k142l73J439K689K949K088L93j186k419
$$ -3310 -312 2793 4747 4946 3416 649 -2420 -4562 -4935 -3496 -807 2142 4230 4623 3437 1018
458A018k755k146o47J101K322K783K022O39r92k111k542k103q30O93K153K607
$$ 1018 -1737 -3883 -4530 -3429 -1107 1676 3698 4337 3345 1234 -1308 -3411 -4241 -3548 -1395 1212
474A212K016P43o40j817k342j986j005M53J757K291K087Q28m41j576k065j958
$$ 1212 3228 3971 3331 1514 -828 -2814 -3819 -3366 -1609 682 2769 3597 3156 1580 -485 -2443
490b443j061K81J434K130J935J095k23j374j938j812j090K3J116J894J924J058
$$ -2443 -3504 -3223 -1789 341 2276 3371 3148 1774 -164 -1976 -3066 -3043 -1927 -33 1891 2949
506B949p2j077j668j714j213j21J016J658J730J251P7q17j609j678j156k69P27
$$ 2949 2877 1800 132 -1582 -2795 -2916 -1900 -242 1488 2739 2816 1999 390 -1288 -2444 -2713 -1986
523a986J451J682J171K64o60j358j584j144l03N84J284J511J176L57n78j138j450
$$ -1986 -535 1147 2318 2582 1922 564 -1020 -2164 -2467 -1883 -599 912 2088 2445 1867 729 -721
540g21j121m36L44J066J441J157M57l42r34j417j123m36J97R75J258J099N89k28
$$ -721 -1842 -2278 -1934 -868 573 1730 2187 1845 911 -506 -1629 -2065 -1868 -893 365 1464 2053 1825
558A825q88j271j093m78J56O95J235J076N88p9p37j102j042n29j1O11J071R77
$$ 1825 937 -334 -1427 -1905 -1749 -1054 181 1257 1845 1766 1029 -73 -1115 -1644 -1655 -1044 27 1004
576A004O39M8o09j018r72o25p3N65Q72R45O58J96m91q86j006n82j33M65P64Q29
$$ 1004 1643 1691 1082 64 -908 -1533 -1606 -1041 -169 776 1434 1630 1139 253 -753 -1335 -1468 -1003 -239 590
596E90P62Q9l60p91q95n84j97L51P44Q29N72K09k14p26p28o95k21K03O36P11O36
$$ 590 1352 1441 1081 290 -605 -1189 -1386 -1035 -291 538 1110 1319 1105 379 -349 -1044 -1265 -1062 -426 285 921
617I21K91j57o26o98n94l14J28N87P29N69L32j95m31o41o59l72J18M80N75N93
$$ 921 1212 1055 429 -269 -863 -1177 -1049 -462 267 836 1168 973 542 -99 -758 -1130 -1012 -532 43 636
637F36L59n0l58n56o56l63NM68N40N40M06m2l45n06n67l90n6K75N56N60L53N4
$$ 636 995 945 587 31 -625 -988 -983 -515 25 565 971 929 584 78 -489 -879 -935 -660 -104 456 809 863
659H63k81m60m76m33o2K50M60N39L83Kj77m19m92l89q7Q6M49N00M11J04j25m01
$$ 863 582 122 -354 -787 -849 -599 -139 400 783 785 608 189 -303 -692 -779 -693 -244 256 667 771 646 245
681B45m41l81j01J04L14M73L45J23j26k79m11m13j21J29L11L62L21J94o0k20m66
$$ 245 -196 -577 -678 -574 -260 213 558 681 555 276 -135 -548 -669 -540 -229 133 454 648 588 368 -98
702i8l42j75Q6K36K72M24J43J2k34l66l42j35o0K34L55K94K44j9j92k82l23j79
$$ -98 -440 -615 -529 -293 -21 403 546 558 324 -42 -384 -519 -579 -345 10 304 548 529 337 55 -268 -447
724d47o0K09L25J82K44k2r8k46l19j81m7J38K75K31J70P1q8k27k20k20j34J09
$$ -447 -507 -298 27 209 453 431 333 87 -232 -413 -460 -322 -47 184 354 425 337 110 -110 -330 -464 -355
746c55K03K49K33Q0n7k66k19j95l1O2J89K32K22K2p7j36k25k22j03Q7J76K43J35
$$ -355 -152 97 330 410 353 87 -132 -327 -358 -296 -107 125 347 369 292 156 -69 -291 -394 -307 -131 112 247
769B47Q1j1j47k45j57q9J7J78J72J84Q9m1q6k07j98j13J5J47J83J89R4k3j43q0
$$ 247 328 317 170 -75 -232 -321 -304 -126 46 230 319 278 192 -15 -213 -326 -311 -164 19 208 302 279 136 56
793E6j78j23k6N7K19J22J44Pj09j63j49q8m5J16J57J47J30J9j18j43m0j47n2K1
$$ 56 -122 -245 -271 -214 5 127 271 278 169 6 -143 -231 -276 -160 -3 144 274 293 175 32 -8 -155 -207 -186
817a86R7J29J13L0k9o1j92j15l8N5J42R8J24R9l0j11j45j22o8k7J52P5J23M9l3
$$ -186 -89 40 153 183 154 93 -99 -214 -252 -197 -55 43 167 266 236 125 -20 -142 -210 -237 -85 -10 113 162 129
842A29q1p6r5r9J37k3R5J30R5m3m8j42p3j39J23K1O4J27N7J4o6q9j05p7N0M2O
$$ 129 48 -28 -123 -222 -85 -108 -13 117 212 169 121 -21 -94 -233 -110 -89 -25 102 159 173 107 18 -87 -164 -114 -72 -66
869f6J92J6Jo2n2p5r2J2J0O4J38L3qn8p5pj35N3PQ3R4N3LL8j63p3j6j6k3O7J22
$$ -66 126 142 143 81 29 -46 -138 -126 -116 -52 86 119 111 53 -22 -29 -164 -111 -104 -21 73 126 129 167 4 -69 -85 -101 -124 -57 65
900F5k4R1mn6m3j27k7R2n8J04Q1j5K1k2q9j27N2N6l0N8L9P8l2Mo1l8r7N9oN9K7
$$ 65 41 132 128 72 29 -98 -125 -33 -91 13 94 79 100 78 -11 -138 -86 -30 -60 -2 37 115 83 87 26 -12 -109 -50 -56 3 30
931C0N5J7l9o1o7qlJ4L5J21K6j5m2m2n7%n7M1N9pO9l4L4Mj27o3J8L2L0Q5l2P0
$$ 30 85 102 63 2 -65 -73 -76 -62 -27 94 120 105 63 21 -36 -36 -93 -52 7 0 69 35 69 73 -54 -117 -99 -67 -37 48 16 86
963H6q0L6j25L5Jm7R8l5M6K6J0pk8J9p3Rl0Q6M0M2l6m0Jp4j6L1oP7j0k9O4k3k1
$$ 86 6 42 -83 -48 -47 -94 4 -31 15 41 51 44 16 35 -38 -29 -59 27 67 109 73 33 34 -40 -56 -25 -31 46 36 7 71 48 27
996B7q3M4k0l4J2J7P7K2o3L0p7J6l6P7m4M0NL1N3n5Pm9N0j02O3J0M4ML5j25J1
$$ 27 -56 -12 -32 -66 -54 -37 40 62 -1 29 -48 -32 -68 9 -35 5 10 41 94 39 46 -3 47 -55 8 18 62 66 101 -24 -13
1027a3l9RO6MkJ3k7Q9q5L3p0k8K0rN3M2p4N3o9MK1k5K1j3N8m1N1M2p0mJ0m7K3
$$ -13 -52 -43 23 27 25 38 11 100 15 48 -22 -50 -30 -39 14 56 -18 35 -34 -30 -9 -34 -13 -26 32 -9 42 84 14 10 20 -27 -4
1060dk3J6K4km0R6q8Lj5MlJ0P2J8r1L8l6M3k5nj3M3Jq8J08K9q4j1p2N9N1k8K4
$$ -4 -27 -11 13 11 -29 67 -21 -18 -33 -29 -32 -22 50 68 -23 15 -21 22 -3 -8 -21 22 23 -65 43 72 -12 -23 -95 -36 15 -13 11
1093A1L2K2m6l9J9PQl2J8qL1j8K8k3j6jl2L0L8j5K3r5O5%m2J6n3N1J7j8P8n9P4
$$ 11 43 65 19 -20 -1 6 14 -18 0 -8 23 5 33 10 -6 -7 -39 -9 29 14 37 -58 7 7 -35 -19 -72 -21 -4 -22 56 -3 71
1126G1r1NJ9k1j9J1K3pJ7J4Km7pjJ0O1k6P2m8j3MJ9p1Q3p5O9n1J4J4k6j3lj0J0
$$ 71 -20 -15 4 -17 -36 -25 -2 -9 8 22 24 -23 -30 -31 -21 40 14 86 38 25 29 48 -23 60 -15 54 3 17 31 5 -8 -11 -21 -11
1160a1Lj6J3LK3l7L3L3l6l1N0o5Q0m9J1L1pj8J4o9L2M2j7j2J9l0K1l5P1m6k8N5
$$ -11 -8 -24 -11 -8 15 -22 11 44 8 -23 27 -38 42 -7 4 35 28 10 24 -45 -13 29 12 0 19 -11 10 -25 46 0 -28 27
1192B7K5m4j9K4qNm4J6k3K5m5P2K3M3j9n2l2K9m2J6O8m1J8J7j9j2k8k2O2J1l8
$$ 27 52 8 -11 13 5 10 -34 -18 -41 -16 -61 11 34 77 58 6 -26 3 -39 -23 45 4 22 39 20 8 -20 -42 20 31 -7
1223gN2j3n7L5K7l2k6pK4L1m1P8o1j6L6pn8K1K0n7J9N5p9L2N4o6NRL3qmj8L4L6
$$ -7 45 32 -25 10 37 5 -21 -28 -4 27 -14 64 3 -13 23 16 -42 -21 -1 -58 -39 16 -63 -31 23 -43 -38 -29 4 -4 -8 -26 8 44
1257D4r7J7N5j7l8K3J4LK3k3n2KM8o7L0N8m8j9M8K4j8l3P6k3J3o2K9K2mj8J1q4
$$ 44 -53 -36 19 2 -36 -13 1 4 27 4 -48 -46 2 -65 -35 23 -25 -44 4 28 10 -23 53 30 43 -19 10 32 28 10 21 -63
1289f3P0j4J4l6%K3pN6n0Qm1lK8J6Jp3N4K4K9Ol8m5J9K1n3N7j0L2M5q9M0j7L1
$$ -63 7 -7 7 -29 -29 -6 -13 43 -7 1 -40 -43 -15 1 2 -71 -17 7 36 42 4 -41 -22 -1 -54 3 -7 25 70 -19 21 4 35
1322C5n8M4m9%L1N7n0l4o8J10J5m5k4N3m1M3k2J1K8j1J4l8m1K8M5q2Q6k1M7q0
$$ 35 -23 21 -28 -28 3 60 10 -24 -92 18 33 -12 -36 17 -24 19 -3 8 36 25 39 1 -40 -12 33 -49 37 16 63 -17
1352a7nkR9j3o5M4o4J2L2r0M9j4L6l1M9ol0mN3k9k7L2j1m9P8m4O1m6l7O5l2J3
$$ -17 -22 -24 75 62 -3 41 -23 -11 21 -69 -20 -34 2 -29 20 14 -16 -20 33 4 -23 9 -2 -51 27 -17 44 -2 -39 26 -6 7
1384Gl0J5j9l4M9J1k8J6J9j7j1j1JO0k1L0m2j5J7J4k1M0m6L2P3m8j6j4n6O1Ll6
$$ 7 -23 -8 -27 -61 -12 -1 -29 -13 6 -11 -22 -33 -32 28 7 37 -5 -20 -3 11 -10 30 -16 16 89 41 25 11 -45 16 19 -17
1416a7K4k3J3n1N5n0P2l3J9j5j8L5JK0o3k0J5K8L0m1l4M0J3K7o4P2k1m0pO5oL4
$$ -17 7 -16 -3 -54 1 -49 23 -10 9 -6 -24 11 12 32 -31 -51 -36 -8 22 -19 -53 -13 0 27 -37 35 14 -26 -33 32 26 60
1448F0n6K1J2l8J5j1pm9L7j3M4j0j1%J8k6j9l6M7N9q1J6NPK6O4o5Rp1L8k1M9n0
$$ 60 4 25 37 -1 14 3 -4 -53 -16 -29 15 5 -6 -6 12 -14 -33 -69 -22 37 -44 -28 -23 -16 10 74 9 18 -53 -15 -36 13 -37
1481c7P6o0L5m0mR2p7j8J6P3m3o4N6L9m0j2oJ8l7J8P5l1Nkq2M8J1n8K7K9mj3J
$$ -37 39 -21 14 -26 -30 62 -15 -33 -17 56 13 -51 5 44 4 -8 -14 4 -33 -15 60 29 34 32 -50 -2 9 -49 -22 7 3 -10 -9
1514iL9n4M7nk6K4p9N3k6K6LKrl1mP8p9O6K3n5L4J8m1J4k4O3o6L0L3n1L4k3J3
$$ -9 30 -24 23 18 -8 16 -63 -10 -36 -10 -7 -5 -14 -45 -49 29 -50 16 39 -16 18 36 -5 9 -15 48 -18 12 45 -6 28 5 18
1547A8l1%J9%J4m1L4j8mL1l2m1LQ5o6RN2o7K4kO4Koq2qN7L3J3m3l0N5j6k8j9L3
$$ 18 -13 -13 6 6 20 -21 13 -5 -9 22 -10 -51 -48 37 -29 -20 32 -35 -11 -13 51 53 47 -35 -43 14 47 60 17 -13 42 26 -2 -21 12
1582A2k2M8n3nK6K4J5r3O5M8l4o4k4J7O3No5P1n1LJ01r6K1J3nl5L5qk4L9k8pO5
$$ 12 -10 38 -15 -20 6 30 45 -48 17 65 31 -33 -57 -40 23 28 -37 34 -17 -14 87 -9 12 25 20 -15 20 12 -12 27 -1 -8 57
1615E7j8n6M2J6k2nk9j0L6KM3j25Q0kj1J1Kj9j3N4m3oJ4K6p0J3RL6j5N0q9P4p3
$$ 57 39 -17 25 41 19 14 -15 -25 11 13 56 -69 11 9 -2 9 11 -8 -21 33 -10 -16 -2 24 -46 -33 -24 12 -3 47 -42 32 -41
1648d1K3O8Jk5l0kk7j0J1J1k8M4k7K1l3R4j5k4K3k1Rq5O6Pl5J5JJ8Nr6N5K9%l3
$$ -41 -18 50 51 26 -4 -6 -33 -43 -32 -21 -49 -5 -32 -11 -44 50 35 11 34 13 22 -63 3 10 -25 -10 -9 9 14 -82 -27 2 2 -31
1682c1JK4l8Qj4K5K1M0l9M7j6pL7m2l0JJ7m2l1R0lk6l2L5nPl6%L0M7l7O2n8j3
$$ -31 -30 -6 -44 -36 -50 -25 -4 36 -3 44 28 21 58 16 -14 -13 4 -38 -69 21 18 -8 -40 -5 -10 -3 -39 -39 -9 38 1 63 5 -8
1716hM2J7q2O3o5O3m7rK6o3K4L1L7m6J4K7k9K6lm8O5l0m8J04l0m0N6o2l6O2J2
$$ -8 34 51 -31 32 -33 30 -17 -26 0 -63 -39 -8 29 -17 -3 24 -5 21 18 -30 35 5 -43 61 31 -9 47 -15 -51 11 23
1747B3o2L1k3k2P0L0n4L8M0q2L7k3K2l6M5k2L1k6l5N4%n6Kj1P5j9k0ONLJ5k6K
$$ 23 -39 -8 -31 -53 17 47 -7 31 71 -11 26 3 25 -11 34 12 43 17 -18 36 36 -20 -18 -29 46 27 7 13 18 21 36 10 12
1780A2K6k6ON6o2%K7o4RN7p0L4K8J9j3m9K6k0l4M8ml5K1L4m0rj8k1R9p7J1K9N
$$ 12 38 12 18 74 12 12 39 -25 -16 41 -29 5 33 52 39 -10 16 -4 -38 10 6 -29 -8 26 -14 -23 -41 -62 37 -40 -29 0 5
1813EM8j4l2K2mr1N9M9J3o0J7K3k5mJ2l8N6K5l9Rr0N9n5K8j4J05l1m0r%M7m0M3
$$ 5 53 39 7 29 25 -66 -7 42 55 -5 12 35 10 6 18 -20 36 61 22 31 -59 0 -55 -27 -41 64 33 -7 -16 -16 31 -9 34
1846C4r7Q2k5J3n5J6Mj4R6n6J9k3m8O9Mj9Nl9N9%n6J3Jj5PN0j6m8O4m9KkRPK1
$$ 34 -63 19 -6 7 -48 -32 -28 -42 54 -2 17 -6 -54 15 19 0 5 -34 25 25 -31 -18 -17 -32 -25 25 9 -39 25 -24 -22 -24 -15 -8 13
1881A3n1K3Lol0L1M1l1K7k4k2L4K1o1M7j2J5m3PK8m6M9Kk5L5o5L1P8j02j3P2m1
$$ 13 -38 -15 -12 -18 -48 -17 24 -7 20 -4 -26 8 29 -32 15 3 18 -25 -18 10 -36 13 15 -10 25 -40 -9 69 -33 -46 26 -15
1913a5M3k2L5j6p9J11m2K5m9j6J11p9L7j5n9jN1j6m1M9m6J8K1Kmm0L4JL1k9KL3
$$ -15 28 6 41 25 -54 57 15 40 -9 -25 86 7 44 29 -30 -31 20 4 -37 12 -34 -16 5 7 3 -37 -3 -2 29 0 2 35
1945C5m5L2j2j1k5M5L0q8M5Qn4K0PQ1p2L0J3ko2KM4m0J8K4n8R2p7J1J12o6o7K0
$$ 35 -10 22 10 -1 -26 19 49 -39 6 14 -40 -20 -13 68 -4 26 39 37 -25 -23 21 -19 -1 23 -35 57 -20 -9 103 37 -30 -10
1977a0lm6O7rO4p0j1O8l6l2J2k7Q3n1KO8o1Qm1PN7j2j07M9L1O0j8j4n4K9L2j3
$$ -10 -13 -59 8 -1 63 -7 -18 50 14 -18 -6 -33 50 -1 1 69 8 16 -25 -18 39 27 -80 -31 0 60 42 28 -26 3 35 22
2009B2m1m6M2j1N0K6m1J2KJ6m2Jk1K0j2L4J0j3o5N5K0l1L4k0L8p3M9k0K0L4k8
$$ 22 -19 -65 -23 -34 16 42 1 13 15 31 -11 -10 -31 -11 -23 11 21 8 -57 -2 18 -13 21 1 39 -34 15 -5 15 49 21
2040B1p4P5l1MO7m8l3J0M0l0OK5k7J3n1l7Q2l4RN4n1lPJ2M2J6p8J2j0J05q8o4
$$ 21 -53 22 -9 -5 62 14 -19 -9 31 1 7 32 5 18 -33 -70 12 -22 -13 41 -10 -13 -6 6 48 64 -14 -2 -12 93 5 -59
2072e9R9k4j1L3q4N4K5n3kK0L2o3M3J2M1j14R2j6j5j9L3K0r0N6K0J0oJ5kk2p3
$$ -59 40 16 5 38 -46 8 33 -20 -22 -2 30 -33 10 22 63 -51 41 25 10 -9 24 44 -46 10 30 40 34 49 47 25 -48
2103d8M3NJ9m1K5l0qQ5o0P5k3m8ljJ0O5r4P3m1J7p1J17k6o7O0o0N9l0J8j1K1%
$$ -48 -5 0 19 -22 3 -27 -35 50 -10 65 42 -6 -9 -10 0 65 -29 44 3 20 -51 66 40 -27 33 -27 32 2 20 9 30 30
2135C0n2Ql2N0k7N9qk8%j4L2k4M0J9m3NkM2o3L8n8PK0L7o4M1j9J6J4k9J8J9m7
$$ 30 -22 -14 -46 4 -23 36 28 0 0 -14 18 -6 34 53 10 15 13 55 -8 30 -28 -21 -1 36 -28 13 -6 10 24 -5 13 32 -15
2168a5K5n1N9nl5k9M0KoK2J2l3O1k4l5M0LQRn0J4jk4L0Pj1M8j1q3j9J05k4PPm2
$$ -15 10 -41 18 13 -22 -51 -11 -9 -15 7 19 -14 47 23 -12 28 31 39 48 -2 12 11 -13 17 24 13 61 50 -33 -52 53 29 36 43 1
2203ARk8j4J1L2OjK7Jl9mL2k3qK1o1O1J2n2O6n7L8j2l0OqN4o3k3R3o1L7l8k4N5
$$ 1 10 -18 -32 -21 11 17 16 43 44 5 1 33 10 2 23 -38 23 35 -17 49 -8 30 18 -12 -6 -14 40 -23 -46 47 -14 23 -15 -39 16
2238A6l4K1J2n9P4n6k5J8K3l7M4J2K5m3J6K0n4lM4ll4j4R8o4j4K5j8l0K0L4l5
$$ 16 -18 3 15 -44 30 -26 -51 -33 -10 -47 -3 9 34 -9 7 27 -27 -30 14 11 -23 -37 61 -3 -17 8 -10 -40 -20 14 -21
2269b1L3%J5j8Lm9O7j3lj7j2K3k0K7J7k1%l7K6QM9n0oj0jK2LRl5l9M1J2K0l3N1
$$ -21 12 12 27 9 12 -37 30 17 14 -3 -15 8 -12 15 32 11 11 -26 0 8 57 7 1 -9 -10 12 15 24 -11 -50 -9 3 23 -10 41
2304D1o1JO2o8Ol1M8m8M3Pl5P2j2Qq8J2J8K5j3P4j26L8K6J0k8k9P2o4J13n3k6
$$ 41 -20 -19 43 -25 -19 -50 -2 -50 -7 0 -35 37 25 33 -55 -43 -25 0 -13 61 -65 -27 -1 9 -19 -48 24 -40 73 20 -6
2335fpM0j5mK4m7M6j6l0L3ll3n9O1J8M1p3K7K6l9pM4l0j5k4N0j4nnK6jL6m5j4
$$ -6 -13 27 12 8 32 -15 31 15 -15 18 15 -18 -77 -16 2 43 -30 -3 23 -16 -23 21 -9 -24 -48 2 -12 -17 -22 4 3 39 -6 -20
2369b0L8j1oJ4j3Mm0L1k3M9K9n7L2k5L4k0k0L8n8O6m8J5k4L7o6N4K5m3J0r4N9
$$ -20 18 7 1 15 2 6 -34 -3 -26 23 52 -5 27 2 36 16 -4 34 -24 42 -6 9 -15 22 -44 10 35 -8 2 -92 -33
2400c3k5O1j3qL6j4n8K3J3l8O6Kppj2J6L0o9O1K0n5O4l8j5%oj7K1M3j4o9K4Nk3
$$ -33 -58 3 -10 -18 18 4 -54 -31 -18 -56 10 12 5 -2 -14 2 32 -37 24 44 -11 53 15 0 0 -6 -23 -2 41 27 -42 -18 -13 -36
2434c6n3M1K8L9l4l7KN9L7n4k0Jj5K6pM4m3MP2n1p1J03l8J1l1P0m1k9N9rl3nP
$$ -36 -89 -48 -20 19 -15 -52 -50 9 46 -8 -28 -27 -42 -16 -23 21 -22 -18 54 3 -68 35 -3 8 -23 47 6 -23 36 27 -6 -11 -4
2467dk3nP2Jk0Nn6M3j4n5M5K1r0J29n8Jj6M4j6lm4J5K3m9K7L3lL7o4J8LO7m1n0
$$ -4 -27 -32 40 41 21 26 -30 13 -1 -56 -11 10 -80 49 -9 -8 -24 20 4 1 -43 -28 -5 -54 -27 6 3 40 -24 -6 -3 64 23 -27
2501b7N0m6k8N6J4k0M6kj1p4m3J46k8l1n5R7k1o4J6J1Lmk8K6k9M0J1n3L3l1N4
$$ -27 23 -23 -51 5 19 -1 45 43 32 -42 -85 61 33 2 -53 44 23 -41 -25 -14 -11 -15 -43 -17 -46 -6 5 -48 -15 -46 8
2532Hj1N6k2nK1k7K0mj7l8J2l0Q5o3N0mo9M6n3Lj2J23j06P1k1l3nL1kk4J8Jm6
$$ 8 -3 53 31 26 47 20 40 36 19 -19 -7 -37 48 -15 35 31 -38 8 -45 -42 -54 69 -37 34 13 -20 -25 6 4 -20 -2 -1 -47
2565d7K7J4j9J6O5l1j1k3l9M6K1mm9K2K6j4J0k5NqL6l9Q9l7o0L6j8K1OJJ5n6J
$$ -47 -20 -6 -25 -9 56 25 14 -9 -48 -2 19 15 -34 -12 14 0 10 -15 -10 -18 18 -21 68 31 -29 7 -11 10 16 17 32 -24 -23
2598b3M8L7m5%J6p2l5J05lo1M2l3N9m0O2p3K8l3k9O4k6L4k5J7L3m5mqJ3mK6N1
$$ -23 25 62 17 17 33 -39 -74 31 28 -33 9 -24 35 -5 57 -16 12 -21 -50 14 -12 22 -3 14 47 2 -2 -10 3 -1 25 76
2630G6q4K4On7J5PK8N0l8q7O7J4m8O0n7mkP7l9Mq2Q7l7k2L6rN0k3K%j9JOk2l1
$$ 76 -8 16 22 -35 -20 -13 15 65 27 -60 7 21 -27 33 -24 -28 -30 47 8 12 -70 17 -20 -42 -6 -15 35 12 14 14 -5 -4 2 -20 -51
2665e1J03o7OmJ5Rm6J1Q6m7o1R2o5K2k2k4L4lM7k4j5K9J9Qp7M6K2m7j1k2K0m5
$$ -51 52 -15 -9 -13 2 11 -35 -24 62 15 -46 46 -19 3 -19 -43 -9 -12 35 11 -4 25 44 52 -25 21 43 -4 -15 -37 -17 -62
2697f2L8J6O3o6L0p4N5l4N1m7K1j1l9J03j10K2L3N1p4K4Kk9O1L6p4K0m7N2pM2
$$ -62 -24 -8 55 -11 19 -55 0 -34 17 -30 -9 -20 -59 44 -66 -44 -11 40 -34 -10 -8 -37 24 60 -14 6 -41 11 4 46
2727D6m2j1O1p7L8n6L0k4M3J6m5LM3n3M2Qn4K5m0K8L3OMn0M3k6J7l5L6j9kl1L2
$$ 46 4 -7 54 -23 15 -41 -11 -35 8 24 -21 -18 25 -28 14 22 -32 -7 -47 -19 14 20 24 -26 17 -9 8 -27 9 -10 -12 -43 -11
2760a1L5m6k3N0qj4j3M3Mlj7K2k9K2J1jo7N9k4J4k2m6N1j1l9N8L1J9p5l7Q8k9
$$ -11 24 -22 -45 5 -3 -17 -30 13 17 14 -3 19 -10 12 23 22 -45 14 -10 4 -18 -64 -13 -24 -63 -5 26 45 -30 -67 21 -8
2792hK7j9N2l7p6O7k0k4N4pJ1l5K2J2m8M3k2K3Ql1%k1K5Pl4J9J3r3J37n4O5q2
$$ -8 19 0 52 15 -61 6 -14 -38 16 9 20 -15 7 19 -29 14 -8 15 23 -8 -8 -29 -4 3 -31 -12 1 -92 45 -9 56 -26
2824b6K3oJ6Rok2m6N8J0k5lM3oK2k7k2M1l2k5K9j2l7jN3J1k9J3j0rM2j2j8J7k3
$$ -26 -3 -9 7 16 10 -12 -58 0 10 -15 -18 25 19 41 14 -8 33 1 -24 5 -7 -44 -45 8 19 -10 3 -7 -16 26 14 -4 13 -10
2858a0k9Q5n3mm8J02n3%J1J7k3L7l1n2L8k2L3J0N6p9J5K8mk6JMooQk5K9L%ok6
$$ -10 -39 46 -7 -11 -59 43 -10 -10 1 18 -5 32 1 -51 -13 -35 -2 8 64 -15 0 28 24 -2 -1 3 -3 -9 -1 -26 3 6 6 0 -26
2893b6J5L4k8j8M9L5q4O4n6LOl3J0L4L9r5L1j7R7q0nQ6j15M8PmL0o5P1j9Nm5K4
$$ -26 -11 23 -5 -23 26 61 -23 41 -15 -12 -6 -39 -29 5 44 -51 -20 -37 60 -20 -25 61 -54 -6 1 -3 27 -38 33 14 19 -26 -2
2926bj9M8J0n3N6K6m8n7mM3Mk9k9O5mJ2J6l8k6L2M6j18J05k1km1M8K9l6l3L6k2
$$ -2 -21 27 37 -16 40 66 18 -39 -43 0 4 -25 -54 11 7 19 35 -3 -29 3 49 -69 36 15 13 -28 20 49 13 -20 16 -6
2958fM2m6l2L8l5M6Jm3K7L1l9j4k1O2j8QK8nlJ1L0o9l2P2l3q7Q9J7lL7Qr0MnJ2
$$ -6 36 -10 -42 -4 -39 7 8 -35 -8 23 -16 -30 -51 11 -7 1 29 24 21 32 62 -7 -39 33 0 -87 2 19 16 53 61 -29 -25 -30 -18
2993a8JJ8j2L2l1K5l9l9K0P1n3M7qn7O3j05J11kj9k6l6M7m5N4k0mL5K7p1rLP6
$$ -18 -17 1 -11 21 -10 15 -24 -63 -43 28 -25 22 14 -43 20 -85 26 24 5 -21 -57 -10 -55 -1 -21 -25 10 37 -34 -43 -40 36
3025C6j2o3Q2l8j8LM0k4J9p9O4j3MK9j1Lo7Q6p8L0QN6q4Q5m4J6nn2Q9l9J9o7J1
$$ 36 24 -39 43 5 -13 -10 30 6 25 -54 10 -3 1 30 19 22 -45 41 -37 -7 1 57 -27 58 14 30 25 -27 62 23 42 -25 -14
3058a4J1K5L4m8k0L3m3O4l8pN1n3Pj5L8q1N5j7k4k1M5kK9po8M3l9R7l5l6K6J9
$$ -14 -3 22 56 8 -12 21 -22 42 4 -3 48 -5 2 -13 25 -56 -1 -18 -42 -63 -18 -20 9 2 -66 -23 -62 35 0 -36 -10 9
3090Ik1Q1q1J0J5Pm0M1rjJ5rM5l7k9J6k8qm0M7M7o1j3M7k2L4j7k4N0j3k1l9M9
$$ 9 -12 69 -12 -2 13 20 -20 21 12 11 26 17 62 25 -4 12 -16 -24 -64 -17 30 -31 -44 3 -19 15 -2 -26 24 11 -10 -49 0
3123@j0l9J6kON1mk6Pj1K5jnJ5j9opK7K1l9RM0j3k8m5J7n8J12%k9j5Oj3N4n5Q9
$$ 0 -10 -49 -33 -35 -29 22 18 -8 -1 -12 13 12 7 22 3 -3 -10 17 38 -1 8 48 35 7 -38 -21 -79 33 33 4 -11 -5 -18 36 -19 70
3159G0l2o0l7M8K1MrLL6l5mL6r9j0P8%J2k1k2L7l7l1N7K2n2M4m2L8M0k0n9P0j19
$$ 70 38 -22 -59 -11 10 14 5 8 44 9 5 41 -58 -68 10 10 22 1 -21 16 -21 -52 5 27 -25 19 -23 15 55 35 -24 46 -73
3192g3J02nm7n3O7oj4QL1n7RO6m9pL5n1PJ01m6l8M0Oo8J6M5n7M5Nm6J0P3o8L1
$$ -73 29 24 -23 -76 -9 -15 -29 -21 10 -47 -38 28 -21 -28 7 -44 -37 64 18 -20 20 26 -42 -26 19 -38 7 12 -34 -24 49 -19 12
3225A2l4K0k8P9k1q3J07r3R9n7L0q1N9J9j3p7M6J0pj2n2L3M0k6J5N4J8o5J2K7
$$ 12 -22 -2 -30 49 28 -55 52 -41 58 1 31 -50 9 28 15 -62 -16 -6 -13 -25 -77 -44 -4 -30 -15 39 57 -8 4 31
3255C1m5L0M6j00L5PL3L3j03j7O2j3O0k9J9m8qnM3mj6Om8M0Jn7L6j8P5l7n3P6
$$ 31 -14 16 62 -38 -3 4 37 70 -33 -50 12 -1 59 30 49 1 -7 -12 31 27 11 17 -31 9 10 -47 -11 -29 46 9 -44 32
3287C2J0r1O3Kk2J1n3R1q2L2p%N4l1j4j1M5J3m9KO9q0J2L3n1QK6K9j00N9N5o7
$$ 32 42 -49 14 16 -6 5 -48 43 -39 -7 -14 -14 40 9 -5 -16 29 42 -7 -5 64 -16 -4 29 -22 -14 12 41 -59 0 55 -12
3319a2Nk0J2L0m0J7%J2k1MJK5K3kkj5r7P6pK7k4K5l9N8o8k3O6Qk3jl2O5p2N2J7
$$ -12 -7 -27 -15 15 -25 -8 -8 4 -17 -13 -12 13 36 34 32 17 -80 -4 -11 16 -8 17 -22 36 -32 -55 11 19 -4 -5 -37 28 -44 8 25
3354B5l8L3r9P5m1J10j34M2K3O4o0Oj0M1m2k0N5o8J6N8j03P4nk8R5j02M7n5l1
$$ 25 -13 20 -79 -4 -45 65 -69 -27 -4 60 0 6 -4 37 -5 -25 30 -38 -22 36 -67 7 2 -26 69 -33 14 -41 -72
3383g2O9L1n4K8n2J2QO2kj4j2J3j1J4j7k5J2J0j3l3N8L1r4L8P3n3j5LK7l6l0J8
$$ -72 -3 28 -26 2 -50 -38 -30 32 30 16 4 17 6 20 3 -22 -10 0 -13 -46 12 43 -51 -13 60 7 -8 -5 22 -14 -44 -26
3415b6L6j0k7O5k4o3M7M0o7J0J0l4J5OM0n4J5L2J5k4J9J9m5k9k0J10m2m1K8m9
$$ -26 10 0 -27 38 14 -49 -2 38 -29 -19 -9 -43 -28 -22 18 -36 -21 11 26 2 21 40 -5 -34 -54 56 14 -27 1 -48
3445d8J01m3j1l8j0O3Qm4NQ4p5j7jN5%k0Qp7j5P2NN7m5j0Pj8j7j0RO0Nl2j0l3
$$ -48 53 10 -1 -39 -49 14 22 -22 -17 67 -8 -25 -26 29 29 9 17 -60 -75 -3 2 59 14 4 11 -7 -24 -34 -25 35 40 8 -2 -35
3479c5j0Q0m6J6l2J1J5L6o8P0J8qo7Oj0NlO2k8m9N8nl1J7Lj8L5m5L1p0J18o8k
$$ -35 -45 35 -11 5 -27 -16 -1 35 -33 37 55 47 -20 -14 -24 -19 -22 40 12 -37 21 16 -15 2 5 -13 22 -23 8 -62 56 -12 -14
3512a4L3j5qJ0jKj9Q7m5n4L5m8K5LK1L8n1pN8n8J4j4PP0p2P6m0k7O7o4Mk1N8m4
$$ -14 19 4 -4 6 5 7 -12 75 30 -24 11 -37 -12 -9 12 50 -1 -8 50 -8 6 -8 -1 69 -3 73 33 6 73 9 13 -8 50 6
3546FJ5j2l9J3K4l1M7k3m1L5RJ9n3O2l8L4j9k0K2m6j1M6ML3n9N1n7N7q1o0J68
$$ 6 21 9 -30 -17 7 -24 23 0 -41 -6 3 22 -31 31 -7 27 8 -12 10 -36 -47 -1 3 36 -23 28 -29 28 -53 -113 55
3577E5j2j2q5N9K5m1N0q9lL3P1l1o5L8j3M6j5j0PL1k6j4lk5N8K7rk8j0qj8L7k3
$$ 55 43 31 -54 5 30 -11 39 -50 -53 -20 51 20 -45 -7 -20 26 11 1 8 39 13 -1 -4 -29 29 56 47 19 9 1 -17 20 -3
3610cnk1P1j2Jk4kO0j02j1N9n7P9j7k8J5k4nM0Rj2l9j1K9Pk1Pj7J4J0J0OJ4m3
$$ -3 -8 -29 42 30 31 7 5 65 -37 -48 11 -46 33 16 -12 3 -21 -26 14 23 11 -28 -39 -10 -3 -24 -17 -34 -20 -10 0 6 20 -23
3644b3oP7o9N0r5K4N1K4nj8m8N6ok7j1rK2J8L6o2L5r5M5K1j2J2P2o8J3n3Q3m0
$$ -23 -29 48 -21 29 -66 -42 9 33 28 10 -38 18 12 -15 -26 -35 -13 5 41 -21 14 -81 -36 -15 -27 -15 57 -11 2 -51 32 -8
3676hk1L1k3oL4j1k7O2l5K0m1L1rl5R8p0jK3m6J4j3J7Q8q5K0l5P7l9M9p8J1Qo8
$$ -8 -29 2 -21 -27 7 -4 -31 31 -4 16 -25 6 -3 -38 60 -10 -11 12 -34 -20 -33 -16 72 -13 7 -28 49 10 59 -19 -8 0 -68
3709f8P4L8o7L2k5J6KrL2l8J1k2k1J1J04j04OL3k4R6k2p8k8Q4k2l9j9K7N3o9R5
$$ -68 6 44 -23 9 -16 0 2 -7 25 -13 -2 -24 -45 -34 70 -34 -28 5 -19 77 55 -23 -51 33 11 -28 -47 -20 33 -36 59
3740E9k5l4K8r9P1K3j0Mj4J8k3Nk3L5j1k4K2j6k7J4Nj0kL4j3LL6n7M9q9O2P4j8
$$ 59 34 0 28 -71 0 23 13 17 3 21 -2 3 -20 15 4 -20 2 -14 -41 -27 -22 -32 -34 0 -13 -10 26 -31 18 -71 -9 65 47
3773D7r8P1P0q8l8L7O8n7m9N8K9l8lk5L5o4J4N3OO7q7Qj0l9O2l0k4L6m0%K7K3
$$ 47 -51 20 90 2 -36 1 69 12 -37 21 50 12 9 -16 19 -45 -31 22 28 95 8 16 6 -33 29 -1 -25 11 -29 -29 -2 21
3805B1m6j7P7l7m6OK7l5R2n3K5k3m3M5J2l9M0k0jMOQ%K3m7RJ2k8O1o7K5K8qJ0
$$ 21 -25 -42 35 -2 -48 -42 -15 -50 42 -11 14 -9 -52 -7 5 -34 6 -14 -15 -11 -5 3 3 26 -21 -12 0 -28 33 -34 -9 19 11 21
3839B1l2j9MN2l0k2M0mqj2j9M6l0O2o9k4K9P3p8Q3j06N3j3l2k2O5N8q2K2n1Kj4
$$ 21 -11 -30 -26 26 -4 -26 14 10 2 -10 -29 17 -13 49 -20 -44 -15 58 -20 63 -43 10 -3 -35 -57 8 66 -16 6 -45 -43 -57
3871e7P2n1M2PL1l3pJ6QJm1K5lMOm3K8nl1K2K2n0L8K5m6K9ll4N6m0NN2l9K1nk8
$$ -57 15 -36 6 13 44 11 4 20 28 29 -12 13 10 14 20 -23 5 0 -31 -9 13 -37 1 26 -20 9 6 -28 28 -12 -7 45 6 27 22 -6
3907fPJ6l4J6mJ2j2Qm7M4j0Oj4K3K7m2J4K3o4K6m3O9l8M0o3O4j9LJ0j3J6o4M2
$$ -6 1 17 -17 -1 -5 7 -5 3 -44 0 -10 -4 -18 5 32 -10 4 27 -37 -11 -54 15 -23 17 -46 18 -1 2 12 -1 15 -49 -7
3940gJ1K3m2L%kJj2k9L8M1pM7NM5k16N8P0j07J11l4N6q1J4JJ1J6k6J6k7k3J04
$$ -7 4 27 -15 -12 -12 -14 -13 -25 -54 -16 25 18 65 70 115 -101 -43 27 -80 31 -3 53 -28 -14 -13 -2 14 -12 4 -23 -46 58
3972E8q3J9L2m7P5l8j0MlMN5p5J8l7N9okl0j6J0j6J2PL2rNJ9p1K9p8Q6j5N6p8
$$ 58 -25 -6 26 -21 54 16 6 10 7 11 66 -9 9 -28 31 25 23 -7 -23 -13 -29 -17 -10 22 13 18 37 -34 -5 -83 3 -12 44 -34
4006c4qM9m7Kj5K1lK2N7J0r5J2Q9n7p2N9K2l0P7m2j08J16J6m1qL7k5o9L9J6M8
$$ -34 -42 7 -40 -38 -53 -32 -35 -13 44 54 -41 -29 60 3 -69 -10 12 -18 59 17 -91 25 41 0 -8 29 4 -65 -26 -10 38
4037C8n9K5M0l2ql0M0k9N1o4LM6l0J4l3K3k1P1m3M1j5k1L8m7l0QN5p0M2m7M6L
$$ 38 -21 4 44 12 4 -26 14 -15 36 -28 -25 21 -9 5 -28 -5 -26 45 2 43 28 7 45 -2 -32 -24 31 -39 3 -44 2 5
4069EMl7O1o4J8K3L2Rn0m6K4L2P5n0n0l1O9j9K5Om7J4j3K6k3K0l8K5Nj2kJ5l0
$$ 5 9 -28 33 -31 -13 10 42 51 1 -45 -21 11 86 36 -14 -45 24 5 30 36 -11 3 -10 16 -7 13 -25 0 5 -7 -9 6 -24
4102b4O4k8j3j8L9LJ2j9m1M5kL6n4qJ7J8l5M0L6j17L7LRk6JM7oNk8M8rl0j1j9
$$ -24 40 12 -1 -19 20 23 35 16 -25 20 18 54 0 -8 9 27 -8 32 68 -49 -12 -9 0 -26 -25 22 16 21 -7 41 32 2 -9 -28
4136b8lj7N2m2K9PK3k3K3J7ko1J6J3o6P5K3m3j5K9k7L6o9O2n4O0pNQnJ4n4Q1r2
$$ -28 -31 -48 4 -38 -9 -2 21 -2 21 38 36 -25 -9 4 -62 13 36 -7 -22 7 -20 16 -53 9 -45 15 8 13 21 16 30 -24 57 -35
4170c5N7m2Lj0M1J7n6O3j4m4m6O5k7PqM3m2M4j4m6R3j0l2Q0o1q1L7J5N7p7J6J4
$$ -35 22 -20 -17 -27 14 31 -25 38 24 -20 -66 -1 -28 -21 -29 14 -28 16 2 -44 49 39 7 87 26 -55 -18 -3 54 -23 -7 7
4202GkK3Oj9j2OK3Lm5P2n9J4j8M9m0l8O8l2k8J7J9J2k2K%L9l5j0JK6o0NK3LK5
$$ 7 5 28 34 15 3 9 32 35 -10 62 3 17 -1 48 8 -30 38 6 -22 -5 14 26 4 6 6 45 10 0 1 27 -33 -28 -5 -2 23
4237B3m4O0m9j2N4Rpm2PJ0l1P4o2k8J3NN0k6l1K7Ro1R8r6R4n1J1Pn2j5Q3lqj4
$$ 23 -21 39 -10 -22 32 41 34 -8 -1 9 -22 52 -10 -38 -25 -20 30 4 -27 0 9 -52 46 -50 44 -7 4 11 -41 -56 27 24 16 2
4271Bj4O1n9j2J4o7Q9pN5l0m3J9J9j1oJ1m9J8L4q4J19Lo3K2n6l1R0j0p2M9K9Q
$$ 2 -12 49 -10 -22 -8 -75 14 7 62 32 -11 8 27 16 10 21 -28 -10 24 -60 59 62 -1 21 -35 -66 24 14 -58 -9 20 28
4303B8o0K1J1N2n8j0M7n6L0k7m2M9K5j8k1N3n2j1J6rO2K3r6jJ5J4O1L9o9J9n0
$$ 28 -32 -11 0 52 -6 -16 31 -25 5 -22 -64 -15 10 -8 -29 24 -28 -39 -23 -32 30 53 -43 -44 -29 -15 46 85 16 35 -15
4334a5K1NqJ8l8LQPmj3Lm1K4M7k9N4r2K2j6L1lK2l1qk1M2L1n4L7l4J8k8O3N7r8
$$ -15 6 11 3 21 -17 -14 -6 1 -3 -16 -13 -54 -30 17 -12 42 -50 -28 -44 -13 -16 6 -25 -33 -54 -12 19 -35 2 -32 -14 -42 21 78 -20
4369b0L0NJkOj8Ok6J4J1M9r9ML9KKk8L3M0p4k7J3NL7J8l2M7p1L6j4O3j1%m4j8
$$ -20 10 15 16 14 20 2 8 -18 -4 7 56 -43 -39 0 2 4 -24 9 49 -25 -52 -39 -34 3 21 -11 36 -35 1 -13 50 39 39 -5 -23
4404b3J4lK9%NK7l8rn8R8m6K8k0k9K5k4J6J3j9J2m6Q7k2k9M8o3K0L4j8Mj5m2K9
$$ -23 -9 -12 17 17 22 49 11 2 -56 42 -4 24 4 -25 0 -24 -8 5 -14 -2 -48 39 17 -12 36 -27 -7 27 9 13 -2 -44 -15
4437a5rn3J01j8k4K0Ko8N7m0O8j5ok5N3n9pL5l3O9J9r1qJ08o4NJ0j2M9j04j0L1
$$ -15 -24 -77 24 6 -18 2 4 -64 -7 -47 21 6 0 -25 28 -31 -38 -3 -36 33 52 -39 -47 61 -3 2 12 0 49 -55 -65 -34
4469c4o0J20l6nj5L4j7RP7j02J11o4l3Q6r1OO2p6k5P4L3l2o2J5J4M1Mj9K1p5N5
$$ -34 -94 26 -10 -15 -30 4 -13 -4 73 -29 82 18 -15 71 -20 -14 48 -28 -53 21 54 22 -40 -25 -11 30 34 15 36 -39 16
4500A6K8l3Nl6LL0K9k5m7L5qJ6k9P8p5L8k7Pj9J7J3J7K4p3PqM1n1mN8NK8J4j10
$$ 16 44 11 16 -20 -17 13 42 17 -30 5 -3 13 -16 62 -13 25 -2 5 -14 3 16 33 57 -16 -9 -17 24 -27 -31 27 32 60 74 -36
4534c6k1l5J09j3j4J1j0L3Mk7j1O5o7J6N4m7j1ONk4J5N7j01N6po5M8L4j5nj9K1
$$ -36 -57 -92 17 4 -10 1 -9 24 28 1 -10 55 -12 4 58 11 0 6 11 -13 2 59 -42 14 7 -58 -10 24 9 4 -15 6
4566FOk3K9o8MNO0LJ8r8K5M2nL0l7j8P3j10M9M6r2R2l9K3n8L9L4n3M2n8K9j9N8
$$ 6 12 -11 18 -50 -46 -41 19 22 40 -58 -33 9 4 34 -3 -21 52 -58 -9 37 -55 37 -2 21 -37 2 36 -17 25 -33 -4 -23 35
4599C5Jl3k4LL7M2q9O2p3k0M3j0N7J2Jn1QKJ6m7Q2l1kj3k0N3k3n2NK0J4m8N9l3
$$ 35 36 3 -21 -18 19 61 -28 34 -39 -59 -16 -26 31 43 44 -7 1 3 19 -28 54 23 21 8 -12 41 18 -34 -29 -9 5 -43 16 -17
4633a7K5J6q8N9k7L1l6P1n0L1n8O7l4mL1l2N4j7l8lQ9o1OJl5j4QN1m1M1l4N2l4
$$ -17 8 24 -64 -5 -32 -1 -37 34 -16 15 -43 24 -10 -14 17 -15 39 22 -16 -19 70 9 15 16 -19 -33 -25 26 -15 26 -8 44 10
4666A0L7M7j11M4q2M4k2O7Pk0o7M7K6J8r3J7K1l6M1L7o8J5pN1l5kL9Ll8j1MM1
$$ 10 47 94 -17 27 -55 -11 -33 34 41 21 -46 1 27 45 -48 -31 -10 -46 -5 32 -36 -21 -28 23 -12 -14 25 28 -10 -21 -17 24
4698B4m0K1lKo6J04m7%N9o0L1K4q1L1K2k9L4j2n1KM5K4Jm6m5Q4o3L6O0j22O4l9
$$ 24 -16 5 2 4 -62 42 -5 -5 54 -6 25 49 -32 -1 21 -8 26 14 -37 -35 10 34 35 -11 -56 28 -35 1 61 -61 3 -36
4730c6K5K4L3l5lQmK7j4J1r1P8M2o7J8J8k6l1N0l0K2l8M3j5k3M2no2J3M3K0Kp9
$$ -36 -11 13 46 11 8 16 12 39 25 36 -55 23 65 -2 16 34 8 -23 27 -3 19 -19 24 9 -14 28 23 -39 -26 17 37 39 -40
4763d0K5N9j01M0L0j6PJ6k3LM1k3Kl9K6L0m2J6j5j4M0L4k1k6mK5jm4qL4k1%J2
$$ -40 -15 44 -57 -17 13 -3 4 20 -3 0 41 18 20 -19 7 37 -5 11 -4 -18 22 56 35 9 5 30 29 -15 -23 11 -10 -10 2
4796Bk4P5l6L0k3k9KqL0k6M4J5p9K2J3qo5Q9M1q9k9K4J9L4j2pOkm5J8j4K2n2N7
$$ 2 -22 53 17 47 24 -5 -3 -11 19 -7 37 52 -27 -5 8 0 -65 24 65 -24 -53 -29 -10 24 12 5 11 9 -36 -18 -32 -10 -62 -5
4830eJ9r4Q3j5l6O7J9k1k1k0M2n2N3K6k6MN2p0n4L8K7nJQk1k0MPj3m9J15k5p5
$$ -5 14 -80 3 -12 -48 19 38 17 -4 -24 18 -34 19 45 19 23 75 5 -49 -11 16 11 12 20 -1 -21 -17 -10 -23 -72 43 18 -57
4863e7M7l6J1J2J4m9P7l3L3k9M6J3l2k6L0m4R3m9mj5O5l8m3N1n0K8m3K4OO5q6
$$ -57 -10 -46 -35 -23 -9 -58 19 -14 19 -10 36 49 17 -9 21 -23 70 21 17 2 67 29 -14 37 -13 15 -28 -4 2 67 -19
4894a9J3J2Nk0K2k5j9L1j7J8PK1j3qO6o9l%m2M5J7n9%RM9n3N5m7RON3jp6L9K1
$$ -19 -6 6 11 -9 13 -12 -31 0 -17 1 8 29 16 8 74 5 2 2 -40 5 22 -37 -37 -28 21 -32 23 -24 -15 -9 44 43 -33 6 27
4929B7l0l6QJ2L7n7K7L0l9L8m7M2j2J7k%M3j4n5J6J7n6Q8p6KK2L5q7L5k3P3j2
$$ 27 -3 -39 -31 -19 18 -39 -12 18 -21 17 -30 12 0 17 15 15 58 44 -11 5 22 -34 54 -22 -20 2 37 -50 -15 -38 35 23
4961B3K0K6k5n4j2J1l9N6m8M8Pm2L4kpkl2R0n0M1j5K4j18N8K6o%%nj2N7p2M5k6
$$ 23 43 69 44 -10 -22 -11 -50 6 -42 6 13 -29 5 3 -4 -6 -38 52 2 43 28 52 -66 -8 18 12 12 12 7 -5 52 -20 25 -1
4995amRN5p8L2o6O3O2m5j5m8mK9N7j8j4J2n9M1prM0l5M2p9P5rp8L0J5J7Mk4L4
$$ -1 -5 4 59 -19 13 -53 10 72 27 12 -36 -40 -11 46 28 14 26 -33 8 1 -8 32 -3 39 -40 35 26 -52 -22 -7 10 14 -10 24
5029B4l8J9Ml8J6OJ0j9O0o0k3L9K3j9k2L0qn4M6K4o6N7lnl2J4N9j4n3J5K5k3j6
$$ 24 -14 5 9 -29 -13 -7 3 -16 44 -16 -39 0 23 4 -18 12 4 -50 -4 20 -46 11 8 3 -29 -15 44 30 -23 -8 17 -6 -22
5062b2K4oNk7J9M3m5m5N5ql7%M8J4Pj7k3L0kkj0RMk9N4l0j6k6nN4n0M2M3o5K8
$$ -22 2 -4 1 -26 -7 36 -9 -54 1 -7 -44 -44 4 18 25 8 -15 15 13 11 1 10 14 -15 39 9 -7 -33 -38 16 -34 8 51 -14 14
5097A4j4rM0n9J2r%rL3LK1m1K4M1o3K0o1P5Klk5M3l8k2L0K2J9k4o1M2J3m0qL8
$$ 14 0 -9 31 -28 -16 -25 -25 -34 -1 2 23 -18 6 47 -16 4 -57 18 20 17 -8 35 -3 -25 5 27 46 22 -39 3 16 -24 -32 6
5131FK8j2l1l0M5K6mNj4q9O0J9k2jN8j2m1ml2%L2K1J1Pqn0O4j1K3m4M3m2J6K9
$$ 6 34 22 -9 -39 6 32 28 33 19 -70 -10 9 -13 -14 44 32 -9 -13 -45 -45 -13 8 19 26 18 -32 32 21 44 0 43 1 17 46
5165D6j7o3L3L5k1L2j08O0M1o9L4%m7J00j8J6j09L7O0n5J2OM6n4j8j5N0p4O2K8
$$ 46 29 -34 -1 34 13 45 -63 -3 38 -31 3 3 -44 56 38 54 -55 -18 42 -13 -1 5 51 -3 -21 -36 14 -60 2 30
5195C0q7R0m8OM0o0J2L6J0l0J7j11J28m2O2p2K7j5k8O9K2o8l3K6Rm2N2l7J3J2
$$ 30 -57 33 -15 -9 31 -29 -17 19 29 -1 16 -95 33 -9 53 -19 8 -7 -35 34 56 -12 -45 -19 -10 -52 0 -37 -24 -12
5225a2L6m3N2k7LJ9k0k9L4K9j02K2P0m7L8m4L8j8M1n7MMN0l2Qm2J0j6J1M7l3O2
$$ -12 24 -19 33 6 9 28 8 -21 13 42 -60 -38 32 -15 23 -21 17 -1 40 -17 -13 -9 41 9 17 -25 -15 -31 -20 27 -6 56
5257E6m3m8M7J3m7L5k7M3pK1l3k2M9%l4L4m8Qk5M4N9o8k2O7n4nL5l6l4L2j5l1
$$ 56 13 -35 12 25 -22 13 -14 29 22 43 10 -12 37 37 3 37 -11 -3 -28 16 75 7 -15 52 -2 -7 28 -8 -42 -10 -25 -56
5289e6M8j0L2j2L6Nr4P2q0P2K5l2jj3okM1K5m9L4kq6N7o4O1J7n1N2J0m3l5rJ13
$$ -56 -8 -18 14 2 38 43 -51 21 -59 13 38 6 5 -8 -14 -16 25 50 1 35 33 -53 4 -60 1 18 -33 19 29 -14 -49 -58 55
5322E5m0nn0jK6KNj3L3l0p7J18Kk3n4L4J8J4j3JJk7P6Po5K2%%l3L0J8p3J20l3
$$ 55 15 10 -40 -41 -15 -13 -8 -21 12 -18 -95 23 25 2 -52 -18 0 14 1 2 3 -24 52 59 -6 16 16 16 -17 13 31 -42 78 45
5356D5o1j4O3j8q5N7l0K5JM4q3N9q2P5M3m1n7P4J4o5J7k8O6m3J0K4j3Kj3J8M9
$$ 45 -16 -30 33 15 -70 -13 -43 -18 -17 27 -56 3 -79 -4 39 -2 -59 15 29 -36 -19 -47 19 -24 -14 10 -3 -1 -14 4 53
5387E3o0J7J1qJ8q5P0k3L1o7lK0J3L2jk3l3RN4l0K4l5J5n0K6O1Jn5J8Rj3l8M1
$$ 53 -7 10 21 13 31 -54 16 -7 24 -43 -46 -26 -13 19 18 -5 -38 -29 25 -5 19 -16 -1 -51 -25 36 37 -18 0 9 -4 -42 -1
5420anpnMLKmL0Ln2P7k9k5M5k8L0n1K5M9j9l9%L1o9N0l4N6J8m1mm4K9j0L6l1j4
$$ -1 -6 -13 -18 -14 -11 -9 -13 17 20 -32 45 16 -9 36 8 38 -13 12 61 42 3 3 34 -35 15 -19 37 55 14 10 -34 -5 -15 21 -10 -24
5456b4j4OJ1K1n4R6j12P7k2J3K5m0j6k0N3J0j2Kk8M2j8L5n8N9kj2j0j0J5l4L1
$$ -24 -38 -32 -21 0 -54 42 -70 7 -15 -2 23 -17 -33 -53 0 10 -2 0 -28 14 -4 31 -27 32 30 18 8 -2 13 -21 10
5487A0l1N2j8o3Q5K1o2J9r7N6R0q2M7OJ7l8m6P7p5J4j1Q3l3k1M4j5kKo5Q1j5m3
$$ 10 -21 31 13 -50 35 56 -6 13 -84 -28 62 -20 27 33 50 12 -34 43 -32 -18 -29 54 21 0 44 29 27 29 -36 45 30 -13
5519a3K1k7J6K2J2l4j0k5j4Q1n7J0m9N8M6r6R0n1P7k1nj2j2m1QL8PK5nj2m3j9
$$ -13 8 -19 -3 19 31 -3 -13 -38 -52 29 -28 -18 -67 -9 37 -59 31 -20 57 36 31 19 7 -34 -26 12 19 44 39 27 -16 -35
5551c5Q6k4p3%J25q9K1l4O2%p4K8l7J03o6l4M3L6k4nK7p8K6o5J08o1K7j7K9k8
$$ -35 51 27 -46 -46 79 -10 11 -23 39 39 -35 -7 -44 59 -7 -41 2 38 14 9 36 -42 -16 -81 27 -34 -7 -24 5 -23
5581b3k4J12r3K3Rj1K9KOk3k2%J2j7K6nJ2J2j05J26l0RJ4n7N2l1nN8j14J01p0
$$ -23 -47 65 -28 -5 4 -7 22 24 30 7 -15 -15 -3 -20 6 1 13 25 -80 46 16 25 39 -18 34 3 -2 56 -58 43 -27
5612b7M0l3k1K6pO5Mj70J39m3j6K5m5K3O6j6k1N3n3Q8r6L0j21J28l3N5Jm7jJ3
$$ -27 13 -20 -41 -15 -22 43 47 -123 16 -27 -43 -18 -63 -40 26 10 -11 42 -11 77 -19 11 -110 18 -15 40 41 -6 -7 6
5642Fj8M9j4m2k4O9j4m5K4NJ5j3jJ1J3j7Jk6K9OJ6n6kL6l8Rl1R8q0k5J06p8N7
$$ 6 -12 37 23 -19 -43 26 12 -33 -9 -4 11 -2 -3 8 21 4 5 -21 8 14 30 -26 -28 8 -30 -21 -52 46 -34 -59 47 -31 26
5675B6k2L5n9k0M0L5l0m0l2J03m3K2j1k5L0j2m7K8K1M5m1k3K3%prJ4mk6K3pKj9
$$ 26 4 39 -20 -40 0 35 5 -35 -67 36 -7 15 4 -21 9 -3 -50 -22 -1 44 3 -20 3 3 -4 -13 1 -3 -29 -6 -13 -11 -30
5708c0j2J8K5n5P1l5k8jN7%nOM4q1K5L9o6M1k6k8N0K0rk5j8N0o1K3k9L9k7K1M1
$$ -30 -42 -24 1 -54 17 -18 -46 -47 10 10 5 11 55 -26 -1 38 -28 13 -13 -41 9 29 20 -5 -23 27 -34 -11 -40 -1 -28 -7 34
5741C4l1J4l5J7K1rn5L6M9r4N3j1J9p2R8J5l6Rn4J7j3N4l3K0mj3J8rn7K3J6l1
$$ 34 3 17 -18 -1 20 11 -44 -8 41 -53 0 -11 8 -64 34 49 13 22 -32 -15 -28 26 -7 13 9 -4 14 5 -52 -29 -13 -44
5773d4K3M0jJ0m5L1j1j3M1n2J0Jk4M3l5M0Jj7Nj9N2k3L2p6R9j12O4p7M3M9k8j3
$$ -44 -21 19 18 28 -17 14 3 -10 31 -21 -11 -10 -34 9 -26 14 15 -2 3 -16 36 13 45 -31 68 -44 20 -57 -14 35 7 -6
5805fj2L3n8M9k0L3jk9J5P1r8qN8K0j6r4M5K3K7k9k3L5J5p5R4j15N9j7PJ3j7k3
$$ -6 -18 15 -43 6 -14 19 18 -11 4 75 -23 -31 27 47 31 -63 -18 5 32 3 -20 15 30 -45 49 -66 -7 -24 -17 -4 -21 -44
5837d4J1Q0m3OJ9k7NPj4n9L8L6M4m7l5N5qK9l4nm6K6Pl0K5j8KN7n7J4km9J6R1
$$ -44 -33 47 4 10 29 2 7 14 0 -59 -21 15 59 12 -23 32 24 53 19 14 -32 -6 1 -29 -4 -22 -20 37 -20 -6 -8 -57 -41 50
5871E0l8n7J0O0m8L9o1K8L7n2O0K3n4K3K3m8L0n5K1Q9j11N2nn0N7Rl3j4M3k1L0
$$ 50 12 -45 -35 25 -23 16 -45 -17 20 -32 28 51 -3 20 43 -5 25 -30 -9 80 -31 21 16 -34 23 32 -1 -15 28 7 37
5902C7q0N8l0K0l4L5j2J7n8O3n0N1k7J0J9J2n4N3ok5k7M0J9j05O1O1KJn8Ol1O1
$$ 37 -43 15 -15 5 -29 6 -6 11 -47 16 -34 17 -10 0 19 31 -23 30 24 -1 -28 12 31 -74 -13 48 50 51 -7 -1 -32 29
5934B9k0j4J7k3N8l8nJPO4r1J5m0NM5K2Pj1l7J0L9r4L0j3j7j5J24r0J4J2nO1o4
$$ 29 9 -5 12 -11 47 9 4 5 12 76 -15 0 -40 -35 10 32 39 28 -9 1 40 -54 -24 -37 -54 -69 55 -35 -21 -9 -14 47 -17
5967a7L8l1m4J17p6L5o8j2N0mRJ5j9RK6o5L8mL4J5q1P9l4nJ4n6N7m2QJ2nPM5n3
$$ -17 21 -10 -54 63 -13 22 -46 -58 -8 -12 -3 12 -7 2 28 -37 1 -3 31 46 -35 44 10 5 19 -37 20 -22 -14 -2 -7 0 45 -8
6001hl5KL6l0J7L5j2j2M9j20N0N2o7K1lR3q8M0l2k9R2n5M7j2l2k5K7k0K0Rk8J2
$$ -8 -43 -41 -5 -35 -18 17 5 -7 42 -78 -28 24 -43 -22 -25 68 -20 20 -12 -41 51 -4 43 31 -1 -26 1 -19 1 10 -18 -6
6033fK9n9m6N3OM0jl6k7Q0l9j6Mj0L6j7O7q0J4j9l3Q9j8l7RJ1j9PN8n2L1mLn3
$$ -6 23 -36 -82 -29 -23 17 16 -20 -47 33 -6 -22 -18 -28 8 -9 58 -22 -8 -27 -60 29 11 -26 -17 -6 -25 -18 40 -12 19 15 18 -35
6067c5O1l7JJJ7%j6Mk0K7MjnK6p3MK8K3k6K3n9J7j5%R9k4n3M4q0N2L4l2k6QO4
$$ -35 26 -11 -10 -9 8 8 -8 -4 -24 3 7 6 1 27 -46 -42 -14 9 -17 6 -53 -36 -51 -51 48 24 -29 15 -65 -13 21 -11 -37 -29 35
6102C5m1K4Jok3K9M4p3J8m0M7%PpJ4opl0L8j9j4LO4m9M2q5J05q8m4M8k8M7j9m
$$ 35 -6 18 19 13 -10 19 63 -10 8 -32 15 15 22 15 29 23 16 -14 24 5 -9 -6 58 9 51 -34 71 -17 -61 -13 -41 6 -13 -17
6136a7K8M4r8M9k7N5j3k1J3ol7K0J5q1J24l8j7pk0M8n5N1k3K4J7k7L2J9n4k1k0
$$ -17 11 55 -43 6 -21 34 21 0 13 7 -30 -10 5 -76 48 10 -7 -14 -34 14 -41 10 -13 11 28 1 33 52 -2 -23 -43
6167d3P2n8J9%J9J1ll3%k5N0mj12L5P3l5L3m3L5kK9m1O5p0P6m4k3K3Mm8L7j0K1
$$ -43 29 -29 -10 -10 9 20 17 -16 -16 -41 9 5 -107 -72 1 -34 -1 -44 -9 -11 18 -23 42 -28 48 4 -19 4 8 -40 -3 -13 8
6200HJ8j5j6J8PMk2m0J00n8l3MN1q1P4j8j3K4K4j6j6k5oL3l2kJ1L8J1j8rl7K2
$$ 8 26 11 -5 13 20 24 2 -38 62 4 -29 -25 26 -55 19 1 -12 12 36 20 4 -21 -27 6 -26 -28 -17 21 32 14 5 -32 -10
6233a0k4K8rj4R3m9rj1k0J13p1%n0k2L3L7lom1K3j6M9j8k4jO8K1k6j05L4J2NO
$$ -10 -34 -6 -15 -29 64 15 6 -5 -25 88 17 17 -33 -55 -22 15 12 6 -35 -12 -28 21 3 -21 -22 46 67 41 -64 -30 -18 -13 -7
6266gk3P1ql1O5m2ql0K8k5j0kPk2N8j3K7n3L9n3N3M9r4M2j01L8K3RJ0k1M6K7j02
$$ -7 -30 41 33 2 67 25 17 -13 15 -10 -20 -22 -15 -37 21 8 35 -18 21 -32 21 70 -24 18 -83 -45 -22 -13 -3 -24 22 49 -53
6299e3M2L9o2j3N9L0k2m3N3r0J09k4ql3M3n8K4N2o4J9K6k2Mk3Mj4J0mj2J12r0
$$ -53 -11 28 -34 -47 12 42 20 -23 30 -60 49 25 17 -16 27 -31 -7 45 -19 0 26 4 8 -15 -11 -25 -15 -19 -31 81 -9
6330iJ1L7j4k9k4K4m9P1l9K6k8Nk0pL5J1J0J7J7k6k6J2n1M5K6j8p7L2Q2Qj05Q4
$$ -9 2 39 25 -4 -28 -4 -53 18 -21 5 -23 -18 -38 -45 -10 1 11 28 45 19 -7 5 -46 -1 25 7 -70 -38 44 52 -53 31
6362C1l9k7L0ql6M6mK5rj4l8M5j8M9L0k0n9OK3l5j2O3%n6L2NK6m5j6nk6R2J3n5
$$ 31 -8 -35 -5 -13 -49 -3 -7 18 9 -5 -43 2 -16 33 63 43 -16 -10 13 -22 -34 29 29 -27 5 10 36 -9 -25 -30 -56 36 49 -6
6396fK3k4M5q1N0pLl7mRR3o2J0J1%n6J6k1P2j3m7L5oK6o7J4L9KPp3J09m6m0J4
$$ -6 17 -7 38 -43 7 0 3 -34 -38 -29 64 2 12 23 23 -33 -17 -38 34 21 -26 9 3 29 -38 -24 15 17 24 -49 60 14 -26 -12
6430a2M3m6j3J6M4m7K2j2o7R5k9j5L1j1J4M9j07N6on6O6j6%J9m4j0Q1m5N5p5L
$$ -12 31 -15 -28 -12 32 -15 7 -5 -72 23 -6 -21 10 -1 13 62 -45 11 5 -51 15 -1 -1 18 -26 -36 45 0 55 -20 -17
6461a7Kk6j5Q8k9m1K6l7N6JK0p9rP2k5K6L7jn6RJ6J6j8j7PM7o9K8k9K7j5K6o9
$$ -17 -15 -41 -56 32 3 -38 -12 -49 7 8 28 -51 -60 12 -13 13 50 49 -7 2 18 34 16 -1 6 53 -16 12 -17 10 -5 21 -48
6494d8M9L0n0J2LL7j4Pk5k2J7l2M0j1j9K4n9M0RL6k3PJ3k0j1m5O0l4K4J0j6L8
$$ -48 1 31 -19 -7 -4 33 19 26 1 -21 -4 -36 4 -7 -26 -2 -61 -21 -12 24 1 8 21 1 -10 -55 5 -29 -5 5 -11 27
6526B7j5Lk4j0J0l4N2o1J5L7l3K2j6O2q2J5%K5N9j14J15p0J6l0KN4j22J14n3R4
$$ 27 12 15 -9 -19 -9 -43 9 -52 -37 0 -33 -11 -27 35 -47 -32 -32 -7 52 -62 53 -17 -1 -31 -29 25 -97 17 -36 58
6556E8j23M8k5M6J7Nl1O2nm0k9ll7P0j5qmrK0K4m9L5Ro2R2p8M2k7m5P8l0ML0n3
$$ 58 -65 -17 -42 4 21 26 -5 57 52 12 -17 -20 -57 13 -2 -10 -14 -23 -3 21 -28 7 16 -46 46 -32 10 -17 -62 16 -14 -10 20 -33
6590c3N4L8o2QK1n0k5M0J0j0l5L1M8l3lJ1J0k3J7j6L2j7m6P3q1kO8K4n3L1k3k5
$$ -33 21 59 -3 5 26 -24 -49 -9 1 -9 -44 -13 35 2 -1 10 20 -3 14 -2 30 13 -33 40 -41 -43 25 49 -4 27 4 -21
6622b1QKQj6Nj3L8k0K3J8l4j1QMK4m7M6k9k3N8k9j6k5N8n1M3n4M9jJ4m1O6No1
$$ -21 -13 -11 -3 -19 -14 -27 11 -9 14 32 -2 -13 -5 -1 23 -24 22 -7 -30 28 -1 -17 -42 16 -35 8 -46 3 2 16 -25 41 46 -15
6656a5%K0l9J4M5m4K2J4L4o2Pj8KNJ4L9K4q7K6Ln0M9m5N4n2N4k9K9L2p8K3k4M6
$$ -15 -15 5 -34 -20 25 -19 3 17 51 -11 -4 -22 -20 -15 -1 38 62 -25 1 4 -46 3 -42 12 -40 14 -15 14 46 -32 -9 -33 13
6689A3Ok0m0N1j5J1PqqNk2k8Q6j8Ol8n7J00l5l2L3J7m6mL2P1n6lJ1q6P6J8k5j4
$$ 13 19 -1 -41 10 -5 6 13 5 -3 2 -20 -48 38 20 26 -12 -69 31 -4 -36 -3 14 -32 -36 -4 67 11 8 19 -67 9 27 2 -12
6723a2L6o1J8K7pM2l9k8J3M3m6L4J1J1o7O8k2n3J1RM4n0K5m2J02o0NMKK9l1Ok1
$$ -12 24 -37 -19 8 1 43 4 -24 -11 32 -14 20 31 42 -25 43 21 -32 -21 -12 32 -18 7 -35 67 7 12 16 18 47 16 22 1
6756AM7m4j05P8m9K9M8Kk1j1K6k4J8N4j2lLl9k1L8o8Q3j6n4K3k0Q4o1L4l8l2K9
$$ 1 48 4 -101 -23 -72 -43 5 7 -14 -25 1 -23 -5 49 37 34 37 -2 -23 15 -53 30 14 -40 -17 -37 47 -14 20 -18 -50 -21
6788b1R3o7j3l5N7k7J0K0j8m1jJ8LK0Kk9L7k6R2o8k9k0N9o5J2L1J1L4p0L3n7Q5
$$ -21 72 5 -8 -43 14 -13 -3 17 -1 -42 -43 -25 -22 -2 0 -29 8 -18 74 6 -23 -43 16 -49 -37 -6 5 39 -31 2 -55 30
6820C0o0M7J5j8l4K6J9qk7l0O7j2rL1k1Oo9K8K2qm3J0M2o1O0Qj7J8%l0L5j8j7
$$ 30 -30 17 32 14 -20 6 25 17 -10 -40 27 15 6 37 16 22 -47 -19 3 -5 -48 -38 4 -57 3 11 -6 12 12 -18 17 -1 -18
6853a8N5q5Q4r1M0L1ll5K1Mpk8l2Q5l4O1n3K7J2q6P6q8J4R0m4po2L5K4k9M0ll3
$$ -18 37 -48 36 -55 -15 16 13 -22 -1 3 -4 -32 -64 21 -13 48 -5 22 34 -52 24 -64 -50 40 -4 -11 -73 -38 -14 -43 -3 -6 -39
6886c9O3n2J5j6J1l8K1M0k5l2PL9J0n5L1P9p4j4J3lqj2N6n4M9q2N4K2k2RJ0l9
$$ -39 24 -28 -13 -29 -18 -56 -35 5 -20 -52 -45 -6 4 -51 -20 59 -15 -29 -16 -19 -27 -39 17 -37 12 -70 -16 6 -16 -7 3 -36
6918c6P0n1M0%j0o4P5Lj1Kk4jJ8l7k4O7M1j13rO9l9M0m2qP2k0L1l7K1pk1K1K3
$$ -36 34 -17 23 23 13 -51 24 27 16 18 -6 -7 11 -26 -50 17 58 -55 -64 5 -34 6 -36 -44 28 8 39 2 23 16 -5 16 39
6951C9m5L8j4M4n3Klln2O8l8P4n7K7J9p3P6n8K0j4N4q7J3K4L9mk8l4J2n2L5L2
$$ 39 -6 32 18 62 9 11 8 5 -47 21 -17 57 0 27 46 -27 49 -9 11 -3 51 -36 -23 1 40 36 8 -26 -14 -66 -31 1
6983AJ5o3M0Mk0K5k4J3l7M0K6l8kL0j2nnJJ9L6j05%J13p3M5q1R2%op8P9k3%Lo
$$ 1 16 -47 -7 -3 -23 2 -22 -9 -46 -6 20 -18 -20 10 -2 -7 -12 -11 8 44 -61 -61 52 -21 24 -57 35 35 29 -49 30 7 7 10 4
7018Dj4K9j0j4q0L9N3L0m4Ml5Q4Ln9J2K9j8k5LNJ6l6L1k9N9o6J8M1k%j2l0O2m0
$$ 4 -10 19 9 -5 -85 -46 7 37 -7 -3 -38 46 49 -10 2 31 13 -12 -9 -4 12 -24 7 -22 37 -29 -11 30 28 28 16 -14 48 8
7052HJ7Nn0%j3J9OK5n9K4MM5k9qj8J1j8L7j7j4L9mm8N4prPrl2M9jJ8j0Kk1j7k7
$$ 8 25 30 -20 -20 -33 -14 -8 17 -42 -18 -14 31 2 -6 -24 -13 -31 6 -11 -25 14 10 -38 16 9 0 7 -2 -34 15 14 32 22 24 3 -14 -41
7089d1P1k5k6J7k8M9K3p4Q0j5Nj7m0RnJ7j1ML7o2L2Lo9P6J4p2P3n4K3M0m8NL8
$$ -41 30 5 -21 -4 -32 17 40 -34 46 31 36 19 -21 -12 -17 0 -11 -7 30 -32 0 3 -66 10 24 -48 25 -29 -6 34 -14 -9 29
7122B9o3K3k4K5MNK4m2O2m8KM6k1k1n8Q1p6M4N0l1n6K3l8R9n6K2K9l6k8j2M8l7
$$ 29 -34 -11 -35 -10 -6 -1 23 -19 43 -5 -3 43 22 1 -57 24 -52 -8 42 11 -45 -22 -60 39 -17 5 34 -2 -30 -42 6 -31
7154c1mmP1LJ1m0J9oj1O8n8k5M7l9k0M9n3O5l8m2K5M7n8K0K3Ln6L1n8O5L5l4m0
$$ -31 -35 -39 32 35 46 6 25 19 8 76 18 -7 40 1 -19 30 -23 42 4 -38 -13 34 -24 -4 19 22 -34 -3 -61 4 39 5 -35
7187c5K9k6j6j5O4k0N6k0j5K9n1K2l1L9k4L8JOn2k3R6r8L8kK8m8L2j2j6K3M3l0
$$ -35 -6 -32 -48 -63 1 -19 37 17 2 31 -20 2 -29 10 -14 24 25 31 -21 -44 52 -46 -8 -10 18 -30 2 -10 -26 -3 40 10
7219A0pK3k1J4p0N4l5K9q2Q6N3L7j41Q4p0lqO9mm2K0M7q9N8n7M0L2p4O9k4K2n2
$$ 10 3 26 5 19 -51 3 -32 -3 -85 1 54 91 -50 34 -36 -39 -47 22 18 -24 -4 43 -46 12 -45 -5 27 -47 22 -2 20 -32
7251c2L7RL2l4L4Mo0K3pN6n0M6p0K2mk4J7n3M0k1N2rqJ3rl0mO2q8Q9k9j1N8k9
$$ -32 5 14 46 12 46 50 -10 13 6 62 12 58 -12 10 6 -18 -1 -54 -14 -35 17 8 0 13 4 -26 -30 32 -56 33 4 -7 51 22
7285B2k2Lm6R4n8L5L9n7K6J2k4m0M0k6O0l6j3Lj2QJ7n3k3M6JJ7m6qP3o3L0k0K1
$$ 22 0 3 -43 51 -7 28 67 10 36 48 24 -16 24 -2 58 22 9 12 0 8 25 -28 -51 -5 -4 13 -33 -41 32 -31 -1 -21 0
7318@k1j8M3l1L4JL4j01M7j0N4k4lj5L1Kj9Ok6jO2p1M0J8n8K1J9m2m6O2K1M0k4
$$ 0 -21 -39 4 -27 7 8 42 -59 -12 -22 32 8 5 -10 21 23 4 10 -16 -17 45 -26 14 32 -26 -5 14 -28 -74 -12 9 49 25
7351B5o6R2n4J5n2M1o5N1P1q2OL4l3M0m9k1Q4k3j6J9Kl9k3O5l2j7m7N8L9J9n2
$$ 25 -41 51 -3 12 -40 1 -64 -13 58 -24 -18 16 -17 23 -26 -47 37 14 -2 17 19 -20 -43 22 -10 -27 -74 -16 23 42 -10
7382a0K3pJ6lnn6M1no0M8kk2l2O3L6o6L3Jk3M5k5j4J1j9KjJ4M9m9M3LPj3rJ7m0
$$ -10 13 6 22 19 14 -42 -1 -6 -66 -18 -20 -42 -74 -11 25 -41 -8 -7 -30 15 -10 -24 -13 -32 -30 -31 -17 32 -17 26 29 36 23 14 31 -9
7418iK0MQm0O7j5J5m8M6k0j5mJ0K0j05Q7k0No5Q5L3j6k2m8m8O9m8N1j1N7l1l1
$$ -9 11 15 23 -17 50 35 50 2 48 28 13 9 19 39 -66 21 1 6 -59 26 59 43 21 -27 -75 -6 -54 -3 -14 43 12 -19
7450a9J1m0P5m2M3r2O7nK1p1O2K6lk2l8O1j8p4O1Ml6N6p5M1K1m4M0o4l0R5o5P
$$ -19 -8 -48 27 -15 28 -64 3 -2 19 -52 10 36 33 11 -27 34 16 -58 3 7 -29 27 -48 -7 14 -30 10 -54 -84 11 -54 -47
7482d7L3O4m3j7j5M3l8QJ4Qp9N4J9L9n7pQJ9K7m5NN9n2Pk8N4n0O7m2Q2m7k5m3
$$ -47 -14 50 7 -10 -25 18 -20 -12 2 10 -69 -15 4 43 -14 -21 -13 6 33 -12 -7 52 0 7 -21 33 -17 50 8 90 43 18 -25
7515b5L5N4m4k0PJ0J0M1j07mK0LrM9l5j5KjK7M0n0q2N9M6J4l0J7k6L4J7k9K9m1
$$ -25 10 64 20 0 7 17 27 68 -39 -43 -23 -20 -29 20 -15 -30 -28 -29 -2 38 -12 -94 -35 11 25 -5 12 -14 20 37 8 37 -4
7548dj0K2k5K2Nk3k3J9K3m7R6m8J1ml4m3K3N4k7K0PL9j09P6mN9n6pKo1P7n2M2
$$ -4 -14 8 -17 5 10 -13 -36 -17 6 -41 55 7 18 14 -20 -63 -40 14 -13 7 14 53 -56 20 16 75 19 12 14 -47 30 -22 20
7581B0oj7L6k3m3M4J5J2jo0MM3n4KL3O9r3L6k5lK2l8O7o9jK5J5p1J11o2L8p9K0
$$ 20 14 -3 33 10 -33 11 26 38 37 -23 -19 24 -30 -28 5 74 -19 17 -8 -11 11 -27 40 -29 -30 -5 10 -61 50 -12 26 -53 -33
7614c3Q5o6j2K2J1k2LL0n0k4P5n4L2Nj8N6p0L4M4n7Lj3L5k4m7M2O9l8k4j1k2L2
$$ -33 52 -14 -26 -4 7 -15 -12 18 -32 -56 19 -35 -3 2 -16 40 -30 4 48 -9 -6 -19 16 -8 -55 -13 56 18 -6 -17 -39 -7
7646gm4N8oll6J5j6L0QoJ8p3j6J04l5O5n6nl0N1l6k9L9pK2k4l2R5o6O2l3o3L1
$$ -7 -51 7 1 -2 -38 -23 -39 -9 -1 -7 11 -62 -78 26 -9 56 0 -5 -35 16 -20 -49 -10 -17 5 -19 -51 44 -22 40 7 -56 -25
7679b5N0%l7j3P5n9k4N2n3K9pQJ7Pm4j5K8M3n1J9j5L5o5O5m2j0j7L7J6Lrk5R2
$$ -25 25 25 -12 -25 50 -9 -33 19 -34 -5 -12 -4 13 20 -24 -39 -11 32 -19 0 -15 20 -45 20 -22 -32 -49 -12 4 7 -2 -27 65
7712F5m8J0%n7J4K3j8K2l4RLL1j7L5n3Ml2N1k5qQ1o2J2j5K5n7OJ7k2L1q0R4j0
$$ 65 17 27 27 -30 -16 7 -11 11 -23 -14 -11 20 3 38 -15 -11 -43 8 -17 -25 56 -6 6 -9 16 -41 -35 -18 -40 -9 -89 5 -5
7745en1O5Lpl5J7K4Lqjn2Q0Qp5J6O2n9J7j0mkL5k3pQ2j41M5J8JL8o7K1L3J2Qk8
$$ -5 -56 9 12 5 -30 -13 11 14 6 5 -47 33 41 -34 -18 44 -15 2 -8 -12 -14 21 -2 -9 73 -68 -23 -5 -4 34 -33 -12 21 33 41 13
7781A3Nl8m9L9J3j1J2QK2ok3j9L0L5l3L8n9R6q2nO9m0m1j0j1R2m6L9n6N0l6k8
$$ 13 18 -20 -69 -30 -17 -28 -16 -8 14 8 -15 -34 -4 31 -2 36 -23 73 -9 -14 55 15 -26 -36 -47 45 -1 38 -18 32 -4 -32
7813c2L9N1p6l3O5o7N7l1K0j1m1P0Pm6kl4R7Jl1l2j0R9m0l8N5l8J8n2O6J2k1l7
$$ -32 7 58 -18 -51 14 -53 4 -27 -7 -18 -59 11 18 -28 -30 -64 33 34 3 -29 -39 60 20 -18 37 -1 17 -35 31 43 22 -15
7845a5L1j4LJ8qm2L0J8l4M6n0J2j6j7M5o5L7j4M2rK7l8Rm5Mj1M1K3k3k8O6M3j07
$$ -15 16 2 5 23 15 -27 3 21 -13 33 -17 -5 -21 -38 7 -58 -21 -35 7 -2 25 -13 -4 -49 -45 -56 -15 8 -15 -43 23 66 -41
7878d1O8J3l9j9L8n8K5N6m4j8l3Q6n9J1o1J5O2k6l2L5M2j3p4R0n8P1Np0nO5l9
$$ -41 27 40 1 -18 20 -38 -13 43 -1 -19 -52 34 -25 -14 -75 -60 2 -24 -56 -21 21 8 -66 24 -34 37 42 -28 -33 32 -7
7909gL8n2J2nkj2K1L0n1J9k4mM6po2O9J5k1K2k6l4K1lrJ0o3P0kk0P7j7k7n2M5
$$ -7 31 -21 -9 -14 -16 -28 -7 23 -28 -9 -33 -37 9 2 -60 9 24 3 25 -1 -35 -14 -17 -26 -16 -79 -9 -11 -31 46 29 2 -50 -5
7943ekJ3KJ2l4j9jJ1L9k9OJ8j1Nl7M1m8J6M4j9LJ7jJ0n4N1j6qkj0l4M8n2rL4K1
$$ -5 -7 6 8 20 -14 -33 -34 -23 16 -13 -7 11 0 5 -32 9 -39 -23 21 2 5 22 21 31 -23 28 12 4 2 -8 -42 6 -46 -55 -21 0
$$ [...]
8191A8
##END NTUPLES=NMR FID
##END=
