##TITLE=1H_DE-80H3_C
 200.13MHz, D2O,
 8 sc
 
 19ns.2.2025
##JCAMPDX= 6.0         $$ Bruker NMR JCAMP-DX V2.0
##DATA TYPE= NMR FID
##DATA CLASS= NTUPLES
##ORIGIN= UXNMR, Bruker Analytische Messtechnik GmbH
##OWNER= pz
$$ XWIN-NMR		Version 3.5
$$ Wed Feb 19 15:43:38 2025 Russian Standard Time (UT+4h)  new_Human@DPX200
##.OBSERVE FREQUENCY= 200.1313
##.OBSERVE NUCLEUS= ^1H
##.DELAY= (6, 6)
##.ACQUISITION MODE= SIMULTANEOUS
##.ACQUISITION SCHEME= undefined
##.AVERAGES= 8
##.DIGITISER RES= 18
##SPECTROMETER/DATA SYSTEM= spect
##.PULSE SEQUENCE= zg30
##.SOLVENT NAME= D2O
##.SHIFT REFERENCE= (INTERNAL, D2O, 0, 14.3821)
##AUDIT TRAIL= $$ (NUMBER, WHEN, WHO, WHERE, WHAT)
$$ ##TITLE= Audit trail, XWIN-NMR		Version 3.5
$$ ##JCAMPDX= 5.01
$$ ##ORIGIN= Bruker BioSpin GmbH
$$ ##OWNER= new_Human
$$ C:/Bruker/XWIN-NMR/data/yarkov/nmr/H-C/1/audita.txt
$$ ##AUDIT TRAIL=  $$ (NUMBER, WHEN, WHO, WHERE, WHAT)
(   1,<2025-02-19 15:39:43.14 +0400>,<new_Human>,<DPX200>,
      <created by zg, POWCHK disabled, PULCHK disabled
       configuration hash MD5:
       00 E9 B6 7A A2 85 ED C7 34 08 36 98 17 FE 4E 26
       data hash MD5: 16K
       27 91 C5 B7 E4 74 E8 13 22 06 8B 75 EB 48 5C C7>)
$$ ##END=
$$ 
$$ hash MD5
$$ 43 3A 32 DE 0E 42 CA 3F BC D8 21 15 83 29 6B 3D
##$RELAX= 
##$RELAX= 
##$RELAX= 
##$RELAX= 
##$RELAX= 
##$RELAX= 
$$ Bruker specific parameters
$$ --------------------------
##$DU= <C:/Bruker/XWIN-NMR>
##$EXPNO= 1
##$NAME= <H-C>
##$PROCNO= 1
##$TYPE= <nmr>
##$USER= <yarkov>
##$AMP= (0..31)
100 100 100 100 100 100 100 100 100 100 100 100 100 100 100 100 100 100 
100 100 100 100 100 100 100 100 100 100 100 100 100 100 
##$AQSEQ= 0
##$AQ_mod= 1
##$AUNM= <au_zg>
##$AUTOPOS= <>
##$BF1= 200.13
##$BF2= 200.13
##$BF3= 200.13
##$BF4= 200.13
##$BF5= 200.13
##$BF6= 200.13
##$BF7= 200.13
##$BF8= 200.13
##$BYTORDA= 1
##$CFDGTYP= 0
##$CFRGTYP= 5
##$CHEMSTR= <none>
##$CNST= (0..31)
1 1 145 1 1 1 1 1 1 1 1 1 1 1 1 1 1 1 1 1 1 1 1 1 1 1 1 1 1 1 1 1 
##$CPDPRG= <>
##$CPDPRG1= <>
##$CPDPRG2= <>
##$CPDPRG3= <>
##$CPDPRG4= <mlev>
##$CPDPRG5= <mlev>
##$CPDPRG6= <mlev>
##$CPDPRG7= <mlev>
##$CPDPRG8= <mlev>
##$CPDPRGB= <>
##$CPDPRGT= <>
##$D= (0..31)
0 0.7 0 0 0 0 0 0 0 0 0 0.03 0 0 0 0 0 0 0 0 0 0 0 0 0 0 0 0 0 0 0 0 
##$DATE= 1739965182
##$DBL= (0..7)
120 120 120 120 120 120 120 120 
##$DBP= (0..7)
150 150 150 150 150 150 150 150 
##$DBP07= 0
##$DBPNAM0= <>
##$DBPNAM1= <>
##$DBPNAM2= <>
##$DBPNAM3= <>
##$DBPNAM4= <>
##$DBPNAM5= <>
##$DBPNAM6= <>
##$DBPNAM7= <>
##$DBPOAL= (0..7)
0.5 0.5 0.5 0.5 0.5 0.5 0.5 0.5 
##$DBPOFFS= (0..7)
0 0 0 0 0 0 0 0 
##$DE= 6
##$DECBNUC= <off>
##$DECIM= 32
##$DECNUC= <off>
##$DECSTAT= 4
##$DIGMOD= 1
##$DIGTYP= 9
##$DL= (0..7)
0 120 120 120 120 120 120 120 
##$DP= (0..7)
150 150 150 150 150 150 150 150 
##$DP07= 0
##$DPNAME0= <>
##$DPNAME1= <>
##$DPNAME2= <>
##$DPNAME3= <>
##$DPNAME4= <>
##$DPNAME5= <>
##$DPNAME6= <>
##$DPNAME7= <>
##$DPOAL= (0..7)
0.5 0.5 0.5 0.5 0.5 0.5 0.5 0.5 
##$DPOFFS= (0..7)
0 0 0 0 0 0 0 0 
##$DQDMODE= 0
##$DR= 18
##$DS= 0
$$ [...]
##$SUBNAM0= <"">
##$SUBNAM1= <"">
##$SUBNAM2= <"">
##$SUBNAM3= <"">
##$SUBNAM4= <"">
##$SUBNAM5= <"">
##$SUBNAM6= <"">
##$SUBNAM7= <"">
##$SUBNAM8= <"">
##$SUBNAM9= <"">
##$SW= 18.0517328524113
##$SWIBOX= (0..15)
0 0 2 0 0 0 0 0 0 0 0 0 0 0 0 0 
##$SW_h= 3612.71676300578
##$TD= 16384
##$TD0= 1
##$TE= 0
##$TE2= 300
##$TE3= 300
##$TEG= 300
##$TL= (0..7)
0 120 120 120 120 120 120 120 
##$TP= (0..7)
150 150 150 150 150 150 150 150 
##$TP07= 0
##$TPNAME0= <>
##$TPNAME1= <>
##$TPNAME2= <>
##$TPNAME3= <>
##$TPNAME4= <>
##$TPNAME5= <>
##$TPNAME6= <>
##$TPNAME7= <>
##$TPOAL= (0..7)
0.5 0.5 0.5 0.5 0.5 0.5 0.5 0.5 
##$TPOFFS= (0..7)
0 0 0 0 0 0 0 0 
##$TUNHIN= 0
##$TUNHOUT= 0
##$TUNXOUT= 0
##$USERA1= <user>
##$USERA2= <user>
##$USERA3= <user>
##$USERA4= <user>
##$USERA5= <user>
##$V9= 5
##$VALIST= <valist>
##$VCLIST= <CCCCCCCCCCCCCCC>
##$VD= 0
##$VDLIST= <DDDDDDDDDDDDDDD>
##$VPLIST= <PPPPPPPPPPPPPPP>
##$VTLIST= <TTTTTTTTTTTTTTT>
##$WBST= 1024
##$WBSW= 4
##$XGAIN= (0..3)
0 0 0 0 
##$XL= 0
##$YL= 0
##$YMAX_a= 509139
##$YMIN_a= -627357
##$ZGOPTNS= <>
##$ZL1= 120
##$ZL2= 120
##$ZL3= 120
##$ZL4= 120
##$ABSF1= 10
##$ABSF2= 0
##$ABSG= 5
##$ABSL= 3
##$ALPHA= 0
##$AQORDER= 0
##$ASSFAC= 0
##$ASSFACI= 0
##$ASSFACX= 0
##$ASSWID= 0
##$AUNMP= <proc_1d>
##$AZFE= 0.1
##$AZFW= 0.1
##$BCFW= 1
##$BC_mod= 2
##$BYTORDP= 1
##$COROFFS= 0
##$CY= -3
##$DATMOD= 1
##$DC= 2
##$DFILT= <>
##$DTYPP= 0
##$F1P= 0
##$F2P= 0
##$FCOR= 0.5
##$FTSIZE= 0
##$FT_mod= 4
##$GAMMA= 1
##$GB= 0.15
##$INTBC= 1
##$INTSCL= 1
##$ISEN= 128
##$LB= 0.25
##$LEV0= 0
##$LPBIN= 0
##$MAXI= 10000
##$MC2= 0
##$MEAN= 0
##$ME_mod= 0
##$MI= 1.114404
##$NCOEF= 0
##$NC_proc= 0
##$NLEV= 6
##$NOISF1= 3.799351
##$NOISF2= 2.8
##$NSP= 1
##$NTH_PI= 0
##$NZP= 0
##$OFFSET= 14.38212
##$PC= 1
##$PHC0= -870.9064
##$PHC1= 73.59224
##$PH_mod= 1
##$PKNL= yes
##$PPARMOD= 0
##$PSCAL= 0
##$PSIGN= 0
##$REVERSE= no
##$SF= 200.129724274929
##$SI= 16384
##$SIGF1= 3
##$SIGF2= 2
##$SINO= 400
##$SIOLD= 16384
##$SREGLST= <1H.CDCl3>
##$SSB= 0
##$STSI= 0
##$STSR= 0
##$SW_p= 3205.1282051282
##$SYMM= 0
##$S_DEV= 0
##$TDeff= 0
##$TDoff= 0
##$TI= <>
##$TILT= no
##$TM1= 0
##$TM2= 0
##$TOPLEV= 0
##$USERP1= <user>
##$USERP2= <user>
##$USERP3= <user>
##$USERP4= <user>
##$USERP5= <user>
##$WDW= 1
##$XDIM= 8192
##$YMAX_p= 0
##$YMIN_p= 0
$$ End of Bruker specific parameters
$$ ---------------------------------
##NTUPLES= NMR FID
##VAR_NAME=  TIME,          FID/REAL,        FID/IMAG
##SYMBOL=    X,             R,               I
##VAR_TYPE=  INDEPENDENT,   DEPENDENT,       DEPENDENT
##VAR_FORM=  AFFN,          ASDF,            ASDF
##VAR_DIM=   8192,          8192,            8192
##UNITS=     SECONDS,       ARBITRARY UNITS, ARBITRARY UNITS
##FACTOR=    0.0002768,     1,               1
##FIRST=     0,             0,               0
##LAST=      2.2672688,     0,               0
##MIN=       0,             -627357,         0
##MAX=       2.2672688,     509139,          0
$$ Real data points
##PAGE= N=1
##DATA TABLE= (X++(R..R)), XYDATA
$$ [...]
1868A07QK21l27j13J64J7j9Lp9Mk35K26l1Oj06J34M7q9J42J35k28l2lK43j46r0
$$ 107 115 336 9 -104 60 77 58 61 -18 -14 -249 -23 -54 -48 -154 -20 27 -62 80 215 -13 -45 -48 195 49 -41
1894d1J7j14P8L30k16n0j14K50j26k58J6L11j51m10N64k9J6k05J82j73O1J46m6
$$ -41 -24 -138 -60 270 54 4 -110 140 14 -244 -228 83 -68 -478 86 57 73 -132 50 -123 -62 84 38
1917C8j81L81k93J1LJ75j96K4J63J87j06l91J69j51J88j45m6pK77k47J16M49m10
$$ 38 -143 238 -55 -44 -41 134 -62 -38 125 312 206 -185 -16 -167 21 -124 -170 -177 100 -147 -31 418 8
1940Hk5J80m6J4k41N5K28p3n8l9k0J67k07M7n2j86K71K29k82LL7J76L1J69n62
$$ 8 -17 163 117 131 -110 -55 173 100 42 3 -17 150 -57 -10 -62 -248 23 252 -30 -27 10 186 217 386 -176
1965a76L84j65N6j45l13L03j80L38j72j1o0L22j43j54L5J30L5k23L96l16K74j01
$$ -176 208 43 99 -46 -359 -56 -236 102 -70 -81 -141 181 38 -116 -81 49 84 -139 257 -59 215 114
1987A14j57J66l55K06j53J31M1J68j37j08O5q4J17R9q6j23L3l8p4KK90j52P2J39
$$ 114 -43 123 -232 -26 -179 -48 -7 161 24 -84 -19 -103 14 113 27 -96 -63 -101 -175 -173 117 -35 37 176
2011A76j87J3K20m97N36o01N82l26M1K09k45J30l3q7J53J0k4p7n2L01m17K82l04
$$ 176 -11 2 222 -275 261 -340 242 -84 -43 166 -79 51 18 -69 84 94 70 -7 -59 242 -175 107 -197
2034a97L8K84J8k01jQ6K7j20P1n4J43m98K59K29R8r3n6k29K34l72L21j80L76j56
$$ -197 -159 125 143 -58 -59 27 54 -66 5 -49 94 -404 -145 84 182 89 33 -196 38 -334 -13 -193 183 27
2058B7K51m25K40k10J25nK6j49J13R1j72j54L89k72K43j8N7P6j91R0J45nj50k36
$$ 27 278 -147 93 -117 8 3 29 -120 -7 84 -88 -242 147 -125 118 100 157 233 42 132 277 272 122 -114
2082a14J6J2M8K96o0k69J07K63l22k6j51K53k00J50n1J54q6J74o1L0j23k25O07
$$ -114 -98 -86 -38 258 198 -71 36 299 -23 -49 -200 53 -147 3 -48 106 20 194 133 163 40 -185 422
2105D22m68P4K14m38K01j58oK65J46O3o52L50l10K91J34q7J51j83R1r2p3K24k03
$$ 422 -46 28 242 -196 5 -153 -159 106 252 315 -337 13 -297 -6 128 41 192 9 100 8 -65 159 -44
2128d4r4J27k0M3j31J7K48m0j01p4O5j31N9J21o0j6K13k28J10r6j19QPl3J46j27
$$ -44 -138 -11 -31 12 -119 -102 146 106 5 -69 -4 -135 -76 45 -15 -31 182 -46 64 -32 -151 -143 -136 -169 -23 -150
2154a50L02j90j51J15r8R0J10J75k65K24n1q4J65j29j20K18l02K01Jj15L2o9J35
$$ -150 152 -38 -189 -74 -172 -82 28 203 -62 162 111 27 192 63 -57 161 -141 60 61 -54 -22 -91 44
2177D4J50l35J48J0k72M31k41M8K79m20M9K31p0j69J54o9j50K74K24k51m9R4j7
$$ 44 194 -141 7 17 -255 176 -65 -17 262 -158 -109 122 52 -117 37 -32 -182 92 316 65 16 110 93
2200I3j61L58k64p1L01k00k4q9j23L60l68J40j80J78k24K88L26l60k32K41j83
$$ 93 -68 290 26 -45 256 56 32 -57 -180 180 -188 -48 -228 -50 -274 14 340 -20 -252 -11 -194
2221a94L09k9j95O6J15k24K34M4j88L01k69p4J83j19Q9j02L8J00j2j56N3J50Q4
$$ -194 115 86 -109 -43 72 -152 82 126 -62 239 -30 -104 79 -40 49 -53 -15 85 73 -83 -30 120 204
2244B04k8j82J39o8j90K79j95Q6m7j4Kk2J71J76l23j62L08k36l1K32P1r1L9r3
$$ 204 176 -6 133 65 -125 154 -41 45 -2 -16 -14 -36 135 311 -12 -174 134 -102 -133 99 170 79 118 25
2268B5n1M5n4K16k02J68j25o2O1o2l1Q0l02K35q1J37Q4n2l1K48m43J31L9j76j
$$ 25 -26 19 -35 181 -21 147 22 -40 21 -41 -72 8 -294 -59 -140 -3 81 29 -2 246 -197 -66 -27 -203 -204
2293b04M83l16m1J8L3n7R0J54j50k02K93K2J3J50k23n2J00j22m3K11k87K27l15
$$ -204 279 -37 -78 -60 -27 -84 6 160 10 -192 101 123 136 286 63 11 111 -11 -54 157 -130 97 -218
2316b18R8K65k09J40K3j06LJ04k1o9pQ9Q7k83M95n13J61j35K34o6k66K01k03M15
$$ -218 -120 145 -64 76 99 -7 -4 100 79 10 3 92 179 -104 391 -122 39 -96 138 72 -194 7 -196 219
2340B19j69j04J5J24l12L14m0K11p18O18J45l05J29k13J42j06J83k43L53j46j29
$$ 219 50 -54 -39 85 -227 87 47 258 -460 158 303 -2 127 -86 56 -50 133 -110 243 97 -32
2361c2q7K68l93K4M1L7M9J82k13L46k43p1K15l4j72j19K59K04J16l97j42J88k62
$$ -32 -119 149 -244 -220 -179 -142 -93 89 -124 222 -21 -92 123 89 -83 -202 57 261 377 -20 -162 26 -236
2384b36L53j83Q2l5R7l0o2o1o7J68M4L9j9L4l0j36j48K96P2j36l7n3J18r7j40
$$ -236 117 -66 16 -19 78 48 -14 -75 -142 26 70 109 90 124 94 -42 -190 106 178 42 5 -48 70 -27 -167
2409a67K22L0NQ8j43j53J74k73j30J93P8J02P1r7j74L17l05L6J97j46K07k66J56
$$ -167 55 85 90 178 35 -118 56 -217 -347 -154 -76 26 97 0 -174 143 -162 -126 71 -75 132 -134 22
2432B2j22n4k31L02J17L9K1j18M8Kj68p6K02Rl9oj66M57l25l03N78j18k01j65
$$ 22 -100 -154 -385 -83 34 73 94 -24 24 26 -142 -218 -16 -7 -46 -52 -218 239 -86 -389 189 71 -130 -295
2456b95L77j46N8m9K41k00J15q1J74J18l25j74L68j93J47j32N7j06P5l29K90M21
$$ -295 82 -64 -6 -55 186 -14 101 20 194 312 -13 -187 181 -12 135 3 60 -46 29 -300 -10 411
2478D11l20J13j41j2k79K66J23j35Q7M6j77J21m2l4O1N4l21K59p1J11k30M2M9
$$ 411 91 204 63 51 -228 38 161 26 113 159 -18 103 61 27 88 142 -179 80 9 120 -110 -68 -19
2501a9K93l56R1J87p5p7L5j30K9J97r1j35p3P8O6j98K47j02K41n2k45Q6K24P6
$$ -19 274 -82 9 196 121 44 79 -51 -22 175 84 -51 -124 -46 20 -178 69 -33 208 156 -89 -3 221 297
2525B97m66Mn1L72j66J50j7j18j55K45j19rj8N2J20j68j36K92m3M8k77K2K72l13
$$ 297 -169 -165 -216 156 -10 140 123 5 -150 95 -24 -33 -51 1 121 -47 -183 109 66 114 -163 -141 131 -182
2549a82J13j22K04j17J02L29j80j2j49k32L83Q0l45J60L5q3L9j0L3l1M5R2j76
$$ -182 -69 -191 13 -104 -2 327 147 135 -14 -246 137 217 -128 32 67 -16 23 13 46 15 60 152 -24
2572b4P3l46L08k3N7k04J27J16k96j6J10j34J49P4L0K12n3n06K77j44Q1L23p1
$$ -24 49 -297 11 -12 45 -159 -32 84 -212 -228 -118 -252 -103 -29 1 213 160 -346 -69 -213 -132 191 120
2595A20k10j21K33m10K87K17q8J59j83r6J76k93L8K74l19K26k49L08j32j33K84
$$ 120 -90 -211 22 -388 -101 116 28 187 4 -92 84 -209 -171 103 -216 10 -239 69 -63 -196 88
2616H8k50j9K79j24O5k16J60JK43k86n9r7L15l5q0j2L8m4K75j20J7J1j55k5J50
$$ 88 -162 -181 98 -26 39 -177 -17 -16 227 -59 -118 -215 100 65 -15 -27 11 -33 242 122 139 150 -5 -30 120
2641A20p2K46l30L4L17k99J11P4m9k23l6J79j42J85k1j71L4k01J67N2K25l15r8
$$ 120 48 294 -36 -2 315 16 127 201 152 -71 -107 72 -70 115 94 -77 -43 -244 -77 -25 200 -115 -213
2664b13K38j48J76q5j20M03l04J14k48N30k84p7J95p7j4j41M5k3Q3J5r6J29j25
$$ -213 25 -123 53 -32 -152 251 -53 61 -187 343 59 -18 177 100 86 -55 -10 -33 50 65 -31 98 -27
2687b7K0L34m98J28J02Q2j56l5n4J1L0r3P3l2K08n0j23K28k26j5N9j59L60k36
$$ -27 -7 327 -171 -43 59 141 -15 -50 -104 -93 -63 -156 -83 -115 93 43 -80 148 -78 -93 -34 -193 167 -69
2711f9J53K2l9J55k64J03J93j58l29L53r9j8j48k05K87L46m18j8l8J16jK63k93
$$ -69 84 106 67 222 -42 61 254 96 -233 120 21 3 -145 -350 -63 283 -135 -153 -191 -75 -76 187 -106
2734a06k1j13M80k99J74m2j00L0K5n7J9K67j89m8k88K23N5K78j81j3j86J65o2
$$ -106 -127 -240 240 -59 115 73 -27 3 28 -29 -10 257 68 20 -268 -45 10 288 107 94 -92 73 11
2757A1J27k30m3J18J01j45K39k85K63j47M7k81L17l03L91m18L94k2o5k45J07K7
$$ 11 138 -92 -135 -17 84 -61 178 -107 156 9 56 -225 92 -211 180 -238 156 134 69 -176 -69 -42
2779d2J31mMr6j56L0J53J37l34K04l2J4k88M16l99L94k67J45l4J7Q8J82k37J3
$$ -42 89 85 89 -7 -163 -133 20 157 -177 27 -5 9 -279 137 -262 132 -135 10 -24 -7 81 263 26 39
2803C9k03r7J81K72j74R7j23M0j41K1K97l51L0j09K90k02Q4J13m5j30K12j44J6
$$ 39 -164 -261 -80 192 18 115 -8 32 -109 -88 209 -142 -112 -221 69 -133 -49 64 19 -111 101 -43 -27
2826b7k1k59J67l01L14J60M0J63j95j12J56k12j57K62Kr4K53m25K49j9P9j82q6
$$ -27 -48 -307 -140 -441 -127 33 73 236 41 -71 85 -127 -284 -22 -20 -114 139 -286 -37 -56 23 -159 -245
2849b45M15l20j01K85Rj7J1L29j52k62n0n7P0J69m2M9j13K90k70l28K62J66p2
$$ -245 170 -150 -251 34 43 26 37 366 214 -48 -98 -155 -85 84 42 91 -22 268 -2 -330 -68 98 26
2872B6l38M32j69K4j42M1K81J06n29J64J09J49j97j1j05O9L08k06L50l63k02L26
$$ 26 -312 120 -49 -25 -167 -126 155 261 -268 -104 5 154 -43 -54 -159 -90 218 12 362 -1 -203 123
2894A23l72J38J78l24K55K48p5j52Q3j12J02j43K12L5l26K27L0J69l32j21K90
$$ 123 -249 -111 67 -257 -2 246 171 19 102 -10 92 -51 161 196 -130 97 127 296 -36 -157 133
2915A33j21j20K73m59M12j38J94j42J04j04j04L21l59M61k09j08J84n2l1m51O05
$$ 133 12 -108 165 -294 118 -20 174 32 136 32 -72 249 -110 351 142 34 218 166 135 -316 289
2936B89q2K3j68L3k1N4j15k4J99j30j10M9j6R9R0n5k57K25k76J94j16J42j48J00
$$ 289 207 230 62 95 74 128 13 -11 188 58 -52 -3 -19 80 170 115 -142 83 -193 1 -115 27 -121 -21
2960b1PJ50j61K79l48J66J9l90K99J44l75K20J70j92J73k11M4J5r5O2J07j72J10
$$ -21 -14 136 -25 254 -94 72 91 -299 0 144 -231 -11 159 -33 140 -71 -27 -12 -107 -45 62 -110 0
2983@K65k12l26J10J27j29k01M29p0j83L68K3j95O8j81M9n8L53k64J20k30J3J37
$$ 0 265 53 -273 -163 -36 -165 -366 63 -7 -190 178 201 6 74 -107 -58 -116 237 -27 93 -137 -124 13
3006A3j70J97K35l06j7J50k17K51j04j16J07j09M43m25k8L67k35J16j31O4N1j05
$$ 13 -157 40 275 -31 -48 102 -115 136 32 -84 23 -86 357 -68 -96 271 36 152 21 85 136 31
3028C1K21r4r2K2j22N8J76k33q1n6L15k24j6J01J72j22j48K86l14L3K37k92L11
$$ 31 252 158 66 88 -34 24 200 -33 -114 -170 145 -79 -95 6 178 56 -92 194 -120 -87 150 -142 169
3051A69k36j0N7k8j33j2J43L3j9q8R6q3r6K31j35J62o6j97j13L76o5k21K15p5
$$ 169 -67 -77 -20 -48 -181 -193 -50 -17 -36 -124 -28 -111 -207 24 -111 51 -15 -212 -325 51 -14 -235 -20 -95
3075i5J76pK03m12j54L05N9k6p1j86mJ61q0L32r6l89N30L3k85n2L8k22K58J44
$$ -95 81 74 277 -135 -289 16 75 49 -22 -208 -212 -51 -131 201 105 -284 246 279 -6 -58 -20 -242 16 160
3099A60j48j35K4K77j79O1j09K68k71m2J51k6j8J99m0q6k48J9K76k51J84l00L41
$$ 160 12 -123 -99 178 -1 60 -49 219 -52 -94 57 31 13 212 172 86 -162 -143 133 -118 66 -234 107
3122A07Q1k2k70N7nL5M9Nk28R0Q6J30q6k00J0K57k6k53J03j8M28k34j26K09k86
$$ 107 188 166 -104 -47 -52 -17 32 37 -191 -101 -15 115 29 -171 -161 96 70 -183 -80 -98 330 96 -30 179 -107
3147a07R5Q9L38n01j71K27k1j95N47m26l1J47J05q4Q8N1k43k8R6j53J51K2l0J58
$$ -107 -12 77 415 -86 -257 -30 -51 -246 301 -125 -156 -9 96 12 100 151 -92 -120 -24 -177 -26 -4 -34 124
3171A24k91L46j74P9j80J79j48p1J58J54j68pJ44n8j06L28k85N9n7j33J16k07
$$ 124 -167 179 5 84 -96 83 -65 -136 22 176 8 1 145 87 -19 309 24 83 26 -107 9 -198
3193a98P3J71O0j19q3N1q2k05M09j01q0O5k74L17k51L82m0O1j65J23j66J97k1
$$ -198 -125 46 106 -13 -96 -45 -127 -332 77 -24 -104 -39 -313 4 -247 135 95 156 -9 114 -52 145 124
3216A24l71O57k93j95M7Q8j60K69J12k21j1q6k61k0N37j38j37j28K03j06L01N7
$$ 124 -247 410 117 -78 -31 57 -103 166 278 57 46 -40 -301 -321 216 78 -59 -187 16 -90 211 268
3238B68k68j22OL27l36L61l47J54nk3j64L0J41n0j1J72k38J54l33K18J39o4j05
$$ 268 0 -122 -116 211 -125 236 -111 43 38 15 -149 -119 22 -28 -39 133 -105 49 -284 -66 73 9 -96
3261i6J75J06j23L8o7L5q9q1J08k60K98J52j30pJ45K7l12L55k74J93k93%QP4k0
$$ -96 79 185 62 100 33 68 -21 -102 6 -254 44 196 66 59 204 231 -81 274 0 193 -100 -100 -92 -18 -38
3286c8J63j04J59j46k86J15J31J70m46J16K97j43J49K02k30K11j67l18L35l2p3
$$ -38 125 21 180 34 -252 -137 -6 164 -282 -166 131 -12 137 339 109 320 153 -165 170 138 65
3307F5r2O3j92L54k62m0p4J12J17P2q2k59M00l89L87j19j6l8J13o9R4q9j84J60
$$ 65 -27 36 -156 198 -64 -104 -178 -66 51 123 41 -218 182 -207 180 61 45 7 120 51 145 56 -128 32
3331C2j49K15j99j81J98k45O11j63n9J75j7j74%l33O40m90J65k20k4L73k32K05
$$ 32 -117 98 -101 -282 -84 -329 282 119 60 235 218 44 44 -289 351 -139 26 -194 -218 155 -77 128
3353A28j98O3j65K80j47Q5l03K91o9r4O4K60j64p3j01j24J98LJ28jL4k74K26o3
$$ 128 -70 -7 -172 108 -39 46 -257 34 -35 -129 -65 195 31 -42 -143 -267 -69 -66 62 61 95 -179 47 -16
3377a6K01r9j45J24k1Q5k13J19J62j42J54l25Q5J81j46j76J97l3j46O4J31j54
$$ -16 185 86 -59 65 44 129 -84 35 197 55 209 -116 -31 150 4 -172 25 -8 -154 -90 41 -113
3399a13K21K6m12K93j85J17N0K79p4l33M00k52R6j34j88J69K5N8k81J20M3J53
$$ -113 108 134 -278 15 -170 -53 -3 276 202 -131 269 17 113 -21 -209 -40 -15 43 -238 -118 -75 78
3421G8o7j05k3J64q0J18l4j1M2j73K12k85L17n3K45m60k5J77L6j19P0L0j47K41
$$ 78 11 -94 -117 47 -33 85 51 40 82 -91 121 -164 153 100 345 -115 -140 37 73 -46 24 54 -93 148
3445A48j77L9j33K48m3q6l5j0J71j05j21J48r5j5J15r9J25j78J46j26J26M5L7
$$ 148 -29 10 -123 125 82 -4 -39 -49 122 17 -104 44 -51 -66 49 -50 75 -103 43 -83 43 88 125
3468A25k77k7R3J5J21j17J35q3j48J87Qj0j5m7M9jK76j28k32J08o5K39k75J05
$$ 125 -152 -179 -86 -71 50 -67 68 -15 -163 24 32 22 7 -40 9 8 284 156 -76 32 -33 206 -69 36
3492C6O8j77R0o0O9j86K21J0J17j59K35l71j05J39J15M1K2k0J42n6k02J63j46
$$ 36 104 -73 17 -43 26 -160 61 71 188 29 264 -107 -212 -73 42 83 105 85 227 171 -31 132 -14
3515a4J40k21Om4N0K1K26k7k11L07m02j74J86K57n47L51r7oJ78R2l03L04O5J5
$$ -14 126 -95 -89 -133 -83 -62 164 137 -74 233 -169 -343 -157 100 -447 -96 -193 -199 -21 71 -232 72 137 152
3539A52j30J24k0M4m3j20N1J26k28n8L8K01j33k17M21m48L87k51L27n31J85J81
$$ 152 22 146 126 170 127 7 58 184 -44 -102 -64 137 4 -213 208 -240 147 -104 223 -308 -123 58
3561E8R8k76J86O3k61r3L29k25M6J52j50n6O0J18j48K03j78kJ74l5j25J71k7j24
$$ 58 156 -120 66 129 -132 -225 104 -121 -75 77 -73 -129 -69 49 -99 104 -74 -76 98 63 -62 109 82 -42
3585d2J68m15L98J82l70o6j54M87k65K7j35J47l2mK29l35K25l7J6J52j03N0k17
$$ -42 126 -289 109 291 -79 -145 -299 188 -77 -50 -185 -38 -70 -74 155 -180 45 8 24 176 73 123 -94
3608i4Rk06N35l00J09J16j81K43k62M1k88K44Q0o1J37j70K39r1k45K63l32L0k1
$$ -94 -85 -291 244 -56 53 169 -12 231 -31 10 -278 -34 46 -15 122 -48 191 100 -145 118 -214 -184 -205
3631b05k0J56K18l16J59m2n0R2K86j10n5j96R1L82m02Q8n6j43J22O3R2l45K78
$$ -205 -225 -69 149 -167 -8 -50 -100 -8 278 168 113 -83 8 390 -12 76 20 -123 -1 62 154 -191 87
3654H7J48k07N4l14J19L1J9J61j03K5J01kk68O6O2m7j02K07l1J18q0k44N3M0L0
$$ 87 235 28 82 -232 -113 -82 -63 98 -5 20 121 119 -149 -83 -21 -68 -170 37 6 124 44 -200 -147 -107 -77
3679g7Q3L12m98M41k93M6K75j46P6j51J5j89L2J12mn8O5k35K07m2J22l15J21n9
$$ -77 6 318 -180 261 -32 14 289 143 219 68 83 -106 -74 38 34 -24 41 -194 13 -29 93 -222 -101 -160
3703a60O7J3N5Q2j30L5K64j04n3l98L96k69K15M0p5k30L48k93J58K69r3k11p4
$$ -160 -93 -80 -25 57 -73 -38 226 122 69 -329 67 -202 13 53 -22 -252 96 -197 -39 230 137 -74 -148
3726a48J03l3K73l75K51Q9k46p3L73l35l5j46J75J55k52J62J3j52L14p9p0q4J90
$$ -148 -45 -78 195 -180 71 160 -86 -159 214 -121 -156 -302 -127 28 -224 -62 -49 -201 113 34 -36 -120 70
3749G0j8o7n5P5J52j73J22l97L29l05K46M9M6k06J52M8j96N8R2J34k53k6J56L
$$ 70 52 -15 -70 5 157 -16 106 -291 38 -267 -21 28 74 -132 20 68 -128 -70 22 156 -97 -123 33 36
3773C6J15k03J56n4j78j29L05j88o3K19M4k0p1M0k04L00M2k04M3L61m96P2O0J18
$$ 36 151 -52 104 50 -128 -257 48 -140 -203 16 60 40 -31 9 -195 105 147 -57 -14 347 -149 -77 -17 101
3797A01L20m55k7J39N0k21J65J00l92M8J91m4J28J14j75Mj35k7J10M6q8J9J84
$$ 101 421 -34 -61 78 128 -93 72 172 -220 -172 19 -25 103 217 42 46 -89 -116 -6 40 -48 -29 155
3820A55r0l70K97J05n6n9j84K35l66L60o1j43M7P3m7q1M10p8j85m4j8O0J39K9
$$ 155 65 -305 -8 97 41 -18 -202 33 -333 27 -34 -177 -130 -57 -104 -185 225 147 -38 -82 -100 -40 99 128
3844A28j5l1j60j40L75j63j03J74K26l11j88j8k4L82Nj27K4k03J38J75j15j26
$$ 128 113 82 -78 -218 157 -6 -109 65 291 -20 -208 -226 -250 132 137 10 34 -169 -31 144 29 -97
3866i7L93k43j8Q4j24P5j61r7L40M9n20N11k66m9M4J88k2n7j58J62p2J35j66l56
$$ -97 296 53 35 119 -5 70 -91 -188 152 201 -319 192 -74 -123 -79 109 87 30 -128 34 -38 97 -69 -425
3890d25O34k37j12M7J42Q0m1j43J86k29qK09J9l13PK24l4m7n7J28j79L3K14J40
$$ -425 209 -28 -140 -93 49 129 88 -55 131 -98 -106 103 122 -191 -184 40 6 -41 -98 30 -149 -116 98 238
3914B38l96J07R8K8P4q5j16J59o1k49L38r3J94j41p8J5J2k9k6k80L52j51K2q1
$$ 238 -158 -51 47 75 149 64 -52 107 46 -203 135 42 236 95 17 32 44 15 -11 -291 61 -90 -68 -149
3938a49L18l46M66m12J04J38m8k08J40j32K04j95J04O6N3k18L53k42J38R7n70
$$ -149 169 -177 289 -123 -19 119 71 -137 3 -129 75 -120 -16 50 103 -115 238 -4 134 231 -339
3959c39J18R5J74J45l7l6m9j25N5m7J53j40J39k45Q6K6J6j61m7J96R8J77k31J4
$$ -339 -221 -126 48 193 156 120 71 -54 1 -46 107 -33 106 -139 -53 -27 -11 -172 -219 -23 75 252 21 35
3983C5J3P4l04N65l81q6k8J03J53k1n92P53m08k0M9O0n1k7K73k33K6j9J03M6k4
$$ 35 48 122 -182 383 2 -84 -112 -9 144 123 -469 284 -124 -144 -95 -35 -86 -113 160 -73 -47 -66 37 83 59
4008E9J51k77J55m0J92j91Q0l48N61m57J26l1j34Q7N5J22j31J4M97p12K91l7j45
$$ 59 210 -67 88 48 240 49 129 -219 342 -115 11 -20 -154 -67 -12 110 -21 -7 490 -222 69 32 -113
4031a13M8j5p7N30j13k0j27j21Q2k96J91k4K18k2j75K44k51L8k9J11j74K04k23
$$ -113 -65 -80 -157 373 260 240 113 -8 74 -222 -31 -55 163 141 -34 210 -41 -3 -32 79 -95 109 -114
4054a14P4P3M5j72J78J77j75j10L06l30N1n3k00K63L2L34n86P6M8R6J96m33J76
$$ -114 -40 33 78 -94 84 261 86 -24 282 -48 3 -50 -250 13 45 379 -207 -131 -83 13 209 -224 -48
4077d8J21k6j54lRk9l1O3J07j38k9K90k50J41o2J43k67J54K23l98K09J60k70J32
$$ -48 73 47 -107 -110 -101 -130 -161 -98 9 -129 -158 132 -118 23 -39 104 -163 -9 214 -184 25 185 -85 47
4101D7k6k38J67KR0J64k84L03l45P1J3P3J90k13L27l11k4p1j3k99N06J1j98L2
$$ 47 21 -217 -50 -48 42 206 -78 225 -120 -49 -36 37 227 14 341 30 6 -65 -78 -377 129 140 -58 -26
4125b6n4J77k39p8L38k0k34J63m7k03L66j32K69l84K79j14N7n5r7j81L30r9j01
$$ -26 -80 97 -142 -220 118 98 -136 27 -20 -223 143 11 280 -104 175 61 118 63 -34 -215 115 16 -85
4148h5J8J3Q2J19k11R3n0k51J04K24M3L00k71l2r2j16K01k19j26L05l0Q6j44j7
$$ -85 -67 -54 28 147 -64 29 -21 -272 -168 56 99 399 128 96 4 -112 89 -130 -256 49 19 105 -39 -56
4172e6J20j39j42K36K30m72L00j74j06J54M1k31m9M54l47N2q2L08J37k37J12J46
$$ -56 64 -75 -217 19 249 -223 77 -97 -203 -49 -8 -239 -288 166 -181 -129 -211 97 234 -3 109 255
4194B55k27J69l14PL69k00m9K8j88K06J72l36k52K74j04J46J88l46O0o7L62j45
$$ 255 28 197 -117 -110 259 59 10 38 -150 56 228 -108 -360 -86 -190 -44 144 -202 -142 -209 153 8
4216HK70l13K38l24K61r9j17K3J24j56K1j56M60l86J38qj31j19L24j51m3K58l17
$$ 8 278 -35 203 -121 140 41 -76 -53 71 -85 -64 -220 240 -146 -8 -16 -147 -266 58 -93 -136 122 -195
4239a95K92j85J28j03J95l20J4N3K89k71rJ24J5K04l35k79K59K06J15m6k55m0
$$ -195 97 -88 40 -63 132 -188 -174 -121 168 -103 -112 12 27 231 -104 -383 -124 82 197 151 -104 -144
4261a44j19L42p8j67M35m62K16n9K3J08o8l48M50o6j62l45K48KJ67O6J9O7k09
$$ -144 -263 79 1 -166 269 -193 23 -36 -13 95 27 -321 129 63 -99 -444 -196 -194 -27 39 58 125 -84
4284h4K34k56j07M43j5l31L2J75Q4k61J98K64n89K13m6R7%l10N1o8M09Lj1j76
$$ -84 150 -106 -213 230 215 -116 -84 91 175 -86 112 376 -213 0 -46 51 51 -259 -208 -276 133 136 125 -51
4308e1j17J40p2J23k15O9k59L86J31q3q1J46l23R8J62o6j34J69j45O2M6K4J73
$$ -51 -168 -28 -100 23 -192 -123 -382 4 135 52 -29 117 -206 -108 54 -12 -146 23 -122 -60 -14 10 183
4331A83j49k51M36K1j79O1l66K85J4j22J75m00K60j17K92k07kK72k43k9J31Q2
$$ 183 34 -217 219 240 61 122 -244 41 55 -67 108 -292 -32 -149 143 -64 -66 206 -37 -66 65 147
4353A47j35J86j47j72J16j58K37L2l27L01j25p0j34N02k79R6K38n49L08P7q2j60
$$ 147 12 198 51 -121 -5 -163 74 106 -221 80 -45 -115 -249 253 -26 70 308 -241 67 144 62 -98
4375i8l5J8k04Q1M4J68j1j48K60o2l21N86J4m49K39j51O2R8j90M1j14J86K11L8
$$ -98 -133 -115 -319 -238 -194 -26 -37 -185 75 13 -308 278 292 -157 82 -69 -7 91 -99 -58 -172 14 225 263
4399B63j64j10J45q6Jk6m2L4oj53L3P0j00J23L7j8o7R6J3Oj58j82J42J37m4J40
$$ 263 99 -11 134 48 49 23 -19 15 9 -144 -111 -41 -141 -18 19 1 -66 30 43 49 -109 -291 -149 -12 -56 84
4425H4k99L63p2l47J34J22L08m57L5M35j66K02j63l56L50q5j59J87r4l5Q8O5j49
$$ 84 -215 148 76 -271 -137 -15 293 -164 -129 306 140 342 179 -177 173 88 -71 116 22 -13 75 140 -9
4448iJ16j23j32k0M22p1P0m64N8L24j72L2N0nj08J88k40J34j29p9K93J92m06P0
$$ -9 107 -16 -148 -168 254 183 253 -211 -153 171 -1 31 81 76 -32 156 -84 50 -79 -158 135 327 -79 -9
4472ij68J54J13M5n6p0k6J22k55K58r1O7k26J90O1J07l21P4j05P7J86m9J23l01
$$ -9 -177 -23 90 135 79 9 -17 105 -150 108 17 84 -142 48 109 216 -105 -31 -136 -59 127 78 201 -100
4496a00J28l25M73k70J92n7k55J80O6j06K08m9m22M06j53M15p2m81L24M5j82N3
$$ -100 28 -297 176 -94 98 41 -214 -34 32 -74 134 85 -337 69 -84 331 259 -222 102 147 -35 18
4518A8k66J14j6k2R6p3K99K09m73J3J71KQ7l49L0J69M9k24J97n6J21J8k4J05j09
$$ 18 -248 -134 -150 -172 -76 -149 150 359 -114 -101 70 72 159 -190 -160 9 58 -166 31 -25 96 114 90 195 86
4543H6k11J88l30p9K65K07n8k09O8J62r8j45O5N6O1n6n4M04l13P5NO1j34Q6O7
$$ 86 -125 63 -267 -346 -81 126 68 -141 -73 89 -9 -154 -89 -33 28 -28 -82 322 9 84 89 150 16 102 169
4568A69k24N2o3r7M14j59m2k13L28j78J43k11j6K14J85m38p8P6N6j50J75M95n62
$$ 169 -55 -3 -66 -163 251 92 50 -163 165 -13 130 -81 -97 117 302 -136 -214 -138 -82 -232 -57 438 -124
4591a24J82m9j30K07l30M08r0k16RJ37o1L7n2P7L24m88K37J7n7p8n6k8j27L35
$$ -124 58 9 -121 86 -244 164 74 -142 -133 4 -57 -20 -72 5 329 -159 78 95 38 -40 -96 -124 -251 84
4615H4j38j52L10k6K07J39l10J29m49J27j6K81l52J76J7l84M33Q8o7Pj55K40k64
$$ 84 -54 -206 104 78 285 424 114 243 -206 -79 -95 186 -166 10 27 -357 76 164 97 104 -51 189 -75
4638g5J52j70O9J31J95m01J42j07j10L03j32j37O8L84l19J29j77j44J04r2L21
$$ -75 77 -93 -24 107 302 -99 43 -64 -174 129 -3 -140 -72 312 -7 122 -55 -199 -95 -187 134
4659A34j65Lj07J3O2j97K16J01Jj4j5k9J60k28J31n05L92M5K24k82mq6Q8OL54
$$ 134 -31 -28 -135 -122 -60 -257 -41 60 61 47 32 3 163 -65 66 -439 -47 -2 222 -60 -64 -150 -62 -56 298
4684B98m79L40k4j82J00l9j04n3L15l73L81j21j35j11j78N22l99K38n5k05K39
$$ 298 -181 159 135 -47 53 14 -90 -143 172 -201 180 59 -76 -187 -365 157 -242 -4 -59 -264 -25
4705b5j68M93j45k40J87l98K88j24J47j05J89j43L00k16j26K9R2J96m10J86j18
$$ -25 -193 300 155 -85 102 -296 -8 -132 15 -90 99 -44 256 40 -86 -57 35 231 -179 7 -111
4726a11j7J62J39q0j94K4J25R9k30J67m8k99L04j00j34K45r3j10N0K26J03m09
$$ -111 -128 34 173 93 -101 -77 48 147 -83 84 36 -263 41 -59 -193 52 -41 -151 -101 125 228 -181
4748a81J29L12k63J12j48L06k94P6pl5j57J19j4j41M46l38L89n68K39J00J41m65
$$ -181 -52 260 -3 109 -39 267 -27 49 42 7 -150 -31 -45 -186 260 -78 311 -257 -18 82 223 -242
4770b42J88J42pj17K14p3p0J20lj88L64n58K09J38k3k87j39N92l39J79l52K37
$$ -242 -54 88 81 -36 178 105 35 155 152 -36 328 -230 -21 117 94 -193 -332 260 -79 100 -252 -15
4792a5KR4p1o1R7J1K0k26J38j25m0R4Q0P9M4m60N49k00p4J55j4K1l30J81N3N7
$$ -15 -13 81 10 -51 46 57 77 -149 -11 -136 -176 -82 -2 77 121 -339 210 10 -64 91 77 98 -232 -51 2 59
4818E9M4N3k13q3p7J00L05K4L1j19k74k7L9K81j25J24k65N3J56n1R8j95J78L0
$$ 59 103 156 -57 -140 -217 -117 188 212 243 124 -150 -177 -138 143 18 142 -123 -70 86 35 133 -62 116 146
4842A46j86K7K31k30rOo7l8K93r8j00rJ2J01j80M8N1J1L2o7n1J19K89l81K5J28
$$ 146 -40 -13 218 -12 -21 -15 -82 -120 173 75 -25 -34 -22 79 -101 -53 -2 9 41 -26 -77 42 331 -50 -25 103
4868A03lJ90l57j86J41L25j27k95K22O2m18R5J88k2J34k45J65J85j79j5Q4J09
$$ 103 100 290 -67 -253 -112 213 86 -209 13 75 -343 -248 -60 -82 52 -193 -28 157 -22 -37 47 156
4890A56Mj74K9n5j79K4J7K06J76p05P23m23NL91k24p4J00K0J45m73L36mk24J31
$$ 156 160 -14 15 -40 -219 -195 -178 28 204 -501 222 -201 -196 195 -29 -103 -3 17 162 -311 25 21 -203 -72
4914g2K11Kj04J54j09p2J62j74l3J05l19L26j74N7j32M02q4R2m59L78j43J07q3
$$ -72 139 141 37 191 82 10 172 -2 -35 70 -249 77 -97 -40 -172 230 146 238 -221 157 14 121 38
4937C8R9O1j66j55J38L71m33K13j13N7j02r8J99l1j75n3J54J79k14J9jJ68J01
$$ 38 137 198 32 -123 15 386 -47 166 53 110 8 -90 109 78 -97 -150 4 183 -31 -12 -13 155 256
4960B56n27K89q7K61K7j09o0N8J82j76L5p0k5j47Q2p1L57n02J55P4J15m8J31j91
$$ 256 -271 18 -69 192 219 110 50 108 290 114 149 79 54 -93 -11 -82 275 -227 -72 2 117 69 200 9
4984IK63R8n39r0J81k02M06k40L5J55j16j79K24J21m18M43l53K15n1j04L33q7
$$ 9 272 370 -169 -259 -78 -280 126 -114 -79 76 -40 -219 5 126 -292 151 -202 13 -38 -142 191 104
5006A04M3Q1l84K05j23Q1L3m2j17K43q1m3J49j68K61p3o0j95J83j10Q5J59j87
$$ 104 147 228 -156 49 -74 7 40 -2 -119 124 43 0 149 -19 242 169 109 -86 97 -13 72 231 44
5029D4pq6j02K03j08P1k01L26j38M4k75r1L57P9j42j10lJ61K13k60J03J20m45
$$ 44 37 -49 -151 52 -56 15 -186 140 2 46 -229 -320 37 116 -26 -136 -139 22 235 -25 78 198 -247
5052b47J08J61j57J31r2K32l00L14l43K10l9k05L0K78M6J27n9j97L6jP1L2j06
$$ -247 -139 22 -135 -4 -96 136 -164 150 -193 17 -22 -227 -197 81 127 254 195 -2 34 33 104 136 30
5075C0J4j42O8J42k5r3j41J75m8j33J16K79l22K5K83j1l51J56l6j2P0l39Q8K5
$$ 30 44 -98 -30 112 87 -6 -147 28 -20 -153 -37 242 -80 -55 228 217 -134 22 -14 -26 44 -295 -207 -182
5099a82J99J3O0k22L28j78p9M7J11L7j30MJ97J34n79J68M7k2J08N1LN9j58J24
$$ -182 17 30 90 -132 196 18 -61 -14 97 134 4 8 205 339 -240 -72 -25 -47 61 112 115 174 16 140
5123A40n3j40K12p7l20K50N9l88L28J72J46n09N0J37m08K57K29N5l50L75k42L34
$$ 140 87 -53 159 82 -238 12 71 -317 11 183 329 -180 -130 7 -401 -144 85 140 -210 165 -77 257
5145B57m15Q9K77k52j38K7L47j31J0n9J65j9J54k63K3J2k4n5j8K71k29N6ql6K05
$$ 257 -158 -69 208 -44 -182 -155 192 61 71 12 177 158 312 49 72 84 60 5 -13 258 29 85 77 41 246
5170B46k35j59J01J38k11K36j60J10k0j70J34m4P5k79L12j15O7l78L48K9j49L29
$$ 246 11 -148 -47 91 -120 116 -44 66 46 -124 10 -34 41 -238 74 -41 26 -352 -4 25 -124 205
5192B05J18k47Q1l01J83m2K12l40J72KL23m56R7l0j02oO9J0l35L04k10K53K68
$$ 205 323 76 157 -144 39 -3 209 -131 41 43 366 -90 7 -23 -125 -131 -62 -52 -387 -83 -293 -40 228
5215B28j42L0j84m0J58N6k31J30j02j21R1R4J7k05P0qp5K04l74M64k51L5L83j18
$$ 228 86 116 -68 -108 50 106 -125 5 -97 -218 -127 -33 -16 -221 -151 -159 -234 -30 -404 60 -191 -156 227 109
5239A09J40l24j36L97k74J37j40J8m9m0L30L3j37J17j93j75N95n05J76j6J37l34
$$ 109 249 -75 -211 186 -88 49 -91 -73 -122 -162 168 201 64 181 -12 -187 408 -97 79 63 200 -134
5261a34j35J92j53O6pj4j3J41J32j20l9K29o8j35n7R9m7K72L8l24q0J56O4j76
$$ -134 -269 -77 -230 -164 -171 -185 -198 -57 75 -45 -84 145 77 -58 -115 -16 -63 209 247 -77 -157 -1 63 -113
5285a13JN8K53l17L94kj24j14k9L04j82k96K36j93J21J41o9J83j47o5nJ81l26
$$ -113 -112 -54 199 -118 276 274 150 36 7 311 129 -167 69 -124 -3 138 69 252 105 40 35 216 -110
5308a10L16l15R8j13J97J29k79K6j62J25J43k96J06J54N9Pm17K11j71Q6R5N1K2
$$ -110 206 -109 -11 -124 73 202 -77 -51 -213 -88 55 -241 -135 19 78 85 -332 -121 -292 -206 -111 -60 -38
5331c8J22l14L70k99L35k32J6N8j91L17j4k21L09j97J29k91L08j51J94j50kK8
$$ -38 84 -230 140 -159 176 -56 -40 18 -173 144 130 -91 218 21 150 -141 167 16 210 60 58 86
5353H6j12nL9j31J45k45J49J14j15l2K42l2J2mk83L30o7j73J10P0j28J65o6j57
$$ 86 -26 -31 8 -123 22 -223 -74 40 -75 -107 135 103 115 111 -172 158 91 -82 28 98 -30 135 69 -88
5377h8r1O4J90q7q1j62M13r8j57J63k94J67j3R1j52J87k30K12n2j03j43K39K00
$$ -88 -179 -115 75 -12 -93 -255 158 60 -97 66 -228 -61 -74 17 -135 52 -178 34 -18 -121 -264 -25 175
5400A75K9m34M37K8k79p2o6N6K62J68k1k48m5%P6o2k32K01P2j57P1K3k5L5j10
$$ 175 204 -230 207 235 -44 -116 -182 -126 136 304 283 35 -10 -10 66 4 -228 -27 45 -112 -41 -18 -43 -8 -118
5425a18p3M25k38j27J60Q7m6J03k3j0k65K40j85j4J71m03K28L12l45J79o2Q8J08
$$ -118 -191 234 -4 -131 29 116 70 173 150 140 -125 115 -70 -84 87 -316 -88 224 -121 58 -4 84 192
5448A92K1l39N65l56l72J87L54j64k19J50m78O54j79k59L22j78J32o4M8j66K7
$$ 192 213 -126 439 83 -289 -102 252 88 -131 19 -459 195 16 -243 79 -99 33 -31 17 -149 -122
5469a22J55p4M1l40M39P1rj58K2J05j6k78J44j8j13K28k77J30j2R2j42J09r8J40
$$ -122 33 -41 0 -340 99 170 161 3 25 130 114 -164 -20 -38 -151 77 -200 -70 -82 10 -132 -23 -121 19
5493A9j68R4L49l03k03J15m4L71l01J01K2k20K03O4j62J25R9n5j91J20J44j39
$$ 19 -149 -55 294 -9 -212 -97 -141 230 -71 30 52 -168 35 99 -63 62 161 106 -85 35 179 40
5515D0N8P2J1k21L38j41l80L09j0j49L82k47o3o5J14N6m2M8j47j05K82%m18L76
$$ 40 98 170 181 -40 298 157 -223 86 76 -73 309 62 -1 -66 48 104 62 110 -37 -142 140 140 -278 98
5539I8nP6o5p7k12J30R9l52L70J50j49M4j28K66j02j60K3j40LJ59j8lj33K30j06
$$ 98 93 169 104 27 -185 -55 44 -308 62 212 63 107 -21 245 143 -17 6 -134 -131 28 10 7 -126 104 -2
5564bK9L2J41l57K16J06K6n33J66J43l2J7m3J16m3J00Mr8JnK19l18M51k70l30
$$ -2 27 59 200 -157 59 165 191 -342 -176 -33 -65 -48 -91 25 -18 82 86 -12 -11 -16 203 -115 336 66 -264
5589b64M2L88j13j7j42R2N8o9K17k56q9L19q9J71M9j73J91j85J0%k43J56j79J67
$$ -264 -222 166 53 36 -106 -14 44 -25 192 -64 -153 166 77 248 297 124 315 130 140 140 -103 53 -126 41
5613D1j62K92l09No1J26P9j75O0K21j13j53L60j24l07L94j27K6o4k9l44M98j07
$$ 41 -121 171 -138 -133 -194 -68 11 -164 -104 117 4 -149 211 87 -220 174 47 73 9 -20 -364 134 27
5636B7p3M01n51J14k4P3J15j9k8r3J6JJ16n8J59p5j49j5j01K97k8m2J6Qj57K81
$$ 27 -46 355 -196 -82 -106 -33 82 63 35 -58 -42 -41 75 17 176 101 -48 -63 -164 133 105 63 79 87 -70 211
5662B11k82J50j28k24L35J18j49p0J08o1k96L57K02m53K89j60P1ML2j69J51k44
$$ 211 -71 79 -49 -273 62 180 31 -39 69 8 -288 69 271 -182 107 -53 18 22 54 -115 36 -208
5684b08K55L4J45k63j23N03k91r5K01j63K57Qk46j94L13l86R1J2N5L22n3k53J81
$$ -208 47 81 226 -37 -160 343 52 -43 158 -5 252 260 14 -180 133 -253 -162 -150 -95 227 174 -79 102
5707A02N8l53K90O3j59k29K67p8J63l55L13J09j16j25q0K20m55N67j87J05j30
$$ 102 160 -193 97 160 1 -228 39 -39 124 -231 82 191 75 -50 -130 90 -365 202 15 120 -10
5728a0k1o2M0l5K17m7j88N7J37j17K13l37J02l12L46K22k42j49M32k87P8l0q7
$$ -10 -31 -93 -53 -88 129 82 -106 -49 88 -29 184 -153 -51 -363 -17 205 -37 -186 246 -41 37 7 -80
5751h0n8J77p9K83j32j34j8J64j21Q1k74K93n2k27J18J5j38J65j18J00K03l30
$$ -80 -138 39 -40 243 111 -23 -41 123 2 83 -191 102 50 -177 -59 -44 -182 -17 -135 -35 168 -162
5773a62N8J46R4Jl9j27K1J25O3j10m6Q5j00J37m08L71j07N1k44J36l15K66J76
$$ -162 -104 42 136 137 98 -29 -8 117 180 70 24 109 9 146 -262 109 2 53 -191 -55 -370 -104 72
5796G2j20L0m56M03J09k88L18P1J90k22l0p6J26l40L66k1l14J12K33q6j98M12
$$ 72 -48 -18 -474 -71 38 -250 68 139 329 107 77 1 127 -213 153 132 -182 -70 163 77 -121 291
5818B91k28Q4k8m6j29M2k49J37K68k09J62k34LJ79k54J90J8k18K88J18l43J61
$$ 291 63 147 119 73 -56 -14 -263 -126 142 -67 95 -139 -136 43 -211 -21 -3 -221 67 185 -158 3
5840CK8j76Kl9m8J95O9m2J74l66L6j3L39k40q1J27M3k3N2J3k07K0j54J71K57l33
$$ 3 31 -145 -143 -182 -230 -35 34 -8 166 -200 -164 -177 162 -78 -159 -32 11 -12 40 53 -154 -134 -288 -117 140 -193
5866a93K14j67J14J54l40J83K7L1J78k76J7j07K88j60J73r4p4o8J58L3R8o5k73
$$ -193 21 -146 -32 122 -218 -35 -8 23 201 -75 -58 -165 123 -37 136 42 -32 -100 58 91 189 124 -149
5889a49O8K6M4j8k53M56l55J03J54Q5k27J85k65J11r2O9J13j00j9Jk6J2K10j59
$$ -149 -81 -55 -11 -29 -282 174 -181 -78 76 161 -66 119 -146 -35 -127 -58 55 -45 -64 -63 -89 -77 133 -26
5913b6k07N45m29m8M9J55j18K08j32lr6L79m11K08l93L50j51K45k81R7O4L6Mm2
$$ -26 -233 312 -117 -165 -116 39 -79 129 -3 -6 -102 277 -134 74 -319 31 -120 125 -156 -59 5 41 45 3
5937CL5k92K75j70Q9J43L11o50K10k47M11q4n8J03m0J41o19L64R2K30k79R5j76
$$ 3 38 -254 21 -149 -60 83 394 -256 -46 -293 118 34 -24 79 39 180 -439 -75 17 247 -32 63 -113
5960a13J7j7J20k35L30j05j00K86k47J80p2J37j80K77j77R5k22N7p0l4j8n0J07
$$ -113 -96 -113 7 -228 102 -3 -103 183 -64 116 44 181 1 278 101 196 -26 31 -39 -73 -91 -141 -34
5983c4j85Q3K56n5k59J42%l7j10J71K05j65k24K49N3j02J2k3Oj56M3K97j25j00
$$ -34 -219 -136 120 65 -194 -52 -52 -89 -199 -28 177 12 -212 37 90 -12 0 -23 -17 -173 -130 167 42 -58
6007e8j50N18k76m5J66j60JQ4j45n7K18N2k4K27m14J97j16O3m7j24J58L04k96
$$ -58 -208 310 34 -11 155 -5 -4 80 -65 -122 96 148 124 351 -63 134 18 81 34 -90 68 372 76
6030G6N0l07J05Q5k02M32k21k9J14j30j66K82j43J02l82L98N9P4m1J2l69J71J97
$$ 76 126 -181 -76 9 -193 239 18 -11 103 -27 -193 89 -54 48 -334 64 123 197 156 168 -201 -30 167
6053A67k75K05K7k31o7Q5K07J36o9k99J22k76L56o5J93k25J97q1q5o7N5Q1l57
$$ 167 -108 97 124 -107 -174 -89 118 254 185 -114 8 -268 88 23 216 -9 188 107 22 -45 10 91 -266
6076b66L99j34O7k21M12k54q5J29J86K3mm06K74o0L87n07q0M1p1K52N0J93j4p93
$$ -266 133 -1 66 -155 257 3 -82 47 233 256 252 -154 120 60 447 -60 -140 -99 -170 82 132 325 311 -482
6100d82N64l8n1j87J23P3j07J48q7p6K59m68K11K25om35K69Q9l24K83J10j7j94
$$ -482 82 44 -7 -194 -71 2 -105 43 -44 -120 139 -329 -118 107 101 -334 -65 24 -300 -17 93 76 -118
6123a18J18L2k13K23J5m3J73k03J47L4l94K19J38j85K44l3k03K1Q7KRj23K9j97
$$ -118 0 32 -181 42 57 14 187 -16 131 165 -229 -10 128 -57 187 154 -49 -28 59 61 70 -53 -24 -221
6147b21R6J56j47J99l4K00k85mJ03m0R5k30M3J77m13L71j23K86j39N2k49R1J61
$$ -221 -125 31 -116 83 49 249 -36 -40 63 23 118 -112 -69 108 -305 66 -57 229 90 142 -107 -16 145
6170A45j64J1J3m3j18J63j95J17R6k59K94j06ok13M26k54N6K51K2k99J92j77M0
$$ 145 -19 -8 5 -38 -156 7 -188 -71 25 -234 60 -46 -52 -265 161 -93 -37 214 236 -63 129 -48 -8
6193hR9o4R8j80J8j68K90k51M03k79N8k22K1Q4L3P0q2K63j98r4J06K08j00j32
$$ -8 91 27 125 -55 -37 -205 85 -166 237 -42 16 -206 -185 -101 -68 2 -80 183 -15 -109 -3 205 105 -27
6217b7J61k40J43K3j68L6J34N8Q8k2j3j64m2q5M9K74j35l24K95j16J03k45L27
$$ -27 134 -106 37 60 -108 -72 62 120 208 186 173 9 -33 -118 -69 205 70 -254 41 -75 28 -217 110
6240A10k78J88k48K22N3O1j18m9Q1K8N4k15O1p8J30J54Ok75K0jJ7j3L03l08J5
$$ 110 -168 20 -228 -6 47 108 -10 -59 22 50 104 -111 -50 -128 2 156 162 -113 -93 -94 -77 -90 213 -95 -80
6265h0J30Mm26K99p2L4Kl5J78j63K74k73R8L76l60J15j87K71j64o0j22K43J27
$$ -80 50 54 -372 -73 -145 -111 -109 -144 34 -129 145 -128 -30 346 -14 101 -86 185 21 -39 -161 82 209
6288B09k34k0k03J40R3J37k09K17o9J32n37L01P7l7QJ47j45K17m64K25j33J71
$$ 209 -25 -45 -248 -108 -15 122 -87 130 61 193 -344 -43 34 -3 5 152 7 224 -240 -15 -148 23
6310B3k89K55%j57J75j06J32J23p2m9M6j89k8L01l45L37k02J51j10K4r1j29K50
$$ 23 -266 -11 -11 -168 7 -99 33 156 84 35 81 -108 -136 165 -180 157 -45 106 -4 20 -71 -200 50
6333E0j74Q6K11k99K24j48L1K83n2r7l5j59M9Q7k42J88j16R1JK4k32J51M04k22
$$ 50 -124 -38 173 -126 98 -50 -19 264 212 115 80 -79 -30 57 -185 3 -113 -22 -21 3 -229 -78 326 104
6357A04L3J35j43m66K11P1k45J51J62J34m0k66K83P2j53O6q1rk6Kjp5J32j12j20
$$ 104 137 272 129 -337 -126 -55 -300 -149 13 147 107 -159 124 196 43 109 28 19 -7 -5 -6 -81 51 -61 -181
6382a81K03r2Q2L61l79N3j50M8n1J24j7R6O7k37J04k12L00k50r3J70q1J84J29
$$ -181 22 -70 12 373 -6 47 -103 -55 -106 18 1 97 164 -73 31 -181 119 -131 -224 -54 -135 49 178
6405A78k92J82J60M7j54l4q7q3o0l1K49q5k00K88P9k13N0l1J34j3k19J92n2Nk96
$$ 178 -114 68 228 275 121 87 0 -83 -143 -174 75 -10 -210 78 157 -56 -6 -37 97 84 -135 57 5 10 -286
6430b86L20j95K54j28K46P5k18j88L5K20j55J12M7k68L01L9k60N3k06K33j6J07
$$ -286 34 -161 93 -35 211 286 68 -120 -85 135 -20 92 139 -129 172 211 -49 4 -202 31 15 122
6452A22kl15L49m43M35J76j05k16j08n3QJ99n8k16M33k00j65R6Q5p8j60L32j25
$$ 122 120 -195 154 -289 146 322 217 1 -107 -160 -152 47 -11 -227 206 6 -159 -63 22 -56 -216 116 -9
6475ik2Q9j13l80N05j77J81J74l51l32N74m15J93J77k00K5m4j84M88j43o6J78
$$ -9 -31 58 -55 -435 70 -107 74 248 -103 -435 139 -276 -83 94 -106 -81 -125 -309 179 36 -30 148
6497A48j06l1j90M40l24K71k46J13k00M4L77oq2k29K4j71M39l38K39l69K77q4
$$ 148 42 11 -179 261 -63 208 -38 75 -125 -81 296 290 208 -21 3 -168 271 -67 172 -197 80 -4
6519dJ36l01J18J70r2j1Ro2k4J64k23K25km7J51r1j79j18P4PJ76J60o6O5k39K55
$$ -4 132 -169 -51 119 27 16 25 -37 -61 103 -120 105 103 56 207 116 -63 -181 -107 -100 76 236 170 235 -4 251
6545B51l92K17l36L80l74K26M68o54J15j7J34j45J04j74L08j25L01m19M9J3j86
$$ 251 -141 76 -260 120 -254 -28 440 -214 -99 -116 18 -127 -23 -197 111 -14 287 -132 -83 -70 -256
6566b56K5L5K01N6k31L70m0J6j52O1m6m0O9R7k51j6L68k65r3J61l0L4j78Q7P2
$$ -256 -231 -196 5 61 -170 200 160 176 24 85 39 -1 68 165 -86 -102 266 1 -92 69 39 73 -105 -18 54
6591E4j09J5K33K0j26j31J40k17Q4o9P6J52m50N13m56M00o2j68J88k92K76o9m8
$$ 54 -55 -40 193 213 87 -44 96 -121 -37 -106 -30 122 -328 185 -271 129 67 -101 87 -205 71 2 -46
6614d6J39j81K09l40K22j42K82k84K43j67J00J9l44L09N7mJ2j31J09k53K49J40
$$ -46 93 -88 121 -219 3 -139 143 -141 102 -65 35 54 -290 19 76 72 84 -47 62 -191 58 198
6636A98j90j55J1K21R5J01n09M86o50M50J68j66J42m81K31ML11o2j21j79L9l2
$$ 198 8 -147 -136 85 180 281 -228 258 -392 58 226 60 202 -279 -48 -44 267 205 84 -95 -56 -88
6658h8Mo1K72j1j94K15j40j46M32l71L3L08k19Q9l63k6N44m49K86l8L84o70J42
$$ -88 -84 -145 127 116 -78 137 -3 -149 283 -88 -55 253 34 123 -240 -266 278 -171 115 77 461 -209 -67
6681f7M9K10k33K46j62L51l16k68R3M32j54j14k67N1K34l39M42k27P5j7p0O4J77
$$ -67 -18 192 -41 205 43 394 78 -190 -97 335 181 67 -200 -149 85 -254 188 -39 36 19 -51 13 190
6704A90j35N3k78%k2K9M19n13L59l43M65k73k04K44j45L52j12j65J21j28j22L09
$$ 190 55 108 -170 -170 -192 -163 256 -257 102 -241 224 -49 -253 -9 -154 198 86 -79 42 -86 -208 101
6726A01k2k78K48N7p8J03j27j15K21l19J45K8m4K13k18L50k10j88JJ65r1J14J47
$$ 101 79 -199 49 106 28 131 4 -111 110 -209 -64 -36 -80 133 -85 265 55 -133 -132 33 -58 56 203
6749B03k94K56j96Lj32K4J42r0j57K56k9O1j33K6O3J1nK9J01l5K2k64m6J51j90
$$ 203 -91 165 -31 -28 -160 -136 6 -84 -241 15 -14 47 -86 -60 3 14 9 38 139 104 126 -138 -184 -33 -223
6774b23N9N81l98jj94K03p1o2K95l41r1L30k79J11O2L41o03J0M15p4k51J49J23
$$ -223 -164 417 19 18 -176 27 -44 -106 189 -152 -243 87 -192 -81 -19 322 -281 -271 144 70 -181 -32 91
6797I1m69K40K20k26M25j06l37O2J1J63ok92J87o2L22j86j14M35k58j10J68n67
$$ 91 -378 -138 82 -144 281 175 -162 -100 -89 74 68 -224 -37 -99 223 37 -77 358 100 -10 158 -409
6819d09L57M02j58k63Q2k08k6J86j0j33L84m51K71k56L27j07o6k5R3n5R1K07k90
$$ -409 -52 350 192 -71 11 -197 -223 -37 -47 -180 204 -247 24 -232 95 -12 -78 -103 -10 -65 26 233 -57
6842e7M8J29k65N40n03kNq9J71R4l7j28L88k62l5R3j92J22k13K23R1J2j74J98
$$ -57 -9 120 -145 395 -108 -110 -105 -194 -23 71 34 -94 294 32 -3 90 -102 20 -193 30 121 133 -41 157
6866A57m61M73k40J3R4Q3k4N0l19J59K20j62K28k47K34o19J76O5M02m11m9L21
$$ 157 -304 169 -71 -58 36 119 95 145 -174 -15 205 43 271 24 258 -361 -185 -120 282 -129 -178 143
6888A43K0r3j41J29k58J14J49M3p5J04k29K57k30o9K58k42Q1N3M1j48J17l9k5
$$ 143 163 70 -71 58 -200 -86 63 106 31 135 -94 163 -67 -136 122 -120 -39 14 55 -93 24 -15 -40
6911d0Q3J87J7l14K50k26%J12l03J55J59j53n2K72J91l03K17j64l09J35J6Q1l47
$$ -40 43 230 247 -67 183 -43 -43 69 -234 -79 80 -73 -125 147 338 35 252 88 -221 -86 -70 11 -336
6934c36J76Q4p6J52K6J32P0o13L58J0R1J68l26J05j57J70r9J90o8o4L6j02N5J2
$$ -336 -160 -76 -152 0 26 158 228 -385 -27 -17 74 242 -84 21 -136 34 -65 125 57 -7 29 -73 -18 -6
6958fj7R7j15nJ12k13O7K45J24k88r7J11j79K49k22J33O4R4j81j41M92k82j4q3
$$ -6 -23 74 -41 -46 66 -147 -80 165 289 1 -96 15 -164 85 -137 -4 60 154 -27 -168 324 42 28 -55
6982e5q2K88j94j46K90j53Q2J38j05J76k16j05J07k08K67J98m43K28J83l20j30
$$ -55 -137 151 -43 -189 101 -52 30 168 63 239 23 -82 25 -183 84 282 -161 67 250 -70 -200
7003b00L80j70q0r9l5L84j15Qj70j32N7J25J05j67Q3j03J65p4R9k28M16j82j79
$$ -200 180 10 -70 -169 -204 180 65 73 -97 -229 -172 -47 58 -109 -26 -129 36 -38 61 -167 249 67 -112
7026a12K26O5k68j24L62j8l25M32m05L70l7p7k76RM52m35M0M33m22J27j20P1L7
$$ -112 114 179 -89 -213 149 131 -194 238 -167 203 166 89 -187 -178 274 -161 -121 312 -110 17 -103 -32 5
7049Ej04J78Q3m94K90l1n4LK66Q4m43K96K65j35k26j79L52M0j58K5L2j4j16j83
$$ 5 -99 79 162 -332 -42 -73 -127 -124 142 226 -217 79 344 209 -17 -196 156 196 38 63 95 81 -35 -218
7073b18L6K38j02K16o9o3j18j56J80j99J02K48j77J8M73n36q1K42j74K39k22M4
$$ -218 -182 56 -46 170 101 38 -80 -236 -56 -255 -153 95 -82 -64 409 -127 -208 34 -140 99 -123 -79
7095g9J16k77mK89J26k68R5P2K9j54j68L21%q2O9J23r8l01J80k26M20k77R9J46
$$ -79 37 -240 -244 45 171 -97 -2 70 99 -55 -223 98 98 16 85 208 110 -191 -11 -237 183 -94 5 151
7119A51j82qQ9M9k79K20j00M94k82j00Q9k07K03k57L3N6j13K65j12k30Q2J94j56
$$ 151 -31 -39 50 99 -180 40 -60 434 152 52 141 -66 137 -120 -87 -31 -144 121 9 -221 -139 55 -101
7142a01J09l37N66j72Q6j17m6j46l2M73j60j1j36M9N0pj94K55k2j30N2k62j28
$$ -101 8 -329 237 65 151 34 -12 -158 -190 283 123 112 -24 25 75 68 -126 129 107 -23 29 -233 -361
7165c61M67J5j18Pj2k67J37J28J84o0m08N83k91k9J73j91k9M0K8L11j15m17M60
$$ -361 106 121 3 10 -2 -269 -132 -4 180 120 -288 295 4 -25 148 -43 -72 -32 -4 307 192 -225 235
7188B35o0q9J60k28J30j62K10j30k33J47J41j39L3j72K61j51j58J54J47k30J97
$$ 235 175 86 246 18 148 -14 196 66 -167 -20 121 -18 15 -157 104 -47 -205 -51 96 -134 63
7209F3j06J4j62l9J53M0j06N3J82N9p3l2j73J85J48k30R8j08n8M4l79M33Q0l57
$$ 63 -43 -29 -191 -230 -77 -37 -143 -90 92 151 78 46 -127 58 206 -24 74 -34 -92 -48 -427 6 86 -271
7233b71J33O3k6K76k16J1j65J36J47n2K64k43k4l2k7q2j5K15Qk63J47K00l08n1
$$ -271 -138 -75 -101 175 -41 -30 -195 -59 88 36 300 57 33 1 -26 -108 -123 92 100 -163 -16 184 -124 -175
7257a75K73k25L48j65q0p2J15J12j68J30j1lj02l09M81mO9j47k01J89J60k44J63
$$ -175 98 -127 221 56 -24 -96 19 131 -37 93 82 79 -23 -332 149 145 214 67 -134 55 215 -29 134
7280A34J0j42K50k29j32L67l39K70j21j63J5N9J42k23K40j9M7j93r0L87j19r4
$$ 134 144 2 252 23 -109 258 -81 189 68 -95 -80 -21 121 -102 138 119 166 -27 -117 270 151 57
7302E7j69J62j77L2j20K58q9J4rjJ96k57J24J27j00q4j88K10J15j99j4L8j49N06
$$ 57 -112 50 -127 -95 -215 43 -46 -32 -41 -42 154 -103 21 148 48 -36 -224 -14 101 -98 -112 -74 -223 283
7326B83l82K88l78J64k6K23j95L0l3k7P1j87P4Q7J70n9r3r4J23J8l6r8K19O0p4
$$ 283 -99 189 -189 -25 -51 172 -23 7 -26 -53 18 -169 -95 -8 162 103 10 -84 39 57 21 -77 142 202 128
7351A28j00K80n11L07j11k29L03k09j99L82j99K87k39J75Ml6O7j67M7j05M9K32
$$ 128 28 308 -203 104 -7 -236 67 -142 -341 41 -158 129 -110 65 69 33 100 -67 -20 -125 -76 156
7373A56m28K62r9j19N54n83J67J41o9J05P8j52j52K32K11m65n3K28J0J81l74J32
$$ 156 -272 -10 -109 -228 326 -257 -90 51 -18 87 165 13 -139 93 304 -161 -214 14 24 205 -169 -37
7395c7J24o4J47m22K73N5Lj09k0k8J31M2Knl3k68j04M33k08J20k37L79J3m16K37
$$ -37 87 23 170 -252 21 76 79 -30 -50 -78 53 95 97 92 59 -209 -313 120 -88 32 -205 174 187 -229 8
7420Hj17J26K13l62L29l49l2J58k49L64r6j8P4K05k38J47n70N87j64j69J13L23
$$ 8 -109 17 230 -132 197 -152 -184 -26 -275 89 -7 -25 49 254 16 163 -407 180 16 -153 -40 283
7442B83n15K08l0K49q5j33rJ03K99j18l51L24r7O5k12K4J0J34m5l1R5k05J47k48
$$ 283 -232 -24 -54 195 110 -23 -32 71 370 252 -99 225 128 193 -19 5 15 149 104 73 168 -37 110 -138
7466a38K31J38l5k99M38m27O1L9j01J52k43K37l07J47K71j39J00J0p8mp5Q7j02
$$ -138 93 231 196 -103 335 -92 -31 8 -93 59 -184 53 -254 -107 164 25 125 135 57 53 -22 65 -37
7489c7j3P2j3jK68l13J45q9J12j18j30J8K78Q5k65K94m35q2L16rk87K01kN2o2
$$ -37 -50 22 9 8 276 -37 108 19 131 13 -117 -99 179 264 -1 293 -142 -224 92 83 -204 -3 -5 47 -15
7514a5J30j83P7m0r6J92j70M17m65L17j51j66K2K74j2k02k6J7O4j95L19K52l59
$$ -15 115 -68 9 -31 -127 65 -105 312 -153 164 13 -153 -131 143 131 -71 -97 -80 -16 -211 108 360 1
7537An3J64K26l14p1J1R3l00jM17m32M35j58j4R6Pj35j16k2K21l04N31j94n1n95
$$ 1 -52 112 338 24 -47 -36 57 -243 -244 173 -259 176 18 4 100 107 -28 -144 -166 55 -249 282 88 37 -558
7562e58M97j65K26n6J17J17l70K83k47M0P1j79P3J82o9J26JJ62qk66k15L05J09
$$ -558 -61 -226 0 -56 61 178 -192 91 -156 -116 -45 -224 -151 31 -38 88 89 251 243 -23 -238 67 176
7585A76l39J13K33j65r1j2P3k44L01r8j17J75j60Q8J54j64J1J13o2J47N8P0m9
$$ 176 -163 -50 183 18 -73 -85 -12 -256 45 -53 -170 5 -155 -67 87 -77 -66 47 -15 132 190 260 211
7608B11j32j45k9J2J00oJ19K7n8m28M75k20K71q0rk20K15j28J98Kj95N1o9K42
$$ 211 79 -66 -95 -83 17 11 130 157 99 -329 146 -74 197 117 108 -112 103 -25 173 175 -20 31 -38 204
7632B04m08J25K13k93k8J12k75K22L11r8O8j52K03j96r8J14j35J72m1J00j29o0
$$ 204 -204 -79 134 -159 -187 -75 -350 -128 183 85 153 1 204 8 -90 24 -111 61 20 120 -9 -69
7654f9j83L36l61L44p1j02n9J20j81J77l9kj3J74l16N87k20J25l55R1k49L22J18
$$ -69 -252 84 -277 67 -4 -106 -165 -45 -226 -49 -88 -90 -103 71 -245 342 122 247 -108 -17 -266 56 174
7677A74l2p8pk16O5P9l50J79K02KL7j70l6J56k89N41j46Oj66n4j04J43k6K61k07
$$ 174 142 64 57 -159 -94 -15 -365 -186 16 18 55 -115 -151 5 -284 257 111 117 -49 -103 -207 -64 -90 171 -36
7702c6N0j69J93N3m0l8m8J3r5K15J8j83m3K17J72m79J61n1K44k71Q3j48L56J06
$$ -36 14 -155 38 91 51 13 -35 -22 -117 98 116 -67 -110 107 279 -200 -39 -90 154 -117 -34 -182 174 280
7726B80j52l0J22j02r7k04L22l10R9j5j98J86L55n38J3L43p1l51M0K14K82m5j62
$$ 280 128 98 220 118 21 -183 139 -171 -72 -87 -285 -99 256 -282 -269 74 3 -348 -308 -94 188 143 -19
7749a9KM2Q4k37L70j80m2J13j50Q8Ll2K55m55K86j51J7J48j97O4j87L01j50j95
$$ -19 -17 25 109 -128 242 62 20 133 -17 71 74 42 297 -158 128 -23 -6 142 -55 9 -178 123 -27 -222
7773b22QL23R3m44K60j90K92J2L2l00N7K31j98O2J79J0j83j72O2J88p6N5l8J90
$$ -222 -214 109 202 -242 18 -172 120 132 164 -136 -79 152 -46 16 195 205 22 -150 -88 100 24 79 41 231
7797B31k91J46J55j59p8o1J34j15k4J43J1P9j98O0K25j03L0j71L5j0M3m8l85L19
$$ 231 -60 86 241 82 4 -57 77 -38 -62 81 92 171 -27 33 258 155 185 14 49 39 82 34 -351 -32
7821c2l15J90k68J63L06rn5n3j11O6K31k84K69j73K4P1k6N8m04L39Q4k00J45K13
$$ -32 -347 -157 -425 -262 44 35 -20 -73 -184 -118 113 -171 98 -75 -51 20 -6 52 -352 -13 71 -129 16 229
7845B29m74K35K02k93J95p6K1M1k69K8J08J62J1k72L3M0M35p00L83m4j11l9K83
$$ 229 -245 -10 192 -101 94 18 39 80 -189 -161 -53 109 120 -152 -119 -79 356 -344 39 -5 -116 -155 128
7868A28l00j0P3K66l50L04n17K64L27k39L08j52l6M9j86P9Q3p0o0k4K8j47J4J35
$$ 128 -172 -182 -109 157 -193 111 -406 -142 185 -54 254 102 66 115 -71 8 91 21 -39 -63 -35 -182 -168 -33
7892c3K64j57k41n6M56k8j49J19j85L7K1m3k8j00K36l71J57J44J66l87K68J79
$$ -33 231 74 -167 -223 233 205 56 175 -10 27 48 5 -23 -123 113 -258 -101 43 209 -178 90 269
7914B69j98rj36M2k2k1j80L05p3L7p7J7J8R0N0J8m43L90j56K16j65k83N38j41
$$ 269 71 62 -74 -32 -54 -75 -255 50 -23 14 -63 -46 -28 62 112 130 -313 77 -79 137 -28 -311 227 86
7938H6k98K84k01k02J41J21j0k15L49j30K10k62j58K67O6MM0k84J63j82J88k7
$$ 86 -212 72 -129 -331 -190 -69 -79 -294 55 -75 135 -127 -285 -18 48 52 92 -192 -29 -211 -23 -50
7960e0J35o0O0J62k62j07K11j41K00j60M8J5L5mk6nJ34k42K01j07j39J44k50J22
$$ -50 85 25 85 247 -15 -122 89 -52 148 -12 36 51 86 82 56 51 185 -57 144 37 -102 42 -208 -86
7984h6J29L3J42j61j99L71k26J95l15J57M8j40N7j54J92k32J36j31R4l4K19j65
$$ -86 43 76 218 57 -142 229 3 198 -117 40 88 -52 5 -149 43 -189 -53 -184 -90 -124 95 -70
8006g0L9J24l65K64Q5j01j57K54j00J87l11N23j93J69l99k08K62k09K89Oo5N9
$$ -70 -31 93 -272 -8 77 -24 -181 73 -27 160 -151 372 179 348 -51 -259 3 -206 83 89 24 83
8028H3j69O7R3k53M54k91K2K34J18l2m85J21J1j03Q9P5k00L67j65j94K58r6q4
$$ 83 -86 -19 74 -179 275 -16 6 240 358 326 -159 -38 -27 -130 -41 34 -166 201 36 -158 100 4 -80
8051h0j42J18L43k2l69K23J10j78k1k7j82L09k80J87n5O7k3R7J09p4j75K42k5
$$ -80 -222 -104 239 217 -152 71 181 3 -18 -45 -227 82 -198 -11 -66 1 -22 75 184 110 -65 177 152
8074A52j47k8o8J23J10K16j61J34k26K8p5n3J0m3l7K90kl29K23k91Q2K51l64K07
$$ 152 5 -23 -91 32 142 358 197 331 105 133 58 5 15 -28 -65 225 223 -106 117 -174 -92 159 -205 2
8098BL53l83J30k53Q8p9K80j59R6o6k41M79j97r7j5L53k29k14J87Lj15r8K59P0
$$ 2 355 -28 102 -151 -63 -142 138 -21 75 9 -232 247 50 -47 -62 291 62 -152 35 38 -77 -175 84 154
8122A54j40n1R7N8l14K52J2k65M38l19N9J16p9J5kq7K44k3j1P9l92K91r9M6qo0
$$ 154 14 -37 60 118 -196 56 68 -197 241 -78 -19 97 18 33 31 -56 188 165 154 233 -159 132 33 79 71 11
8148A1r2j92J2K9O87l76N8j11Oj14J29j4O6k24K04J12m65L64mn4j06j10p5J67
$$ 11 -81 -273 -261 -232 455 79 137 26 32 -82 47 33 99 -125 79 191 -274 90 86 32 -74 -184 -259 -92
8172i2K20k21M0k61K61K33j09J17l06j38K79l99L17m4K01j17l6J49l46
$$ -92 128 -93 -53 -314 -53 180 71 188 -118 -256 23 -376 -59 -103 98 -19 -55 94 -252
8191b52
$$ Imaginary data points
##PAGE= N=2
##DATA TABLE= (X++(I..I)), XYDATA
0@%%%%%%%%%qJ6j6K3l1M0m8N6p2Q8j04J25j49J76k09K49k95L43l97M58n25O00
$$ 0 0 0 0 0 0 0 0 0 0 -8 8 -8 15 -16 24 -24 32 -40 48 -56 69 -80 96 -113 136 -159 184 -213 245 -280 320
31C20o86P81q85J003j130J270j426J595j782J985k207K451k715L003l320L667
$$ 320 -366 415 -470 533 -597 673 -753 842 -940 1045 -1162 1289 -1426 1577 -1743 1924
47A924m045M458m913N413n963O572p247Q005q858R820j0923J2199j3693J5474
$$ 1924 -2121 2337 -2576 2837 -3126 3446 -3801 4204 -4654 5166 -5757 6442 -7251 8223
61H223j7641K0346k3830K8509l5177M5521o3917J06679l98212k16560N31974K69563
$$ 8223 -9418 10928 -12902 15607 -19570 25951 -37966 68713 -329499 -546059 -14085 255478
73B55478K53661k883j41529l01096k47376k01360m491J25260K06896J79273J62049
$$ 255478 509139 506256 364727 63631 -183745 -385105 -389596 -264336 -57440 121833 283882
84B83882K2528r4334j55520j40392j27374j8667P5252J12766R8312R2924K3838
$$ 283882 306410 212076 56556 -83836 -211210 -229877 -154625 -41859 56453 149377 173215
95A73215m5365q6377r2509p9335p551M6590O3390O4930N6296M668l2390m1249
$$ 173215 127850 41473 -51036 -130371 -137922 -91332 -27942 36988 93284 97952 65562 24313
107B4313m7321m3306k699K3112K5793L4757L6747P276j7150k4557l0098k3925
$$ 24313 -23008 -66314 -69013 -45901 -20108 14649 51396 58672 41522 16965 -13133 -37058
119c7058k652O764J2650K7435K4127J07q977j0091j9338j6213n95P281R376J3692
$$ -37058 -39710 -32946 -20296 7139 31266 31373 22396 12305 -7033 -23246 -23841 -16560 -7184 6508
133F508R774K090m26o819j4696q841K70K065N740R039M174j124j182l527n078
$$ 6508 16282 18372 17946 11127 -3569 -12410 -12140 -10075 -4335 4704 8878 7754 6572 3045 -2033
148b033l602k820j283L612O218L597K499l10m891m146N3N1J48J619O75J782L825
$$ -2033 -5635 -8455 -9738 -6126 92 3689 6188 5878 987 -3159 -3106 -3055 -2907 -1288 -613 1169 4994
165D994L52l572k143k291j670K043K999k57j7Q58j102j074K177j195k896N76J041
$$ 4994 5346 1774 -369 -2660 -4330 -2287 712 455 438 1296 194 -880 1297 102 -2794 -2218 -1177
182a177J18K236J822k666j268J645o05j592J514j5j776K191J498j769m26Q89j921
$$ -1177 -1059 1177 2999 333 -935 710 105 -1487 27 12 -1764 427 1925 156 -270 619 -1302
199a302p20K638J42j596J611q9j773J676J416j892n31J197o26k98J448k30j421
$$ -1302 -2022 616 758 -838 773 684 -1089 587 2003 111 -420 777 151 -147 1301 1071 -350
216c50J375N27j792K47M04j058N4J657p94j088J149j40j549J171O97q78k20N99
$$ -350 1025 1552 -240 7 411 -647 -593 1064 270 -818 331 191 -1358 -187 510 -368 -588 11
234A1r91O19J509j025r23R92R6q56P41K0p03N98O55q06o43J135k29n88N54l1m59
$$ 11 -980 -361 1148 123 -800 192 288 -568 173 193 -510 88 743 -63 -706 429 200 -388 166 135 -324
255c24K23L17o51L00N55o89m96O18K17n62N76p7p52L93J51K7J12J89k57j49K73
$$ -324 -101 216 -435 -135 420 -269 -765 -147 70 -492 84 7 -745 -352 -201 -174 -62 127 -130 -279 -6
276fJ3m02M91K72l69R6M7k08j53L19j65K61j29K8j71J24K40n5j47J40l90j2K46
$$ -6 7 -395 96 368 -1 95 142 -66 -219 100 -65 196 67 95 -76 48 288 233 86 226 -164 -176 70
299G0p2M9N1J08k34R5j2O1m6k8j52J10Q9j84Q5j60J69k48q8K92J95k53J90p5k62
$$ 70 -2 47 98 206 -28 67 55 116 70 42 -110 0 89 -95 -10 -170 -1 -249 -337 -45 150 -103 87 12 -250
324b50L99rm1N0L08m33R9j06kN0J09O2j30j43j20o0K43N4k47J22k61O0L8J47L3
$$ -250 149 140 99 149 457 24 123 17 15 65 174 236 106 -37 -157 -217 26 80 -167 -45 -306 -246 -208 -61 -28
349b8j76N9l5K86q9o8L41j56j06j98J54Q5q2J80M46o76j27K26k26m6K03O1N8K76
$$ -28 -204 -145 -180 106 17 -51 290 134 28 -170 -16 69 -13 167 613 -63 -190 36 -190 -236 -33 28 86 362
373C62k43j89p5M57l04L9M3L8J30j12L4j09L36k91j58R0J35k08k17K66k29L77
$$ 362 119 -70 -145 312 8 47 90 128 258 146 180 71 407 116 -42 48 183 -25 -242 24 -205 172
395A72j82k28L29r7L68l22P6%p0J41J11J0k10L8k78n3J45K06j33l2J71k81J33
$$ 172 -10 -238 91 -6 362 40 116 116 46 187 298 308 98 136 -142 -195 -50 156 23 -9 162 -119 14
418A4k66O9M17J30m14J19k14j1k27M42J97m61j0K68j45k54K51%J7K83L6m32J99
$$ 14 -252 -183 234 364 -50 69 -145 -156 -383 59 256 -205 -215 53 -92 -346 -95 -95 -78 205 241 -191 8
441HN8n0l82J92K99o29K78L59m44K51O2j63k37O74l48J11r6j08j7L53Lm93J67
$$ 8 66 16 -366 -174 125 -504 -226 133 -311 -60 2 -161 -398 276 -72 39 -57 -165 -182 171 174 -319 -152
464a52K98k46j13P15q67K85L1K71m36L11J86l55K02M2m11J80M51m59m12O20M2
$$ -152 146 -100 -213 502 -365 -80 -49 222 -214 97 283 -72 130 172 -239 -59 392 -67 -479 141 183
485A83l97M12J57k43k22N66r26M63M02l60l96N22j6k41J66k00j23M47p5l22L94
$$ 183 -214 198 355 112 -110 456 -470 -7 395 35 -361 161 145 -96 70 -130 -253 194 119 -203 191
506A91N0l20j03J99J3m49O85k42j82N30N6p30L87J65j27j70j7j53k44L29L20l76
$$ 191 241 -79 -182 17 30 -419 266 24 -158 372 428 -302 85 250 123 -47 -64 -217 -461 -132 188 -188
528a88J66R0k20M40nl60J58K4j05j74M40j53o07L77M33m27L23j70m51M29J11L1
$$ -188 -22 68 -152 288 283 -77 81 105 0 -174 266 113 -494 -117 316 -111 212 42 -409 20 131 162
550A62k63J86k08L2K86N1l97J74P3k06M03J99n51J6L2p9qK80J66m34J68K6j53
$$ 162 -101 85 -123 -91 195 246 -151 23 96 -110 293 492 -59 -43 -11 -90 -98 182 348 -86 82 108 -45
573d5M67k37l19m63Q39j32k55J84N9m19L31L58l59j28K98k77k34N72k32k6l7K78
$$ -45 422 185 -134 -597 242 110 -145 39 98 -321 10 368 9 -119 179 -98 -332 240 8 -18 -55 223
595B23j82O3J80n86J81L65l93L01J5l31k0R4J74l02K80K01k86j97N35n8k75K94
$$ 223 41 104 284 -302 -121 244 -149 152 167 -164 -184 -90 84 -218 62 263 -23 -220 315 257 -18 276
617B76l88q2J30K19n24M42L09m91K48J69j45n40J40L74l87N42j44l45K14M12n87
$$ 276 -112 -194 -64 155 -369 73 382 -109 139 308 163 -377 -237 137 -250 292 148 -197 17 429 -158
638a58n0N2J48k7K72r7j78J25R0j10p8J5O9j96M5J01q6q1K45k98J99L95l67Q6
$$ -158 -208 -156 -8 -35 237 140 -38 87 177 67 -11 4 73 -123 -78 23 -63 -144 101 -197 2 397 30 116
662A16k02j38j42O53L0k48R9J08m8l30K42j64J39l20K03j27M51k95k87L70J5N
$$ 116 -86 -224 -366 287 317 69 168 276 228 -102 140 -24 115 -205 -2 -129 322 27 -260 110 125 130
684A30n2j43j51K62p3o2J23J82j28j67J72J21m6j16QP5qJ11l40O5K21k20l9J7
$$ 130 78 -65 -216 46 -27 -89 34 216 88 -79 93 214 168 52 60 135 127 238 -102 -37 184 -36 -75 -58
708e8P6L2l1K2j30J29j5j65J34K03m01L05j86R5k49K86j89L08k3k59R5K9p1M7
$$ -58 18 50 19 41 -89 40 25 -140 -6 197 -204 101 -85 10 -239 47 -142 166 143 -116 -21 8 -63 -16
732a6j23K0%k95M69j23k75J09L23j36Q9K12k53j4L70k73N4k38L74k18N9j01j86
$$ -16 -139 -119 -119 -414 55 -68 -343 -234 89 -47 42 254 1 -13 357 84 138 -100 274 56 115 14 -172
755a72J92M9k04N7K70j21j15J20l7j00n2K67k66rJ37K07m02P8K40q9j09R5q9r0
$$ -172 20 69 -135 -78 192 71 -44 76 39 -61 -113 154 -112 -121 16 223 -179 -101 139 50 -59 36 -53 -143
779a43k10M07m74M03J06l35L65k24j24L33J15j34j92K19j62K50%K8k99M6L58n30
$$ -143 -353 54 -420 -17 89 -246 119 -105 -229 104 219 85 -107 112 -50 200 200 228 -71 -25 333 -197
801a97RJ86k0J00m1mK8J40j43r0O4j51L95k98K9k28N37l56Q8m8K16L0k60j30J48
$$ -197 -188 -2 -22 78 37 33 61 201 58 -32 32 -119 276 -22 7 -221 316 -40 48 0 216 246 -14 -144 4
826DLN7N5r9j44J05K59j80r1o9K95m00M06o7Qk04n5P7J28j14l01K05j31K67J95
$$ 4 7 64 119 20 -124 -19 240 60 -31 -100 195 -205 201 134 142 -62 -117 -40 88 -26 -327 -122 -253 14 209
851B09r7j02k39L18j62J95l28K49j80J68j29l5Q3J38k05O2L90r5p2r4M8l17K24
$$ 209 112 10 -229 89 -73 122 -206 43 -137 31 -98 -133 -50 88 -117 -55 335 240 168 74 122 -195 29
874B9j9K26k55K14l77K33j18J51Nk5l8J42l64J59j30K99j07k26K50j05j8O6q8
$$ 29 10 236 -19 195 -182 51 -67 84 89 64 26 168 -196 -37 -167 132 25 -201 49 -56 -74 -8 -96
897i6j14J7j1L64k4j35K26k25j54R5J16k21l7N82o39M61l07J47Qo2p2J78p0L0
$$ -96 -210 -193 -204 160 136 1 227 2 -152 -57 59 -162 -199 383 -256 205 -102 45 53 -9 -81 97 27 57
921E7l47K6L22P1j00R3m4j08j70L04L14o04J36K30l75L30J53j60j99j8K78p8l73
$$ 57 -290 -264 58 129 29 122 78 -30 -200 104 418 -186 -50 180 -195 135 288 128 -71 -89 189 111 -262
944b62M61j6j41q2K56J8k85L46n19R3J01O9k5Kk74J49j0k5J21K0L8k89L98k87
$$ -262 199 183 42 -40 216 234 -51 295 -224 -131 -30 39 14 16 -258 -109 -119 -144 -23 -3 35 -254 144 -143
968a43J29J16n7N1lp6J09j45L01m47K25r4K4K17J01k04j44M8P5j02N4j03K00m6
$$ -143 -14 102 45 96 93 17 126 -19 282 -165 60 -34 -10 207 308 104 -40 8 83 -19 35 -68 132 86
992H6Ok77J19j37J05P8J40p4J56j40j59J3j06J41k26K71P2k30K10O3j61n8K1L41
$$ 86 92 -185 -66 -203 -98 -20 120 46 202 62 -97 -84 -190 -49 -275 -4 68 -162 48 111 -50 -108 -87 254
1016B54k37J26l15M73m74L15l1l26J23P5O4J49r7l32L97p0q1K2r5J97m73L03k42
$$ 254 17 143 -172 301 -173 142 111 -215 -92 -17 47 196 99 -233 164 94 13 35 -60 137 -336 -33 -275
1039b75M85K3j00j55P5O7k10rJ8q7J39J85n99M19p6MJ90J28k66o3N9r3J33K45
$$ -275 210 233 133 -22 53 120 -90 -99 -81 -168 -29 156 -443 -24 -100 -96 94 222 -44 -107 -48 -141 -8 237
1063B37l76J06M6n0n7J3k10L82j73K39r7N2o6j17J16k90L88m74L60J48j46R9j87
$$ 237 -139 -33 13 -37 -94 -81 -291 91 -82 157 60 112 46 -71 45 -245 143 -331 29 177 31 130 -57
1086e7L32j65j34Q8k02K67M5j12j94K91m32J08J60o7J55j22J10j1J43j91r9N8
$$ -57 275 110 -24 64 -138 129 174 62 -132 159 -273 -165 -5 -72 83 -39 71 60 203 12 -87 -29
1108b9oJ51j73L1M6l93K25q4K82k93K09n8K35j02J5k01J59q6l3J31J93l94O4L51
$$ -29 -35 116 -57 -26 20 -373 -148 -232 50 -243 -34 -92 143 41 56 -145 14 -72 -105 26 219 -175 -111 240
1132B40j19j48J16k00N6K38n47L69Q0r0j9j77K06l23M03j30J50m9J42k75L00L
$$ 240 121 -27 89 -111 -55 183 -364 5 85 -5 -24 -201 5 -318 85 -45 105 56 198 -77 223 226
1154B26k83K83j37k7Pj82J78k09J67j11K3j27L57k57J63j52p8K57k58k8K46j46
$$ 226 -57 226 89 62 69 -113 65 -144 23 -88 -65 -192 165 -92 71 -81 -159 98 -160 -188 58 -88
1176h8P4MJ5j29J54J68k05J60k29L71m70K39K25k61j13M47l10J75l21Q3j72J41
$$ -88 -14 -10 5 -124 30 198 -7 153 -76 295 -175 64 289 28 -85 362 52 227 -94 -11 -183 -42
1198d2K01k20R3q1p4J27j73K06o5n0Jj77M60k83J82r1m3L38k06K3k16L66j83M
$$ -42 159 -61 32 -49 -123 4 -169 37 -28 -78 -77 -254 206 -77 105 14 -29 309 103 126 -90 276 93 97
1222I7k16j9K88N0k57j25J3j71L46j12K93m92M48r0o6J11p5p1k24M55k09j59M79
$$ 97 -119 -138 150 200 -57 -182 -169 -340 6 -106 187 -305 143 53 -13 98 23 -48 -272 183 -26 -185 294
1245B94k88J44j74l6L1j85L80K4m64J79J77P1k19L57m27L4K14%j22l01J79K52
$$ 294 6 150 -24 -60 -29 -214 166 190 -274 -95 82 153 -66 291 -136 -102 112 112 -10 -311 -132 120
1267A20o6j67k3J16N8j26NJ63J31k91LJ33K2J76l58M1k50K92j29j52J31J94pJ6
$$ 120 54 -113 -136 -20 38 -88 -83 80 211 -80 -77 56 78 254 -104 -63 -313 -21 -150 -302 -171 23 16 32
1291C2J37l30J43K20l54Q7K7Rj43K60k74O1J94J20n19K10K21m7j35K24K1p3J05
$$ 32 169 -161 -18 202 -152 -65 -38 -29 -172 88 -186 -125 69 189 -330 -120 101 54 -81 143 164 91 196
1314A96m09RK33j10Q4J29m3o0K28r0j83K36k56M2M26o08o6K12j39J10l56K70P7
$$ 196 -213 -204 29 -81 3 132 89 29 257 167 -16 220 -36 6 432 -176 -242 -30 -169 -59 -415 -145 -68
1337f8L8j9K02j19j48j20K95nK8l46M40j39j32K11l36O5K45J01k81J67j74K68
$$ -68 -30 -49 153 34 -114 -234 61 56 84 -262 178 39 -93 118 -218 -153 92 193 -88 79 -95 173
1359A73k42r6L29l38R8P7J67k51R1j54j00K79LP1j23k4j12Q7O9J4j36K57N4l22
$$ 173 -69 -165 164 -174 -76 1 168 -83 8 -146 -246 33 36 107 -16 -40 -152 -65 4 18 -118 139 193 -129
1383a29L59m11K02N3k14M9J71n3n5J35j73Q8pL5j6J00k42m6N63l70l85M72k9l2
$$ -129 230 -181 21 74 -140 -91 80 27 -28 107 -66 22 15 50 34 134 -108 -154 409 39 -346 126 97 65
1407F5r0l28L34L7l3J44L2j92K23j43n1R0L29n76M17J24m17j5R3j52M35j77k53
$$ 65 -25 -353 -19 18 -15 129 161 -31 192 49 -2 88 417 -159 258 382 -35 -50 43 -109 326 149 -104
1430a04R0O8R2q8m6k22P8J15O8j70K17MNK0j43N1j54J98J28j89k54K77j9m0l5
$$ -104 -14 54 146 58 12 -210 -132 -17 51 -119 98 102 107 127 -16 35 -119 79 207 18 -236 41 22 -18 -53
1455e3k5m37N65J44k46k83J68L10l6J02m08O2K72k89n0J38J72oq6N1nM7p9J28
$$ -53 -78 -515 50 194 -52 -335 -167 143 107 209 -199 -137 135 -154 -204 -66 106 100 14 65 60 107 28 156
1479A56r3o4J55k43J24j4J34p0o0J72l2K27l40r8J00J93k27oK5m1J00j67N2j68
$$ 156 63 -1 154 -89 35 21 155 85 25 197 165 392 52 -46 54 247 20 14 39 -2 98 -69 -17 -185
1503a85J59K32j86j12P1J68k26J21j43K92k70o3J32j39R5M1J35m3j70J17J68j97
$$ -185 -26 206 20 -92 -21 147 -79 42 -101 191 -79 -142 -10 -149 -54 -13 122 79 -91 26 194 -3
1525cJ89k32j2Pj40M85k87J78k25j44J24N1r0Q9J61m6Q8J7m45L23k7r0m5j9P9
$$ -3 186 -46 -58 -51 -191 294 7 185 -40 -184 -60 -9 -99 -10 151 105 193 210 -235 88 61 -29 -74 -93 -14
1550a4n3K75j61k40K34j52N0L24n6j51R7L1j21o9j53L59J75j32r0O8k41L0r0J1
$$ -14 -67 208 47 -193 41 -111 -61 263 207 56 153 184 63 -6 -159 200 375 243 153 221 -20 10 -80 -69
1574f9p5L28J35m37M3J67Q7j7j86P8j95qo7P9j27L47J02J11m18K08Ko8k1J28M8
$$ -69 -144 184 319 -118 -75 92 179 162 -24 54 -141 -149 -216 -137 -264 83 185 296 -122 86 88 20 -1 127 175
1599A75k63L67l25J97j98N6n1K32l09Q1l8K02Q1j00j89J13Q6R1j65O3j16J3K24
$$ 175 -88 279 -46 151 -47 9 -42 190 -119 -38 -76 126 207 107 -82 31 117 208 43 106 -10 3 227
1622B27m4k07k09N27k30K60m56jL93j86J3j04M0J39j19oL5L10l76j44M9J52k2
$$ 227 183 -24 -233 294 64 324 -132 -133 260 74 87 -17 23 162 43 37 72 382 6 -138 -89 63 41
1645D1j20J99l62K12j75J15J20j27J04j76K60k65L03J9o8m8K8l70L94j64r2J29
$$ 41 -79 120 -242 -30 -205 -90 30 -97 7 -169 91 -174 129 148 80 32 60 -310 84 -80 -172 -43
1667d3K61k95J69r1k04L56j3k53K42j22Q1k9q2O4k07j4J63K70k80K46l73o3K50
$$ -43 218 -77 92 1 -203 153 140 -113 129 7 88 59 -23 41 -166 -180 -17 253 -27 219 -154 -217 33
1690C3j51J6O2J6J2J31j72k6k4n6J28J87l16LQ2j32K50J10k35J68K18k56k39n7
$$ 33 -118 -102 -40 -24 -12 119 -53 -79 -103 -159 -31 156 -160 -157 -75 -207 43 153 -82 86 304 48 -191 -248
1714b48K50J76k02K57k08J56k1p4K3K15k00jk09R8J50j81J5k53J4O8L88p5j22
$$ -248 2 178 -24 233 25 181 160 86 109 324 124 123 -86 12 162 -19 -4 -257 -243 -175 213 138 16
1737A6j1mQ7q3J51l01J88ql07N65l66K40l15K70R7l21J16L9j4q4J20j79mK14k04
$$ 16 5 1 88 5 156 -145 43 35 -272 293 -73 167 -148 122 219 -102 14 53 39 -45 75 -104 -108 106 -98
1762i8J67Q6k18p0K61j62N2J70k28L90j70L7j72p6P7j84L65k19j22K3J25N4r2
$$ -98 69 155 -63 -133 128 -34 18 188 -40 350 180 217 45 -31 46 -138 227 8 -114 -91 34 88 -4
1785dk48M05j3J11k27j48K18km7Q9j17p5N4J19P0k83J40k6p0Q1k02K94M1j71J61
$$ -4 -252 153 140 251 24 -124 94 92 45 134 17 -58 -4 115 185 -98 42 16 -54 27 -175 119 160 -11 150
1810A50P9k52l1L53L9k66M59l21n0j28o6j4o2N4K92j47j67K97J4o26K74N7j63
$$ 150 229 -23 -54 299 338 72 531 210 160 32 -34 -48 -110 -56 236 89 -78 219 233 -393 -119 -62 -225
1833b25M38r8j0k6k48K62l38K45L4K00k67k50P0J03J19j52J82j40J29j25R5j68
$$ -225 213 115 105 79 -169 93 -245 0 34 234 -33 -283 -213 -110 9 -143 39 -101 28 -97 -2 -170
1855a70J23J06p6RK0P6j8J7K20p01J26L25k61J66j68L23o5J22j2j94J2o9m1Q8
$$ -170 -47 59 -17 -8 12 88 70 87 307 -394 -268 57 -204 -38 -206 117 52 174 162 -32 -20 -89 -130 -42
1879d2m5K72j03n36M03M3jl13M67k15n5Q8Po6k5j02L7K81r6M8N9j08q3l2Q7O7
$$ -42 -87 185 82 -454 -51 -8 -9 -322 145 -70 -125 -37 -30 -96 -121 -223 -186 95 -1 47 106 -2 -85 -117 -30 37
1905C7L4L8k06O4P4K0j13K39l16J05O4j61K50l5k31j36K05R4Ql97M13n5mJ02p4
$$ 37 71 109 -97 -33 41 61 -52 187 -129 -24 40 -121 129 94 -137 -273 -68 26 34 -363 50 -5 -9 93 19
1930A9l41O16n66L34J04j06o2j18K42j36J57j50J87j08k48J86M1R8k90K25j11
$$ 19 -322 294 -272 62 166 60 -2 -120 122 -14 143 -7 180 72 -176 10 51 149 -141 84 -27
1951b7J30M1k11K63J0lj38K3n9L40n14J75j99J49Q4%j63R3J9j53P9J16J65n43
$$ -27 103 144 -67 196 206 203 65 88 29 369 -145 30 -169 -20 64 64 -99 -6 13 -140 -61 55 220 -323
1975c23K47J11M6j18J3K3QPL4m1j14J3J86p7Q8k15M0L90j67k89J20J57n6k02j10
$$ -323 -76 35 81 -37 -24 -1 7 14 48 7 -107 -94 92 15 103 -112 -72 318 151 -138 -18 139 83 -119 -229
2000b29kJ29K44O5l15q4N21n62K58l2O7j2j0k66k3K61P0j87J64l1J19o5j4j31
$$ -229 -231 -102 142 207 -108 -192 329 -233 25 -7 60 48 38 -228 -251 10 80 -107 57 26 145 80 66 -65
2024f5k6j12J50R5k43J44M1J77l04K84J05l59J99k2K8j11k2L3J24Q3j75r8O4J24
$$ -65 -91 -203 -53 42 -201 -57 -16 161 -143 141 246 -113 86 64 92 -19 -41 -8 116 199 24 -74 -10 114
2048A14J07m06J61j2j54L31j19j50L16j07j52m4L9l0L53k62L7q1j87K59m8N0N2
$$ 114 221 -185 -24 -36 -190 141 22 -128 188 81 -71 -115 -76 -106 247 -15 22 -59 -246 13 -35 15 67
2071F7q2l1N7j05j0M3J86R7k98L7j90K47j04L3j36M95M1m15J46l13K29m0J92k27
$$ 67 -15 -46 11 -94 -104 -61 125 222 -76 -39 -229 18 -86 -53 -189 306 347 -68 78 -235 -6 -46 146 -81
2095h1k8l0O5M8j43K77K99k36o8O7J8j80J08k22L9m1J81j94K01j84J30M7k22l9
$$ -81 -109 -139 -74 -26 -169 108 407 171 103 170 188 8 116 -106 -67 -108 73 -121 80 -104 26 73 -149 -188
2119a88K06J42J7l47K76n9p7J28J0k05Q1j43n9M04m84L02o6J40k52K97Q7k50k1
$$ -188 18 160 177 -170 106 47 -30 98 108 -97 -16 -159 -218 186 -298 4 -62 78 -174 123 210 -40 -61
2142f1P8k05m8K50o3o5M45m15L19k72J55l31K62p0K65j96m49N70q9m7R1r9J35
$$ -61 17 -188 -236 14 -49 -114 331 -84 235 -37 118 -213 49 -21 244 48 -401 169 80 33 124 25 160
2165A60J66j82L8l70jK75J21k12J57Rq8j57M35l04n6J38l7j41j05q4qK92Nj37
$$ 160 326 144 182 -188 -189 86 207 -5 152 161 73 -84 351 47 -9 129 92 -49 -154 -238 -246 46 51 -86
2189h6L39l8k58J37k27K43p1M1J37k98l6q0K27p4k56K97K7J63L8j65L5O9j77k6
$$ -86 253 215 -43 94 -133 110 39 80 217 -81 -117 -197 30 -44 -300 -3 24 187 225 60 95 164 -13 -39
2213c9P9r2KR1K09k35m1k5K28j68j87J65R2k7l45K25J01o0R9j64K35j78K51q3
$$ -39 40 -52 -50 41 250 15 -26 -51 177 9 -178 -13 79 52 -293 -68 33 -27 72 -92 143 -35 216 133
2237A33q3l5l00K69l9k0k23L34M1K8Q0j84J01o9m4J17j29j10J22P2k18K01N8J08
$$ 133 50 15 -285 -16 -55 -75 -298 36 77 105 185 1 102 33 -11 106 -23 -133 -11 61 -157 44 102 210
2261B10J2j75M6k4m2l83M03J29k32q5J66J90q9J64k83k42K25R9M7J32k74j43M1
$$ 210 222 47 93 69 27 -356 47 176 -56 -141 25 215 126 290 7 -235 -10 89 136 268 -6 -149 -108
2284a08J13j78K94j79M0K3j30q9K89n6k19J04K25n2j69K04O6m11L15k31L71r3
$$ -108 5 -173 121 -58 -18 5 -125 -214 75 19 -200 -96 129 77 -92 112 178 -233 82 -149 222 129
2306A29j17K8J1j74%R8o9q7K93l07J99q5j36K86q3L3j65N5J50N5Jj96N9J32l73
$$ 129 12 40 51 -123 -123 -25 -94 -181 112 -195 4 -81 -217 69 -14 19 -146 -91 59 114 115 -81 -22 110 -263
2331b63M54L7m8k52Q0n2j22K81k47J10j07L82rk92O0J10k02p2%J03l7K47k61l4
$$ -263 191 228 180 -72 8 -44 -166 115 -132 -22 -129 253 244 -48 12 122 -80 -152 -152 -49 -86 161 -100 -134
2355a34J35J54j29m8k62P7M88l01J47k93J96K30j40j30j51J31J00j54n9P6J41
$$ -134 1 155 26 -22 -284 -207 281 -20 127 -166 30 260 120 -10 -161 -30 70 -84 -143 -67 74
2376G4j69K34l16k5j34K35J54l0o8k1K7M07o34J51P8q7J75j54J24j3J0J95mk11
$$ 74 -95 139 -177 -202 -336 -101 53 23 -45 -66 -39 368 -266 -115 -37 -124 51 -103 21 8 18 213 209 -2
2400bJ7p3J18K15j35k3j66J7J07j54J52k63J66J09j89K63k35r5K25k34J91K3k02
$$ -2 15 -58 60 275 140 117 -49 -32 75 -79 73 -190 -24 85 -104 159 -76 -171 54 -180 11 34 -168
2423a68n3Q6P9j22J02j5L01n52K92J52j33L6J24j05J23j20P0J3j83l3K29J87j31
$$ -168 -221 -135 -56 -178 -76 -91 210 -342 -50 102 -31 5 129 24 147 27 97 110 -73 -106 123 310 179
2446A79k8j36o6j04K97j07O4m6N1j85K34l9k66K13k3M3k32J78P8j31M4R6l03K14
$$ 179 151 15 -51 -155 142 35 99 53 104 -81 153 114 -152 61 38 81 -151 27 105 -26 18 114 -189 25
2470B5jj24K12J39p4k62J84m7l11Q4L85k41k8k4R2k11J75P9k46L86m28L40k03
$$ 25 24 -100 112 251 177 -85 99 52 -259 -175 210 -31 -59 -83 9 -202 -27 52 -194 192 -236 104 -99
2493i9L3J35l35K65K6J7k24J49J07k6l7N8k52K35P4j12P2n6oJ94l53M47m19N6
$$ -99 -66 69 -266 -1 25 42 -182 -33 74 48 11 69 -183 52 126 14 86 30 24 218 -135 312 -107 -51
2517e1j31L34J9j02o9M6L16n12J22k2M0O6M6k98kK77O9j14j08l1K96j78l8L9K
$$ -51 -182 152 171 69 0 46 362 -150 -28 -50 -10 56 102 -196 -198 79 148 34 -74 -105 191 13 -25 14 16
2542A6J83p7j26K3l53M58pK5j50M6p2J35R7j40j38J09J52n7m31J10K44j30J30
$$ 16 199 122 -4 19 -334 124 117 142 -8 38 -34 101 198 58 -80 29 181 124 -307 -197 47 -83 47
2565D7J50k61K77j45j68p5j00N12q9k41N7k4j13oJ27N4NJ34l18J10J8Q4p0L3L5
$$ 47 197 -64 213 68 -100 -175 -275 237 148 -93 -36 -60 -173 -179 -52 2 7 141 -177 -67 -49 35 -35 -2 33
2590C3n5k0L5j84J99K68n01K73j61J38nN9N4j75K11k61l7J50j07j34J44L89m64
$$ 33 -22 -42 -7 -191 8 276 -225 48 -113 25 20 79 133 -42 169 -92 -129 21 -86 -220 -76 313 -151
2613a51k3K0K06j67J12oJ44o6oQ2k68L28o2k06J88L8j05k42K26k19J86no2K06
$$ -151 -174 -154 52 -115 -3 -9 135 69 63 145 -123 205 143 -63 125 163 58 -184 42 -177 9 4 -58 148
2637A48j13J54l70L71l17J68j00K6R7j96L45k73j42J66J14M9k4j86j34K83j37
$$ 148 35 189 -181 190 -127 41 -59 -33 64 -132 213 -60 -202 -36 78 127 103 -83 -217 66 -71
2658g1J05N0pj14r8J58j75j55L48L1j11J74j50J35j14mk9q2j9pl8n2K61j04j17
$$ -71 34 84 77 -37 -135 23 -152 -307 41 72 -39 135 -15 120 6 2 -27 -109 -128 -135 -173 -225 36 -68 -185
2683a85L06k77K97m6p2j7K4J45m58K16J94j13L18n01K30k09j59J81N4j0J07J95
$$ -185 121 -156 141 95 23 6 30 175 -283 -67 127 14 332 -169 61 -148 -307 -126 -72 -82 25 220
2705B20j07l08K04o3j21J55M0k13q1L61q4J13m7j54L09l02j4J60J30j31k29J35
$$ 220 113 -195 9 -54 -175 -20 20 -193 -274 87 3 116 69 -85 224 -78 -92 68 198 67 -162 -27
2727b7j43J20Q4l34K78o5J24l5m8K1j53j09K60k8p0m6K28j84j18K58p4j29L34
$$ -27 -170 -50 34 -300 -22 -87 37 2 -46 -25 -178 -287 -27 -55 -125 -171 57 -127 -245 13 -61 -190 144
2750A44j50j36%J31J6Q9J35j60n4L4kJ43M9o8j12J87m15K45N7l39M22m17K62j19
$$ 144 -6 -142 -142 -11 5 94 229 69 15 49 47 190 239 171 59 246 -169 76 133 -206 216 -201 61 -58
2774e8oj79M34k14j00J61Jj26p5J04k76M37j45k44M5J33J91o5N3j5k04N8J02k3
$$ -58 -64 -243 191 -23 -123 38 39 -87 -162 -58 -334 103 -42 -286 -241 -108 83 18 71 56 -148 -90 12 -11
2798a1k35M13l7l70K88n8K66k42J74n06M25N0P8m66K21R9k7k29j1K02R7j90q8
$$ -11 -246 167 130 -240 48 -10 256 14 188 -318 107 157 235 -231 -10 89 62 -167 -178 24 121 -69 -157
2821a57J09K20m01N1L22k21p4j16K09J14m9R1Qm4J59k71m0K4nj0J56j03J62j92
$$ -157 -48 172 -229 -178 144 -77 -151 -267 -58 56 7 98 106 62 221 -50 -90 -66 -71 -81 75 -28 134 -58
2845e8k3P2j2K41n14K92K46k94Q8O5j39l02P82m22lj81L37j11J99o3R0l72P0p1
$$ -58 -81 -9 -21 220 -294 -2 244 -50 38 103 -36 -338 444 22 19 -162 175 64 263 200 290 -82 -12 -83
2869h3J13Q3j57Nj31J82j09K4j60K30j85K80j07L0n8R3j34K72k54r9L30P6j57
$$ -83 30 113 -44 -39 -170 12 -97 -73 -233 -3 -188 92 -15 15 -43 50 -84 188 -66 -165 165 241 84
2892H4o9L2k27M13k14L4n3m4qj63J9J23j08M4J07M3K05k58pkJ87l61MO9P9k08
$$ 84 15 47 -180 233 19 53 0 -44 -52 -215 -196 -73 -181 -137 -30 13 218 -40 -47 -49 138 -223 -219 -150 -71 -279
2918b79J01L39k28l1K49k48j47J89J91O9q3p2o1O1l9l5jp1K10J5l44O0Q6L82k54
$$ -279 -178 161 -67 -98 151 -97 -244 -55 136 205 122 50 -11 50 11 -24 -25 -96 114 129 -215 -155 -69 313 59
2943E9j38M6j20R6P7J64k19j40J33j0J80j66J67r5j86J40M32q9l63J78l9j82%
$$ 59 -79 -33 -153 -57 20 184 -35 -175 -42 -52 128 -38 129 34 -152 -12 420 331 -32 146 107 -75 -75
2966g5K75k83K63p3q8m8J62nk36o0J88j82K92jj52LJ04j82r3J40Q2j55K59j07
$$ -75 200 -83 180 107 19 -29 133 128 -108 -168 20 -162 130 129 -23 -20 84 -98 -191 -51 31 -124 135 28
2990B8j27J06n5jJ02j47o1o6K10QM7k05L7K52r6KJ06K1j20l33J88J01J00o9K8
$$ 28 -99 7 -48 -49 53 -94 -155 -221 -11 -3 44 -161 -124 128 32 34 140 161 41 -292 -104 -3 97 28 56
3015E6k25K91j67J51o3n5J31q4n9L41k20o9J04J35k68Qj19r4L35j06K20n62O24
$$ 56 -169 122 -45 106 43 -12 119 35 -24 317 97 28 132 267 -1 7 -112 -206 129 23 243 -319 305
3038C05p15K07k3P9J74L8q1K61O6k54j04K4J47k36j27M00j22NJj90J95J3l3j46
$$ 305 -410 -203 -226 -147 27 65 -16 245 311 57 -47 -23 124 -112 -239 161 39 44 45 -145 50 63 30 -116
3062a16J11J63m7k95K21l81K24K93j32n9mJ88j36k63L01O3o8l16K48J6P2j3J53
$$ -116 -5 158 111 -184 37 -344 -120 173 41 -18 -22 166 30 -233 68 131 63 -253 -5 11 83 70 223
3085B23k57R5jq1L19l99j43L33l94K54L01k83R3O0k47K08n4Lk05K29M0Q9J48j51
$$ 223 -34 61 60 -21 298 -101 -244 89 -305 -51 250 -33 60 120 -127 81 27 30 -175 54 94 183 331 180
3109A80j33j97J53R4j32J78j25J3j43K01m1j57J42j15q1K00k30M63j20j73K04
$$ 180 47 -150 3 97 -35 143 18 31 -112 89 48 -109 33 -82 -163 37 -193 270 150 -23 181
3130A81r7j54J01K6r4M9n1j18O3R5K11L2j80Q4k52L13m03L49k38K18m68K72q3
$$ 181 84 -70 31 57 -37 12 -39 -157 -94 1 212 244 64 148 -104 209 -194 155 -83 135 -333 -61 -144
3153a44J75l04p1K58P7K17q0j27l40L47j55j44J85O6M4K12l97J66k3j94N11j42
$$ -144 31 -273 -344 -86 -9 208 128 1 -339 8 -147 -291 -106 -40 4 216 -181 -15 -38 -232 279 137
3175A37l34L17k36nq2K28m2j02K98k88N0o3J63l74K45O6J89j76j07J43K21k64
$$ 137 -197 120 -116 -121 -203 25 -17 -119 179 -109 -59 -122 41 -333 -88 -22 167 -9 -116 27 248 -16
3197a6K00Qm62q9M28J48l01Pp1J39O9p1l62K86J90q8j72M4Q6J87j41O7j22J24
$$ -16 184 192 -270 -359 69 217 -84 -77 -148 -9 60 -11 -373 -87 103 15 -157 -113 -27 160 19 86 -36 88
3221H8j67K33k30k57L01K11k50J22Q6N5r0k79K04K12n02L20jK1m9P8j83l8J42
$$ 88 -79 154 -76 -333 -32 179 -71 51 137 192 102 -177 27 239 -263 57 56 77 28 106 -77 -115 27
3244B7j08J39j72o0J56J94j57p8J82r3J43k48J69k31j60N22k70j03j0j30K88P5
$$ 27 -81 58 -114 -174 -18 176 19 -59 123 30 173 -75 94 -137 -297 225 -45 -148 -158 -288 0 75
3266G5j54O6p6K45k79J65k51J02K87j76K50n1m48K66N9k11K42M3q0N1k58j70J60
$$ 75 -79 -13 -89 156 -123 42 -209 -107 180 4 254 203 -245 21 80 -131 111 154 74 125 -133 -303 -143
3289a43K53n7k74K71l16K78K13j71j61J4O1J67j76N9o1q5j18L29k68J21mQ5L87
$$ -143 110 53 -221 50 -266 12 225 54 -107 -93 -32 135 -41 18 -43 -128 -246 83 -185 -64 -68 17 404
3312D04l45r3m3M1j81o5L53k20J42L8J1j2k34K43O0j04k4J93k72k8QL46j83j44
$$ 404 59 -34 -77 -36 -217 -282 71 -149 -7 31 42 30 -204 39 99 -5 -29 164 -108 -136 -128 218 35 -109
3336a09K4j4J15j46j57L06P6J53j96J12j56n3j02p2J41K16M9k67K60j20J31k72
$$ -109 -85 -99 16 -130 -287 19 95 248 52 164 8 -45 -147 -219 -78 138 187 -80 180 60 191 -81
3358h1Q3ok1j14J35J17l5j18K52k92J1J82J02k83J80j20o8J19O4j51K47m38q1
$$ -81 2 -4 -25 -139 -4 113 78 -40 212 -80 -69 113 215 -68 112 -8 -76 43 107 -44 203 -235 -316
3381c16K66P4Q3l10J77J67p4j32j3l1l1M48n44N0K27o4J76P3Kk96kJ70j1j32l3
$$ -316 -50 24 107 -203 -26 141 67 -65 -78 -109 -140 308 -236 -186 41 -23 153 226 228 -68 -70 100 89 -43 -76
3406g6O2O1J55k10RM9k6k32K58J42k14Q6j85J14J0L7N3j4k93J54K64m73M18l8
$$ -76 -14 47 202 -8 1 50 24 -208 50 192 -22 64 -121 -7 3 40 93 79 -214 -60 204 -269 149 111
3430A11p9l58L76m2j88K44j41M46m10K28j17l6O2J57k63p3P8J39j86M12j74r5
$$ 111 32 -326 50 8 -180 64 -77 369 -41 187 70 34 96 253 -10 -83 -5 134 -52 360 186 91
3452I1q9r7M3O5q5j83J14L3M8k09K69l5n8lo9L72j49r6L62l96K4p5K09j52J53
$$ 91 2 -95 -52 13 -72 -255 -141 -108 -60 -269 0 -35 -93 -96 -165 207 58 -38 324 -72 -48 -123 86 -66 87
3477H7n6k47k2J79J18n1j20L02l14L10l84M32j51j86K92k16J1j77K87p4o9J33
$$ 87 31 -216 -238 -59 59 8 -112 190 -124 186 -198 234 83 -103 189 -27 -16 -193 94 20 -49 84
3499H4l65NJ99J01j11j33K38j12L77k89j12J16L0l15L99k39J46k2j45K10m66N64
$$ 84 -281 -276 -77 24 -87 -220 18 -94 283 -6 -118 -2 28 -287 112 -127 19 -3 -148 62 -404 160
3521A60k02J75k64P3J0k1J73J56l38K53m6l27L94j76j26j38OJ74L1o3J25k03L80
$$ 160 -42 133 -131 -58 -48 -69 104 260 -78 175 129 -198 196 20 -106 -244 -238 -64 -33 -96 29 -174 206
3544B06k48M2Moj50R0K33j42k0R4l47L97r6j12K7J32N0j40J25q3m32J40M50k31
$$ 206 -42 0 4 -2 -152 -62 171 29 9 103 -244 153 57 -55 -28 104 154 14 139 56 -376 -236 214 -17
3568a7o5J80k39K86k25M5o5J02q0J87j16P7J97n6L7n76L41J6j96L19J05j10l38
$$ -17 -82 98 -141 145 -80 -35 -100 2 -78 109 -7 70 267 211 248 -328 13 29 -167 152 257 147 -191
3591a91L5R1J58K79l66J26l61L19N8j15o1j02J64q5J16j32m2J54k0o6K46j77j32
$$ -191 -156 -65 93 372 6 132 -229 90 148 33 -28 -130 34 -51 65 -67 -109 45 25 -41 205 28 -104
3614a04j03N6J79n4N4jj36Q2j8k21K68K50j47J21j15j43J30n5K0n9J78k37j01
$$ -104 -207 -151 28 -26 28 27 -109 -27 -45 -266 2 252 105 226 111 -32 98 43 63 4 182 -55 -156
3637a56J50kmo9l7J50K29k77K14m43J86J76j89r1M5J13J51j7J08l94rK52Rj41
$$ -156 -6 -8 -12 -81 -118 32 261 -16 198 -245 -59 117 -72 -163 -118 -5 146 129 237 -157 -166 86 95 -46
3661d6qJ85O9n1k37K07k1j75Q9K50M8m97L47k36P0J72j89j33J75J86m60M23k1
$$ -46 -54 131 200 149 -88 119 98 -77 12 262 310 -187 160 -76 -6 166 -23 -156 19 205 -255 168 147
3684A47q6j59K28j13n5K31p7j64%k27K99j15J30k71J27K66j93m0J30p2k4Q5J25
$$ 147 61 -98 130 17 -38 193 116 -48 -48 -275 24 -91 39 -232 -105 161 -32 -72 58 -14 -38 47 172
3707A72J00n86K92n4j11K31Q8j72J34k35j60N4J28L32k87K70j56M5o5J1j95Q0
$$ 172 272 -314 -22 -76 -187 44 132 -40 94 -141 -301 -247 -119 213 -74 196 40 85 20 31 -164 -84
3729h4K3k64L19j43J80j11j5K61j00k55N15m97L0L06l30K5Q1j27K47q8J17K51
$$ -84 -61 -325 -6 -149 31 -80 -95 166 66 -189 326 -171 -141 165 -165 -140 -59 -186 61 -27 90 341
3751C41l60j16O3J12pQ1l3j23N4J62k84j36J85j06M39l60rJ52J5L38n52m1K77
$$ 341 -19 -135 -72 40 33 114 81 -42 12 174 -110 -246 -61 -167 272 -88 -97 55 70 408 -144 -185 92
3774I2l0n6p6J57ml18L28j85L24p5k46l1K46j48L4J00j49L07l75K02j68K59j27
$$ 92 62 6 -70 87 83 -235 93 -92 232 157 -89 -120 126 -22 12 112 -37 270 -105 97 -71 188 61
3797F1j98l2L26j22j67O3N0k64K59J73K3p9m6p0l0j3J5Oj86J24r0L45j31J25J13
$$ 61 -137 -169 157 35 -132 -69 -19 -283 -24 149 172 93 47 -23 -53 -66 -51 -45 -231 -107 -197 148 17 142 255
3822B55k49L23l99j35J33J68k59J38O2N6L3j76R5q7J46n8lq0J97j08N6m01q5L60
$$ 255 6 329 -70 -205 -72 96 -163 -25 37 93 126 -50 45 -42 104 46 43 -37 160 52 108 -293 -378 -18
3846a8j88K81j29%K72k44K8j44K6J88k89J82K51q7j47l76K89O9l3k16L93n2j06
$$ -18 -206 75 -54 -54 218 -26 2 -142 -116 72 -217 -35 216 129 -18 -394 -105 -36 -69 -285 108 56 -50
3869e0K02m9K17k54j43k32J21k1J18J72O9k75K48J00q9k06J92k54J36K25j58j72
$$ -50 152 103 320 66 -77 -309 -188 -209 -91 81 150 -125 123 223 134 -72 120 -134 2 227 69 -103
3891a03P1K27j50j19J45P7j58j3oJ22j8J96l70J22Q8K2j54K48k73J88m17J66M37
$$ -103 -32 195 45 -74 71 148 -10 -23 -29 93 75 271 -99 23 111 133 -21 227 -46 142 -275 -109 328
3914C28l32j11l8P1j25K76k00M53n52L39n8k11K70l06K16oL7j60R4K56j49j68
$$ 328 -4 -115 -153 -82 -207 69 -131 322 -230 109 51 -160 110 -196 20 14 51 -109 -15 241 92 -76
3936g6j91j49M15j17q9J33k9P1K77k84K23N7m4l03Q1K60q2l09K04l09O73l68o
$$ -76 -267 -416 -1 -118 -207 -74 -103 -32 245 -39 184 241 197 -106 -25 235 153 -156 48 -261 412 44 38
3959C8m8O1j37L35p0j02j6l16O64k18j93P7k60K83k08J37k0Pj16J80J14l06J84
$$ 38 -10 51 -86 249 179 77 61 -255 409 191 -2 75 -185 98 -110 27 7 14 -102 78 192 -114 70
3982G0l16L36L8p6o6j95j0L78m77l3J95K31J25l6j14j1p5RK5lj67K86k57R5j67
$$ 70 -246 90 128 52 -14 -209 -219 159 -318 -351 -156 75 200 164 50 39 -36 -27 -2 -5 -172 114 -143 -48 -215
4007b15L74j19M2j10p8K8Q7L16m99L73k7l80J67J09J57p0k46L3q0K35r1pj8m8
$$ -215 159 40 82 -28 -106 -78 9 325 -174 199 172 -208 -41 68 225 155 -91 -58 -138 97 6 -1 -19 -67
4031f7J96p6m8K29k43n5j1j1J42o9J44n6P8k91K05L2K2j9Kjq3N8o6l44M95m82
$$ -67 129 53 5 234 -9 -64 -75 -86 56 -13 131 75 153 -138 67 99 121 102 104 103 20 78 12 -332 163 -319
4057c19M67k65J81J02j22l07L87k55l4L55j33k0r7L4q1K06Oj57J51j14K9j3M5
$$ -319 148 -117 64 166 44 -263 124 -131 -165 190 57 37 -60 -26 -107 99 105 -52 99 -15 14 1 46
4080D6J55l72k7R8M52n41J71J07l6n2K70j33l35R5O2J56j83k15K08N06n24p3K93
$$ 46 201 -171 -198 -100 352 -189 -18 89 53 1 271 138 -197 -102 -40 116 -67 -282 -74 432 -92 -165 128
4103A28k92J43k33o8K41K1j44J00K79k90K22l25M03k71J32k5j24J22L6Nq3R4j08
$$ 128 -164 -21 -254 -322 -81 -60 -204 -104 175 -115 107 -218 185 -86 46 21 -103 19 55 60 -23 71 -37
4126c7j41N4K55j0L6k29P9M0j68L4k52J79K27O7j57J49k04J9J91n9M36n75K90
$$ -37 -178 -124 131 121 157 -72 7 47 -121 -87 -339 -160 67 134 -23 126 -78 -59 132 73 509 -66 224
4149B24k54k69L09l1k77L90p8k62M39j49K25n41J18q0K58j5J37k90k1N25l38J21
$$ 224 -30 -299 10 -21 -298 92 14 -248 191 42 267 -274 -156 -236 22 7 144 -146 -167 358 20 141
4171A41j07J01kp1J20k19P2L0j70J98k22J26J41j39l00L33q6M0j09J29L8R1j96
$$ 141 34 135 133 62 182 -37 35 65 -105 93 -129 -3 138 -1 -301 32 -54 -14 -123 6 44 135 -61
4194f1j5k8J33k19K39M2k57K41k53K24K98m11l6K07k66n3N4L42l09L57j07j88
$$ -61 -76 -104 29 -190 49 91 -166 75 -178 46 344 -67 -103 104 -162 -215 -161 181 -128 229 122 -66
4216f6r4J81Ro9j13J66l4j75J12J6K80j67j99j1j15M61l33J60J37m7J28j54r2
$$ -66 -160 21 30 -39 -152 14 -20 -195 -83 -67 213 46 -153 -164 -279 182 -151 9 146 99 227 73 -19
4239a9Nm3J9p8R7j4J57j96r1N6N0j62q8K53l35J08M94r2j45m5L47k87P1nq1j23
$$ -19 -14 -57 -38 -116 -19 -33 124 -72 -163 -107 -57 -219 -307 -54 -389 -281 213 121 -24 -69 278 -9 62 57 -24 -147
4265a47J73J66m07J39J7k04K71J19K9k39K61p2K8M3k42N8M4J7J53l94J74j84L20
$$ -147 26 192 -215 -76 -59 -263 8 127 156 -83 178 106 134 177 -65 -7 37 54 207 -187 -13 -197 123
4288A23j32n7J30J94o17K07m9K48j14J40m8k17O6J0L39k98K08j34q5r2K77k34
$$ 123 -9 -66 64 258 -359 -152 -201 47 -67 73 25 -192 -126 -116 223 -75 133 -1 -86 -178 99 -135
4310a35J6K08J11j83o3L01r5k94M31p87N03ql13L50J73j77L1j43m1L90k9l94l0
$$ -135 -119 89 200 17 -46 255 160 -134 297 -490 13 5 -308 42 215 38 69 -74 -115 275 246 -148 -178
4333a78R0m5L60l46J19J01j49J42k00J22j9J22p6k24N78k39j10j53J88l76J25
$$ -178 -88 -133 227 -119 0 101 -48 94 -106 16 -3 119 43 -181 397 158 48 -105 83 -293 -168
4354a68r4K73j34m8J09k78K43O9p3J65N5k29NK36k58K70r8L3n3k5jj7k4J19j11
$$ -168 -262 11 -123 -171 -62 -340 -97 -28 -101 64 119 -110 -105 131 -127 143 45 78 25 0 -1 -18 -42 77 -34
4379c4q2p8r8K73n9J72j08Q8j4j21K78m55M10m65J78L29j30l73L11lQ2p7r5J11
$$ -34 -116 -194 -292 -19 -78 94 -14 74 60 -61 217 -238 172 -293 -115 214 84 -289 22 19 101 24 -71 40
4403D0k34K98j42j0K13k23L99m06j10K63k04J74l0L8oRj89k0K08n1j0l2J76j80
$$ 40 -194 104 -38 -48 165 -58 341 -65 -175 88 -116 58 28 66 60 69 -120 -140 68 17 7 -25 151 -29
4427b9j3J29J35m64J89j96L62j45K59k00j26J97j92K9l1K59M3j77k35K05P0p5
$$ -29 -42 87 222 -242 -53 -249 113 -32 227 27 -99 98 -94 -65 -96 163 206 29 -206 -1 69 -6
4449fJ38k68L11k40J12k3Q1k59K70l7J64k50n0J44k54m5L69p5o3J57q9Rm4J24
$$ -6 132 -136 175 -65 47 24 105 -154 116 79 243 -7 -57 87 -167 -212 157 82 19 176 87 96 52 176
4473A76m07M38k68Q3K18k58j2K41p9r1M7n9mj45l24M93J91k83pJ80k38K52q7L0
$$ 176 -231 207 -61 22 240 -18 -30 211 132 41 88 29 25 -120 -444 49 240 -43 -50 130 -108 144 57 87
4497H7m3J33j11R9L8j11Ll09J30N3J10Q7l90J91J46J11k60j15J29K0j49K94k84
$$ 87 44 177 66 165 203 92 95 -214 -84 -31 79 166 -224 -33 113 224 -36 -151 -22 -2 -151 143 -141
4520a41K3J59o8N3O2j84k6K97m98L09r2J59l0j17L6J96j67l0R1N2J92n44J35J12
$$ -141 -118 41 -27 26 88 -96 -122 175 -323 -14 -106 53 23 -94 -58 138 -29 -59 32 84 276 -268 -133 -21
4544b1j67L59P5k01j41L41k49j41K03j8r4J12L1k13Q0NK6n7N3L7PP7k89J18R9
$$ -21 -188 171 246 45 -96 245 -4 -145 58 40 -54 58 89 -124 -44 -39 -13 -70 -17 20 27 104 -185 -67 32
4569C2j20J89m2k4O6j84J46l3N7k23J03j97J94K63n16M4M58j19Q3p9q0m1J55m1
$$ 32 -88 101 59 35 101 -83 63 30 87 -136 -33 -230 -36 227 -289 -245 213 94 177 98 18 -23 132 91
4593I1m8j79J2J70L9k87J12K8N2j47K57Mq3R6k6Q4l12K79m53L80j9K27k15j13
$$ 91 43 -136 -124 46 85 -202 -90 -62 -10 -157 100 104 21 117 91 175 -137 142 -311 69 50 277 62 -51
4617e1k9K72k3l75K27j35J05J86l86K26R2l6J33J83m48K0K50k23M3M3J91j23o3
$$ -51 -80 192 169 -206 21 -114 -9 177 -209 17 109 73 206 389 -59 -39 211 -12 31 74 265 142 79
4640G9j20J46J8l59P7p6l1K82N0J15J39k10n6l29L84l41K90j48Q6K06k02R4M0
$$ 79 -41 105 123 -236 -159 -235 -266 16 66 181 320 110 54 -275 109 -232 58 -90 -4 202 0 94 134
4663A34J2k73L68k58J86k65L15j11J71l80J75n3J07k14K62j19j09R5q0j20K10
$$ 134 146 -127 241 -17 169 -96 219 108 279 -101 74 21 128 -86 176 57 -52 43 -37 -157 53
4684E3J22j07k0K2r1j2K89k03K74j40m73K42M4Q0q3p8O9j40J48J2K02j33j58L67
$$ 53 175 68 48 70 -21 -33 256 53 327 187 -286 -44 0 80 -3 -81 -12 -152 -4 8 210 77 -81 286
4708B86k46MJ34j35J04k15Q1N3J38r9q0J33j78J21n8l5K10j37ok4q1P5k7J22r6
$$ 286 40 44 178 43 147 -68 13 66 204 105 25 158 -20 101 43 8 218 81 75 51 -30 45 18 140 44
4733D4J1J2k80K42k12QL61m1j98J00j2j10K08m1K46k06J58k48k46K50j55q0K30
$$ 44 55 67 -213 29 -183 -175 186 145 -53 47 35 -75 133 92 338 132 290 42 -204 46 -109 -189 41
4756D1j01J47m4O7N6J1k84J52n1L7k84N71j12k66j27Q8J42j35Q0k55J98J62j92
$$ 41 -60 87 43 110 166 177 -107 45 -6 31 -253 318 206 -60 -187 -99 43 -92 -12 -267 -69 93 -99
4779i9J31K70m87Q7J06K0j59O7P9J76J7l47j32N57l31p9k12L75p3o0K32n4q2j22
$$ -99 32 302 -185 -98 8 28 -131 -64 15 191 208 -139 -271 286 -45 -124 -336 39 -34 -94 138 84 2 -120
4803a20O9K25r8L3J05k21R0j67K60q3M6k34J00k15M92k61j86K87m1J09j53p2k28
$$ -120 -51 174 76 109 214 -7 83 -84 176 93 139 -95 5 -210 282 21 -165 122 81 190 37 -35 -263
4826b63J83k6j99M5Q1J12k7O3j51J64j87J03K00k01K51k48J13J04k06K48l1j27
$$ -263 -80 -106 -305 -260 -179 -67 -94 -31 -182 -18 -205 -102 98 -103 148 -100 13 117 -89 159 128 1
4848AJ88k38L84l88J04J23m2j81P4J41l70J71j01Q3N4L16j53k02j53J86r9L79
$$ 1 189 -49 335 -53 51 174 132 -49 25 166 -204 -33 -134 -51 3 319 166 -36 -189 -3 -102 277
4870B77k17n8k34L35k21o4P3Q0m5n0K02M1J6k28J71j06L59n31K81k37O9k54N18
$$ 277 60 2 -232 103 -118 -182 -109 -29 -74 -124 78 119 135 -93 78 -28 331 -200 81 -156 -87 -341 177
4893A77m82K28j36J90j98K94M2k05k9J72K11k64k4l7P8k52J96j2J14K26k34r5
$$ 177 -305 -77 -213 -23 -221 73 115 -90 -119 53 264 0 -24 -61 17 -235 -39 -51 63 289 55 -40
4915d0K9J32q2J01Pj94l93M01j92N40l96J50Q9j45k18J89j07j1M2L20l8k05L20
$$ -40 -11 121 39 140 147 -47 -440 -39 -231 309 -87 63 152 7 -211 -22 -129 -140 -98 222 184 -21 299
4938B99m11J55l2R2j26J29k65Q5m8J26J60j05k60p4K74J33j77L17r9k74N8J84
$$ 299 -112 43 11 103 -23 106 -159 -74 -122 4 164 59 -201 -275 -1 132 -45 272 173 -101 -43 141
4960A41k44L03k37N6J01rk35J70Q1k02J18k40j66K76R5j6k9q5J58m4J75q9j60
$$ 141 -103 200 -37 19 120 111 -124 46 127 -75 43 -197 -363 -87 8 -8 -37 -122 36 -8 167 78 -82
4983h2L49k48k93L46Jr2j23J05r4k4K77l39N42o09K16J01k15J40m9J04o5L8O0
$$ -82 267 19 -274 72 73 -19 -142 -37 -131 -155 122 -217 325 -284 -68 33 -182 -42 -91 13 -52 -14 46
5006D6J69r8k5k3j36J66L27m04j91L01p1Q3J19k77l26L41j50Q8O4r0L38j83p2
$$ 46 215 117 92 69 -67 99 426 22 -169 132 61 144 263 -14 -340 1 -149 -61 3 -87 251 68 -4
5029dk27M89l09J22k6j61J13q3K11j45J60j91J97l68J98P0K7Np5N0k13J12J48
$$ -4 -231 258 -51 71 45 -116 -3 -86 125 -20 140 -51 146 -222 -24 46 73 78 3 53 -160 -48 100
5052A00K4l26K82p2k57J82L48k73k8n1L6m8J31k92L58j69M31k81k05N0M7O6p8
$$ 100 124 -202 80 8 -249 -67 281 8 -20 -71 -35 -83 48 -244 114 -55 376 95 -110 -60 -13 53 -25
5075b5k03L25J68m73K02J23q8q7J10J06k77j3L4P7k33K04n9K28r1k01K7m7K04
$$ -25 -228 97 265 -208 -6 117 29 -58 52 158 -119 -132 -98 -21 -254 -50 -109 119 28 -173 -146 -193 11
5098A1m3J83N8k76Mq7O9oK72k72J23mj63Q0N4J78k73k31L31N6L4k30K41Q5k45
$$ 11 -32 151 209 -67 -63 -150 -81 -87 185 -87 36 32 -131 -51 3 181 -92 -323 8 64 98 -132 109 194 -51
5123e1K0R7r1o4K67j31J8K02j20m39M40j31o3L7P9P7l18K83l08L24j89R8o3M5
$$ -51 -31 66 -25 -89 178 47 65 267 147 -292 148 17 -46 -9 70 147 -171 112 -196 128 -61 37 -26 19
5147A9m6J00P4j00Q2J5j38qK32k71Ol6J40K0j64J82j23K68l94j10M58L4l08J00
$$ 19 -27 73 147 47 129 144 6 -2 230 -41 -35 -71 69 89 -75 107 -16 252 -142 -252 206 240 -68 32
5171C2q8j31n0L90l09r4M8L93j54Q8j95q2M26m74O7K67l21M06n1l26j0K21j36
$$ 32 -56 -187 -237 153 -156 -250 -202 191 37 125 -70 -152 274 -200 -133 134 -187 219 168 -158 -168 53 -83
5194h3j14j25K69j63Q6k4K87J71l63q6M0J46n1j41J67k82L23K2l10K65J55j06
$$ -83 -197 -322 -53 -216 -130 -154 133 304 -59 -145 -105 41 -10 -151 16 -266 57 79 -231 34 189 83
5216H3m02M68j65o9m3K14j36j80L37m11L34KK11k79lm5R6n8j53J05r6K07J8kJ42
$$ 83 -319 149 -16 -85 -128 86 -50 -230 107 -304 30 32 243 -36 -39 -84 12 -46 -199 -94 -190 17 35 33 175
5241A75Nk3k22J79j62l5M4k38K57k17K13R5p3K31n7k11N9j81K19L3j49J89j29
$$ 175 180 157 -65 114 -48 -83 -39 -277 -20 -237 -24 71 -2 229 172 -39 20 -161 58 91 -58 131 2
5264Bk76M65j99J73j79j31J25Q1Pl77L88J4k29N3j8n5J98l4l78P6R5L46j19J22
$$ 2 -274 191 -8 165 -14 -145 -20 61 68 -309 79 93 -136 -83 -101 -156 42 8 -370 -294 -199 147 28 150
5288A50j41J42k80q2K31J0k28K56MN4l26K53J16l7J06j63Kk47K04j8m3L1J90p9
$$ 150 9 151 -129 -211 20 30 -198 58 62 116 -210 43 159 122 228 65 67 -180 24 6 -37 -6 184 105
5312A05j7K0k23Qk78M80j46j82o1J93l6Q2J82l42L73p0p1j07j63K12p5J58J8j08
$$ 105 88 108 -115 -107 -385 95 -51 -233 -294 -101 -137 -55 127 -215 158 88 17 -90 -253 -41 -116 42 60 -48
5336d8J56Oq5K96m05J5J44l3J87r2Q2k56l7L20k39N7k67o7J88K29l33J19j37L54
$$ -48 108 114 29 325 -80 -65 79 46 233 141 223 -33 -70 250 11 68 -199 -266 -78 151 -182 -63 -200 154
5360A54r3k48L10j80K41j51j1j78M23k12j27r6P6j55K80j68J47R3m20N43l34j9
$$ 154 61 -187 123 -57 184 33 22 -156 267 55 -72 -168 -92 -247 33 -135 12 105 -315 228 -106 -125
5382a25m9J79K18l40R1l66L09J5K09k40R6L11l83J85p1J66p6m81L92k52J36K06
$$ -125 -174 5 223 -117 -26 -392 -83 -68 141 -99 -3 308 -75 110 39 205 129 -352 40 -212 -76 130
5404A30k73j97K99J22o9j19n2J89J00n1N1j60L3j2j45J92k49J35J94o2J64k07
$$ 130 -143 -340 -41 81 12 -107 -159 30 130 79 130 -30 3 -9 -154 38 -211 -76 118 56 220 13
5426A3J33qm62J73L26pJ69j83j39j44J45j09k00M07l0N0k92L9L25k28M7j48M64
$$ 13 146 138 -324 -151 175 168 337 154 15 -129 16 -93 -293 114 84 134 -158 -119 206 -22 25 -123 341
5449C41j26l61J30J16kk30N3j52K20p2K72j63j33K33q5j70M52l39j60J89j41P
$$ 341 215 -146 -16 100 98 -132 -79 -231 -11 -83 189 26 -107 126 41 -129 323 -16 -176 13 -128 -121
5471a21R8O7k7N0j84P7K00k99K00k14j67M86j27l07L70k6p0LR9k89L33j52P6j75
$$ -121 -23 44 17 67 -117 -40 160 -139 61 -153 -320 166 39 -268 102 76 6 9 108 -181 152 0 76 -99
5495i9O4K15j75k3L26k94J22J23n03K53j18J3P7n3J07j31J63k64N6L87%l55K03
$$ -99 -35 180 5 -18 308 14 136 259 -244 9 -109 -96 -19 -72 35 -96 67 -197 -141 246 246 -109 94
5518I4j87L22j17j45p0m5n5K51j56L88k76k09J33J74k94J99L24l08o8r1K11%k83
$$ 94 -93 229 112 -33 -103 -148 -203 48 -108 280 4 -205 -72 102 -192 7 331 23 -45 -136 75 75 -208
5541b08J87j02J69L10j92k24N8p6j25Q0M2J3K11j36j44K34j96km8q2K42o7J91
$$ -208 -21 -123 46 356 164 -60 -2 -78 -203 -123 -81 -68 143 7 -137 97 -99 -101 -149 -231 11 -56 135
5564A35j00J2M7k1n7QJ05j39j01J45l2j09R3Q8j99r8P2J90P0j10j40P5K58j38
$$ 135 35 47 94 73 16 24 129 -10 -111 34 2 -107 -14 74 -125 -223 -151 39 109 -1 -141 -66 192 54
5588E4l47K90Q9o6J28r8j5J69j33k0j30J15J87n30L37j03j0J93Q5k4j63l28K51
$$ 54 -293 -3 86 20 148 50 35 204 71 51 -79 36 223 -307 30 -73 -83 110 195 171 8 -320 -69
5611f9J46j32j46N18l48K79j61o4n3R3oj15J17k63J90K6J72k61j45K68j32Q2j73
$$ -69 77 -55 -201 317 -31 248 87 23 -30 63 57 -58 59 -204 -14 12 184 -77 -222 46 -86 -4 -177
5634a77J95K0k36J41j3J60j5j51p5R4k7R0j37M4J48J17k20J67j33Q9m57K34M40
$$ -177 18 38 -198 -57 -70 90 75 -76 -151 -57 -84 6 -131 -87 61 178 -42 125 -8 81 -376 -142 298
5657B98m34N17n33K42k70K70n1P9O2j2j24k37K42j47K77j30J1k21K42j10K88l60
$$ 298 -136 381 -152 90 -180 90 39 118 180 168 44 -193 49 -98 179 49 60 -161 81 -29 259 -101
5679a01L88j87J2j37K36k06M3o8J33k23N45m71Q3K2M4k29k5m9K20Q5m7M2m37J97
$$ -101 287 100 112 -25 211 5 48 -20 113 -110 435 -36 47 69 113 -116 -141 -190 30 115 68 110 -327 -130
5703a30o4J89M56o38Q7J70k34p0M12k12rK2J89m8J66o4m06L36l40L76j07j8p6
$$ -130 -194 -5 451 -187 -100 70 -164 -234 178 -34 -43 -21 168 120 286 222 -184 152 -188 188 81 63 -13
5726a3k39L73k03j25K64Q5k67O0J63P2j36j99o7J7J28J50mj60O5R7q9L0o8k24
$$ -13 -252 121 -82 -207 57 142 -125 -65 98 170 34 -165 -232 -215 -87 63 59 -101 -36 61 -28 2 -66 -290
5750b90L17R4l5N9k06J88k60K03O8o9K48m35J13N4k7O8j44l84M04O0p3Q1K7M1
$$ -290 27 121 86 145 -61 127 -133 70 138 69 317 -118 -5 49 22 90 -54 -438 -34 26 -47 34 61 102
5774A02m5J10l91M7K41k1J40k28K53j41j13K93l72K88m15K30N1j93K58l62K13
$$ 102 57 167 -224 -177 64 43 183 -45 208 67 -46 247 -125 163 -252 -22 29 -164 94 -268 -55
5795e5L6j07M0j9r2L94l57j14Q3K85j70J45j83j1J68k94K32L56l37m3j21J71j20
$$ -55 -19 -126 -86 -105 -197 197 -160 -274 -191 94 -76 69 -114 -125 43 -251 -19 337 0 -43 -164 7 -113
5818a13M5K14j02j14O7J6J40r4J10k13l40N27N8k70M2j09K53J70m59K50k11j2
$$ -113 -68 146 44 -70 -3 13 153 59 169 -44 -384 143 201 -69 -27 -136 117 287 -172 78 -133 -145
5840a45M58n07R3p5J34k2k35L06J40q3l12K34k33L50k23J35J05rK9n9j20kq7m
$$ -145 313 -194 -101 -176 -42 -64 -299 7 147 64 -248 -14 -247 103 -120 15 120 111 140 81 -39 -41 -128 -132
5864a32K20J24k64j32L58k51m7K65j58l7k6M19m61J43o8j5R9j33K30q3r4Ok6j9
$$ -132 88 212 -52 -184 174 -77 -124 141 -17 -54 -80 339 -122 21 -47 -62 37 -96 134 51 -43 -37 -63 -82
5888h2j28N08l82K23O5k18O8r4QK03l3j09O3p2Q3j59L7j00J24m4J13k19J46j30
$$ -82 -210 298 -84 139 204 -14 54 -40 -32 171 138 29 92 20 103 -56 -19 -119 5 -39 74 -145 1 -129
5912a29l0L99k21O5k01K31k41J50k26j07K61j7O3k8k4R0q6ql87M48j26P5L96j60
$$ -129 -159 240 19 84 -117 114 -127 23 -203 -310 -49 -66 -3 -31 -55 35 -51 -59 -446 2 -124 -49 347 187
5936A87j12j54J0Q4o9q3J17M1O1K04n67L15l25J93mL27m47K37k11l3K72j2r4R2
$$ 187 75 -79 -69 15 -54 -137 -20 21 82 286 -281 34 -291 -98 -102 225 -222 15 -196 -229 43 31 -63 29
5960B9L02j62k62K19m47L18j08j78R4L12J54k74J00op1J27k2q8Q5q4q7M7k5J48
$$ 29 331 169 -93 126 -321 -3 -111 -289 -195 117 271 -3 97 91 20 147 125 37 122 38 -49 -2 -27 121
5984A21k91L84k27L09n02J76r8Q7Qj07M65m24j7N0n4K98k30RQ8m4k63J97l08M54
$$ 121 -170 214 -13 296 -206 -30 -128 -41 -33 -140 325 -99 -116 -66 -120 178 -52 -43 45 1 -262 -65 -373 81
6008H1O3l31J66K79M2j34o2J4j36J95J90l05j4j71R2q8N4N4o5j60L48l13L50k4
$$ 81 144 -187 -21 258 300 166 104 118 -18 177 367 62 48 -123 -31 -119 -65 -11 -76 -236 112 -201 149 125
6032A25p1Q8j07r7n4K55m54J98J04j30J40j19M6p3K77J60m17K56k39J39J5k2n8
$$ 125 54 142 35 -62 -116 139 -315 -117 -13 -143 -3 -122 -76 -149 128 288 -129 127 -112 27 42 20 -38
6055c8j32K9J13l2J5L53m67k0K02q8J90j56J59j94j28J58K15j73K69j56j09K14
$$ -38 -170 -141 -28 -60 -45 308 -159 -179 23 -65 125 -31 128 -66 -194 -36 179 6 275 119 10 224
6077B24J24k36r0j81J76j90J78p1J16M7o3o1n9L20l25J56n4J3J85l76K01l9J05
$$ 224 348 112 22 -159 17 -173 5 -66 50 97 34 -27 -86 234 -91 65 11 24 209 -167 34 -5 100
6100A00R3m71M54K18j29k43o2P3k9j12P7P6j51J0K73k9l1l36K96MJ9k97K47k61
$$ 100 193 -278 176 394 265 22 -40 33 4 -108 -31 45 -106 -96 177 148 117 -219 77 81 100 -197 50 -211
6124b11K34J6J1l8Q3r4rj39J57r3k5K77k68K94m6k30J63n8k6JK57l7k45j2j8P1
$$ -211 23 39 50 12 95 1 -8 -147 10 -83 -108 169 -99 195 149 -81 82 24 -2 -1 256 219 -26 -38 -56 15
6150A5J68l16J20J22j0j78J61J0O8k38q2K38q1j65L01k40K24J20m11K84n5m13
$$ 15 183 -133 -13 109 99 -79 82 92 160 -78 -160 78 -3 -168 133 -107 117 237 -174 110 55 -358
6172c58M19l32J76N6oL05j71P9j69K8n2L39j48o9q8k27K20L0j04M5J40k2k00l
$$ -358 61 -271 -95 -39 -45 260 89 168 -1 27 -25 314 166 97 9 -218 2 32 -72 -27 113 91 -109 -112
6196a12k5J30P4J06Onl05L2j0K93M5j32l8j1j88J83J70k72m3j6J17k75N6J38J81
$$ -112 -137 -7 67 173 179 174 -131 -99 -109 184 229 97 59 48 -140 43 213 -59 -102 -118 -1 -276 -220 -82 99
6221I9j39N0J1K83k25j86J15qJ13K7k93K17oj96K99m19M57n62J63K26K25j52k74
$$ 99 -40 10 21 304 79 -107 8 0 113 140 -153 64 58 -138 161 -258 199 -363 -200 26 251 99 -175
6244a75K61m42M15q0k5J09j43K9r8J04J10j05M8j34J45J56n3m67M32l3j33P8K64
$$ -175 86 -356 59 -21 -46 63 -80 -51 -149 -45 65 -40 8 -126 19 175 122 -345 87 54 -79 -1 263
6267B63j09q0j56K92M4m04K04O6k39K2M81m60K66J18l13j70m4M57k21j07K69j07
$$ 263 154 74 -82 210 254 -150 54 120 -119 -97 384 -76 190 308 -5 -175 -219 238 17 -90 179 72
6289G2k04R3K2L1mK04j19m5J03k12N9m3L84l35M1p8J6Q2J30j60j85K51o3J04k66
$$ 72 -132 -39 -17 14 10 214 95 50 153 -59 0 -43 341 6 47 -31 -15 67 197 37 -148 103 40 144 -122
6314a22M09j15j41J14Ql8n0k64L23l93L86%n0k89K30K24k07O1j76J96J85j18j7
$$ -122 287 172 31 145 153 115 65 -199 124 -269 117 117 67 -222 8 232 25 86 -90 106 291 173 156
6337A56l2J30l75J83p7K09j90J55q1q1M0K00k02L2j72K00k12L8L46k03k3J49%
$$ 156 124 254 -121 62 -15 194 4 159 78 -3 37 237 35 67 -105 95 -117 -79 267 64 41 190 190
6360A90j84N9j31j38L79j77l42P03l97O0J01j60j64K41L0q4lO9qM0J69j12r5j6
$$ 190 6 65 -66 -204 175 -2 -344 359 -38 22 123 -37 -201 40 70 -14 -17 52 44 84 253 141 46 30
6384C0M0Q4j50l2R3k07L92l83M31l33m3j88L20p4J61l27O9pK60k73kL49k47K39
$$ 30 70 154 4 -28 65 -142 250 -133 298 -35 -78 -266 54 -20 141 -186 -117 -124 136 -137 -139 210 -37 202
6408B02k28M9J2J42k38J64j54P9j08J6R2j48rK17j36l30L55m6K5j54L17m5j25
$$ 202 -26 23 35 177 -61 103 -51 28 -80 -64 28 -120 -129 88 -48 -378 -23 -69 -44 -198 119 74 -51
6431e1J2j70L46l30R7J25l9J44k14L69l36r9pJ85P6n22K99K04j16Q8p4o1k16N51
$$ -51 -39 -209 137 -193 -96 29 -10 134 -80 289 -47 -146 -153 32 108 -414 -115 89 -27 61 -13 -74 -290 261
6455B61l76PM4J47L8Q8j92k5lK68m00K45j67m6M17m56O3J3M1%M4ok49J55J80j56
$$ 261 -115 -108 -64 83 121 209 17 -8 -11 257 -143 102 -65 -111 306 -150 -87 -74 -33 -33 11 5 -244 -89 91 -65
6481f5j48J41M0J33j0l11M08k60r3K03J10k11J84m8j03k7O0q9K64p0J38j92J39
$$ -65 -213 -72 -32 101 91 -220 188 -72 -165 38 148 -63 121 73 -30 -57 3 -86 178 108 246 54 193
6504A93O4j99j66k59M58n4R5n16K10J06q1J24l06K02J75j96L79k98K56j88n2K7
$$ 193 257 58 -108 -367 91 37 132 -384 -174 -68 -149 -25 -331 -129 46 -150 229 -69 187 -1 -53 -26
6526b6K9l9m7K05L7l37L01RJ31l06J58J59l59q2L84n10J76O9l0J04q6N4N9P8l12
$$ -26 3 -36 -83 122 159 -178 123 132 263 -43 115 274 -85 -167 217 -293 -117 -48 -78 26 -60 -6 53 131 -181
6551a81J68J17J3j21LN7k4j59Qj3K58k81L3J16j92K81k3j86K06j4M5L3J0L8k16
$$ -181 -13 104 117 -4 -1 56 32 -127 -119 -132 126 -155 -122 -6 -198 83 60 -126 80 66 111 144 154 192 -24
6576b4O2M5P5j53J09n8j34p2M50m12N7P9n5L9k25K4R4R9J0j43L54n2k10J56J14
$$ -24 38 83 158 5 114 56 -78 -150 300 -112 -55 24 -31 8 -217 -193 -99 0 10 -133 221 169 -41 115 229
$$ [...]
8191b06
##END NTUPLES=NMR FID
##END=
