##TITLE=1H_LR_724-R2-CR7
 200.13MHz, CDCl3
 8 sc
 
 19ns.25.2.2025
##JCAMPDX= 6.0         $$ Bruker NMR JCAMP-DX V2.0
##DATA TYPE= NMR FID
##DATA CLASS= NTUPLES
##ORIGIN= UXNMR, Bruker Analytische Messtechnik GmbH
##OWNER= pz
$$ XWIN-NMR		Version 3.5
$$ Tue Feb 25 14:12:23 2025 Russian Standard Time (UT+4h)  new_Human@DPX200
##.OBSERVE FREQUENCY= 200.1313
##.OBSERVE NUCLEUS= ^1H
##.DELAY= (6, 6)
##.ACQUISITION MODE= SIMULTANEOUS
##.ACQUISITION SCHEME= undefined
##.AVERAGES= 8
##.DIGITISER RES= 18
##SPECTROMETER/DATA SYSTEM= spect
##.PULSE SEQUENCE= zg30
##.SOLVENT NAME= CDCl3
##.SHIFT REFERENCE= (INTERNAL, CDCl3, 0, 14.3821)
##AUDIT TRAIL= $$ (NUMBER, WHEN, WHO, WHERE, WHAT)
$$ ##TITLE= Audit trail, XWIN-NMR		Version 3.5
$$ ##JCAMPDX= 5.01
$$ ##ORIGIN= Bruker BioSpin GmbH
$$ ##OWNER= new_Human
$$ C:/Bruker/XWIN-NMR/data/yarkov/nmr/H-C/1/audita.txt
$$ ##AUDIT TRAIL=  $$ (NUMBER, WHEN, WHO, WHERE, WHAT)
(   1,<2025-02-25 14:09:46.20 +0400>,<new_Human>,<DPX200>,
      <created by zg, POWCHK disabled, PULCHK disabled
       configuration hash MD5:
       00 E9 B6 7A A2 85 ED C7 34 08 36 98 17 FE 4E 26
       data hash MD5: 16K
       DB 16 FB C1 CD 6E BC E1 93 07 65 9B B8 C4 7C B5>)
$$ ##END=
$$ 
$$ hash MD5
$$ E6 B5 D6 7A A9 CF 7D 38 7E 59 6E C7 97 54 7D 69
##$RELAX= 
##$RELAX= 
##$RELAX= 
##$RELAX= 
##$RELAX= 
##$RELAX= 
$$ Bruker specific parameters
$$ --------------------------
##$DU= <C:/Bruker/XWIN-NMR>
##$EXPNO= 1
##$NAME= <H-C>
##$PROCNO= 1
##$TYPE= <nmr>
##$USER= <yarkov>
##$AMP= (0..31)
100 100 100 100 100 100 100 100 100 100 100 100 100 100 100 100 100 100 
100 100 100 100 100 100 100 100 100 100 100 100 100 100 
##$AQSEQ= 0
##$AQ_mod= 1
##$AUNM= <au_zg>
##$AUTOPOS= <>
##$BF1= 200.13
##$BF2= 200.13
##$BF3= 200.13
##$BF4= 200.13
##$BF5= 200.13
##$BF6= 200.13
##$BF7= 200.13
##$BF8= 200.13
##$BYTORDA= 1
##$CFDGTYP= 0
##$CFRGTYP= 5
##$CHEMSTR= <none>
##$CNST= (0..31)
1 1 145 1 1 1 1 1 1 1 1 1 1 1 1 1 1 1 1 1 1 1 1 1 1 1 1 1 1 1 1 1 
##$CPDPRG= <>
##$CPDPRG1= <>
##$CPDPRG2= <>
##$CPDPRG3= <>
##$CPDPRG4= <mlev>
##$CPDPRG5= <mlev>
##$CPDPRG6= <mlev>
##$CPDPRG7= <mlev>
##$CPDPRG8= <mlev>
##$CPDPRGB= <>
##$CPDPRGT= <>
##$D= (0..31)
0 0.7 0 0 0 0 0 0 0 0 0 0.03 0 0 0 0 0 0 0 0 0 0 0 0 0 0 0 0 0 0 0 0 
##$DATE= 1740478185
##$DBL= (0..7)
120 120 120 120 120 120 120 120 
##$DBP= (0..7)
150 150 150 150 150 150 150 150 
##$DBP07= 0
##$DBPNAM0= <>
##$DBPNAM1= <>
##$DBPNAM2= <>
##$DBPNAM3= <>
##$DBPNAM4= <>
##$DBPNAM5= <>
##$DBPNAM6= <>
##$DBPNAM7= <>
##$DBPOAL= (0..7)
0.5 0.5 0.5 0.5 0.5 0.5 0.5 0.5 
##$DBPOFFS= (0..7)
0 0 0 0 0 0 0 0 
##$DE= 6
##$DECBNUC= <off>
##$DECIM= 32
##$DECNUC= <off>
##$DECSTAT= 4
##$DIGMOD= 1
##$DIGTYP= 9
##$DL= (0..7)
0 120 120 120 120 120 120 120 
##$DP= (0..7)
150 150 150 150 150 150 150 150 
##$DP07= 0
##$DPNAME0= <>
##$DPNAME1= <>
##$DPNAME2= <>
##$DPNAME3= <>
##$DPNAME4= <>
##$DPNAME5= <>
##$DPNAME6= <>
##$DPNAME7= <>
##$DPOAL= (0..7)
0.5 0.5 0.5 0.5 0.5 0.5 0.5 0.5 
##$DPOFFS= (0..7)
0 0 0 0 0 0 0 0 
##$DQDMODE= 0
$$ [...]
##$SUBNAM0= <"">
##$SUBNAM1= <"">
##$SUBNAM2= <"">
##$SUBNAM3= <"">
##$SUBNAM4= <"">
##$SUBNAM5= <"">
##$SUBNAM6= <"">
##$SUBNAM7= <"">
##$SUBNAM8= <"">
##$SUBNAM9= <"">
##$SW= 18.0517328524113
##$SWIBOX= (0..15)
0 0 2 0 0 0 0 0 0 0 0 0 0 0 0 0 
##$SW_h= 3612.71676300578
##$TD= 16384
##$TD0= 1
##$TE= 0
##$TE2= 300
##$TE3= 300
##$TEG= 300
##$TL= (0..7)
0 120 120 120 120 120 120 120 
##$TP= (0..7)
150 150 150 150 150 150 150 150 
##$TP07= 0
##$TPNAME0= <>
##$TPNAME1= <>
##$TPNAME2= <>
##$TPNAME3= <>
##$TPNAME4= <>
##$TPNAME5= <>
##$TPNAME6= <>
##$TPNAME7= <>
##$TPOAL= (0..7)
0.5 0.5 0.5 0.5 0.5 0.5 0.5 0.5 
##$TPOFFS= (0..7)
0 0 0 0 0 0 0 0 
##$TUNHIN= 0
##$TUNHOUT= 0
##$TUNXOUT= 0
##$USERA1= <user>
##$USERA2= <user>
##$USERA3= <user>
##$USERA4= <user>
##$USERA5= <user>
##$V9= 5
##$VALIST= <valist>
##$VCLIST= <CCCCCCCCCCCCCCC>
##$VD= 0
##$VDLIST= <DDDDDDDDDDDDDDD>
##$VPLIST= <PPPPPPPPPPPPPPP>
##$VTLIST= <TTTTTTTTTTTTTTT>
##$WBST= 1024
##$WBSW= 4
##$XGAIN= (0..3)
0 0 0 0 
##$XL= 0
##$YL= 0
##$YMAX_a= 614805
##$YMIN_a= -663338
##$ZGOPTNS= <>
##$ZL1= 120
##$ZL2= 120
##$ZL3= 120
##$ZL4= 120
##$ABSF1= 10
##$ABSF2= 0
##$ABSG= 5
##$ABSL= 3
##$ALPHA= 0
##$AQORDER= 0
##$ASSFAC= 0
##$ASSFACI= 0
##$ASSFACX= 0
##$ASSWID= 0
##$AUNMP= <proc_1d>
##$AZFE= 0.1
##$AZFW= 0.1
##$BCFW= 1
##$BC_mod= 2
##$BYTORDP= 1
##$COROFFS= 0
##$CY= -3
##$DATMOD= 1
##$DC= 2
##$DFILT= <>
##$DTYPP= 0
##$F1P= 0
##$F2P= 0
##$FCOR= 0.5
##$FTSIZE= 0
##$FT_mod= 4
##$GAMMA= 1
##$GB= 0.15
##$INTBC= 1
##$INTSCL= 1
##$ISEN= 128
##$LB= 0.25
##$LEV0= 0
##$LPBIN= 0
##$MAXI= 10000
##$MC2= 0
##$MEAN= 0
##$ME_mod= 0
##$MI= 1.114404
##$NCOEF= 0
##$NC_proc= 0
##$NLEV= 6
##$NOISF1= 3.799351
##$NOISF2= 2.8
##$NSP= 1
##$NTH_PI= 0
##$NZP= 0
##$OFFSET= 14.38212
##$PC= 1
##$PHC0= -1179.726
##$PHC1= 5.192251
##$PH_mod= 1
##$PKNL= yes
##$PPARMOD= 0
##$PSCAL= 0
##$PSIGN= 0
##$REVERSE= no
##$SF= 200.129724274929
##$SI= 16384
##$SIGF1= 3
##$SIGF2= 2
##$SINO= 400
##$SIOLD= 16384
##$SREGLST= <1H.CDCl3>
##$SSB= 0
##$STSI= 0
##$STSR= 0
##$SW_p= 3205.1282051282
##$SYMM= 0
##$S_DEV= 0
##$TDeff= 0
##$TDoff= 0
##$TI= <>
##$TILT= no
##$TM1= 0
##$TM2= 0
##$TOPLEV= 0
##$USERP1= <user>
##$USERP2= <user>
##$USERP3= <user>
##$USERP4= <user>
##$USERP5= <user>
##$WDW= 1
##$XDIM= 8192
##$YMAX_p= 0
##$YMIN_p= 0
$$ End of Bruker specific parameters
$$ ---------------------------------
##NTUPLES= NMR FID
##VAR_NAME=  TIME,          FID/REAL,        FID/IMAG
##SYMBOL=    X,             R,               I
##VAR_TYPE=  INDEPENDENT,   DEPENDENT,       DEPENDENT
##VAR_FORM=  AFFN,          ASDF,            ASDF
##VAR_DIM=   8192,          8192,            8192
##UNITS=     SECONDS,       ARBITRARY UNITS, ARBITRARY UNITS
##FACTOR=    0.0002768,     1,               1
##FIRST=     0,             0,               0
##LAST=      2.2672688,     0,               0
##MIN=       0,             -663338,         0
##MAX=       2.2672688,     614805,          0
$$ Real data points
##PAGE= N=1
##DATA TABLE= (X++(R..R)), XYDATA
0 0 0 0 0 0 0 0 0 0 0 0 0 0 0 0 0 -8 8 -8 8 -8 10 -14 16 -16 21 -24 24 -29 31 -37 44 -46 52 -60 66 -76 81 -91
38 -91 102 -114 125 -136 150 -168 185 -201 222 -244 269 -297 325 -358 396 -440 492 -546 613 -696
58 -696 793 -914 1065 -1267 1539 -1927 2513 -3477 5254 -9192 21340 -130446 -639160 -133041
72 -133041 207546 -97060 188366 614805 79922 -348059 101140 138760 -355323 -88660
82 -88660 394401 40838 -169415 243500 8590 -663338 -356994 284611 121823 4958
92 4958 334997 36969 -534418 -177758 323232 49709 -8369 420286 197702 -308938 -28341
103 -28341 214105 -263976 -290818 322936 295502 -144310 -23527 -1955 -479922 -347823 328128
114 328128 292274 -84965 96835 112551 -351461 -224004 323997 166784 -153161 183445
124 183445 312718 -143464 -189665 85758 -144119 -268178 243403 374836 -126210 -214665
134 -214665 -3172 -228821 -271456 264896 364223 -105252 -115574 146428 -69084 -201628
144 -201628 139892 167122 -122293 59156 300381 -47694 -294506 -39888 -6488 -160835
154 -160835 127143 339384 -65967 -316514 -45970 22343 -105209 120084 261960 -51568
164 -51568 -135086 144318 67447 -189943 -17995 154220 -37501 -20004 215380 13282 -323063
175 -323063 -154043 92135 7748 34108 172025 -39498 -250082 -18985 148248 -20344
185 -20344 -9201 160646 32997 -97172 93394 120992 -145121 -139530 98566 80314 -16451
196 -16451 55132 -30235 -242102 -122395 132121 69007 -48375 40439 15114 -125151 -8704
207 -8704 164364 39018 -81398 48120 105858 12600 26622 33919 -114425 -119577 83161
218 83161 109581 -45022 -64553 -38878 -119506 -75937 104138 88203 -68334 -53105 37182
229 37182 21759 34022 84517 1421 -74999 43004 132415 28511 -49110 -24305 -53650 -68172
241 -68172 42528 83033 -46130 -119839 -56377 -8314 14139 53804 15470 -69621 -27047 83369
253 83369 76184 9885 4334 300 -18490 35817 90243 21732 -74797 -70886 -21280 10712 32763
266 32763 1960 -80813 -90356 2374 55402 21148 -10615 -14959 -16859 17756 76939 71141 -1225
279 -1225 -41136 -14274 33475 59915 31556 -45023 -84475 -35627 27110 24719 -18130 -50692
291 -50692 -55702 -23590 31888 53826 16125 -30282 -29685 19097 70458 69391 9318 -43741 -28993
304 -28993 27572 51311 16234 -36488 -59714 -41879 -2773 23192 8536 -35194 -61591 -30399
316 -30399 34096 62768 25075 -28141 -30301 18631 62950 56686 10285 -29674 -29552 3614 32035
329 32035 25015 -17685 -59538 -57224 -9697 33257 21743 -31945 -61391 -25022 37579 57650
341 57650 25586 -12758 -20488 6313 43757 55176 23112 -23630 -40282 -14779 25466 34882
353 34882 -10940 -68149 -61921 -517 33955 12602 -20689 -36506 -26699 16355 56751 42243
365 42243 -2977 -18399 -1138 24505 50304 39231 -24941 -59983 -11740 37326 16303 -24709
377 -24709 -43103 -51606 -27990 28381 38599 -12463 -37628 -16575 4169 34389 65413 25851
389 25851 -41542 -17230 52804 44380 -3233 -13950 -27416 -38329 11712 47232 -13939 -68908
401 -68908 -42575 -17609 -7445 42984 48988 -38192 -62867 24986 60919 16862 14171 22218 -14888
414 -14888 380 62145 24572 -58412 -39317 4499 -12497 8240 46819 -32038 -114388 -37860
426 -37860 51735 20814 3016 30335 -13153 -44366 38211 69955 -14522 -22294 47310 25578
438 25578 -9983 39656 13713 -100756 -71108 56547 46773 -22205 -5638 -30317 -99698 -27424
450 -27424 83427 29162 -32842 32038 35513 -38681 8472 69873 -22985 -58617 69751 92536
462 92536 -23546 -37895 -11893 -83792 -62248 86730 76062 -58053 -45723 4164 -65509
473 -65509 -47066 86790 57273 -54377 16039 91205 -14250 -59647 24927 4968 -39656
484 -39656 74905 115712 -48695 -110512 -16396 -28422 -55746 73207 104360 -61290 -91159
495 -91159 28702 -411 -66021 36647 81886 -18533 9192 100729 -14169 -127092 -11832
506 -11832 62113 -7512 41245 111233 -46199 -168401 -33735 48089 -24466 22224 98164
517 98164 -22789 -93297 30439 33145 -87428 -8097 123559 37963 -23080 64395 -2347
528 -2347 -156675 -55657 111916 49573 -9392 51857 -30143 -157840 -39957 88101 -5397
539 -5397 -27779 95769 44920 -88418 -13892 52043 -63676 -46418 131289 107534 -37264
550 -37264 -19119 -15896 -129909 -62466 128994 80551 -59911 -7596 11128 -115394 -72971
561 -72971 87793 39127 -46900 66708 99968 -54373 -69163 28593 -23751 -38971 127287
572 127287 135500 -65616 -98756 -6383 -61118 -71723 91313 99981 -67521 -58977 33001 -49353
584 -49353 -87946 48432 66451 -26281 49875 120832 -36189 -123470 6715 46827 -11047
595 -11047 74226 119728 -55588 -140498 -18333 6129 -51784 34451 85963 -43338 -72885
606 -72885 39243 -2095 -101708 85 102233 28536 16434 84253 -12839 -128917 -20584
617 -20584 88210 27790 20868 67982 -39644 -132553 -19363 48298 -42494 -27789 71016 12233
629 12233 -65332 8628 20414 -78671 -27373 107737 71906 -5438 28255 -5160 -101023 -24689
641 -24689 102915 43088 -35693 15079 537 -88407 -39401 44635 -16935 -47963 47904 51687
653 51687 -39922 -26163 12732 -42865 -22636 101084 88876 -29497 -31111 6780 -40275 -26503
665 -26503 67299 42269 -48992 -21011 21039 -37098 -46158 17185 -2821 -38114 37842 72361
677 72361 -23550 -60003 3868 10644 -2371 60387 67128 -30286 -52515 9010 2795 -20724 23604
690 23604 22806 -43973 -26100 35842 -5786 -59022 -12431 23281 128 21761 49303 -12186
702 -12186 -55914 696 37835 14785 23872 30843 -27869 -47318 14798 27233 -25161 -23793 8355
715 8355 -7127 -12660 18394 -488 -45650 -17648 33212 25717 13268 20793 -9563 -38122 7750
728 7750 50410 16744 -16752 -4823 -6582 -16660 6816 12054 -26516 -33207 4458 13288 -918
741 -918 3016 -5388 -29718 -6914 41723 36353 -3152 -10148 -1445 -1221 14681 27391 149 -27187
755 -27187 -12380 4638 -321 -2493 -6095 -27087 -26150 11046 26577 1562 -17055 -10798 1079
768 1079 16910 31036 17109 -10508 -11730 6973 15181 12493 4079 -15803 -27014 -7082 15258
781 15258 6096 -18161 -25754 -15684 2326 17299 12937 -6885 -14540 361 17371 23704 17518
794 17518 -81 -13840 -5001 16828 20299 -277 -20870 -22289 -7294 7483 6656 -9567 -22308
807 -22308 -16880 103 14060 14914 1987 -11043 -6849 13295 27645 19476 -2916 -14419 -4312
820 -4312 13146 16449 698 -17448 -21905 -11622 3117 7416 -2965 -17824 -20475 -4271 16196
833 16196 19626 3401 -11851 -7098 12657 25353 17857 -1134 -12041 -6611 6397 12390 4838
846 4838 -11640 -23373 -16859 1952 11410 331 -16637 -18846 -3787 15015 19381 4934 -8861
859 -8861 -5135 9863 18429 16895 5742 -10487 -14948 1098 15291 6539 -11947 -21497 -16610 -1487
873 -1487 11670 4088 -15491 -16784 713 12662 13591 11125 -791 -11839 585 23209 21513
886 21513 1023 -10809 -12932 -7019 9619 13626 -10142 -26182 -11022 3400 765 1345 -82
899 -82 -14675 -11779 17037 26290 5684 -6061 -4047 -4112 10079 29417 12296 -20718 -16926 3076
913 3076 -765 -3421 4549 -9684 -25727 -3265 18356 -154 -15055 -4218 -2257 1290 27902
926 27902 28755 -11848 -22426 7180 14134 5120 15903 9559 -25197 -21699 11509 4849 -18954
939 -18954 -8133 -494 -12920 3127 23276 -8107 -34843 -71 27099 13034 15654 22081 -13985
952 -13985 -31600 10580 29223 -223 -3602 8045 -16335 -23252 11179 4726 -35107 -16010 24450
965 24450 8534 -8298 10247 -6073 -36612 1715 48153 22572 -3901 9787 -6797 -31083
977 -31083 8088 35661 -7602 -23090 15593 7004 -30209 -10748 5119 -28195 -16442 40763
989 40763 27978 -21798 -12195 -270 -24066 3641 58340 27442 -26409 -4310 12977 -22602
1001 -22602 -14037 27929 2903 -26344 13804 23048 -32644 -36326 3925 -6998 -8860 45295 39110
1014 39110 -35083 -36296 13373 3260 -4786 41510 33909 -27886 -17179 20838 -14590 -34609
1026 -34609 15511 20109 -18531 7553 30100 -34369 -60250 6951 30048 1274 25302 36106
1038 36106 -30231 -46869 17353 24055 -11140 19170 38215 -18522 -29286 18075 -5761 -50327
1050 -50327 -398 45431 4263 -11398 14033 -24239 -58974 7151 54499 11900 703 27183
1062 27183 -13064 -47203 10281 37104 -13503 -8209 39860 6914 -38026 -6787 -1452 -42426
1074 -42426 -7044 56616 20802 -29733 -5232 -6999 -43245 2618 63602 20891 -22283 12827
1086 12827 10881 -35950 -10265 31946 -4352 -17758 34857 22398 -44220 -32334 3901 -19947
1098 -19947 -8943 53472 32506 -40248 -26789 10787 -12224 -4855 47769 27025 -25202 1506
1110 1506 24487 -23659 -31372 19226 11977 -16128 20279 27651 -40322 -52416 5516 11786 -4149
1123 -4149 30482 29882 -31974 -32249 20400 10648 -12839 24615 32650 -15080 -10115 23772 -12217
1136 -12217 -43779 3787 29407 -2943 56 14672 -30562 -50411 7897 31946 -1252 6512
1148 6512 24383 -14536 -29270 18615 23317 -15940 628 32772 4476 -15592 6321 -8226
1160 -8226 -39195 -2786 36080 5819 -17747 183 -13079 -34574 4633 37215 4135 -12481
1172 -12481 14266 8140 -15260 5690 18169 -11666 -7457 29428 15126 -21573 -12336 -2899 -22398
1185 -22398 -6384 30240 10894 -25866 -12513 2487 -10477 1884 25277 4841 -15069 11142
1197 11142 20166 -7716 -8731 10139 -1661 -7663 18736 15858 -21335 -24623 -1425 -2471 -2918
1210 -2918 15068 5069 -22846 -11259 14203 4745 -4699 9603 7966 -6373 7550 20124 -2712
1223 -2712 -17405 -306 7321 890 7042 4833 -19719 -22272 3641 9558 -3284 -1183 1480 -9673
1237 -9673 -4895 14907 10141 -6906 -1837 8876 5655 6724 9625 -5736 -16742 -647 11971
1250 11971 1954 -5777 -4923 -11543 -11593 4687 10570 -3734 -9157 -663 3320 5296 10595 4171 -8026
1265 -8026 -2360 11845 10549 799 -2719 -6349 -8226 559 8733 111 -11406 -10399 -4276 834
1279 834 5701 3567 -6447 -7664 4523 11677 7093 1665 -1568 -3025 2329 9553 6889 -4169
1293 -4169 -9407 -6448 -754 3710 2028 -6858 -12400 -5648 4493 6372 1390 -3295 -4177 899 8579
1308 8579 10587 4537 -3102 -3992 1337 7436 6599 -1330 -9927 -8922 -686 4166 994 -5909 -9471
1323 -9471 -5851 1803 6736 4826 -1441 -4605 -242 7552 10747 5600 -2774 -5424 299 6266 5750
1338 5750 -1639 -8006 -8395 -3210 2555 2414 -3562 -8241 -6896 721 7015 6890 -97 -5044 -938 7193
1354 7193 9960 5409 -1124 -4557 -1888 3899 5594 -173 -7158 -8506 -4378 1094 3987 -858 -8541
1369 -8541 -7537 1578 7654 5822 1543 -2172 -2315 4134 10021 5985 -1928 -3935 -1797 633 4363
1384 4363 2601 -7095 -12205 -4141 4226 2106 -1492 -3997 -6911 -2863 7951 9513 466 -2144 1657
1399 1657 2358 4385 8648 1658 -8892 -4302 5808 3456 -2690 -4132 -8165 -10093 1289 9148
1413 9148 -449 -7289 -2124 -310 -627 8291 9456 -3600 -5341 7782 8303 -528 -92 -691 -8251
1428 -8251 -1963 10773 2698 -11870 -8708 -2754 -5535 2046 11426 -828 -12161 167 9172 636
1442 636 1084 7677 -184 -3654 10739 10474 -8721 -9945 1771 -1584 -2307 9863 2780 -18659 -12790
1457 -12790 5883 2071 -2613 7767 3364 -10170 1257 13959 -725 -8072 7709 8520 -2297
1470 -2297 6417 9338 -13837 -18345 5321 9528 -3480 1469 2533 -16899 -13950 10917 7564 -8253
1484 -8253 3972 12057 -4930 -3693 12670 125 -14706 6823 20214 668 -5235 2735 -12466
1497 -12466 -19848 7636 17944 -5815 -8747 5071 -8309 -16037 8377 13327 -8610 -997 19422
1510 19422 3847 -11622 3290 2819 -12697 5560 26284 2116 -18794 -3808 -3371 -17039 2850
1523 2850 21452 -2777 -16866 4325 3336 -15920 -501 15542 -2051 -2995 22190 9901 -20700
1536 -20700 -8287 9650 -3510 864 23468 3930 -26768 -11206 6026 -9580 -4621 18404
1548 18404 3241 -17397 3200 11442 -14809 -11456 17716 10729 -2997 14297 11047 -22804 -18157
1561 -18157 14047 8398 -3646 12839 6621 -25443 -15942 11754 -1027 -12391 12058 14431 -11425
1574 -11425 -4545 11660 -9781 -17202 16481 23528 -1484 973 7984 -18472 -21282 14357 17679
1587 17679 -7965 -1035 9058 -15600 -19469 9212 5799 -14049 6047 22484 -2560 -12687
1599 -12687 5857 -3017 -15569 13413 29461 -903 -13128 2887 -7528 -18609 8271 19650
1611 19650 -8055 -10909 9502 -3302 -19737 1084 9760 -8445 1750 24523 3899 -19700
1623 -19700 -3186 6394 -6497 7082 25576 1001 -20655 -3114 2932 -12785 -1276 15483
1635 15483 -2951 -13509 7499 5891 -18131 -8630 12819 3301 390 17861 6880 -20284 -8902
1648 -8902 12119 2869 -80 14768 2290 -20504 -5974 9243 -7172 -10551 9137 4911 -9300
1661 -9300 2390 7475 -13547 -12419 12809 12651 -178 7365 6054 -15013 -10198 13660 8660 -6443
1675 -6443 2016 4151 -11784 -7875 7186 -2832 -12881 3869 11345 -3223 -3415 4762 -6575
1688 -6575 -10088 11658 17467 -285 -3468 3380 -5187 -7436 8695 8071 -8749 -5167 5521 -3075
1702 -3075 -8695 1640 -1053 -9846 1654 13911 1490 -7967 -211 678 -3049 8286 13748 -1484
1716 -1484 -8525 1601 2426 -4095 1721 3674 -7055 -6615 5430 2429 -8515 -4884 948 -2011
1730 -2011 2198 10512 2444 -8548 -1588 5944 3020 3834 6484 -1832 -7424 1368 5552 -2575 -5263
1745 -5263 -1197 -2509 -3100 3325 2117 -7513 -6160 2868 4133 2893 4888 659 -5216 22 8237
1760 8237 4979 -953 -926 -1306 -2484 1478 3065 -3871 -7806 -2516 1283 237 763 -1108 -4838 -3161
1776 -3161 4974 7000 1935 -711 -271 -236 2993 6022 1973 -4134 -3488 324 1040 443 -1239 -5310
1792 -5310 -6596 -678 3627 1335 -2167 -3204 -1800 2249 6111 4828 -352 -2207 510 3631 3987
1807 3987 1967 -2143 -4780 -2531 1628 1908 -1840 -5229 -5086 -1725 2470 2989 -495 -3384 -1702 2638
1823 2638 5434 4290 1131 -2103 -1093 2689 4636 1968 -2550 -4726 -3044 573 1791 -794 -4297
1838 -4297 -5230 -1734 1936 3116 679 -2194 -2027 1454 5271 5058 1443 -1915 -1690 1539 4085 2702
1854 2702 -2098 -4836 -3580 42 1651 -118 -3121 -4881 -2521 1840 3609 1490 -1308 -1897 818
1869 818 4547 5963 1844 -2088 -1866 858 2815 2172 -788 -4686 -5077 -662 2242 3 -2940 -3754
1885 -3754 -2812 601 4677 3020 -2021 -2056 1692 3935 4347 3688 -753 -4099 -619 3831 1795 -1682
1901 -1682 -2842 -4091 -3291 1204 2354 -2893 -5023 -505 2260 2163 3267 1503 -3366 -1621 5741 6001
1917 6001 836 -357 -1185 -3536 -198 4706 -160 -6036 -2942 397 -1501 -730 1203 -3721 -5335
1932 -5335 3172 6951 1717 -849 610 -1812 -708 7120 6663 -3302 -3837 1181 -1011 -2598 1894
1947 1894 -349 -6904 -2323 4891 -275 -4712 -1023 -944 -2920 5115 9944 -419 -6247 944 2655
1962 2655 -492 4442 5997 -3866 -5687 2537 1451 -6152 -2400 1462 -4053 -1499 7323 425 -10193
1977 -10193 -3002 5187 2051 3594 8596 -511 -8874 380 7179 -828 -953 5166 -1516 -6921 1889
1992 1889 2373 -9071 -6450 5382 2783 -1945 3749 407 -10889 -3948 10511 6256 -275 5429
2006 5429 2238 -8652 -1533 8590 -217 -5984 3968 4404 -6316 -3046 1526 -8297 -8174 8434
2020 8434 9534 -3558 -2108 1585 -7454 -4724 12095 9788 -4015 257 4912 -5120 -6041 5498
2034 5498 1454 -7801 3280 9266 -5396 -10033 -430 -3261 -6335 8511 13442 -4011 -8301 2297
2048 2297 -919 -4532 8677 10972 -3979 -3529 7202 -1756 -11209 483 4592 -4713 1166 10202
2062 10202 -4194 -15562 -2621 3975 -2085 5518 12791 -2430 -11476 2179 5207 -4243 2735
2075 2735 11088 -345 -6041 4957 893 -13450 -4954 8180 1397 -1727 6192 -1921 -16121 -4147
2089 -4147 9785 2764 238 9114 1617 -10387 -5 8136 -3138 -3847 9513 5232 -6418 -534
2103 -534 875 -12139 -7571 10412 7124 -4312 122 90 -11436 -4963 11608 6514 -3653 4625
2117 4625 5821 -6457 -3825 6322 -1033 -5879 7430 9191 -6363 -7859 -385 -6863 -7366 9503
2131 9503 9802 -5439 -5582 1864 -3808 -4738 8659 7863 -3976 679 8220 -2414 -7964 2045 2385
2146 2385 -4383 3855 9537 -5014 -12088 -1959 -50 -3740 5514 8997 -4380 -7580 3581 2380
2160 2380 -4189 3237 7756 -1373 -1113 7118 -136 -10190 -2292 4785 -739 831 5731 -4097 -12178
2175 -12178 -2212 5424 -794 197 5907 -920 -5949 3079 5510 -3504 -1455 6516 2837 -1459 2983
2190 2983 279 -9103 -4188 6076 2565 -2573 536 -2001 -8053 -1662 6394 958 -3238 2801 3148
2205 3148 -2113 965 4083 -2260 -3219 5161 5715 -2070 -1948 -878 -5773 -3222 5144 3328 -4414 -3499
2221 -3499 187 -2624 -703 4483 1457 -3411 1443 5541 651 -1131 1407 -530 -1932 3551 4601
2236 4601 -2361 -5325 -1520 -1328 -1412 2158 1508 -4283 -3582 2107 1878 -399 1194 1261 -866 1829 5071
2253 5071 1466 -2722 -896 937 160 1603 1934 -3184 -5409 -1130 1643 -70 -735 -519 -2426 -1063
2269 -1063 3093 3193 -802 -775 1177 1612 2335 3126 127 -3097 -1197 1869 1064 -707 -1503 -3032 -3066
2286 -3066 169 1971 -562 -2166 -1472 322 1535 2603 1633 -1012 -699 2266 3127 1871 51 -1243
2302 -1243 -2151 -123 1820 349 -2286 -3406 -2263 -325 880 817 -1347 -2130 -47 2574 2856 1169
2318 1169 -263 -728 949 2714 2531 158 -1985 -2240 -640 837 359 -1448 -3199 -2541 -423 1295
2334 1295 859 -856 -1715 -477 2208 3163 2176 -274 -888 527 2046 2521 674 -1945 -2527 -946 407
2351 407 435 -1276 -2994 -2806 -435 1427 1423 -646 -1363 -818 1718 3020 2331 39 -1253 -403 2076 2126
2369 2126 357 -1292 -2508 -1510 598 929 -1283 -2802 -2346 -429 906 2022 585 -1351 -729 1776
2385 1776 2800 2153 1102 -566 -1026 1133 2672 354 -2275 -2386 -1492 -755 888 176 -2766 -3427 -389
2402 -389 1400 1257 1044 268 -1064 100 3097 2774 -295 -450 543 -81 1174 1644 -1400 -4290 -1984
2419 -1984 1024 100 -534 -348 -2499 -2941 1352 2993 383 -787 1026 876 841 2955 1564 -2280 -1469
2436 -1469 2263 2018 -699 -525 -2122 -4647 -1315 2963 379 -2600 -826 -465 -1784 1297 3784 -65
2452 -65 -1727 2643 3296 -340 187 851 -2366 -1442 3914 2605 -3355 -3176 -862 -3015 -1774 3813 1444
2469 1444 -4094 -860 2869 -704 -1019 2976 803 -1573 3559 5186 -2073 -3980 643 -116 -1425
2484 -1425 3261 3033 -4909 -5521 675 -239 -2540 2250 2572 -3110 -770 4573 381 -3991 1922 3977
2500 3977 -151 1680 4637 -2813 -7165 337 3109 -1556 511 3135 -4066 -6427 1458 2395 -3372
2515 -3372 200 4823 -374 -2120 3739 1081 -5693 538 7393 1877 -1503 2418 -2485 -8215 -408
2530 -408 5925 -502 -2791 2173 -1428 -6504 196 3987 -2805 -1584 6822 3410 -3437 72 1878
2545 1878 -4553 -513 8644 3738 -4400 -1336 -424 -6572 -1858 6262 1008 -5357 1339 2193 -5754
2560 -5754 -2703 4346 -119 -2013 7110 6032 -4903 -4063 2103 -1569 -1392 7473 4839 -6580 -4520
2575 -4520 1795 -3440 -4075 4474 3045 -4652 130 4769 -4006 -6017 3448 4070 -683 4788 6445
2590 6445 -4982 -7502 2519 2986 -1793 3490 4513 -5613 -6512 2208 -326 -5407 1328 5421 -2134
2605 -2134 -2023 4389 -1793 -7079 2351 7645 864 784 4695 -3162 -7969 1636 5625 -1995 -709 4074
2621 4074 -2792 -6678 683 1876 -5393 -513 7151 1569 -3422 1665 10 -5840 1499 9175 2656
2636 2656 -2914 1613 -633 -6622 -234 5655 -1326 -4070 2862 843 -6137 -1710 2289 -2901 -1480
2651 -1480 7395 4056 -4369 -1790 1895 -1966 188 7744 3069 -4914 -1118 1824 -3525 -2374 3773
2666 3773 -18 -4256 1635 2939 -4599 -4399 2254 857 -689 5612 4530 -4056 -3613 2802 1367
2681 1367 -618 4190 2802 -4429 -2433 2621 -1656 -4452 975 1658 -2468 115 2853 -2949 -4850
2696 -4850 1873 4175 440 2011 3492 -2493 -3418 3089 3441 -1526 172 1829 -2319 -2821 1436 -634
2712 -634 -4622 -858 3013 37 -1084 1149 -1308 -3705 1815 5067 1022 -551 1511 -148 -2026
2727 -2026 1942 2678 -1852 -2373 1388 21 -2510 -237 -343 -3358 -748 3263 1675 -1709 -368 283
2743 283 -1246 1724 4205 788 -1887 806 1425 -500 232 1200 -1729 -2517 1001 1163 -1652 -2023 -685
2760 -685 -1336 -448 2578 1471 -2042 -1248 1350 1334 1178 1640 74 -1473 8 1902 82 -1430 -689
2777 -689 -1183 -1076 443 690 -1910 -2728 -503 1035 771 1083 363 -1298 -186 2151 2245 310 -251 -158
2795 -158 -222 350 1213 -561 -2469 -1706 -223 101 87 -579 -1806 -1593 774 1984 1093 129 -315 100 1289
2814 1289 2206 1074 -815 -1184 67 591 621 -331 -1591 -2188 -713 521 509 -587 -1587 -765 33 1484
2832 1484 1757 502 -300 14 1137 1366 1106 -157 -1304 -801 412 799 -321 -1325 -1609 -1017 249
2849 249 965 166 -1215 -1136 291 1534 1520 389 -188 -168 886 1757 1011 -7 -793 -963 -336 708 -130
2868 -130 -1402 -1943 -829 268 632 274 -881 -858 186 1522 1428 766 -12 -204 498 1452 1573 -29
2886 -29 -1215 -907 -384 139 48 -524 -1775 -1599 213 1019 50 -345 -521 -306 1005 2302 1319 -956 -355
2905 -355 676 867 822 567 -929 -1944 -551 758 -183 -1047 -1057 -919 -642 986 1251 -922 -1068 722
2923 722 734 1198 1803 669 -1246 -443 1461 952 -529 -285 -559 -1538 -192 1032 -1050 -2348 -543
2940 -543 718 -109 801 989 -1217 -1073 1877 2522 108 315 868 -1265 -917 1624 633 -1944 -734
2957 -734 678 -1046 -1065 575 -1197 -2718 379 2584 498 -535 820 -607 -1271 2265 3265 -507
2973 -507 -898 1205 5 -1516 457 530 -2555 -1305 1874 179 -2367 -458 -232 -1903 608 3924
2989 3924 701 -2230 463 876 -975 1338 3105 -641 -2230 1139 929 -2725 -1470 1087 -1431
3004 -1431 -1187 2398 829 -3651 -1814 1713 -360 263 3514 1258 -2816 -234 2468 -683 -967 2432
3020 2432 691 -2427 469 1690 -3360 -3028 1500 936 -1092 1562 1029 -3877 -2693 2833 1780 -449
3036 -449 2305 2242 -2519 -1341 2661 130 -2482 1630 2657 -1918 -1142 1135 -2786 -3961 1670 3206
3052 3206 -1032 -676 1217 -2240 -3059 2806 3360 -916 542 2909 -1338 -2790 1738 591 -2648 620
3068 620 4158 -986 -3261 -249 -1259 -3283 1675 4651 -595 -2492 965 -119 -2715 1863 3951
3083 3951 -841 -913 3027 292 -3651 -540 1508 -1842 -414 3752 -294 -4800 -1369 718 -1739
3098 -1739 449 4316 539 -3416 521 1888 -1990 -351 3820 647 -1551 2033 1411 -4169 -2395
3113 -2395 2140 221 -848 2563 716 -4664 -2274 2208 85 -315 3160 1608 -2840 -207 2579
3128 2579 -1053 -1760 2795 2261 -1322 369 1205 -3218 -3355 2154 1825 -1548 374 874 -3253 -2403 2916
3145 2916 1646 -1257 1118 2422 -1488 -1185 1866 -26 -2045 1871 3224 -1266 -1720 521 -1769
3160 -1769 -2705 1594 2863 -1210 -1156 728 -866 -2220 1519 2376 -1184 325 3054 4 -2008 705
3176 705 836 -1392 1002 2992 -567 -2863 -922 -309 -1915 762 2196 -694 -2089 814 558 -1211
3192 -1211 609 2047 -49 -283 2490 777 -2345 -981 1054 -506 -158 1907 -125 -3137 -870
3207 -870 799 -639 -395 1172 -148 -1685 934 1533 -837 -206 1791 1054 61 1205 449 -2149 -1416
3224 -1416 1135 340 -877 387 -156 -2095 -776 1469 275 -1017 498 1036 -387 287 1430 -520
3240 -520 -858 1197 1313 -303 -175 276 -1045 -1054 803 486 -845 -963 -16 -790 -402 762 607 -850
3258 -850 185 1347 257 73 447 -167 -563 892 1314 -280 -911 -390 -381 -635 451 269 -883 -1106
3276 -1106 -22 -64 -261 263 110 -250 243 1232 646 -419 70 181 158 559 231 -640 -1207 -612 103 -100
3296 -100 -157 -74 -684 -674 518 900 -7 -307 231 216 777 899 190 -646 -184 339 149 16 -633 -458 -896
3317 -896 -251 199 -242 -678 -880 -98 87 782 553 101 -104 430 750 693 388 -232 -154 -146 331 63 -343
3338 -343 -473 -698 -206 26 98 -207 -697 -395 267 750 551 202 -65 256 420 705 265 -74 -469 9
3358 9 156 -69 -469 -811 -713 -385 99 -3 -143 -443 -124 88 699 658 201 -281 96 424 515 448 -186 -99
3380 -99 -451 167 76 -377 -435 -799 -397 233 361 46 -387 -381 47 611 996 363 -15 -240 378 483 -112 2
3402 2 -496 -508 15 291 -197 -775 -746 -143 -39 401 346 -383 -233 351 744 531 499 62 -284 273 708 295
3424 295 -339 -217 -209 -530 99 340 -154 -1038 -393 278 75 110 554 92 -240 592 783 27 32 319 130 -2
3446 -2 689 -62 -520 -845 48 30 14 -21 -124 -880 -107 640 191 -169 448 380 -37 513 813 -278 -426 703
3468 703 370 -209 -171 51 -1164 -840 529 173 -314 4 99 -327 -145 739 439 -555 555 945 94 -128
3488 -128 450 -307 -977 680 859 -221 -556 -257 -826 -994 293 1004 -876 -148 491 94 -504 662
3506 662 757 -517 473 1143 83 -874 -11 167 -690 497 1123 -601 -1260 164 -90 -871 -130 985
3524 985 -199 -398 830 774 -785 11 890 -241 46 1230 277 -1137 -363 446 -172 -334 727 36
3542 36 -1498 -60 675 -472 -410 930 742 -341 550 792 -627 -547 1206 601 -147 666 535 -1520
3560 -1520 -1137 630 169 -642 456 468 -727 -664 940 -255 -1061 622 1167 -131 -264 878 -635
3577 -635 -751 1000 1318 -511 -369 505 -906 -1250 571 566 -864 -57 905 -97 -585 407 90 -492 589
3596 589 1801 128 -807 199 -62 -853 401 1089 -348 -779 260 -184 -1208 93 757 -405 -440
3613 -440 724 547 -1071 -221 440 -291 56 1179 440 -1212 -476 561 -618 -77 871 -300 -795 4
3631 4 230 -916 -638 400 -55 -300 842 497 -947 -525 833 595 132 767 618 -1080 -371 580 -344
3650 -344 -730 385 413 -756 -124 711 -554 -960 483 647 -434 280 480 -217 -684 715 832 66
3668 66 -82 427 -709 -783 390 271 -301 -92 576 -172 -392 45 -279 -579 539 755 205 -173 318 -110
3688 -110 -468 491 686 -381 -334 185 -92 -866 123 330 -435 -370 507 103 -462 -41 225 -228 15 1037
3708 1037 431 -622 23 -95 -160 68 575 -77 -637 -114 57 -466 -483 296 -45 -149 269 478 -220 -195
3728 -195 364 312 118 436 149 -355 -404 570 71 -309 -137 -42 -303 -173 316 -278 -730 -61 128 -23 66
3749 66 249 -412 -201 345 88 88 309 107 -112 125 71 34 -451 -167 123 8 18 -145 -48 -160 32 457
3771 457 202 123 48 -70 -47 166 538 19 -134 146 -71 205 -98 -1 -246 -334 -9 84 -168 -468 -136 -132 218
3794 218 256 147 -346 87 39 349 19 399 -41 -193 19 -101 190 -307 149 -66 -122 14 253 22 -22
3815 -22 185 224 311 368 49 -331 -141 168 -39 -249 19 -363 -47 302 311 -40 -150 -331 -33 -75 156 179 134
3838 134 -23 137 187 173 385 135 47 123 29 125 -112 -103 231 -152 141 165 224 -255 59 49 53 168 -79 -55 323
3863 323 162 343 114 12 -163 130 97 1 107 -322 -316 -202 -32 -56 7 -233 110 113 258 -113 179 -5 152
3886 152 318 231 118 -235 -108 73 -52 109 -140 103 -166 -101 55 102 41 -179 -102 -61 -143 232 16 -24 -268
3909 -268 179 33 108 -82 -130 -157 160 -45 -294 -372 -161 98 -78 -39 160 -242 143 -61 188 364 346 265
3931 265 -77 76 218 539 41 48 -132 -62 -328 -158 -261 -198 -20 -30 300 -94 7 191 -231 336 282 193
3953 193 47 267 -61 63 170 422 -375 -236 -76 -59 -325 -94 -176 -460 -157 364 240 -229 1 115 335
3974 335 208 382 139 -179 -158 237 -67 33 417 -133 -147 -131 197 -144 24 131 138 99 288 150 -649 184
3996 184 323 67 67 169 -233 -281 -26 416 -126 -98 114 162 -230 -185 50 -568 -382 463 158 -149 133 427
4018 427 -500 48 505 380 13 -98 210 -234 17 291 46 -404 215 73 -190 -448 144 -267 -422 641
4038 641 343 -121 -78 137 -74 -52 476 513 -325 -313 23 -211 -281 9 225 -293 244 403 -193 -482 89 88
4060 88 -203 117 963 103 -186 298 225 -164 39 622 -180 -209 55 -215 -794 -135 165 -124 -245 299 -96
4081 -96 -592 -183 89 275 110 696 148 -721 -271 114 -194 -452 629 84 -223 27 -60 -519 -266 194
4101 194 222 -95 275 307 -549 -271 289 238 -133 530 51 -446 -126 334 -102 -458 213 368 -450 -265 282
4122 282 -341 -390 264 648 -249 -62 207 -481 -315 272 432 -157 88 415 -9 -367 -32 228 -518 -161
4142 -161 834 -95 -435 304 107 -295 33 678 -21 -42 -175 -52 -366 69 428 -182 -286 318 -69 -577
4162 -577 -613 9 -2 -81 609 4 -757 -258 67 -176 66 549 170 -281 -284 106 -356 -476 284 -100 -251 87
4184 87 77 -157 -452 397 168 -63 594 17 -563 -265 525 184 -204 162 360 -461 43 -108 -146 -510 165
4205 165 158 -84 -108 -33 -161 -380 307 187 -3 1 339 -259 -133 482 183 -95 193 -87 -42 136 69 -210 -506
4228 -506 33 163 -374 -256 359 -74 -324 189 680 -105 -46 -130 71 -241 181 362 -313 -224 390 142 -332
4249 -332 -174 136 -335 -206 406 241 -371 -108 166 -267 -70 310 34 41 62 388 246 -121 360 61 -193
4270 -193 154 26 -299 -67 -429 20 60 -54 226 -277 -114 248 -76 -115 290 -8 140 13 106 -62 -25
4291 -25 -157 92 -257 2 -135 -101 -30 117 236 -192 -184 52 -146 -152 41 301 94 -41 157 11 125 35 16
4314 16 -96 59 -272 80 -258 35 -87 -126 -164 -171 -157 120 178 441 4 45 -85 -177 27 -7 -153 23 102 -142
4338 -142 -185 -209 -203 27 -187 -12 -36 -101 31 40 -150 -189 -307 135 109 91 -31 -198 -234 282 -327 -123 -131 170 -126
4363 -126 186 48 -199 159 -22 -276 -144 196 -21 84 -81 17 125 183 93 -115 -195 217 213 -240 -24 -135
4385 -135 -95 247 6 -93 -328 -110 -14 238 -281 -28 55 208 -153 189 362 256 148 84 112 193 -57 -232
4407 -232 -50 -274 -121 26 -124 -30 -365 -108 -153 -14 -179 -106 81 -66 418 220 318 -123 -186 -125 -132 -111 -167
4430 -167 59 -30 -308 -55 -78 -124 -100 -96 -59 42 201 141 81 -15 186 207 36 -133 -174 135 -193 -242 196 101 -135
4455 -135 64 210 122 1 -131 -124 343 -39 -73 52 71 -119 -284 9 2 -158 -300 20 59 -87 15 0 -223
4478 -223 168 64 -57 -187 257 -43 -89 -63 524 -148 74 399 242 -96 -125 -70 -123 -253 63 226 100 -101
4500 -101 43 -155 -86 308 179 -252 19 55 7 -26 175 -221 -282 -135 15 -76 -189 43 72 -235 112 149 -360
4523 -360 153 282 122 -53 39 -98 8 76 393 -83 -299 144 427 -154 12 320 -389 -243 -14 278 -281
4544 -281 162 197 -181 -138 88 62 -266 76 299 -306 -57 445 220 -171 120 312 3 -129 3 -125 -304
4565 -304 104 271 -224 -309 24 -200 -39 88 479 -178 123 335 98 -205 282 273 -322 285 413 43 -431
4586 -431 -191 17 -484 -103 193 144 -298 336 8 -311 -168 334 -33 128 25 71 -475 -128 291 -193 -84
4607 -84 310 183 -407 -383 94 -84 -207 350 411 -300 -335 167 -118 -112 346 181 -108 40 266 -353 -123 361
4629 361 91 -271 -226 -122 -293 -369 139 445 -53 65 259 -336 -4 288 32 -55 189 541 -72 -376 253
4650 253 22 -356 117 275 -448 -452 349 -287 -503 -43 72 -319 219 481 -164 -359 -35 276 -146 108 245
4671 245 -208 -355 94 130 -435 -141 507 -145 -26 444 216 -270 194 252 -173 -3 584 406 -163 -125 302
4692 302 -174 171 80 479 -427 -98 95 -115 -266 159 -116 -342 -58 386 -15 -17 284 144 21 360 -49
4713 -49 -152 -43 536 156 10 -85 74 -25 -124 245 140 -84 246 171 -324 -82 118 139 -214 209 384 71
4735 71 51 196 -322 -318 -66 185 -143 -22 -41 -116 -221 1 362 -195 -55 265 173 -267 170 -81 -332 30
4757 30 233 -87 -83 -61 -58 -309 -74 219 -370 -204 26 118 -51 69 250 -336 -36 247 199 148 -55 -189 19
4780 19 -163 157 58 -201 -100 24 -261 2 190 167 -70 -171 -6 184 26 71 194 14 185 4 -117
4801 -117 115 -151 105 -409 54 -129 -242 -377 -2 61 -310 -137 117 -144 76 -106 35 -121 -94 194 237
4822 237 -180 97 -104 -433 -108 119 85 -370 377 -130 -201 22 -287 -50 186 280 130 9 39 180 78
4843 78 114 -28 43 91 398 127 -112 -55 90 -92 -209 34 -59 -45 199 -17 -96 -31 171 275 277 43 182 -245
4867 -245 -19 -168 223 103 30 148 111 -99 93 -352 -329 -87 -80 -115 114 182 -20 -201 8 133 246 106
4889 106 328 33 -182 -88 270 -88 -37 -65 -19 121 -88 -278 -126 -238 93 331 -98 -10 -5 181 257 192 111
4912 111 -150 -159 66 44 18 -49 -24 -241 -10 154 -315 -318 5 -134 -147 -131 -223 -198 111 10 200 -236 -25 -425
4936 -425 -192 -19 103 54 -119 -10 33 -233 58 156 -244 -263 -227 300 -38 168 153 -232 -115 231 139 -72
4958 -72 -50 206 23 -153 86 -235 -190 126 1 -130 47 18 -317 -54 38 27 -179 -241 353 340 -119 140 -228
4981 -228 -168 -314 483 -128 -279 57 -150 -299 -298 86 -86 -231 -19 316 -185 540 299 35 126 309 147
5002 147 54 177 175 -37 -12 486 56 -448 -56 123 -262 -316 114 -246 34 9 287 -58 -163 120 77 -15 401
5025 401 237 -130 -367 125 39 -377 26 332 -141 -172 197 -348 -8 139 250 -375 -72 315 -500 -262 -121
5046 -121 298 -171 167 224 -391 -279 -53 243 -358 -88 68 -157 -378 144 9 -469 223 319 -58 -159 193
5067 193 -112 -366 199 318 217 202 340 149 -772 -145 238 -184 106 7 1 -593 5 110 -13 -128 384
5088 384 400 -165 260 396 -333 -42 84 187 -126 -43 7 -495 -179 430 -294 -466 176 441 194 -240 396
5109 396 -189 -55 574 434 -69 -150 303 -456 19 582 275 -92 -59 -18 -150 -514 44 178 -222 325 289
5130 289 -30 -273 252 72 -27 366 738 -43 -414 -53 152 -546 68 489 -424 -393 -190 -217 -529 88 399
5151 399 -182 -152 424 -13 -395 -61 486 -258 -30 446 -194 -688 247 262 -269 -206 437 2 -246 103 -91
5172 -91 -460 -65 544 284 15 64 51 -463 -48 605 31 -604 107 41 -579 24 239 -440 -493 326 224 -492
5194 -492 125 275 -434 -95 399 534 -14 -244 223 -255 -99 395 499 39 -25 92 -286 -324 328 119 -249
5215 -249 216 627 -147 -110 271 83 -176 254 403 -142 -236 265 -69 -437 -21 275 -313 -208 -190 76 -321
5236 -321 144 -25 -488 -30 287 137 -213 139 121 -64 165 259 -17 -71 256 -106 -302 -56 -5 -43 -297 57
5258 57 129 -67 10 93 204 40 403 75 -114 156 426 278 22 137 124 -97 127 28 -158 3 -113 144
5280 144 -276 66 155 -328 -220 187 149 -126 286 224 -250 226 -99 -118 -143 214 -131 -305 -239 101 -67 -206
5302 -206 1 300 -134 -196 -200 -122 183 219 121 104 72 -81 418 -46 130 -3 -117 10 66 9 -98 -142 -77 -195
5326 -195 38 217 -136 -99 347 281 76 179 228 276 -228 172 278 351 -90 -87 130 -153 16 0 -298 -147 -214
5349 -214 74 26 46 -158 -22 -106 82 334 53 389 165 131 -135 181 -271 -44 -95 133 -67 -116 -66 -157 -181
5372 -181 112 -85 134 -143 149 -136 155 267 -146 12 311 72 -42 236 -24 -168 -69 -27 81 -423 -211
5393 -211 -255 -111 -42 -14 332 52 -98 20 281 168 58 55 -353 -162 198 -84 44 56 -270 -216 -79 63
5415 63 -11 -197 -31 97 286 34 -70 -7 193 239 287 136 204 123 14 -25 339 -217 187 -206 126 39 -51
5438 -51 119 191 -98 248 1 105 -177 -40 398 70 -127 50 55 348 24 -212 -287 126 -164 -294 -124 -104
5460 -104 -126 -198 141 238 -157 -84 441 130 27 381 118 110 306 169 -376 -139 21 -268 -58 -94 -167 -422 -208
5483 -208 105 32 -338 -86 456 -45 49 293 -55 -264 31 360 165 -1 80 27 -253 -21 168 -143 -107 55
5505 55 45 -284 -77 88 -319 -2 406 321 233 523 429 -76 -120 363 16 -432 428 195 -529 -155 56 -423
5527 -423 -353 354 34 -276 -94 369 -190 -306 531 668 -130 -6 518 -346 -153 237 15 -283 17 421
5547 421 -122 -543 319 -210 -305 448 90 -163 -245 392 10 -284 461 323 -145 -78 331 -36 -446 398 126
5568 126 -405 -10 327 -300 -910 -68 252 -435 189 771 -99 -578 314 330 -387 142 490 -86 -339 409
5588 409 -158 -643 -285 319 -126 -291 147 -7 -655 -129 812 -129 -87 791 133 -456 -60 445 -154 -674
5608 -674 709 10 -597 20 77 -764 -453 725 157 -211 71 403 -443 -351 453 242 -235 405 313 -314
5628 -314 -302 541 251 -152 581 389 -550 4 211 -275 -848 426 493 -595 -256 448 -182 -546 464 550
5648 550 -220 158 742 -212 -578 356 285 -589 -59 422 -344 -726 203 108 -394 201 584 -159 -141 378 -99
5669 -99 -550 355 577 -188 -301 463 -186 -514 -52 482 -440 -202 343 -189 -688 -126 353 -368 -84 278
5689 278 -195 -535 501 354 -187 145 803 120 -89 64 171 -648 -353 448 -14 -289 88 315 -661 -330
5709 -330 589 -119 -141 458 26 -278 97 612 -289 -283 420 328 -373 144 170 -707 -694 135 221 -463 155 173 -269
5732 -269 -287 677 238 -193 298 391 -367 -283 291 207 -235 24 231 -426 -339 134 -157 -408 266 90 -414 -156
5754 -156 502 68 -276 390 252 -203 4 362 130 -296 94 95 -227 -94 108 -302 -553 205 190 -129 87
5775 87 352 173 -225 351 441 72 119 330 176 -77 210 150 -396 -12 322 -245 44 129 -143 -330 -339 101
5797 101 -37 -157 90 -6 -92 40 323 60 54 391 240 8 11 125 -138 -6 43 40 -264 -472 9 -277 -116
5820 -116 153 330 60 220 384 -83 75 347 -161 142 94 304 -8 -338 -163 -52 -147 70 -4 -94 -184 -243
5842 -243 30 7 -176 187 -42 330 228 352 43 72 349 -19 14 59 -112 -336 -245 -127 -277 138 79 -208
5864 -208 -32 190 348 64 72 244 172 224 319 215 -89 246 165 90 -160 80 -236 -342 -53 252 21 -47 107
5887 107 38 -151 -58 137 -88 -22 332 347 91 195 276 -40 -102 -157 -200 -290 -529 46 -31 84 -13 -244 -393 -93
5911 -93 228 20 470 230 10 71 302 309 197 203 199 -21 -201 7 8 -91 -425 -20 -301 -156 -66 18 39 218 162
5936 162 112 -267 -19 -54 -152 277 -279 -18 -166 -88 167 -22 72 -84 -434 -126 202 -233 4 97 -99 137
5958 137 113 240 40 -278 294 236 63 191 -5 -33 -435 308 321 -186 -241 154 -379 -145 354 236 79 -32
5980 -32 90 98 54 213 407 -135 86 497 -326 -208 237 -148 -442 0 31 -222 -485 167 -27 -401 -34 116
6002 116 -434 64 525 222 -225 287 320 -152 119 378 -201 -582 -61 159 -463 112 358 -236 -359 5
6022 5 512 -259 47 566 77 -153 425 122 -423 -61 472 -175 -39 245 140 -589 -252 227 -400 -243 83
6043 83 -78 -567 -71 579 -65 -348 616 335 -262 195 216 -214 -387 561 187 -517 132 32 -788 -327 421
6064 421 60 -601 261 390 -316 -56 465 -70 70 447 634 -456 -371 411 -6 -467 106 459 -391 -187
6084 -187 -4 -420 -420 533 291 -462 -340 656 -33 -524 313 365 -557 215 631 -305 -748 626 387 -656
6104 -656 -89 368 -637 -703 194 121 -553 104 360 -22 -205 909 296 -788 184 887 -158 39 698
6123 698 -9 -691 -102 453 -326 -66 302 -78 -690 -65 464 -472 -11 791 285 -606 363 590 -481 -267
6143 -267 569 -98 -473 448 13 -881 -234 159 -107 -460 235 267 -653 -49 519 -97 -218 629 862 -233
6163 -233 -164 429 -345 -341 561 134 -693 -2 241 -511 -603 378 -322 -662 189 527 -234 -645 406 -185 -394
6184 -394 516 734 5 -329 625 -23 -579 -37 519 -415 -558 301 -120 -725 61 567 5 367 381 210
6204 210 -591 116 480 -16 223 461 144 -297 81 268 -224 117 297 -330 -434 -116 422 -375 -289 462
6224 462 -90 -226 383 5 -260 29 747 278 -29 539 236 -478 172 499 -193 -377 261 -322 -547 -103
6244 -103 94 -80 -224 496 126 -325 87 277 -187 -50 566 323 -196 156 217 -676 -185 176 -221 -531
6264 -531 326 172 -232 -226 207 15 45 305 239 -96 -88 101 -16 -101 230 75 -445 -306 336 37 -209 -126 -53
6287 -53 -419 -115 -85 -122 -143 -30 210 -74 162 111 -13 -40 218 182 -31 -68 309 -235 -73 -97 -138 -295 -85
6310 -85 -18 -15 -71 368 -28 90 -319 548 13 26 103 -128 79 136 156 12 79 0 17 -186 -112 -6 -226 -228 -169
6335 -169 202 -187 174 215 -223 37 266 309 -209 158 -53 37 -275 122 -164 -113 -93 69 99 -210 -90 -3
6357 -3 28 266 130 -15 119 -201 441 39 81 245 172 87 -60 -118 -355 -124 -29 -236 -175 92 -76 71 -121
6380 -121 -19 -136 0 44 87 -62 187 434 320 -16 95 -277 -5 90 -54 100 -287 -38 -312 -210 140
6401 140 -58 -185 -167 -57 74 95 74 359 229 410 337 212 -157 -25 -71 143 -64 129 -292 -225 -157 19
6423 19 95 -157 -24 -429 282 164 153 -287 164 254 100 312 -108 -28 -64 6 42 122 -333 -124 -236 -180 64
6446 64 206 -83 -113 153 283 167 220 -10 16 -4 266 126 -20 -5 -311 -152 74 7 -389 -213 -252 -73 -318
6469 -318 -22 213 -171 -174 379 359 254 99 20 -32 140 270 -108 16 -50 219 -169 -349 26 -366 -75 289
6491 289 -122 -39 17 97 123 -143 264 346 -11 370 291 -58 90 225 -71 -223 -53 259 -182 -487 165 33
6513 33 -289 247 75 -165 -252 85 -166 -64 395 465 -179 -45 291 -239 -203 265 109 -138 -101 114 -284 -463
6535 -463 178 12 -432 75 592 -193 -447 443 476 10 64 451 -181 -124 226 151 -492 -143 75 -120 -363
6556 -363 -1 185 -322 153 249 95 21 173 73 -502 39 360 102 149 449 202 -360 -268 210 -242 -552
6577 -552 -20 -135 -534 -69 231 -363 -46 340 228 -383 -151 277 -379 -19 600 230 -258 254 541 -344
6597 -344 -379 385 -70 -430 335 366 -554 355 389 -102 10 497 500 -356 112 481 -429 -369 268 385 -680 105
6619 105 363 -260 -400 287 -49 -644 -32 612 19 -193 -19 180 29 110 597 211 -349 641 -71 -405
6639 -405 189 730 -444 -617 163 -280 -792 69 272 -61 100 349 -116 -684 281 443 -195 39 536 -252
6659 -252 -278 231 253 -351 -279 309 -135 -642 -32 -147 -463 -137 327 -140 -278 420 398 -304 105 771 0
6680 0 -467 391 131 -344 162 574 -232 -174 348 226 -385 20 230 -488 -326 536 272 -606 197 272 -18
6701 -18 -183 486 2 -369 455 198 -371 -354 -100 -130 -463 410 -112 -338 -363 388 -120 -261 635 343 -235
6722 -235 -77 432 90 -248 370 40 -276 37 -187 -307 -614 -24 -228 -304 -30 625 -202 -303 333 210
6742 210 -160 -272 696 -160 -36 512 130 -501 105 407 20 -300 20 64 -448 -242 15 17 47 435 -39
6763 -39 -214 342 312 -72 236 422 -29 -283 139 159 -119 -275 208 -335 -379 -154 259 -340 -342 258 0 -227
6785 -227 128 192 -136 178 332 362 -136 196 438 -126 57 290 -328 -446 95 345 -281 -79 98 -38 -18
6806 -18 64 7 124 -135 251 -109 20 393 211 -92 40 395 -245 47 14 -80 -319 -169 64 -446 -443 169
6828 169 22 -63 72 112 111 42 245 39 -165 -50 347 -103 127 -123 -182 -215 -119 82 -67 -233 -81 32 -73
6851 -73 50 -20 53 -25 238 -163 219 204 95 65 139 98 -2 25 -159 -40 -358 -157 143 25 138 70 122 275
6875 275 -24 335 150 14 -26 276 68 111 286 -145 -211 193 65 -378 -167 -44 -46 -195 154 64 98 -98
6897 -98 317 -143 56 113 276 168 63 449 97 -124 248 117 -164 -244 -173 -165 -221 116 -150 45 -290 251
6919 251 -109 188 -9 385 -123 133 214 -14 -73 53 41 127 -57 -54 -13 23 -22 -384 -174 -18 165 -79 -62
6942 -62 -64 103 166 334 32 56 -53 154 82 -50 -57 65 -231 -28 23 -148 -179 285 -57 -233 -429 -103 -188 -34
6966 -34 277 228 85 48 241 -47 -66 103 -11 -232 15 -90 -199 -55 99 -288 -304 74 59 -177 -138 131
6988 131 -119 -97 -31 211 -13 124 318 -211 -164 307 140 -431 -413 41 -394 -248 -85 -82 -359 31 143 -86
7010 -86 -194 -5 77 20 137 335 45 -151 489 82 -223 344 111 -448 -265 -38 -190 -352 4 -225 -131
7031 -131 61 458 -20 -305 425 651 -523 139 247 100 -330 225 161 -387 -224 46 -344 -232 91 -62
7051 -62 -554 -3 57 -135 -163 310 64 -308 208 463 -513 -232 276 14 -151 -245 264 -338 -663 -55 -60 -296
7073 -296 35 253 -207 -326 19 -65 -369 432 416 -29 -212 351 120 -390 205 321 -296 -130 316 -216 -473
7094 -473 93 137 -364 12 259 -250 -403 246 325 -258 -157 553 67 -283 257 140 -371 -68 154 -245 -450
7115 -450 287 -42 -695 -256 516 -188 -203 488 227 -196 145 391 53 -125 544 -47 -423 -265 13 -319
7135 -319 -324 664 -177 -669 105 271 -518 -212 554 233 -47 510 464 -190 -167 640 -11 -180 355 299 -574 -64
7157 -64 313 -298 -400 380 69 -513 -267 267 -143 -614 506 334 76 78 494 212 -579 569 296 -353
7177 -353 67 272 -479 -738 213 223 -515 -143 663 -351 -522 571 238 -256 317 524 -119 -283 502 225
7197 225 -459 13 382 -466 -3 404 -369 -480 -82 196 -518 -103 292 -194 -415 265 325 -164 49 515
7217 515 0 -139 51 -21 -400 -149 499 47 -354 -173 133 -432 -437 394 -111 -165 403 223 14 -95 595
7238 595 93 -161 308 251 -231 -193 559 -337 -450 335 -157 -732 -184 145 -154 -473 -171 102 -314 294 387
7259 387 -208 52 246 37 -262 188 408 -290 -327 134 -93 -149 -6 164 -261 -210 39 12 -324 169 266 46
7281 46 101 464 69 -226 309 249 -155 -156 215 -171 -156 132 -14 -296 -149 -103 -317 -187 369 81 -41 175
7303 175 439 -88 57 -190 -16 -229 -219 259 223 -255 -120 -2 -458 -84 202 -25 -291 -6 -64 -318 -44
7324 -44 313 60 -123 236 282 113 11 276 10 -58 5 -88 -355 -206 176 23 -335 -175 -35 85 288 351
7346 351 38 -131 158 53 -97 402 -40 121 143 -30 -5 -163 225 -344 -451 -265 -164 -151 -249 54 -73
7367 -73 -86 -158 347 137 96 287 170 188 135 439 -54 6 -125 -130 -106 -367 -143 -340 -65 -85 50 -244 -202 113
7391 113 162 -22 191 54 202 254 184 21 98 113 105 -6 -265 141 -388 -328 -10 -83 -203 -205 -73 -104 426 344
7415 344 269 134 325 240 311 -207 -107 -24 -342 -67 189 -314 -177 -138 -85 -230 -116 -190 -18 -2 187 18 57
7438 57 152 134 104 -113 387 180 129 195 -7 56 -39 -48 -233 -152 72 -183 -192 -86 2 -259 -84 243 337 88 -191
7463 -191 157 73 -4 191 39 -129 52 81 -148 -174 -48 -155 -306 -177 78 -79 -170 183 68 134 372 30
7485 30 163 27 511 283 -429 -51 -138 -394 -111 16 147 -186 -186 181 -249 71 71 -42 163 249 124 -127
7507 -127 179 232 -162 -169 267 273 -204 263 307 -391 -438 213 -121 -293 44 346 -315 -68 268 -119 -319 289
7529 289 566 -76 245 273 44 -405 -4 525 -387 -263 334 -218 -146 -167 59 -189 -128 167 80 -123 361 277
7551 277 -257 -187 411 -197 -332 168 22 -335 -229 65 94 -358 -24 205 -307 -62 393 -79 -75 143 223 -349
7573 -349 123 511 230 58 563 119 -394 -21 52 -552 -250 110 85 -576 -315 229 -640 -327 29 -12 -208
7594 -208 414 528 -209 -180 538 126 -267 221 224 -201 -448 551 -17 -177 48 6 -336 -115 92 -207 -342
7615 -342 447 425 -270 32 437 -207 -363 445 190 -534 172 200 -256 -426 -3 1 -332 -53 47 -336 -233
7636 -233 214 -36 -483 156 293 -206 -191 592 26 -289 42 355 -389 -402 149 -103 -839 -106 -74 -311 -164
7657 -164 396 146 -447 190 430 -292 -167 839 115 -180 254 153 -537 -62 95 -228 -168 -33 29 -608
7677 -608 -466 265 36 -301 518 -45 -199 70 600 3 -217 613 197 -273 -99 444 -545 -471 226 20
7697 20 -419 51 408 -560 -444 317 -44 -249 118 409 23 124 583 255 -327 429 249 -137 -245 175
7717 175 -132 -456 -43 211 -247 142 103 -265 -537 201 170 -311 178 279 -247 -99 205 346 67 64 102 -49
7739 -49 -321 176 -8 -334 39 156 -444 -443 422 -63 -183 94 568 -27 -83 297 169 -401 -18 445 -9
7760 -9 -379 141 -62 -562 -122 59 -203 -275 128 -81 -38 -181 331 -59 85 561 270 -92 189 226 -199 -197
7782 -197 43 231 -354 236 369 -396 58 121 309 -225 -50 -5 -253 -59 200 6 109 300 15 -157 -161
7803 -161 219 12 62 272 -62 -428 -271 32 -140 -31 48 154 -184 59 339 71 252 65 384 188 109
7824 109 369 22 -130 69 -118 -404 43 108 -383 -260 96 -204 -190 -108 153 -17 206 439 152 234 30
7845 30 248 97 -8 136 35 -53 122 -47 -121 -162 50 -82 -278 106 203 134 -8 246 282 24 209 207 -84
7868 -84 152 167 -78 -253 112 104 -397 41 -11 119 127 -245 24 -140 -194 -245 229 19 239 341 22 101 397
7891 397 76 -138 -100 239 -213 -189 64 -135 28 42 -286 54 -29 -77 82 -88 123 194 278 117 413 235
7913 235 268 81 86 64 -1 327 -107 -101 -196 126 50 -306 -208 -282 -140 227 254 55 104 -22 -22 40 -1 -4 32 83 36
7940 36 -135 -49 -75 -250 -346 -132 -220 -360 -497 41 15 -31 158 83 148 266 191 414 -84 -14 177 -280 -145 316
7964 316 11 -288 -202 -22 -67 -56 259 216 -443 263 95 423 153 258 238 114 234 262 -162 49 183 -262
7986 -262 -174 41 33 -464 -252 46 17 -102 462 -49 -179 251 19 137 213 350 164 46 170 65 -410 49
8008 49 131 118 -362 198 -86 -466 -232 469 -44 -280 272 -66 -129 4 284 67 159 181 174 -181 109 -70 -100
8031 -100 -90 -38 53 -130 -84 -15 -125 27 225 -160 -235 391 489 -442 196 537 -28 69 180 124 -186 71 -88
8054 -88 -481 -312 200 -55 -388 -38 121 -318 -421 384 385 -217 -45 413 243 -81 563 261 -281 -140 420
8075 420 -185 -424 66 -61 -270 -36 45 -509 -240 499 31 -251 212 459 150 14 388 200 -22 55 123
8096 123 -103 45 379 -160 -705 -49 157 -349 -48 389 -59 -116 206 488 -401 120 584 303 -18 298
8116 298 208 -163 71 421 -137 -159 141 -100 -469 76 203 -314 -49 457 276 -486 96 369 -194 -69 381
8137 381 264 -32 -131 507 -89 -444 38 77 -125 -26 -87 -394 -265 401 -39 -472 267 335 66 150 638 135
8159 135 -59 291 459 -519 -135 234 -206 -416 248 -1 -225 -240 -51 -58 -537 151 231 -154 313 488 18
8180 18 -201 -9 234 -88 -96 225 -164 -436 70 -123 -345
8191c45
$$ Imaginary data points
##PAGE= N=2
##DATA TABLE= (X++(I..I)), XYDATA
0 0 0 0 0 0 0 0 0 -8 8 -8 8 -16 16 -21 24 -32 40 -49 59 -73 89 -105 129 -146 172 -203 235 -273 316 -359
30 -359 414 -471 534 -605 683 -771 865 -969 1084 -1209 1347 -1494 1656 -1835 2032 -2244
46 -2244 2476 -2728 3007 -3316 3649 -4020 4433 -4891 5407 -5985 6642 -7398 8279 -9316
60 -9316 10561 -12087 14012 -16522 19947 -24927 32845 -47448 83324 -363220 -272926 410929
72 410929 -31598 29816 349550 -60772 -540017 13653 274348 -139787 1038 533852
82 533852 182438 -207149 121156 78667 -495495 -185775 506564 268318 -169442 26304
92 26304 -121899 -586852 -214341 400004 118041 -150552 199756 102575 -384952 -109797
102 -109797 304873 -44813 -151984 419511 394009 -196069 -172798 35416 -268321 -181739
112 -181739 432978 337139 -246886 -182920 -7207 -328370 -230943 335495 220073 -215285
122 -215285 33471 252124 -164991 -250019 145876 80044 -100939 282165 383928 -185949
132 -185949 -341635 10780 -44189 -146331 260118 320321 -226290 -307194 62983 -25956 -197365
143 -197365 121198 224351 -92697 -16755 241895 -46559 -301479 20462 185486 -10609
153 -10609 111893 267829 -130221 -393010 -43491 140610 -42227 47470 178333 -113129
163 -113129 -235559 75091 92886 -162542 -13142 224392 43030 -44145 155334 21757
173 21757 -279729 -79766 233228 105234 -23731 61109 -88158 -276508 -37370 175272
183 175272 -16467 -89901 85332 15463 -133737 36456 126004 -97283 -93352 177810 165863
194 165863 -20078 3864 -9278 -162178 -50984 194318 93015 -116454 -57868 -20791 -135180
205 -135180 -49269 124168 8928 -132589 9329 110379 1438 -17228 37526 -38760 -34771
216 -34771 151590 160590 -41609 -86330 -7944 -42493 -31024 99738 57644 -127166 -117232 12578
228 12578 5048 -25827 15898 -24594 -77214 40263 134893 23162 -64629 2186 32268 17447
240 17447 87449 101999 -40406 -113345 -21112 39011 14813 3602 -36175 -103137 -56670 53000
252 53000 34898 -50563 -42890 -703 6296 48143 89136 22550 -58080 -20078 56823 69639
264 69639 46088 -733 -68387 -64314 23758 52749 -18136 -67895 -53940 -32697 -1946 38128
276 38128 21080 -42509 -51297 11567 67060 71275 28949 -29216 -37577 27105 77314 42688 -24617
289 -24617 -52266 -38934 -6357 23951 14758 -37793 -73580 -47454 12398 47859 26704 -27225
301 -27225 -49064 -1418 64169 72685 22393 -23353 -21937 12232 42640 39330 -59 -46711 -58681
314 -58681 -20025 27937 25544 -30046 -71958 -47592 15705 50003 27175 -17933 -32079 -1390
326 -1390 43371 60667 36305 -8092 -31926 -11356 32305 47250 6967 -52831 -67057 -19862
338 -19862 29848 22595 -26769 -56703 -37944 6001 39372 37387 2823 -25436 -13062 29809
350 29809 60909 48482 -3991 -45319 -22926 35521 45614 -4877 -49020 -51047 -26996 7453
362 7453 26272 -2457 -45487 -41085 1029 31569 41604 24552 -20664 -30854 30038 74684
374 74684 34066 -20696 -27225 -14875 4514 34064 20257 -43607 -66559 -27408 1491 12176
386 12176 20193 -13582 -59778 -19092 60179 49505 -9308 -10802 8292 10282 42768 60858 -6174
399 -6174 -62346 -21458 19285 9451 17015 7055 -69419 -84462 11491 50627 -11969 -28155 3206
412 3206 -8435 2217 57698 31977 -42654 -11400 56346 37255 18563 34842 -26921 -95337
424 -95337 -15380 74599 17739 -44013 -20123 -35050 -60808 11741 52328 -27149 -41877 43820
436 43820 41905 -10955 24378 28513 -54104 -21187 104778 79317 -34073 -34918 -21379 -66784
448 -66784 -13605 81810 14691 -79302 -21838 13192 -53105 -23588 54518 -8017 -49778 69006
460 69006 98327 -32163 -56449 16543 -7925 -4691 107929 81757 -79679 -81375 8472 -30499
472 -30499 -40415 66942 42608 -85682 -36785 59219 -27247 -82536 25529 50259 -8192 61413
484 61413 97965 -55436 -113959 21870 55540 -2179 65396 82651 -83663 -125055 20965
495 20965 27636 -59917 13657 73421 -31772 -44090 52116 -19587 -117013 13744 122595 31908
507 31908 11958 69835 -48730 -150856 5498 119278 15765 -8553 55294 -43385 -125321
518 -125321 2776 48651 -66297 -17617 116802 30832 -74398 8958 6472 -108286 -8065
529 -8065 167873 81992 -47335 -1311 -24883 -122791 -12583 127408 20735 -62838 39267
540 39267 16063 -119748 -51752 61080 -22864 -35901 119990 94550 -81515 -67143 11306
551 11306 -45210 945 163095 95461 -92495 -58056 14464 -76151 -55954 99099 54143
562 54143 -76537 -50 54801 -85295 -104506 38721 36590 -9366 105337 109230 -92029
573 -92029 -120257 34835 34868 -9008 102795 100113 -87298 -101397 25825 -18843 -79807 39677
585 39677 72336 -46404 -21052 57184 -63664 -136988 26594 109222 22434 43628 85296
596 85296 -60279 -131366 26612 91516 3054 30335 73818 -51939 -104812 14929 10798
607 10798 -91195 -9158 99924 9943 -53815 13775 -29353 -113855 9279 139253 57261
618 57261 -8468 35051 -25762 -100118 17754 105223 272 -32663 54376 5272 -93825 -29105
630 -29105 19476 -61756 -31474 95200 49678 -64610 -32387 -6567 -62030 8316 132613
641 132613 62176 -51760 -5066 21059 -51228 -16604 73460 15129 -48495 25182 35384 -67777
653 -67777 -64701 7263 -19228 -19246 78019 59564 -69945 -65824 19988 6139 3134 78610 54755
666 54755 -47716 -27257 36607 -10057 -36874 25321 19111 -33600 11624 42087 -50881 -86896
678 -86896 2042 33487 1490 33089 40808 -44893 -58617 28023 42143 1474 26279 33460
690 33460 -28909 -24030 37759 3634 -57288 -11089 35645 -420 -10061 12384 -32251 -65244
702 -65244 3241 52909 16552 2196 15138 -20632 -32442 32220 49846 -9942 -18763 21108
714 21108 8901 -14413 5153 -5021 -45125 -19027 33065 15870 -17940 -11524 -19312 -32621
726 -32621 13424 55103 15516 -24434 -2014 14180 3691 16040 21758 -13917 -22742 14593
738 14593 19734 -10398 -16684 -15837 -28991 -9519 31105 17134 -28227 -27293 730 9987 17967 26018
752 26018 2982 -18001 3682 26279 14262 1061 -2447 -15262 -14086 14058 19207 -16087 -36058
765 -36058 -18957 171 8620 12162 -2421 -22705 -12328 15985 24193 14007 4627 -5455 -6948
778 -6948 13450 28969 9946 -18234 -20896 -4759 7661 8799 -5022 -25257 -26195 -5198 11524
791 11524 9847 -929 -11625 -12580 4870 26593 24645 1801 -12363 -3343 14988 21929 9688
804 9688 -11123 -20726 -11368 3828 7951 -2443 -17566 -24054 -12020 8497 16977 3946 -13684
817 -13684 -12980 7231 25291 22237 3961 -9101 -5005 9210 17735 11230 -6480 -19787 -17231
830 -17231 -1389 10170 2844 -16511 -25498 -11960 9731 17185 4820 -10583 -9967 5116 20062
843 20062 20863 8789 -5690 -9744 1252 15957 15011 -4752 -21650 -18685 -1726 9229 3927
856 3927 -13957 -22847 -10445 8438 14072 7501 -2079 -8513 -3051 15757 26581 11975 -8570
869 -8570 -10800 -62 11148 13168 -1706 -21498 -19739 51 7943 -970 -8144 -13601 -15789 1073
883 1073 22236 15987 -5771 -10684 335 10812 21143 18791 -5275 -18541 -409 14160 3341
896 3341 -6342 -8299 -17237 -14064 9590 13061 -11970 -21971 -7584 2657 12762 24088 8223
909 8223 -19491 -8206 20066 16712 3990 6918 -2068 -17001 500 17993 -5425 -26248 -11167
922 -11167 -818 -2813 11079 8820 -25498 -28731 12140 25710 8027 9719 9782 -14827 -9604 25481
936 25481 19376 -12002 -5915 8170 -5872 -4329 9723 -16266 -39920 -3553 27566 4305 -8686
949 -8686 1026 -17781 -25775 19092 41305 5159 -7720 11242 -1118 -11674 17646 16071 -23382
962 -23382 -11515 27865 6959 -26255 -10995 -10386 -32407 211 43231 10681 -28339 -8244
974 -8244 -1102 -16231 16424 45461 2814 -21675 17913 18581 -22498 -9775 16601 -10506 -12404
987 -12404 31831 15254 -43402 -33619 1068 -10324 2973 44943 14349 -43385 -16321 22762
999 22762 -3378 -4181 36600 18933 -20447 8880 24960 -27649 -35083 15452 13655 -8193 22767
1012 22767 16147 -53361 -49622 19075 20434 -4791 25781 23741 -34158 -24970 28142 7172 -20154
1025 -20154 24550 36237 -12669 -6969 19581 -29572 -53143 17803 46294 -3619 -6940 9052
1037 9052 -38948 -50316 23016 41244 -7088 5347 30806 -16761 -33640 20880 16116 -28772
1049 -28772 10027 54797 3356 -34081 -5082 -17348 -44439 13888 59056 2049 -31939 741
1061 741 -14133 -41443 14962 51109 -2367 -14233 34190 11205 -39393 -7015 20512 -14334
1073 -14334 2324 54044 11493 -53593 -25989 972 -25152 4544 56746 9836 -46810 -8096
1085 -8096 14425 -24249 -5120 44647 13835 -15922 26256 22175 -42584 -30284 24376 8508
1097 8508 -4156 37248 14510 -59871 -42811 17509 3684 -6954 33897 18092 -37463 -13720
1109 -13720 26379 -9312 -21996 31885 32932 -9373 8584 21295 -35667 -45789 21259 33322
1121 33322 -4872 5842 8787 -43574 -42244 20775 20907 -14595 11147 27033 -17674 -19364 23017
1134 23017 3097 -27795 17617 46912 2397 -14104 5106 -22119 -38827 16842 41019 -7219
1146 -7219 -18979 4369 -19805 -34540 14303 28146 -14027 -6503 30642 7205 -21448 4365
1158 4365 8190 -17213 10240 45427 7346 -30233 -9126 -4853 -23808 5221 34004 -4248
1170 -4248 -31357 -1218 5053 -18527 -1375 19749 -3605 -6241 27825 17419 -22089 -11135
1182 -11135 12920 -165 3662 29972 7550 -33874 -19002 7159 -4589 -4241 14762 -2558
1194 -2558 -24590 297 16396 -9949 -13013 13418 10077 -1539 17203 16936 -18258 -19084 12604
1207 12604 14354 947 8098 -136 -25789 -15021 13164 3499 -13681 -835 3995 -9341 42
1220 42 14723 -3144 -15768 6592 19344 7241 5228 4797 -12566 -13104 12530 16454 -5140 -9419
1234 -9419 -2942 -10492 -8562 7976 3663 -14434 -8063 8001 5530 1332 4943 -2768 -8819 8345
1248 8345 21188 6464 -6344 -2617 -3288 -3960 7110 8563 -8465 -15496 -3994 1526 -651 647
1262 647 -2918 -10894 -2597 12804 10256 -2159 -3321 289 1887 8895 13124 1816 -10046 -6126
1276 -6126 2328 3672 2159 -3203 -11742 -10846 1649 7093 -828 -6886 -5002 -1231 5356 10813 6899
1291 6899 -3293 -4684 2637 8484 8682 3074 -6236 -9237 -1599 5728 2508 -5929 -10012 -7478 -1506
1306 -1506 4638 3905 -2908 -6934 -2888 5799 10601 7416 -575 -4899 63 7832 9101 1963 -6421
1321 -6421 -7794 -3359 2700 3140 -2624 -8803 -9169 -2457 5384 5434 -660 -6155 -3570 5124 10510 7814
1337 7814 -132 -4143 -594 5149 7428 2850 -4687 -8474 -5116 1119 3442 -866 -8151 -10138 -2925
1352 -2925 5668 5891 75 -4483 -2678 3333 8641 8348 1574 -3805 -1925 2980 5792 4008 -2795
1367 -2795 -9767 -7237 1575 4166 -1400 -7025 -7106 -3791 3024 7343 2389 -4191 -2228 4091 6930
1382 6930 7488 4265 -3669 -6293 2490 8917 2512 -5197 -6655 -6837 -3163 4159 3086 -7204 -8418
1397 -8418 -973 2334 3198 5506 1076 -5756 648 11649 7994 -1382 -2278 -2017 -2953 4772 8907 -3210
1413 -3210 -12182 -5300 -531 -2448 1758 2950 -7601 -8171 6229 8507 -1810 -1477 3237 79 3432
1428 3432 13351 4869 -11040 -5872 4317 836 1110 6168 -4887 -16872 -4042 7606 -1733 -5661
1442 -5661 2862 -369 -4774 7927 9636 -7376 -7193 9438 8980 1869 8274 2819 -15964 -9723
1456 -9723 10820 6213 -6601 -208 -1303 -13613 -5239 9845 -2226 -11549 5517 11101 -2462
1469 -2462 1438 8246 -7601 -10964 14566 18888 -2008 -3891 1367 -12370 -10922 12056 8807 -12449
1483 -12449 -5290 6267 -8108 -11202 7502 1964 -12663 6628 22285 213 -10510 2830
1495 2830 -1305 -8508 14233 22775 -6052 -15098 1905 -3696 -14191 6191 12683 -11073 -10277 11818
1509 11818 238 -18022 -1120 8456 -4397 6268 24597 1276 -21928 -2296 9631 -3750
1521 -3750 6053 21281 -3540 -22733 -820 5631 -14108 -4373 14631 -1848 -10484 10632 4472
1534 4472 -23080 -8522 18792 7990 968 17693 3539 -25604 -7782 17550 2922 -3889
1546 -3889 14515 2333 -22321 -5112 10060 -12554 -14090 16397 12141 -10172 850 6181 -19590
1559 -19590 -12941 23661 19737 -3895 4971 5589 -20469 -12579 19138 8164 -12316 5737 10715
1572 10715 -16308 -14554 7375 -5283 -15462 14999 22969 -8209 -11454 4436 -8881 -11621 22352
1585 22352 25404 -7979 -8548 7819 -9330 -16355 11798 12173 -12803 -1426 15896 -8707 -22763
1598 -22763 802 3496 -9676 11751 26356 -5567 -21606 2179 4546 -7628 12556 24043
1610 24043 -6148 -16344 6883 1151 -17871 -21 13772 -5954 -5796 14169 -2689 -26539
1622 -26539 -5689 14217 1031 4475 19971 -1149 -22896 -1134 14431 -1412 1201 17080
1634 17080 -537 -16648 2404 6192 -16709 -9916 14334 5118 -7774 5619 763 -22059 -8144
1647 -8144 18954 10194 -1826 9414 2735 -17011 -2967 17047 1505 -8822 8934 7144 -11931
1660 -11931 -4799 4453 -12054 -12616 12853 12645 -7436 -3846 1632 -11927 -6543 18237 14092 -6485
1674 -6485 -440 7156 -6412 -5595 10496 3169 -10558 2807 10872 -6678 -11329 -233 -4783 -9365
1688 -9365 9368 14665 -6155 -11176 2123 388 -2761 10926 11710 -6005 -4703 8311 1643 -7373
1702 -7373 1777 2915 -7532 -320 9878 -3038 -15202 -4105 2564 -2095 4439 9850 -4388
1715 -4388 -10595 3333 8000 44 2879 6788 -2685 -3985 6798 4137 -8670 -5947 2527 -576
1729 -576 -1253 3856 -3019 -12282 -3921 6933 3260 72 3459 -922 -5112 4274 9849 611 -3516
1744 -3516 2266 2279 -722 2722 920 -8096 -6990 2804 3384 -1999 -2264 -3209 -6324 -515 8244 4440
1760 4440 -2948 -1129 2078 1883 4103 5031 -1098 -4978 991 4447 770 -2155 -3287 -6321 -3968
1775 -3968 3179 3927 -3254 -5760 -2141 598 3357 5029 1405 -3138 -303 5136 4966 1837 -94
1790 -94 -2687 -2765 1605 3777 -439 -5459 -5239 -2444 546 2364 -77 -4296 -4233 1165 4889 3736 1328
1807 1328 -780 -1256 2158 6029 4175 -1046 -3744 -2366 723 2464 495 -4019 -5976 -3368 1000
1822 1000 2228 51 -2867 -3393 -225 4147 5190 2059 -1588 -1306 2039 4795 4132 -386 -3910 -3302
1838 -3302 4 2161 335 -3068 -5427 -4191 -89 2660 1213 -2090 -3215 -191 3686 5440 2771
1853 2771 -1042 -1893 1029 4421 3598 244 -3166 -4049 -1373 1826 1395 -2500 -5584 -3935 -263 2608
1869 2608 2433 -1156 -3291 -855 3969 5263 3290 250 -1940 -754 3382 4300 100 -3440 -3642 -1748
1885 -1748 63 1559 -1121 -5634 -4476 865 2786 1870 360 -1981 -2531 2087 6482 3847 -638
1900 -638 -1075 -87 542 2630 2604 -3358 -5620 -802 1852 -469 -1790 -2419 -4991 -2318 4875 4739 -1199
1917 -1199 -2010 174 491 2936 6456 2073 -3949 -1105 3714 527 -1445 -385 -3560 -5233 1758
1932 1758 4677 -2912 -6508 -1985 -1077 -65 6502 5153 -3871 -3817 3856 3584 129 3463 2422 -3864
1948 -3864 -952 5424 -558 -7461 -2593 226 -2543 1524 4989 -4573 -9535 66 5268 1259 3161
1963 3161 5606 -2436 -4635 5444 5394 -3276 -807 4598 -773 -2162 4183 -1586 -11428 -3895 6375
1978 6375 1489 -1975 2239 -3150 -9680 857 9808 1707 -1463 5155 1519 -4819 2742 5566 -5319
1993 -5319 -4824 7398 4692 -5285 -2086 -1652 -10554 -4075 10399 5004 -5755 -1142 642 -6910 -634
2008 -634 11063 3431 -4638 4834 6941 -4778 -3754 3987 -2807 -5215 8347 7916 -8301 -8864 -364
2023 -364 -4928 -3939 10312 8072 -8000 -4846 4737 -1810 -4040 8139 6535 -4184 3156 9470
2037 9470 -5116 -11241 1359 2740 -3288 5577 8486 -9252 -14528 521 2536 -3473 6145 9560
2051 9560 -5602 -6822 6553 2214 -7469 3227 10715 -486 -782 7145 -4209 -15286 -987
2064 -987 9283 -251 -9 5890 -6750 -15168 848 8305 -2211 303 9869 178 -7641 3624
2078 3624 4294 -7734 -949 13384 4813 -5361 710 -2621 -14139 -2974 12385 3063 -5793 1622
2092 1622 -1371 -11682 -1474 10536 117 -3839 9038 6793 -7163 -2314 4419 -4756 -2653
2105 -2653 13062 8084 -8606 -6240 -597 -8476 -4164 11410 5077 -8750 -2312 3856 -6106 -4605
2119 -4605 8257 3762 -3613 6844 9600 -6195 -8615 3242 855 -2439 8743 8254 -9550 -10760
2133 -10760 1006 -1439 -4816 6149 6145 -6780 -4021 6112 -1314 -7525 3903 7744 -454 3255
2147 3255 8328 -4631 -11738 864 6284 -877 2271 5135 -7358 -11567 1488 3597 -4768 160
2161 160 6643 -1660 -3923 4926 1258 -7622 873 10251 2910 -458 3964 -3046 -10269 120 8538
2176 8538 60 -3550 1688 -2801 -8104 602 4978 -3500 -2841 6246 3502 -3114 967 1927 -4887
2191 -4887 -333 10085 5062 -3998 -1467 -472 -5826 -755 6455 212 -6492 -683 1577 -3967 -1543
2206 -1543 3089 -1186 -2840 6050 6353 -2395 -2990 1828 -751 33 6657 3865 -5091 -4462 758 -1344
2222 -1344 -1982 2299 -176 -5757 -1008 3658 -851 -3520 1259 1189 -65 4291 5237 -1779 -4084 1329
2238 1329 2616 692 2323 974 -4492 -4321 1467 1322 -2785 -1630 -444 -1769 225 3535 72
2253 72 -3424 -136 3634 2607 2182 2360 -1532 -3051 1654 3890 87 -2032 -1395 -2537 -2052 1287
2269 1287 870 -3270 -2881 539 1096 1049 1664 -149 -2229 730 4396 2814 16 -594 -990 -589 1780
2286 1780 2170 -1354 -3497 -2060 -248 64 169 -1383 -2811 -1509 1974 2845 1067 -381 -575 660
2302 660 2328 3625 1660 -1658 -1433 6 1211 955 -671 -2787 -3264 -866 1009 301 -1427 -2145
2318 -2145 -1348 812 2582 2353 -125 -1056 632 2543 2942 1475 -684 -2060 -665 1099 1245 -851
2334 -851 -2817 -2892 -1255 880 1073 -573 -2378 -1662 853 2632 2338 712 -835 -72 2183 2955 1452
2351 1452 -802 -2054 -1080 609 991 -442 -2693 -3386 -1370 351 1112 -126 -1643 -1666 240 2750
2367 2750 2720 665 -476 -324 1611 2524 2074 -661 -2451 -1319 171 771 -77 -1924 -3206 -2105 967
2384 967 1370 -254 -897 -904 -19 2106 3570 1432 -934 -337 1362 1715 1618 447 -2403 -2767 129 1203
2402 1203 -362 -1900 -2243 -2362 -692 1904 1077 -1672 -1140 1278 1714 1831 2556 -27 -1960 542 3529
2419 3529 1464 -1021 -1171 -2214 -2706 762 1625 -1803 -3356 -618 94 -323 1304 1175 -1660 -553
2435 -553 4044 3161 -408 -70 67 -1668 796 4203 445 -3970 -1997 -370 -1935 -614 1825 -1706
2451 -1706 -3715 991 2609 -1029 -1036 1191 91 341 5137 3792 -2749 -2483 1852 78 -381 3099
2467 3099 437 -5291 -2483 1947 -1320 -2880 986 896 -2454 1570 3853 -2209 -3971 2371 3656
2482 3656 895 3434 3072 -4007 -4377 2764 2418 -1877 498 1587 -4326 -3611 2589 -441 -5025 771
2498 771 4759 -208 27 3153 -1833 -5174 3187 6937 720 -610 2225 -2809 -5701 2405 3911
2513 3911 -3154 -2221 3232 -1660 -4874 885 640 -4932 370 7944 1840 -3629 722 147 -4274 2387
2529 2387 8902 1002 -4310 723 -133 -5912 -497 4415 -2444 -3724 4108 1716 -6462 -2488 2379
2544 2379 -1991 304 8687 3746 -6071 -2304 2855 -1726 535 7939 1815 -6466 -961 2320 -5161
2559 -5161 -3769 4071 900 -4117 3060 3399 -6654 -5656 4144 2464 280 6513 4356 -6604 -4473
2574 -4473 4436 1308 -2195 4603 3593 -5642 -2675 3020 -3559 -6749 3026 5234 -1779 97 3533
2589 3533 -5350 -6841 4967 6941 36 2094 4603 -4405 -5776 4162 3450 -3878 881 4886 -3051
2604 -3051 -5343 1301 -1739 -6863 1933 7904 -360 -3232 1486 -2280 -6043 4178 9233 -38 -2147
2619 -2147 3571 -785 -6116 1334 3983 -3647 -1240 5737 -508 -7031 -1752 658 -4119 997 8787
2634 8787 1456 -5829 -342 1501 -2714 1874 8235 583 -4257 2204 1856 -5640 -2271 3531 -1079
2649 -1079 -2573 4341 1526 -7499 -4154 2369 -63 133 6541 2372 -6014 -1739 4038 -183 -843
2664 -843 5061 2342 -3822 265 3030 -4431 -4711 2283 1818 -2253 1282 1683 -5942 -4783 3758 3252
2680 3252 -983 3063 2831 -3418 -1690 4505 1388 -2724 1814 3389 -2377 -1673 1609 -3250 -5557
2695 -5557 1484 4300 -1317 -1800 766 -3002 -3505 3526 4602 -1005 -179 2941 -308 -1814 2832 1595
2711 1595 -2858 128 3445 -390 -3061 -820 -1496 -3737 985 4124 -649 -3436 71 -158 -1076 2302
2727 2302 3666 -834 -1450 2332 1666 -1403 -218 752 -1612 -566 2948 327 -4044 -2222 6 -1184
2743 -1184 727 2588 -447 -2969 -47 2575 598 655 2033 71 -765 1790 2109 -1973 -1983 161
2759 161 -359 -658 933 -156 -3512 -2155 979 807 -12 408 -181 -1570 1009 2975 829 -533 6
2776 6 1213 21 1143 888 -1715 -2415 173 1088 -728 -1017 -1099 -2211 -1095 1725 1169 -515 -829 513
2794 513 1122 1465 2155 479 -888 331 1586 968 -104 -1178 -1849 -1510 213 1018 -731 -1895 -1273
2811 -1273 -306 724 1216 672 -679 -421 1288 1662 1272 363 -490 -244 631 1372 297 -1186 -1655 -1172
2829 -1172 -159 408 -71 -1253 -1567 -498 1293 1171 387 -230 -445 667 1949 1489 368 -440 -433 397
2847 397 575 611 -759 -1964 -1337 -125 555 -139 -1111 -1202 -728 947 1576 1005 -379 -256 382 1493 1377
2866 1377 775 -500 -1390 89 539 247 -617 -1539 -1903 -373 737 286 -715 -1037 -448 381 1639 1478
2884 1478 140 -399 335 1573 1253 681 -355 -1138 -898 723 602 -908 -1795 -1069 -498 76 982 -155
2902 -155 -1429 -861 943 1329 1010 710 -216 -459 931 2028 365 -830 -297 -523 -700 430 116 -1977
2920 -1977 -2186 114 776 -233 257 -1 -1321 -261 2231 1619 -297 296 638 -169 513 1600 -656
2937 -656 -2035 -88 1108 -394 -771 -449 -2066 -2042 1173 2103 -790 -683 637 -199 -178 2393 1891 -1109
2955 -1109 -359 1691 266 -767 337 -357 -2342 85 2170 -724 -2806 -770 -751 -1120 1419 2725
2971 2725 -976 -1824 1544 961 -570 1247 1740 -1151 -636 2315 782 -2968 -900 669 -1481 -19
2987 -19 2408 -715 -4020 -852 1336 -535 402 2725 -313 -2022 1735 2315 -1286 -385 2502 520
3003 520 -1171 1418 423 -3932 -2514 1972 420 -1279 1544 -380 -3891 -1050 3132 724 -1003
3018 -1003 2477 1717 -1958 301 2281 -1473 -1979 2607 2376 -1653 -239 326 -3544 -2937 2826 2214
3034 2214 -1976 -188 972 -2686 -1744 3401 1392 -1981 1498 3517 -1209 -1556 1805 -546 -2606
3049 -2606 2408 3649 -2052 -2897 -78 -1887 -3027 2624 3253 -2188 -1730 2193 -782 -2401 2164 2433
3065 2433 -1431 1090 4303 -560 -3463 358 828 -1644 1642 3893 -1838 -4734 -160 364 -2346
3080 -2346 887 3604 -1070 -2270 2164 961 -3048 261 3571 258 -168 3077 -4 -4757 -956
3095 -956 2612 -401 -533 2487 -777 -4857 -419 2192 -1198 -707 3247 836 -2377 1199 1640 -2802
3111 -2802 -1281 3852 2240 -1106 931 -75 -4437 -1938 3245 1098 -1859 932 319 -3814 -1596
3126 -1596 2623 -123 -1670 2675 2811 -1854 -537 1510 -1405 -1949 3502 3014 -1959 -1193 498 -2752
3142 -2752 -2308 2459 1517 -2311 -569 1672 -1698 -2155 2213 1219 -1610 1762 3784 -990 -2124 800
3158 800 285 -1527 2276 3198 -1710 -2944 583 -493 -2237 1067 1925 -1616 -1291 1815 -344 -2358
3174 -2358 575 1898 -287 892 2977 -222 -2992 160 1318 -608 518 1826 -1352 -2744 168
3189 168 850 -1873 -587 1731 -377 -1212 1381 891 -2107 -512 2218 1154 25 1813 18 -2590
3205 -2590 -467 1720 -89 -866 544 -338 -2328 -434 1004 -1118 -1263 1269 1003 -420 527 226
3221 226 -1152 -621 2343 1877 -167 -38 302 -1594 -824 1377 73 -1564 -519 181 -1124 -659 658
3238 658 -369 -1273 1120 1743 40 -195 724 -88 -433 1619 1228 -743 -753 102 -400 -562 566 -98
3256 -98 -1478 -643 518 10 -745 -15 79 -9 853 1311 75 -710 342 806 309 644 465 -740 -1157
3275 -1157 -23 366 -826 -741 -409 -807 -329 792 387 -902 -463 450 574 870 492 -48 -597 315 977
3294 977 458 -208 -255 -598 -542 -38 253 -858 -755 -37 -19 317 -38 193 -694 93 735 944 454 -147 -30
3315 -30 -117 696 609 163 -632 -275 -9 -199 40 -449 -720 -800 -72 741 234 132 -303 38 390 1004 488
3336 488 170 -430 -206 120 151 -125 -459 -843 -619 -107 -19 -238 -485 -407 -153 492 475 120 -119 25 509
3357 509 758 383 121 -348 -171 246 473 2 -294 -804 -530 -75 101 -158 -150 -607 -79 93 597 235 23
3378 23 33 233 514 327 -153 -413 -152 96 347 -127 -334 -689 -560 -308 -127 74 51 -551 -311 167 641
3399 641 170 180 174 243 788 794 5 -413 -188 150 -360 335 52 -680 -622 -171 265 -23 116 -319 -227 196 723
3422 723 807 -76 -76 191 236 443 451 -190 -945 -520 499 -240 -509 185 -740 -617 285 650 -12 -271 574 539
3444 539 204 493 250 -732 -35 807 381 -32 -162 -495 -1216 41 537 -230 -973 -36 87 -373 48 541
3464 541 -249 -543 912 897 -6 55 450 -692 -558 860 448 -634 -618 95 -736 -538 502 -17 -842
3483 -842 -165 961 -73 -657 463 74 -386 952 1166 -34 -544 54 -353 -580 742 617 -698 -762
3501 -762 118 -470 -988 213 320 -517 184 1050 118 -1014 168 834 80 382 1210 -38 -1220 -145
3519 -145 391 -446 -241 770 -306 -1016 326 311 -1160 -349 704 333 -255 616 275 -1366 -183 1122
3537 1122 338 -202 906 63 -1184 -224 695 -353 -538 545 231 -915 -12 474 -747 -739 1146 1038
3555 1038 -25 132 436 -877 -792 1086 844 -578 104 529 -1030 -997 804 -22 -1101 586 898 -495
3573 -495 -690 273 -186 -1065 1074 1684 -234 -706 464 -578 -725 938 1046 -634 -221 641 -334 -1329
3591 -1329 99 356 -203 209 1052 -291 -1249 66 292 -130 510 1440 -138 -1022 270 234 -858 35
3609 35 1015 -247 -680 546 -121 -1360 -374 522 39 -58 870 394 -1299 -349 1009 94 -131 873 247
3628 247 -1242 -319 657 -531 -563 567 394 -868 0 175 -793 -919 758 757 -489 346 491 -695 -228
3647 -228 1191 657 -193 120 684 -871 -446 350 -116 -644 498 776 -543 -379 144 -699 -658 788 725
3666 725 -179 -228 496 -355 -450 178 803 -351 -338 536 -280 -687 52 -5 -453 61 661 -294 -814 -47 175
3687 175 -424 445 929 20 -409 369 213 -319 402 594 -14 -289 411 207 -721 -317 166 -16 334 514
3707 514 223 -416 -171 340 -144 130 533 -33 -71 -20 684 -269 -304 224 117 -247 -12 30 -610 -595 232 -81
3729 -81 -409 217 100 -588 -23 688 266 11 115 53 -117 -49 392 -124 -541 4 117 -238 -191 -97 -266 -398
3751 -398 192 234 117 -239 288 -42 114 371 60 -140 175 86 -7 -252 -85 -31 -533 346 139 -243 -223 -199
3773 -199 -219 -241 382 468 125 -12 83 205 158 96 -7 -252 151 188 60 75 -280 -151 -184 -99 235 90 -602
3796 -602 -96 326 163 216 -84 50 55 -56 195 136 -201 81 -40 -259 -90 -178 -268 -38 -123 -184 -200 -34 -157
3819 -157 -84 179 239 -137 43 81 -22 124 -214 369 -51 -102 113 -27 50 121 -148 -194 -420 13 17 -225 -71
3842 -71 86 273 111 181 201 83 -57 88 265 281 -312 -54 -94 -151 159 100 -285 -122 28 -75 -29 125 90
3865 90 221 -68 12 211 106 193 -3 162 261 385 -28 -252 -69 -26 121 189 -55 -365 -22 -240 -149 143
3887 143 23 -154 -229 267 538 76 51 21 -68 110 179 3 -7 -205 19 87 -2 -134 -176 -183 -81 404 320 -138
3911 -138 -143 95 -144 191 515 61 209 -98 44 146 59 -149 -511 -551 116 27 -149 -61 107 -52 107 350
3933 350 145 -63 86 -52 85 37 47 -91 -174 -23 306 179 -14 108 9 -344 352 236 129 -101 11
3954 11 319 104 110 48 27 -121 82 110 -87 405 115 -370 -13 53 108 -498 -134 68 11 84 362 -171 -275
3977 -275 -91 231 36 120 327 -90 -503 214 151 17 49 242 -150 -108 125 -1 -325 -60 394 -131 -269
3998 -269 -29 172 -39 296 601 51 -181 153 181 -48 -73 353 21 -242 341 161 -545 -123 153 -92 -204
4019 -204 518 369 -44 14 488 -97 -152 732 271 -315 64 56 -98 -644 94 -45 -267 206 457 -436 -630
4040 -630 122 -362 -78 510 229 13 2 333 65 -292 338 496 -475 -269 568 -122 -799 -85 188 -156
4060 -156 -15 252 -66 -551 355 502 -88 79 525 132 -295 385 56 -445 99 437 -164 -237 166 -46
4080 -46 -678 -316 477 218 -359 183 21 -501 269 840 244 -295 588 97 -530 -50 426 -550 -70 634
4100 634 80 -333 -23 246 -522 -339 866 460 -600 5 177 -179 -305 560 245 -402 345 221 -488
4119 -488 -147 -62 -376 -388 364 770 -445 -33 171 -91 -221 386 390 -239 58 241 280 -621 254 269 -74 -179
4141 -179 182 -321 -739 94 -16 -202 -158 505 -152 -696 400 390 -292 102 313 -66 -490 321 58 -362
4161 -362 -42 549 -239 -395 243 -60 -686 -230 293 -48 -214 343 -123 -629 -153 362 70 -17 348 234
4181 234 -402 193 241 -110 -296 152 238 -355 22 -24 -453 -445 118 98 -340 200 -87 -232 28 158 -126 -312
4203 -312 206 203 -282 -98 46 -92 -266 389 434 -86 -595 -24 -424 -563 383 211 -161 -50 198 -42 -251
4224 -251 247 34 -194 211 389 -23 13 -37 -190 -148 217 138 -160 -748 40 85 -164 148 167 -34 -5 472
4246 472 150 -208 232 441 -228 11 142 -8 -306 -394 165 -191 -325 93 -213 -212 -98 252 83 -230 218
4267 218 231 -72 315 337 -110 -21 74 284 -202 123 2 -439 -190 134 15 -143 -149 35 61 221 205 -124 -302
4290 -302 128 182 324 238 -187 82 -475 154 76 197 -180 180 -377 3 103 -170 -343 279 44 -8 -36 280
4312 280 194 169 -102 213 -97 10 64 -90 -111 -99 96 136 -252 -373 -244 -5 191 20 -69 -342 164 142 160
4335 160 6 153 -117 201 234 42 -337 45 107 13 -41 -290 -199 -21 -70 -187 -183 -169 -156 -66 136 251 54 116
4359 116 210 -11 102 27 -137 -97 -131 -245 85 -237 -157 -294 -180 -213 -135 253 -114 -90 -132 -113 263 217 110 126
4383 126 168 142 77 106 -228 -57 -13 -178 106 126 105 -235 -56 29 -51 -187 -196 67 176 147 27 -125 -134 38 -190
4408 -190 61 196 20 -104 -107 405 326 -39 131 -285 49 -166 -56 -226 -68 19 -35 282 83 -49 -242 -87
4430 -87 56 194 -11 38 -436 -208 -66 -243 -81 49 5 -9 93 78 5 13 207 52 -189 141 -13 -39 -197
4453 -197 -34 169 80 -288 -98 -71 -170 63 67 -366 -33 -260 -53 -12 157 257 -53 69 269 46 -197 143
4475 143 107 -127 -41 69 10 -356 -285 169 -70 -125 136 -394 -153 -40 178 77 89 -22 -73 -19 144 135 -185
4498 -185 38 -79 154 106 258 -172 -226 35 105 7 39 314 -193 -234 -84 260 -95 8 303 161 -126 407
4520 407 -197 -361 -314 332 -103 -241 -162 -99 -237 -78 190 279 -178 68 57 -282 -197 136 -135 -93 529 196
4542 196 -89 228 298 -359 -645 -47 106 -231 -61 316 -152 -362 142 182 -226 167 525 -156 -347 280 249
4563 249 79 187 377 -136 -357 -88 -281 -333 131 276 -149 -231 194 -38 -287 141 344 183 -220 413 -55
4584 -55 -202 39 155 -172 -64 253 -302 -486 -143 123 -320 -55 351 55 -347 282 51 -521 -243 349
4604 349 61 -165 556 61 -338 -288 662 23 -279 -39 -168 -841 -96 95 -225 -187 93 138 -264 80 55
4625 55 -183 -377 270 467 -96 33 195 -335 -132 448 -4 -80 -64 74 -66 -279 204 66 -212 -2 457
4646 457 -246 -70 360 -71 -229 408 666 6 -130 70 -56 -356 106 70 -302 -105 331 -41 -513 212
4666 212 369 -135 108 628 152 -57 -72 106 -387 262 275 -177 -473 -106 254 -306 -140 136 213 -114 -83
4687 -83 135 -337 -146 503 -143 77 131 96 -284 10 202 -55 -133 239 32 -423 -268 33 -263 -293 123 348
4709 348 -294 -9 370 48 -91 98 139 -44 384 98 -327 -195 89 209 5 53 173 -500 -395 139 -115
4730 -115 -204 -94 285 -68 -24 321 -201 33 -5 294 -124 -15 139 46 -161 -173 79 -215 -221 -110 145 -487
4752 -487 -8 -212 -91 110 53 381 188 -199 -183 -200 0 -37 -70 -147 342 -147 -304 -38 -263 -82 -137 48
4774 48 -95 -163 20 18 -225 -3 127 121 -119 -190 44 -142 11 -52 323 -213 -10 177 -222 -84 -36 -148 -118
4797 -118 -263 247 -24 -207 130 40 111 76 -79 84 60 312 15 -170 33 83 -173 -370 -47 -138 -43 55 137
4820 137 -74 83 -43 -197 -97 136 -18 -51 -40 -73 29 92 -179 14 -33 -4 -242 -78 -78 27 -138 -205 258
4843 258 -1 169 25 367 373 275 205 -52 160 157 58 -106 18 106 -147 -179 -200 -118 -131 1 -12 -277 48 25 83
4868 83 0 -75 -38 106 -169 78 186 -64 320 69 234 101 157 -17 -81 50 -223 77 -127 -19 115 23
4890 23 188 139 249 150 94 122 -121 -264 32 -108 261 66 -55 -198 -451 -146 -117 62 55 -99 70 -239 54
4913 54 412 101 -180 4 82 15 144 -255 -183 -142 109 -50 -229 -423 -247 90 -176 -60 205 -38 -18 236
4935 236 -142 271 -32 -282 -270 27 -72 23 -61 274 -203 -45 -124 -147 -188 67 26 80 -220 159 -43 27 365
4958 365 81 162 -90 -80 24 -173 234 186 68 -223 27 17 -101 72 -112 -228 -298 50 -128 -50 207 475
4980 475 -291 -69 238 171 48 197 125 -259 103 221 80 -102 68 -79 -458 1 75 -60 -248 -75 349
5001 349 -180 88 210 41 -54 159 223 -194 -205 102 -254 -217 234 -22 -96 -133 416 -296 -389 275 -128 -149 3
5024 3 475 -392 -61 7 -50 90 165 181 -208 -274 125 104 -65 -86 161 -181 3 175 23 -419 63 587 -48
5047 -48 77 89 143 -388 199 359 137 -65 314 -239 -181 -174 -81 -754 -195 703 153 49 2 64 -290 31 251
5070 251 -146 -194 -38 -127 -648 99 431 -33 -316 181 36 -667 62 152 -92 59 207 -68 -195 67 -18
5091 -18 -78 -147 672 272 -64 243 198 -191 -84 423 262 -491 148 260 -626 -240 255 134 -297 384 591
5112 591 -221 -144 244 -5 -181 373 373 -426 -357 398 -230 -274 195 339 -341 -96 465 -389 -220 277 36 -324
5134 -324 326 314 -248 -339 398 334 -73 156 413 10 -493 221 72 -479 -112 476 -229 -467 463 -275 -634
5155 -634 19 425 144 -152 336 138 -497 18 556 -85 -285 306 144 -250 -286 -107 -650 -329 325 85
5175 85 -318 48 166 -247 -30 453 228 -138 221 425 -62 340 440 12 -291 439 -96 -341 -252 307 -470
5196 -470 -338 340 296 -698 -45 191 -39 144 102 300 -322 164 577 -143 -277 96 439 -252 -95 179 -321
5217 -321 -237 109 46 -379 69 81 -508 -275 168 203 -36 54 346 36 112 251 233 -463 194 306 -178 -488
5239 -488 -132 -80 -384 -181 326 -93 -102 233 -187 -282 219 249 20 60 88 0 -63 44 255 -216 -230 157 -2
5262 -2 -142 112 149 -290 -103 309 216 107 -31 52 -25 180 191 -9 -298 -123 70 -233 96 135 -233 -95 -4
5285 -4 -12 2 49 41 -19 21 177 121 -108 -63 493 -188 191 -103 -39 -192 -154 211 -23 -280 122 -27 -117 151 316
5310 316 -8 -49 225 268 50 272 143 -29 254 269 16 -54 99 50 -87 -224 -47 -190 -268 -107 120 -3
5332 -3 -248 -133 -112 -165 394 304 224 263 -144 78 44 102 53 -89 82 244 113 -186 -24 -112 -341 -152 154 -293
5356 -293 -153 -114 -177 38 193 194 -183 -122 323 74 68 -69 7 217 105 69 -408 -396 -285 -112 -12 136 -82
5379 -82 -288 30 -76 292 -7 -55 -54 61 -153 -79 218 125 -217 96 -67 -223 -34 -254 -201 -188 115 99 37
5402 37 -3 139 79 416 291 403 245 96 8 1 9 156 -106 -237 -8 201 45 -168 -169 -311 3 320 158
5425 158 102 42 419 -119 4 324 364 113 -4 -35 -17 -26 -328 -91 -231 -45 128 -82 -255 -225 -60 -203 293
5448 293 415 58 -27 346 24 -89 132 28 -48 149 170 -126 -477 140 -69 -69 -181 210 -197 -186 30 156
5470 156 -13 -20 227 34 -22 486 347 51 186 112 -126 55 134 63 -394 -241 133 -184 -85 184 133 -436 55
5493 55 440 29 4 574 133 4 182 350 -336 -138 416 83 -342 8 14 -574 -14 196 22 -404 281
5514 281 249 -216 256 640 187 -383 411 410 -122 -9 90 -119 -168 406 -48 -406 -116 116 -307 -434 122 233
5536 233 -319 -94 452 180 -35 545 354 -182 -95 550 -147 -560 302 -223 -134 136 291 -519 -549 219 19
5557 19 -345 141 462 -381 -184 415 -161 -242 208 593 -202 -185 567 70 -703 -70 270 -510 -202 142 90
5578 90 -605 131 333 -125 64 696 199 -297 327 115 -459 89 861 161 -458 5 -19 -669 -236 674 33
5599 33 -686 316 25 -612 -142 724 -96 -162 611 455 -234 -17 335 -363 -132 605 412 -664 164 240
5619 240 -682 -562 589 92 -605 123 344 -481 -441 705 365 -294 519 641 -394 -247 650 2 -515
5638 -515 284 285 -612 -619 49 -377 -635 315 452 -397 -312 739 142 -625 146 534 -322 88 650 -226 -613
5659 -613 -17 486 -657 -9 536 -582 -601 271 -27 -289 -86 630 -322 -530 562 271 -554 259 530
5678 530 135 -306 218 278 -871 17 488 -86 -385 227 -176 -635 48 285 -274 -240 553 243 -342 493
5698 493 563 -294 -269 664 180 -361 57 55 -564 -307 569 100 -547 -360 222 -531 -83 551 90 -338 351
5719 351 765 -255 -323 675 -42 -153 596 258 -566 -206 386 -404 -363 180 423 -606 -208 227 -96 -423
5739 -423 429 149 -316 612 287 -49 -447 367 70 -380 137 126 -466 -413 -15 87 -521 204 76 -196 38
5760 38 484 142 -455 413 598 14 -20 159 -187 -175 310 148 -182 -123 214 -134 -275 -274 -164 -474 -85 84
5782 84 44 -67 -115 96 -84 19 135 251 -49 296 109 -232 -186 262 -145 -166 36 -2 -336 -291 202 -171
5804 -171 -39 202 151 -193 89 8 214 -37 385 170 -133 -227 144 -123 -194 56 165 -276 -145 105 -161
5825 -161 9 -39 -97 68 124 421 0 -268 317 -134 123 -162 281 -84 -235 89 65 -465 -114 -29 -146 -132
5847 -132 -10 -224 -218 64 47 96 -44 140 110 -71 286 178 -62 46 212 -113 -100 -131 -113 -255 -359 -331 11
5870 11 -212 -8 -6 -272 144 249 354 144 83 129 30 10 288 -130 -98 9 -42 -69 -231 -126 -92 -232 183 -157
5894 -157 10 197 57 102 143 50 65 219 380 251 390 202 84 21 -408 -97 28 -214 -130 -11 -194 -59
5916 -59 249 248 98 -105 106 97 91 84 -39 -347 67 164 -72 -245 102 -102 -599 -319 79 48 -37 -171 296 -183
5940 -183 118 367 -104 -1 463 270 -12 142 -112 -34 -14 99 -50 -117 -148 -102 -242 -48 41 88 -38 391
5962 391 516 -96 91 283 158 -2 558 460 -74 178 310 57 -282 102 78 -506 -217 34 -182 -329 115
5983 115 -55 33 219 503 -84 -213 379 353 4 222 163 -40 -190 43 230 -250 -201 77 -399 -452 163 93
6005 93 -164 115 457 -188 -99 220 -9 -330 449 513 -132 -111 200 -86 -590 177 698 -224 -275 377 -33 -493
6027 -493 -82 205 -377 230 701 236 -261 -93 346 -611 106 594 109 -366 130 193 -568 -147 500 -625
6047 -625 -496 515 139 -244 -284 507 -136 -342 608 215 -394 119 467 -166 -5 634 163 -639 -255 120
6067 120 -680 -323 399 173 -791 149 503 -409 -232 622 373 -78 356 591 -235 -309 358 -95 -243 206
6087 206 521 -657 -66 518 -386 -533 265 432 -171 243 625 -284 -499 347 492 -100 3 720 -50 -690
6107 -690 148 461 -416 -183 307 -496 -619 230 273 -608 71 896 -151 -228 503 -100 -641 398 767 67
6127 67 -187 307 -196 -866 20 562 -364 -468 342 -214 -797 -57 431 -608 -36 769 496 -127 265 373
6147 373 -316 -95 558 29 -390 289 250 -566 -610 422 -145 -656 134 227 -620 -388 446 -280 26 773 446
6168 446 -431 103 316 -57 -417 430 440 -964 -316 204 -723 -688 325 292 -493 37 468 -244 -427 408
6188 408 88 -92 298 573 -204 -55 153 79 -515 -44 506 -363 -229 47 -282 -529 366 446 124 -155 403
6209 403 -107 -683 183 707 -234 190 511 -54 -527 217 -47 -676 -363 371 -264 -483 -182 -64 -360 -34
6229 -34 480 130 -452 324 -56 -151 198 744 120 -106 222 266 -293 -152 517 -410 -394 274 136 -542 -66
6250 -66 -24 -268 -52 693 301 -40 -86 545 32 -114 373 432 -347 10 347 -48 -140 -18 -289 -529 230 68
6272 68 -391 -217 89 266 -218 135 259 -146 94 281 240 -1 289 386 -157 38 158 60 -516 -106 -140 -113
6294 -113 78 242 -306 -353 378 273 148 308 469 180 138 50 112 -223 -172 188 14 -221 -205 -206 -194 -342 136
6317 136 -221 -319 61 227 -63 42 255 131 -169 306 329 36 48 -17 32 -217 -12 -179 -194 -440 -166 -468
6339 -468 -452 167 218 -19 188 414 335 149 342 -114 -197 222 289 -45 -43 -273 -70 -20 -168 -119 -506 -271 -180
6362 -180 210 14 143 21 -146 404 142 215 -12 151 -18 -88 -126 -29 -276 -373 -103 -56 -211 -277 -129 -290
6384 -290 -180 14 78 211 120 -11 -232 -93 109 75 -2 197 207 -158 42 -270 -41 -95 -201 270 -194 -337
6406 -337 -123 -43 -274 -164 251 77 -272 -241 220 3 175 121 -227 27 160 -35 -86 -110 -241 160 61 179
6428 179 -172 -392 -186 65 -2 158 210 -50 123 175 386 46 112 206 75 -294 -94 4 -120 -344 -6 -304
6450 -304 -300 -32 35 -238 75 179 -3 30 -109 90 64 166 319 -185 -133 -111 -431 -320 -197 -101 -110 26 -169
6473 -169 -159 29 -45 40 -231 101 369 247 115 57 391 161 -40 157 83 -170 -117 177 -517 -216 295 -239
6495 -239 19 -37 -30 -370 -100 314 -35 -69 245 273 -1 114 184 -185 -391 324 4 -362 -51 167 -397 -249
6517 -249 116 228 -36 22 384 -248 -243 132 88 -29 370 525 -386 -61 424 69 -198 -44 138 -296 -108
6538 -108 15 73 -676 458 75 -73 -208 315 5 -160 486 334 -58 7 414 1 -275 196 129 -362 -104
6559 -104 380 -194 -520 -2 335 -597 136 596 -189 -208 459 267 -303 298 296 69 -121 542 415 -525 -226
6580 -226 -20 -285 -196 199 -54 -726 -199 184 -473 -158 560 328 -201 489 278 -294 -30 280 305 -679 309
6601 309 329 -696 -148 169 -97 -597 490 60 -429 -221 406 52 -314 368 604 -356 -76 215 -243 -470
6621 -470 421 645 -414 -6 52 -528 -602 134 -26 -542 -70 420 -274 -251 550 104 -246 292 634 -94 -45
6642 -45 460 -82 -347 -304 447 -371 -661 378 15 -717 -36 613 -86 156 519 -39 -326 387 381 -56 -65 768
6664 768 38 -493 428 112 -460 -231 545 0 -571 135 42 -294 35 369 -196 -258 297 305 -370 -233 485
6685 485 -72 -6 527 330 -426 -256 504 -109 -288 459 -265 -558 -215 147 -316 7 485 323 -469 211
6705 211 204 -135 -316 349 302 -247 135 303 -297 -418 508 120 -160 -128 -63 -127 -492 565 -177 -221 415 581
6727 581 191 -108 529 14 -233 361 441 -340 27 129 -36 -648 -59 284 -193 -320 79 -68 -37 248 259
6748 259 -70 214 581 78 167 334 30 -406 -119 359 -267 -440 219 -112 -244 -21 131 -510 -185 297
6768 297 76 -22 -294 219 87 533 207 422 -293 -113 111 -32 -99 202 297 -380 -95 33 80 -389 134
6789 134 -96 -65 26 270 -149 46 504 239 -1 193 249 73 -104 88 184 -135 -6 -40 -218 -64 68 -320
6811 -320 -129 -117 541 288 -164 314 25 -308 198 79 -89 171 325 -144 44 -130 -155 -198 -201 -40 -296 -208
6833 -208 74 -131 196 216 308 -82 241 320 353 169 -120 67 -86 199 16 -96 50 -275 -51 -206 -192 -92
6855 -92 0 -88 -17 91 -14 168 202 38 111 -66 91 -50 68 320 72 -376 23 40 -114 -162 -105 -383 -266
6878 -266 -67 52 69 132 226 93 60 230 148 29 211 127 -65 -74 29 120 -80 40 -107 155 -429 -89 -89 -201
6902 -201 -226 -194 51 -173 -109 77 -17 166 90 -51 190 102 150 -68 -339 -119 -120 112 105 30 -209 -57 184 -11
6926 -11 44 334 178 98 45 163 2 249 104 -85 -259 180 -129 -468 -204 -3 -42 -273 93 -121 -224 -30
6948 -30 331 -20 352 176 82 152 181 452 -71 -95 182 566 152 -329 59 -317 -196 210 -160 -178 128 34
6970 34 -170 41 71 -154 -55 -8 343 269 -155 221 -252 -204 67 22 -70 -99 -115 -278 -281 -149 298 -165 18 217
6994 217 -61 -145 222 90 104 424 699 -49 -125 -164 -85 11 -103 39 -217 -160 97 -51 25 -103 183 -131 -205
7017 -205 330 434 -279 186 159 96 -219 318 -218 -217 -163 25 -464 45 168 -114 -295 30 151 -290 11 152
7039 152 50 -44 186 151 -534 -46 446 -142 -212 36 230 -459 -258 92 -138 -285 226 183 -314 -348 352 180
7061 180 -393 314 394 -271 150 169 -105 -300 224 267 -368 73 332 -208 -367 271 -83 -487 152 336 -83
7082 -83 -261 713 430 -423 307 711 -45 -257 242 95 -298 -20 453 -311 -412 194 -242 -497 64 324
7102 324 -422 -19 508 75 -596 170 441 -201 37 617 208 -480 139 20 -551 -199 546 -192 -565 41
7122 41 124 -538 -277 415 -76 -471 246 306 -354 -16 451 -139 -67 423 280 -560 -209 223 -428 -709 10
7143 10 129 -714 50 30 -582 -260 721 450 -442 269 387 -265 -51 294 -100 -291 181 360 -325 -362 470
7164 470 -16 -375 -117 513 -570 -33 324 188 -277 445 474 -112 8 319 168 -418 163 322 5 -37
7184 -37 237 -356 -581 10 283 -389 -82 440 -157 -229 328 455 -79 267 667 77 -194 293 116 -390 -170
7205 -170 306 -214 -435 305 12 -531 -146 338 -257 -236 268 174 -322 75 566 394 -116 684 63 -135 87
7226 87 179 -198 -158 365 71 -615 56 -13 -518 -408 386 -4 -222 470 342 -152 -247 537 44 -124 346 215
7248 215 -396 47 424 -210 -331 193 389 -605 -185 91 -104 -257 26 232 -329 158 428 330 50 247
7268 247 11 -117 223 253 -165 -11 135 -6 -175 -119 -34 -297 -71 181 190 -320 36 401 -393 -63 267 345
7290 345 63 116 452 -183 -105 356 -187 -372 -98 -49 -182 -271 80 48 -237 181 197 -161 138 10 70 117 275
7313 275 296 -53 -124 112 -46 -114 109 -161 -275 -409 -211 -246 -247 78 231 -10 123 234 77 -2 120 293
7335 293 -90 165 81 26 -233 59 -75 -73 -238 46 -360 -243 -165 135 -109 -254 378 37 92 112 369 -88
7357 -88 216 216 186 18 254 178 -216 -136 -39 -196 -416 -54 -122 -100 -40 40 118 -48 -81 275 -131 -40 56 -214 44
7382 44 25 180 82 76 -17 -149 -108 -61 -173 -316 -54 22 85 113 197 143 -43 344 216 255 37 295 0 -89 -69
7407 -69 -157 -104 -27 62 -173 -404 -92 -139 -125 -150 61 340 177 295 392 -344 139 257 169 -4 356 31 -171
7430 -171 264 -34 104 38 -72 -109 -276 41 125 -9 -342 209 -104 -56 130 190 107 301 148 38 -164 95
7452 95 126 -374 -78 -300 -555 -109 42 -255 -168 -60 -206 77 147 231 43 -114 167 118 -37 -243 229 -5
7474 -5 -127 -178 60 -280 -226 101 -198 -200 -11 -111 -220 -255 376 237 -35 427 325 302 12 422 99 -150 141
7497 141 137 -30 -78 71 -143 -463 -160 -28 -155 -34 245 -7 19 299 391 68 296 234 -129 105 217 287
7519 287 -249 -145 -9 -66 -360 29 -149 -328 58 -99 -137 -80 360 -52 -202 59 367 2 102 353 -22
7540 -22 -282 165 -99 -224 -268 188 8 -266 -104 165 -287 99 534 141 -240 522 427 -130 -231 225 182
7561 182 -338 286 290 -37 -243 240 118 -385 130 -25 -538 -357 270 143 -234 331 393 -280 74 687 2
7582 2 -169 303 349 -308 91 315 -414 -290 -6 147 -718 27 121 -484 72 614 309 -350 638 332 -88
7603 -88 -47 255 100 -43 276 404 -281 -295 34 -493 -147 -7 399 -435 -176 408 28 -714 382 329 -256
7624 -256 0 557 -32 -229 491 200 -551 -144 287 -353 -261 131 163 -335 -319 148 -213 -500 -65 122 -194
7645 -194 5 415 -45 -67 639 137 -523 225 339 -328 -565 185 86 -716 -68 195 -224 -165 487 59 -420
7666 -420 199 455 -242 10 633 124 -271 375 413 -519 -146 169 -132 -222 80 43 -178 -184 561 -77 -105 547
7688 547 95 -279 76 766 -216 -296 472 207 -321 -66 170 -120 -429 179 253 -452 -310 221 -351 -370 324
7709 324 304 -218 159 580 -74 -429 501 159 -308 315 320 -77 -239 48 190 -495 -120 324 -93 -248 238
7730 238 -219 -247 143 335 294 81 330 110 -481 437 407 -120 57 227 -236 -407 69 298 -292 -42 55
7751 55 -106 -97 59 75 -174 -28 323 -72 -151 403 366 -132 -107 302 -62 -224 364 127 -490 -178 164 -175
7773 -175 -80 345 135 -386 -68 -55 -308 -327 223 237 -154 310 378 -270 -4 152 -27 -361 -52 -197 -386 -168
7795 -168 80 -3 -293 67 508 172 -254 302 43 35 195 510 -168 -140 -46 -115 153 -209 -203 -250 -206 37 -174
7818 -174 54 -162 404 103 107 88 204 80 287 180 -123 0 131 -57 -29 141 141 -162 -38 -118 -253 -261 111
7841 111 47 124 187 257 -80 -79 86 160 3 -52 186 -177 -19 -260 -28 -113 -134 -210 -171 -28 -194 -70 -70 -4 2 -121
7867 -121 108 170 336 -64 -225 58 265 229 444 171 -216 -32 31 -88 -245 -27 -78 -261 143 -142 -341
7888 -341 -2 -29 63 177 238 200 302 200 4 -57 226 -52 -6 93 298 -20 1 -63 -75 14 140 -276 155 29
7912 29 -125 172 256 278 -24 185 -96 40 81 180 -237 -15 -130 81 -173 233 40 -59 -60 29 -45 -166 13
7935 13 49 82 256 232 284 -178 53 -90 98 189 140 -85 -206 49 -469 -222 -71 -79 -120 -216 18 -19 -33 83
7959 83 165 -272 178 326 119 -175 -181 -111 -269 279 -33 -258 -224 69 -52 -110 140 155 -300 32 262 -106 -71
7982 -71 92 309 397 -269 81 234 -283 -256 -73 -165 -223 -263 -277 -375 -84 -28 -117 -139 -74 -48 -157 350 434 41 67
8007 67 42 -76 -32 203 81 -190 -217 -120 53 -589 190 -70 -156 27 126 105 -179 221 277 -100 328 378 -8
8030 -8 149 282 318 -395 215 225 -210 -223 -2 89 -340 -111 367 -303 -553 100 -30 -363 474 168 -175 -25
8052 -25 233 52 -40 52 279 -430 -126 293 -326 -365 -1 -128 -496 -317 309 164 -460 62 498 -238 128
8073 128 421 -100 -363 388 -15 -296 -70 129 -326 -294 358 155 -314 -57 237 -294 -143 272 227 -363 8
8094 8 246 0 -156 288 39 -64 147 290 -87 -667 286 6 -684 8 -33 -132 -124 211 20 -336 475 332
8116 332 -259 -16 521 236 -347 235 -2 -506 -99 151 -269 -456 -187 111 -512 -42 356 -44 -355 350
8136 350 306 -424 -191 426 -186 -238 405 340 -166 247 154 -31 -193 347 133 -332 -168 98 -188 -328 67
8157 67 205 -150 61 383 -100 108 359 -300 -202 188 546 -54 -151 246 23 -494 192 259 -289 -47 221
8178 221 -339 -350 109 406 -34 -95 372 -23 -355 295 114 -264 71
8191G1
##END NTUPLES=NMR FID
##END=
