##TITLE=1H_LR-724-R2-CR17
 200.13MHz, CDCl3
 8 sc
 
 19ns.26.2.2025
##JCAMPDX= 6.0         $$ Bruker NMR JCAMP-DX V2.0
##DATA TYPE= NMR FID
##DATA CLASS= NTUPLES
##ORIGIN= UXNMR, Bruker Analytische Messtechnik GmbH
##OWNER= pz
$$ XWIN-NMR		Version 3.5
$$ Wed Feb 26 15:55:06 2025 Russian Standard Time (UT+4h)  new_Human@DPX200
##.OBSERVE FREQUENCY= 200.1313
##.OBSERVE NUCLEUS= ^1H
##.DELAY= (6, 6)
##.ACQUISITION MODE= SIMULTANEOUS
##.ACQUISITION SCHEME= undefined
##.AVERAGES= 8
##.DIGITISER RES= 18
##SPECTROMETER/DATA SYSTEM= spect
##.PULSE SEQUENCE= zg30
##.SOLVENT NAME= CDCl3
##.SHIFT REFERENCE= (INTERNAL, CDCl3, 0, 14.3821)
##AUDIT TRAIL= $$ (NUMBER, WHEN, WHO, WHERE, WHAT)
$$ ##TITLE= Audit trail, XWIN-NMR		Version 3.5
$$ ##JCAMPDX= 5.01
$$ ##ORIGIN= Bruker BioSpin GmbH
$$ ##OWNER= new_Human
$$ C:/Bruker/XWIN-NMR/data/yarkov/nmr/H-C/1/audita.txt
$$ ##AUDIT TRAIL=  $$ (NUMBER, WHEN, WHO, WHERE, WHAT)
(   1,<2025-02-26 15:52:59.21 +0400>,<new_Human>,<DPX200>,
      <created by zg, POWCHK disabled, PULCHK disabled
       configuration hash MD5:
       00 E9 B6 7A A2 85 ED C7 34 08 36 98 17 FE 4E 26
       data hash MD5: 16K
       59 71 FA 2F 0D 25 00 6D D8 C2 E3 2B 8B 96 71 C3>)
$$ ##END=
$$ 
$$ hash MD5
$$ BB 2F 95 65 07 92 B5 5F 38 D0 0D 07 01 59 3F 67
##$RELAX= 
##$RELAX= 
##$RELAX= 
##$RELAX= 
##$RELAX= 
##$RELAX= 
$$ Bruker specific parameters
$$ --------------------------
##$DU= <C:/Bruker/XWIN-NMR>
##$EXPNO= 1
##$NAME= <H-C>
##$PROCNO= 1
##$TYPE= <nmr>
##$USER= <yarkov>
##$AMP= (0..31)
100 100 100 100 100 100 100 100 100 100 100 100 100 100 100 100 100 100 
100 100 100 100 100 100 100 100 100 100 100 100 100 100 
##$AQSEQ= 0
##$AQ_mod= 1
##$AUNM= <au_zg>
##$AUTOPOS= <>
##$BF1= 200.13
##$BF2= 200.13
##$BF3= 200.13
##$BF4= 200.13
##$BF5= 200.13
##$BF6= 200.13
##$BF7= 200.13
##$BF8= 200.13
##$BYTORDA= 1
##$CFDGTYP= 0
##$CFRGTYP= 5
##$CHEMSTR= <none>
##$CNST= (0..31)
1 1 145 1 1 1 1 1 1 1 1 1 1 1 1 1 1 1 1 1 1 1 1 1 1 1 1 1 1 1 1 1 
##$CPDPRG= <>
##$CPDPRG1= <>
##$CPDPRG2= <>
##$CPDPRG3= <>
##$CPDPRG4= <mlev>
##$CPDPRG5= <mlev>
##$CPDPRG6= <mlev>
##$CPDPRG7= <mlev>
##$CPDPRG8= <mlev>
##$CPDPRGB= <>
##$CPDPRGT= <>
##$D= (0..31)
0 0.7 0 0 0 0 0 0 0 0 0 0.03 0 0 0 0 0 0 0 0 0 0 0 0 0 0 0 0 0 0 0 0 
##$DATE= 1740570778
##$DBL= (0..7)
120 120 120 120 120 120 120 120 
##$DBP= (0..7)
150 150 150 150 150 150 150 150 
##$DBP07= 0
##$DBPNAM0= <>
##$DBPNAM1= <>
##$DBPNAM2= <>
##$DBPNAM3= <>
##$DBPNAM4= <>
##$DBPNAM5= <>
##$DBPNAM6= <>
##$DBPNAM7= <>
##$DBPOAL= (0..7)
0.5 0.5 0.5 0.5 0.5 0.5 0.5 0.5 
##$DBPOFFS= (0..7)
0 0 0 0 0 0 0 0 
##$DE= 6
##$DECBNUC= <off>
##$DECIM= 32
##$DECNUC= <off>
##$DECSTAT= 4
##$DIGMOD= 1
##$DIGTYP= 9
##$DL= (0..7)
0 120 120 120 120 120 120 120 
##$DP= (0..7)
150 150 150 150 150 150 150 150 
##$DP07= 0
##$DPNAME0= <>
##$DPNAME1= <>
##$DPNAME2= <>
##$DPNAME3= <>
##$DPNAME4= <>
##$DPNAME5= <>
##$DPNAME6= <>
##$DPNAME7= <>
##$DPOAL= (0..7)
0.5 0.5 0.5 0.5 0.5 0.5 0.5 0.5 
##$DPOFFS= (0..7)
0 0 0 0 0 0 0 0 
##$DQDMODE= 0
$$ [...]
##$SUBNAM0= <"">
##$SUBNAM1= <"">
##$SUBNAM2= <"">
##$SUBNAM3= <"">
##$SUBNAM4= <"">
##$SUBNAM5= <"">
##$SUBNAM6= <"">
##$SUBNAM7= <"">
##$SUBNAM8= <"">
##$SUBNAM9= <"">
##$SW= 18.0517328524113
##$SWIBOX= (0..15)
0 0 2 0 0 0 0 0 0 0 0 0 0 0 0 0 
##$SW_h= 3612.71676300578
##$TD= 16384
##$TD0= 1
##$TE= 0
##$TE2= 300
##$TE3= 300
##$TEG= 300
##$TL= (0..7)
0 120 120 120 120 120 120 120 
##$TP= (0..7)
150 150 150 150 150 150 150 150 
##$TP07= 0
##$TPNAME0= <>
##$TPNAME1= <>
##$TPNAME2= <>
##$TPNAME3= <>
##$TPNAME4= <>
##$TPNAME5= <>
##$TPNAME6= <>
##$TPNAME7= <>
##$TPOAL= (0..7)
0.5 0.5 0.5 0.5 0.5 0.5 0.5 0.5 
##$TPOFFS= (0..7)
0 0 0 0 0 0 0 0 
##$TUNHIN= 0
##$TUNHOUT= 0
##$TUNXOUT= 0
##$USERA1= <user>
##$USERA2= <user>
##$USERA3= <user>
##$USERA4= <user>
##$USERA5= <user>
##$V9= 5
##$VALIST= <valist>
##$VCLIST= <CCCCCCCCCCCCCCC>
##$VD= 0
##$VDLIST= <DDDDDDDDDDDDDDD>
##$VPLIST= <PPPPPPPPPPPPPPP>
##$VTLIST= <TTTTTTTTTTTTTTT>
##$WBST= 1024
##$WBSW= 4
##$XGAIN= (0..3)
0 0 0 0 
##$XL= 0
##$YL= 0
##$YMAX_a= 344880
##$YMIN_a= -414122
##$ZGOPTNS= <>
##$ZL1= 120
##$ZL2= 120
##$ZL3= 120
##$ZL4= 120
##$ABSF1= 10
##$ABSF2= 0
##$ABSG= 5
##$ABSL= 3
##$ALPHA= 0
##$AQORDER= 0
##$ASSFAC= 0
##$ASSFACI= 0
##$ASSFACX= 0
##$ASSWID= 0
##$AUNMP= <proc_1d>
##$AZFE= 0.1
##$AZFW= 0.1
##$BCFW= 1
##$BC_mod= 2
##$BYTORDP= 1
##$COROFFS= 0
##$CY= -3
##$DATMOD= 1
##$DC= 2
##$DFILT= <>
##$DTYPP= 0
##$F1P= 0
##$F2P= 0
##$FCOR= 0.5
##$FTSIZE= 0
##$FT_mod= 4
##$GAMMA= 1
##$GB= 0.15
##$INTBC= 1
##$INTSCL= 1
##$ISEN= 128
##$LB= 0.25
##$LEV0= 0
##$LPBIN= 0
##$MAXI= 10000
##$MC2= 0
##$MEAN= 0
##$ME_mod= 0
##$MI= 1.114404
##$NCOEF= 0
##$NC_proc= 0
##$NLEV= 6
##$NOISF1= 3.799351
##$NOISF2= 2.8
##$NSP= 1
##$NTH_PI= 0
##$NZP= 0
##$OFFSET= 14.38212
##$PC= 1
##$PHC0= -1186.444
##$PHC1= 12.99225
##$PH_mod= 1
##$PKNL= yes
##$PPARMOD= 0
##$PSCAL= 0
##$PSIGN= 0
##$REVERSE= no
##$SF= 200.129724274929
##$SI= 16384
##$SIGF1= 3
##$SIGF2= 2
##$SINO= 400
##$SIOLD= 16384
##$SREGLST= <1H.CDCl3>
##$SSB= 0
##$STSI= 0
##$STSR= 0
##$SW_p= 3205.1282051282
##$SYMM= 0
##$S_DEV= 0
##$TDeff= 0
##$TDoff= 0
##$TI= <>
##$TILT= no
##$TM1= 0
##$TM2= 0
##$TOPLEV= 0
##$USERP1= <user>
##$USERP2= <user>
##$USERP3= <user>
##$USERP4= <user>
##$USERP5= <user>
##$WDW= 1
##$XDIM= 8192
##$YMAX_p= 0
##$YMIN_p= 0
$$ End of Bruker specific parameters
$$ ---------------------------------
##NTUPLES= NMR FID
##VAR_NAME=  TIME,          FID/REAL,        FID/IMAG
##SYMBOL=    X,             R,               I
##VAR_TYPE=  INDEPENDENT,   DEPENDENT,       DEPENDENT
##VAR_FORM=  AFFN,          ASDF,            ASDF
##VAR_DIM=   8192,          8192,            8192
##UNITS=     SECONDS,       ARBITRARY UNITS, ARBITRARY UNITS
##FACTOR=    0.0002768,     1,               1
##FIRST=     0,             0,               0
##LAST=      2.2672688,     0,               0
##MIN=       0,             -414122,         0
##MAX=       2.2672688,     344880,          0
$$ Real data points
##PAGE= N=1
##DATA TABLE= (X++(R..R)), XYDATA
$$ plain form
0 0 0 0 0 0 0 0 0 0 0 0 0 0 0 0 0 0 8 -8 8 -8 8 -8 8 -13 16 -16 20 -21 24 -29 32 -37 39 -45 51 -57 64 -71 78
39 78 -86 94 -105 115 -128 142 -157 171 -187 208 -228 249 -277 305 -338 375 -420 471 -532 606
59 606 -695 808 -955 1157 -1437 1860 -2548 3803 -6555 14931 -89199 -414122 -52541 139726
73 139726 -133796 27475 344880 36736 -241520 12821 25338 -222897 33481 321079
83 321079 -9616 -203942 93977 59262 -233149 -30623 216514 -26719 -98476 164170
93 164170 40318 -233580 -16076 154834 -102576 -72032 255029 96782 -222015 -36691
103 -36691 105635 -148018 -103438 227738 122050 -136300 4668 58626 -190230 -104206 203914
114 203914 81386 -120328 64934 106226 -166045 -119154 145975 52288 -88365 83990
$$ packed form
0@%%%%%%%%%%%%%%%%Qj6J6j6J6j6J6k1K9l2L6m1M5n3O1o9P6q4R6j08J21j35J49
39G8j64J80j99K20k43K70k99L28l58L95m36M77n26N82o43P13p95Q91j003J138
59F06j301J503j763K112k594L297m408O351j0358K1486j04130l24923L61581J92267
73A39726k73522J61271L17405l08144k78256K54341J2517k48235K56378K87598
83C21079l30695j94326K97919l4715k92411K02526K47137k43233p1757K62646
93A64170j23852k73898K17504J70910k57410L0544L27061j58247l18797J85324
103c6691J42326k53653M4580L31176j05688k58350J40968N3958k48856Q6024L08120
114B03914j22528k01714J85262M1292k72271M6891K65129r3687j40653J72355
$$ plain form
124 83990 96249 -139377 -82239 112686 -13115 -104941 98125 105353 -113225 -54642 92670
135 92670 -53132 -114961 100019 106456 -88639 -19925 106095 -51364 -118642 71839 75118
146 75118 -78395 12850 115013 -53611 -114191 61709 51019 -96446 -5409 107746 -20023
157 -20023 -72103 50910 14365 -92786 14011 93526 -30052 -42943 76296 10591 -100134
168 -100134 5831 78557 -29840 -27087 75301 -1702 -98274 3914 58194 -39192 -19241
179 -19241 75266 2598 -75765 11962 41337 -45393 -13936 71174 6814 -50867 23738 31235
191 31235 -46086 -12220 47530 -12861 -40192 35652 27594 -48734 -16821 37806 -11600 -31137
203 -31137 30076 20825 -34248 -3071 30639 -15064 -20581 34168 22390 -25018 -4983 16716
$$ packed form
124H3990J2259k35626N7138J94925j25801r1826K03066P228k18578N8583J47312
135I2670j45802o1829K14980O437j95095O8714J26020j57459o7278J90481L279
146G5118j53513R1245J02163j68624o0580J75900j0690j47465R1037J13155j27769
157b0023n2080J23013l6545j07151J06797P9515j23578j2891J19239o5705j10725
168a00134J05965P2726j08397K753J02388p7003r6572J02188N4280r7386J9951
179a9241R4507p2668p8363Q7727K9375q6730L1457Q5110o4360n7681P4605P497
191C1235p7321L3866N9750o0391k7331P5844q058p6328L1913N4627m9406j9537
203c1137O1213r251n5073L1177L3710m5703n517N4749j1778m7408K0035K1699
$$ plain form
215 16716 -16016 -13929 23036 4799 -23174 6959 17455 -21368 -18346 17271 4369 -18216
227 -18216 6032 16932 -8470 -5371 17882 2190 -16002 5197 14094 -5755 -4413 8113 -3389
240 -3389 -9993 5347 4758 -11382 -4137 8790 -4396 -12248 3337 7197 -2772 1665 8398 -1810
254 -1810 -4812 6493 5047 -5066 -728 6755 844 -4070 298 -583 -5548 -2545 141 -3204 -1901
269 -1901 1920 -41 -1191 2219 896 -2510 2130 8046 1882 -4741 1409 6198 1548 -3514 -2502
284 -2502 224 876 -1615 -4630 -3572 1534 1587 -3343 -3861 323 2490 1407 929 534 1486 3683 3110
301 3110 -707 -506 2162 1072 -2643 -1919 756 178 -2769 -3366 -1020 -871 -1782 -2550 -296 2909 1747
318 1747 -2094 465 4988 3938 -1128 -1570 2729 3485 377 -1245 -818 -568 26 -1402 -3732 -3157 -487
$$ packed form
215A6716l2732K087L6965j8237k7973L0133J0496l8823L022L5617j2902k2585
227a8216K4248J0900k5402L099K3253j5692j8192K1199Q897j9849J342J2526j1502
240c389o604J5340n89j6140P245J2927j3186p852J5585L860r969M437O733j0208
254a810l002J1305j446j0113M338P483n911m914M368q81m965L003K686l345J303
269a901L821j961j150L410j323l406M640N916o164o623O150M789m650n062J012
284b502K726O52k491l015J058N106N3m930n18M184K167j083m78l95R52K197n73
301C110l817K01K668j090l715P24K675n78k947n97K346J49r11p68K254L205j162
318A747l841K559M523j050n066m42M299P56l108j622M27K50N94j428k330N75K670
$$ plain form
335 -487 992 -818 -2116 -976 1603 2434 1032 -1569 537 4945 4248 -704 -1139 2042 1662 -1516
351 -1516 -2623 -1817 -840 158 -214 -2561 -2900 367 851 -1895 -1711 802 1728 1583 2048 2096 2615 2946 417
370 417 -2797 -1610 532 -802 -1380 2100 1757 -2616 -3672 -1815 -1611 -2645 -1389 -99 1773 3914
386 3914 3383 -478 -510 3317 1185 -3084 31 4007 944 -2180 -20 151 -2146 -192 1508 -4020
402 -4020 -6565 -1486 142 -905 3590 6674 1822 -1169 693 -2593 -5180 2147 6892 1595 664
417 664 3921 -1311 -5862 267 -530 -7770 -1142 8478 -1283 -8915 3111 6439 -5052 -2604 7856
432 7856 1409 -4492 3604 1834 -7408 2421 11134 -1092 -4732 6413 -918 -14946 -3574 7549
446 7549 -3707 -2653 11674 1931 -12163 64 4491 -9156 -127 17286 2608 -10913 6189
$$ packed form
335d87J479j810j298J140K579Q31j402k601K106M408o97m952m35L181l80l178
351a516j107Q06R77R98l72k347l39L267M84k746J84K513R26j45M65M8N19L31k529
370D17l214J187K142j334n78L480l43m373j056J857K04j034J256J290J872K141
386C914n31l861l2L827k132m269L115L976l063l124K160J71k297J954J700n528
402d020k545N079J628j047M495L084m852k991J862l286k587P327M745n297r31
417F64L257n232m551O129p97p240O628R620r761p632J2026L328j1491K448J0460
432G856o447n901Q096j770r242R829Q713j2226l640J1145p331j4028J1372J1123
446G549j1256J054J4327r743j4094J2227M427j3647R029J7413j4678j3521J7102
$$ plain form
459 6189 7329 -12871 -4753 14200 1368 -7901 5297 -1634 -17087 1450 14631 -6499 -8462
472 -8462 13649 2901 -17512 491 13770 -5601 -4045 15664 1303 -14266 7508 12620 -13772
485 -13772 -9342 12066 -880 -11157 9304 8890 -14683 -7168 8667 -6753 -9156 16254 11907
498 11907 -11841 -2910 7229 -9727 -6268 18304 8464 -11206 2402 7048 -15872 -9665 15439
511 15439 3499 -12640 7517 10450 -17357 -12734 12534 1809 -9926 12424 15965 -9502 -8395
524 -8395 7158 -6947 -12276 15032 19572 -5880 -6667 3582 -10947 -15053 7366 10542 -2260
537 -2260 5112 5908 -17515 -14811 12584 7780 -7026 9946 15721 -13886 -16050 9718 4221 -9663
551 -9663 11657 19734 -11059 -16204 5353 -4563 -17383 9738 22265 -4809 -8894 7711 -7001
$$ packed form
459F189J140k0200Q118J8953j2832r269J3198o931j5453J8537J3181k1130j963
472h462K2111j0748k0413J8003J3279j9371J556J9709j4361j5569K1774N112k6392
485a3772M430K1408j2946j0277K0461m14k3573P515J5835j5420k403K5410m347
498A1907k3748Q931J0139j6956L459K4572r840j9670J3608M646k2920O207K5104
511A5439j1940j6139K0157K933k7807M623K5268j0725j1735K2350L541k5467J107
524h395J5553j4105n329K7308M540k5452p87J0249j4529m106K2419L176j2802
537b260P372P96k3423K704K7395m804j4806J6972N775k9607k164K5768n497j3884
551i663K1320Q077l0793n145K1557r916j2820K7121J2527k7074m085J6605j4712
$$ plain form
564 -7001 -20121 5209 18014 455 2360 10985 -9975 -16169 9478 8526 -10524 4960 15778
577 15778 -13307 -18744 11096 7286 -13722 5479 16164 -13164 -14821 14684 3759 -16547 7768
590 7768 18763 -11156 -9001 18915 2173 -19809 2840 12664 -12478 -6609 17819 2848 -13225
603 -13225 4098 1565 -18346 -895 19246 -2993 -10215 14314 6254 -19284 -2192 17192 -3711
616 -3711 -7496 14388 2581 -17801 3161 13231 -13021 -9288 18901 3894 -20712 580 12576
629 12576 -11349 -9032 16895 6986 -9795 5419 6555 -15767 -6067 16015 2197 -8030 12317
642 12317 9306 -18547 -10935 10338 -1009 -7585 11500 7380 -14330 -4532 8947 -7131 -7942
655 -7942 16312 10255 -14377 -3552 11653 -5088 -9546 12475 8892 -10285 -1156 7257 -9876
$$ packed form
564g001j3120K5330J2805j7559J905Q625k0960o194K5647r52j9050J5484J0818
577A5778k9085n437K9840l810k1008J9201J0685k9328j657K9505j0925k0306K4315
590G768J0995k9919K155K7916j6742k1982K2649R824k5142N869K4428j4971j6073
603a3225J7323k533j9911J7451K0141k2239p222K4529q060k5538J7092J9384k0903
616c711l785K1884j1807k0382K0962J0070k6252L733K8189j5007k4606K1292J1996
629A2576k3925K317K5927r909j6781J5214J136k2322R700K2082j3818j0227K0347
642A2317l011k7853P612K1273j1347o576J9085m120k1710R798J3479j6078q11
655g942K4254o057k4632J0825J5205j6741m458K2021l583j9177R129Q413j7133
$$ plain form
668 -9876 -9932 11082 5278 -10300 3243 10685 -9919 -10769 10139 4344 -9902 5335 12914 -6017
682 -6017 -7301 8644 656 -9929 5965 9405 -9475 -6098 9973 -2141 -13047 5337 10010
695 10010 -8572 -5979 8499 -970 -8628 6908 7805 -7604 -645 10896 -3506 -9512 7938
708 7938 6694 -9976 -3014 9156 -2409 -7963 4720 2918 -8594 -668 6733 -4791 -4990 8855
722 8855 3549 -8999 1212 9546 -2649 -5373 6034 2825 -6315 1239 4800 -5411 -3719 6686
736 6686 -337 -8389 1434 5728 -4803 -4080 5137 935 -4491 2927 4111 -3696 -312 6227 -705
751 -705 -5573 2929 4516 -3762 -2176 3909 -1100 -4360 1491 1375 -4069 -718 3235 -1504 -3432 2858
767 2858 3066 -2149 357 3757 -465 -1791 2521 1025 -2439 187 2214 -1761 -1964 1268 115 -3350
$$ packed form
668i876n6K1014n804j5578J3543P442k0604q50K0908n795j4246J5237P579j8931
682f017j284J5945p988j0585J5894L440j8880L377J6071j2114j0906J8384M673
695A0010j8582K593J4478r469p658J5536Q97j5409O959J1541j4402o006J7450
708G938j244j6670O962J2170j1565n554J2683j802j1512P926P401j1524j99J3845
722H855n306j2548J0211Q334j2195k724J1407l209r140P554L561j0211J692J0405
736F686p023q052R823M294j0531P23R217m202n426P418J184p807L384O539o932
751g05m868Q502J587q278J586O085n009l260N851j16n444L351L953m739j928O290
767B858K08n215K506L400m222j326M312j496l464K626K027l975k03L232j153l465
$$ plain form
783 -3350 -1364 1278 -1527 -1293 1690 986 -806 1204 2068 -313 -260 1328 403 -1191 326 1305 -253
800 -253 -297 482 -1257 -2471 -768 -228 -1343 -805 922 634 -17 787 978 -120 340 958 -242 -428
818 -428 1409 1821 -183 -323 125 -712 -1553 -879 -1026 -1268 451 380 -825 -193 1364 385 -815 83 961
837 961 266 627 1737 880 -59 789 34 -1809 -821 542 -1123 -1606 225 256 -728 -471 156 -797 -769
856 -769 706 564 109 1875 2180 -333 -65 1076 -104 -1478 113 380 -1116 -259 791 -1255 -1609
873 -1609 499 -1 -2040 -308 1685 639 -169 1350 1169 -538 122 1469 -242 -769 1010 1205 -653
890 -653 -840 926 -122 -1667 -1841 -632 -214 -63 416 705 332 1212 904 -411 -533 994 367 -933
908 -933 1023 2150 516 -869 24 -799 -2792 -913 633 -1243 -1130 2387 812 -2628 39 2612
$$ packed form
783c350J986K642k805K34K983p04j792K010Q64k381N3J588r25j594J517R79j558
800b53m4P79j739j214J703N40j115N38J727k88o51Q04J91j098M60O18j200j86
818d28J837M12k004j40M48q37q41O74j47k42J719p1j205O32J557r79j200Q98Q78
837I61o95L61J110q57r39Q48p55j843R88J363j665m83J831L1r84K57O27r53K8
856g69J475j42m55J766L05k513K68J141j180j374J591K67j496Q57J050k046l54
873a609K108n00k039J732J993j046q08J519j81j707O60J347j711n27J779J95j858
890f53j87J766j048j545j74J209M18J51M79K89l73Q80l08j315j22J527o27j300
908i33J956J127j634j385Q93q23j993J879J546j876J13L517j575l440K667K573
$$ plain form
924 2612 -1137 -2455 2260 2443 -1102 510 3351 -63 -1568 1230 -580 -3401 -121 1696 -2436
939 -2436 -1830 3103 791 -3054 413 1644 -2720 -1602 2593 925 -1250 3182 2674 -2240 -652 2702
955 2702 -1657 -3824 1856 2065 -2658 -941 3024 -807 -3521 467 291 -2528 668 3228 -836 -1714
971 -1714 2640 1464 -2029 1064 4098 -753 -3092 28 490 -1823 608 2753 -574 -2273 -3
986 -3 -1263 -3348 995 4311 719 -1736 1356 1783 -2213 -1424 2332 1599 -536 598 771 -2058 -1155
1003 -1155 1339 -1164 -1863 2240 1638 -3341 -2458 1953 -101 -1324 2844 2928 -2015 -668 1841 -2171
1019 -2171 -1879 4464 3183 -3440 -629 3450 -2400 -4650 2139 2186 -3335 -1121 3349 -1222 -2497 2488
1035 2488 1006 -3863 602 3824 -769 -1059 3108 213 -3281 484 2412 -1818 -421 2898 -1861
$$ packed form
924B612l749j318M715J83l545J612K841l414j505K798j810k821L280J817m132
939b436O06M933k312l845L467J231m364J118M195j668k175M432n08m914J588L354
955B702m359k167N680K09m723J717L965l831k714L988j76k819L196K560m064q78
971a714M354j176l493L093L034m851k339L120M62k313K431K145l327j699K270
986cj260k085M343L316l592k455L092M27l996P89L756p33k135J134J73k829R03
1003a155K494k503o99M103o02m979Q83M411k054j223M168Q4m943J347K509m012
1019b171K92O343j281o623K811M079n850k250O789M7n521K214M470m571j275M985
1035B488j482m869M465L222m593k90M167k895l494L765J928m230J397L319m759
$$ plain form
1050 -1861 -4541 836 1812 -2584 766 4351 -1270 -4280 1334 1439 -3045 266 5074 1455 -1785
1065 -1785 1074 445 -3827 -1393 2067 17 -208 2268 475 -4014 -2993 554 635 1514 2920 805
1081 805 -1841 -1896 -837 -330 2498 5175 1795 -2122 -2579 -2085 -2128 183 3876 2978 -1057 -2341 -2857
1098 -2857 -3359 -1260 3025 3519 219 -545 99 -1616 -2142 1393 3838 1035 -691 342 -605 -2408
1114 -2408 -1066 1289 598 176 1106 -958 -3150 -1080 859 -263 403 3043 1513 -1589 -913 -224
1130 -224 -910 1262 3289 806 -1755 216 -601 -3021 -715 3293 741 -2022 -599 -558 -2223 54
1146 54 2868 824 -819 1230 144 -2158 423 3328 495 -1610 470 143 -2287 -223 1593 278
1162 278 -933 72 -1248 -2558 316 2024 -562 -875 1539 599 -1872 167 2062 672 -101 871
$$ packed form
1050a861k680N377R76m396L350L585n621l010N614J05m484L311M808l619l240
1065a785K859o29m272K434L460k050k25K476j793m489J021L547Q1Q79J406k115
1081H05k646n5J059N07K828K677l380l917m57M94m3K311L693q98m035j284n16
1098b857n02K099M285M94l300p64O44j715n26L535K445k803j726J033r47j803
1114b408J342K355o91m22R30k064k192K070J939j122O66K640j530l102O76O89
1130b24o86K172K027k483k561J971q17k420K306M008k552k763J423M1j665K277
1146E4K814k044j643K049j086k302K581K905k833k105K080l27k430K064J816j315
1162B78j211J005j320j310K874J708k586l13K414r40k471K039J895j390p73R72
$$ plain form
1178 871 -286 -1667 510 684 -1481 -607 1955 -220 -2459 -600 1416 -664 -1150 1087 842 -348
1194 -348 431 640 -1263 -235 2132 212 -1163 1268 1188 -1808 -1783 572 677 -923 267 179 -1605
1211 -1605 -1044 549 -245 -456 2114 1350 -1489 -813 1534 849 -679 616 720 -903 -598 224 -659
1228 -659 -685 1250 -82 -2306 -747 1120 -19 -943 742 638 -506 385 1391 -110 -453 629 48
1245 48 -988 471 1095 -273 -589 441 -568 -1529 -535 747 -204 -418 557 371 -506 750 737 -551
1263 -551 -115 727 -155 -615 787 1115 -73 -332 110 -277 -853 -320 -711 -943 -46 662 -19 -227 334
1282 334 649 -232 -106 322 270 451 638 85 -127 362 52 -350 -625 -148 -524 -642 -217 37 89 -44 -94
1303 -94 -266 -9 294 185 337 638 345 494 441 77 395 -66 -505 -702 -616 85 -602 -370 -137 194 121
$$ packed form
1178H71j157j381K177J74k165Q74K562k175k239J859K016k080m86K237k45j190
1194c48P79K09j903J028K367j920j375K431q0k996K5K355J05j600J190q8j784
1211a605N61J593p94k11K570p64k839O76K347o85j528J295J04j623L05Q22q83
1228f59k6J935j332k224J559J867j139r24J685j04j144Q91J006j501l43J082n81
1245D8j036J459O24j368l16J030j009r61R94J282r51k14R75j86q77J256j3j288
1263e51M36Q42q82m60J402L28j188k59M42l87n76N33l91k32Q97P08o81k08N61
1282C34L15q81J26M28n2J81J87n53k12M89l10m02k75M77l76j18M25K54N2j33n0
1303i4j72K57L03j09J52L01k93J49n3l64L18m61m39j97Q6P01o87K32K33L31p3
$$ plain form
1324 121 -103 -268 -135 -4 189 160 328 843 450 739 16 -140 -345 -195 -352 -605 -370 -148 -198 -481 -338
1345 -338 -129 61 -314 -325 -85 663 395 293 745 833 23 -340 110 -248 -382 128 42 -624 -162 163 -270
1366 -270 -1129 -74 -117 -80 -203 650 673 515 538 253 -58 324 462 -491 -37 378 -104 -292 237 -105 -770
1387 -770 -623 -322 -694 -294 796 628 -352 467 890 152 -458 255 262 115 252 488 286 -233 53 -481
1407 -481 -696 -217 -617 -620 -38 530 219 492 118 -411 -164 153 -199 -257 737 1335 152 -370 329 304 -538
1428 -538 -646 -491 58 -143 -80 -495 115 676 -696 -436 368 134 -72 501 346 21 998 1582 -181 -1120
1448 -1120 344 32 -1253 -325 714 239 -138 121 -445 -1239 65 207 -662 117 1176 19 -521 1100
1466 1100 1071 -581 111 400 -937 -787 908 298 -894 291 548 -1073 -1063 530 -211 -874 620 799
$$ packed form
1324A21k24j65J33J31J93k9J68N15l93K89p23j56k05J50j57k53K35K22n0k83J43
1345c38K09J90l75j1K40P48k68j02M52Q8q10l63M50l58j34N10q6o66M62L25m33
1366b70q59J055m3L7j23Q53K3j58K3k85l11L82J38r53M54M15m82j88N29l42o65
1387g70J47L01l72M00J090j68r80Q19M23p38o10P13Pj47J37K36k02n19K86n34
1407d81k15M79m00lN82N68l11K73l74n29K47L17l52n8R94N98j183n22O99k5q42
1428e38j08J55N49k01O3m15O10N61j372K60Q04k34k06N73j55l25R77N84j763r39
1448a120J464l12j285R28J039m75l77K59n66p94J304J42q69P79J059j157n40J621
1466A100k9j652O92K89j337J50J695o10j192J185K57j621J0J593p41o63J494J79
$$ plain form
1484 799 -377 113 1034 -30 -482 817 401 -926 161 869 -330 -719 391 -294 -1379 -324 233
1501 233 -1024 -356 820 187 -677 -22 785 -386 -299 1004 65 -219 419 477 -412 -42 56 -301 -1007 -106
1521 -106 -335 -476 311 419 105 11 334 -259 -923 465 1027 660 236 519 125 -380 -473 174 151 12 -174
1542 -174 -383 -780 -485 406 811 -129 31 181 -414 -544 266 1232 770 773 545 -179 -297 -492 -163 140 463
1563 463 405 -641 -518 -272 -423 -183 652 433 -272 -170 -172 -744 -232 1597 1157 123 -84 68 -636 -876
1583 -876 48 704 683 234 -621 -1032 -958 -464 -2 474 442 612 90 -532 -396 -150 910 1067 310 -186 -497
1604 -497 -569 -719 412 1303 886 -72 -614 -1432 -930 -292 723 756 628 138 -673 -919 -45 618 994 1065
1624 1065 202 -641 -547 -508 -346 607 892 -276 -1256 -1124 -594 -883 -75 1086 429 -44 125 -201 -590 95
$$ packed form
1484G99j176M90R21j064m52J299m16j327J087P08j199l89J110o85j085J055N57
1501B33j257O68J176o33q64O55Q07j171Q7J303r39k84O38N8q89L70R8l57p06R01
1521a06k29j41P87J08l14r4L23n93o64J388N62l67m24K83l94n05r3O47k3j39j86
1542a74k09l97K95Q91M05r40J60J50n95j30Q10R66m62Lk28p24j18j95L29L03L23
1563D63n8j046J23K46j51K40Q35k19p05J02kn72N12J829m40j034k07J52p04k40
1583h76R24O56k1m49q55m11P4M94M62M76l2J70n22o22J36K46J060J57p57m96l11
1604d97p2j50J131Q91m17r58n42q18N02O38J015L3j28m90q11k46Q74O63L76P1
1624A065q63q43R4L9J62R53K85j168r80J32N30k89Q08J161o57m73J69l26l89O85
$$ plain form
1644 95 1092 498 115 270 135 -609 -196 139 -279 139 285 -269 -917 -377 -54 -807 -360 1343 893 -240
1664 -240 263 338 -631 -81 811 666 66 75 153 -1002 -263 670 -269 -292 -105 -310 -956 -402 485 36 29 584
1686 584 510 -551 56 514 137 -153 702 691 5 185 19 -492 -646 20 -221 -735 70 392 175 -314
1706 -314 -36 23 -156 174 373 278 179 146 -194 -451 80 559 -367 -402 63 -123 -166 -377 -24 -251 -127 173
1728 173 -167 -573 125 268 227 -17 535 125 -292 -234 121 192 260 255 -533 -256 -137 -202 -537 -203 -3 -98 -236
1751 -236 114 594 498 302 7 101 79 406 112 -274 -89 394 -166 -310 -95 67 -103 -286 -413 -279 363
1772 363 118 340 113 50 55 31 -164 -52 537 271 291 104 52 -42 171 -256 -271 -227 -239 -91 431 180 -190
1795 -190 175 -136 105 215 233 62 151 284 249 105 315 -109 -137 -230 -109 -492 -543 166 -80 -338 -90 -92 -165
$$ packed form
1644I5R97n94l83J55j35p44M13L35m18M18J46n54o48N40L23p53M47J703m50j133
1664b40N03P5r69N50Q92j45o00RP8j155P39R33r39k3J87k05o46N54Q87m49pN55
1686E84p4j061O07M58l77k90Q55j1o86J80j66n11j54O66k41n14Q05L22k17m89
1706c14K78N9j79L30J99r5r9l3l40k57N31M79r26l5M65j86m3k11L53k27J24L00
1728A73l40m06O98J43m1k44N52m10m17N8L55P1O8np88K77J19o5l35L34K00r5j38
1751b36L50M80r6j96k95R4k2L27k94l86J85M83n60j44K15J62j70j83j27J34O42
1772C63k45K22k27o3Nk4j95J12N89k66K0j87n2r4K13m27j5M4j2J48N22k51l70
1795a90L65l11K41J10J8j71Q9J33l5j44K10m24k8r3J21l83n1P09k46k58K48kp3
$$ plain form
1818 -165 326 264 -66 -161 259 308 7 204 481 162 -276 85 -264 -281 72 344 -249 -315 -25 -42 -494 -233
1840 -233 355 -249 94 460 384 388 305 -17 -133 -43 34 -359 112 69 -169 -281 187 -69 -402 102 74 -518 -273
1863 -273 522 136 -93 293 329 -5 -39 439 163 -297 94 -7 93 -98 -95 -397 -270 91 -151 -482 15
1884 15 8 -55 35 408 83 -84 105 312 -109 177 521 141 -34 -8 -71 -467 -503 -323 -69 -529 -205 43 156
1907 156 461 209 -215 332 -86 40 309 441 606 -52 193 -395 -422 -41 -80 -345 -231 214 64 38 296
1928 296 -15 101 80 52 10 2 577 146 254 316 152 -254 23 152 -417 -256 -128 7 47 376 228 -235
1950 -235 -287 -600 -509 -30 837 520 74 98 132 235 -241 98 203 33 -288 -278 -395 290 148 -142 -258 -432
1972 -432 -218 -199 -286 -82 93 321 256 464 697 -138 96 -412 -381 94 831 741 118 -117 -483 -714 -346 87
$$ packed form
1818a65M91o2l30r5M20M9l01J97K77l19m38L61l49j7L53K72n93o6K90j7m52K61
1840b33N88o04L43L66p6Mq3l22j16R0P7l93M71m3k38j12M68k56l33N04k8n92K45
1863b73P95l86k29L86L6l34l4M78k76m60L91j01J00j91Ll02J27L61k42l31M97
1884A5po3R0L73l25j67J89K07m21K86L44l80j75K6o3l96l6J80K54m60L24K48J13
1907A56L05k52m24N47m18J26K69J32J65o58K45n88k7L81l9k65J14M45j50k6K58
1928B96l11J16k1k8m2qN75m31J08O2j64m06K77J29n69J61J28J35M0L29j48m63
1950b35n2l13R1M79Q67l17m46K4L4J03m76L39J05j70l21J0j17O85j42k90j16j74
1972d32K14J9q7K04J75K28o5K08K33q35K34n08L1M75P37r0o23k35l66k31L68M33
$$ plain form
1994 87 757 168 -215 -298 -776 -232 597 339 505 394 -107 -650 -694 433 271 139 473 122 -640 -741 -490
2015 -490 -160 -522 691 735 -273 -113 50 -345 -536 390 879 393 222 357 -603 -517 236 194 15 373
2035 373 34 -1007 -815 353 218 -249 269 548 -418 -103 386 73 -340 310 608 -214 167 531 -67
2054 -67 -705 -573 112 -240 446 436 135 -1109 -624 -203 99 267 915 127 -115 -101 -282 -54 496 585 -195
2075 -195 -312 -72 -6 -166 -29 -145 -345 220 676 4 42 -184 -151 -494 199 641 1022 295 20 -629 -774
2096 -774 -219 310 775 937 -211 -1061 -824 -657 143 360 903 -10 -231 -548 -418 -353 511 684 390 -74
2116 -74 -50 -405 -128 163 202 138 -1 -92 -515 -453 -279 117 -168 239 696 101 -427 12 -11 -54 429 694 424
2139 424 5 -77 -340 -322 -36 335 47 -265 36 -112 -471 -193 328 -71 -44 331 177 -257 103 266 -218
$$ packed form
1994H7O70n89l83q3m78N44Q29k58J66j11n01n43m4J127j62j32L34l51p62j01K51
2015d90L30l62J213M4j008J60J63l95j91R26M89m86j71J35r60Q6P53m2j79L58
2035C73l39j041J92J168j35m67N18K79r66L15M89l13m13O50K98q22L81L64n98
2054f7o38J32O85l52O86j0l01j244M85M21L02J68O48p88k42J4j81K28N50Q9p80
2075a95j17K40O6j60J37j16k00N65M56o72L8k26L3l43O93M42L81p27k75o49j45
2096g74N55N29M65J62j148q50K37J67Q00K17N43r13k21l17J30O5Q64J73k94m64
2116g4K4l55K77K91L9o4j39r1m23O2J74L96k85M07M57n95n28M39k3m3M83K65k70
2139D24m19q2k63J8K86L71k88l12L01j48l59K78N21l99K7L75j54m34L60J63m84
$$ plain form
2160 -218 -212 182 547 -223 -446 175 -154 -615 211 254 -276 56 54 -105 -230 73 196 -195 211 632 -51 -147
2182 -147 444 7 -456 67 432 101 -326 273 -113 -925 99 309 -415 -258 572 -3 -423 159 571 3
2202 3 -130 355 73 -208 278 284 -91 -32 113 -187 -575 -269 -147 -487 -100 319 254 -1 228 158 -337 -36
2224 -36 594 33 34 389 457 -150 29 -42 -268 -464 346 162 -391 0 74 -242 -430 204 376 -250 24 377
2246 377 -116 -226 438 137 -229 240 404 198 58 60 -53 -291 -177 49 -230 -152 17 -117 -492 86 451
2267 451 19 -47 299 -301 -281 138 401 81 -48 64 168 -223 -39 55 -235 -401 -24 -196 -7 274 270 178
2289 178 -211 45 87 -277 221 8 343 -38 165 290 -164 147 -73 -352 -468 159 -213 -200 192 351 -105
2310 -105 -257 102 -83 -92 115 180 -202 268 350 172 56 142 31 -313 -63 -53 -12 -124 -42 -45 50 -44 -83 20
$$ packed form
2160b18OL94L65p70k23O21l29m61Q26M3n30L32kj59j25L03J23l91M06M21o83r6
2182a47N91m37m63N23L65l31m27N99l86q12J024K10p24J57Q30n75m20N82M12n68
2202Cj33M85k82k81M86Ol75N9J45l00l88L06J22l40L87M19o5k55K29p0m95L01
2224c6O30n61JL55O8o07J79p1k26j96Q10j84n53L91P4l16j88O34J72o26K74L53
2246C77m93j10O64l01l66M69J64k06j40Kj13k38J14K26k79P8J69j34l75N78L65
2267D51m32o6L46o00K0M19K63l20j29J12J04l91J84R4k90j66L77j72J89K81mr2
2289A78l89K56M2l64M98k13L35l81K03J25m54L11k20k79j16O27l72J3L92J59m56
2310a05j52L59j85rK07O5l82M70Q2j78j16Q6j11l44K50J0M1j12Q2lR5r4l9J03
$$ plain form
2334 20 98 10 277 100 224 -171 90 170 -18 279 90 35 43 23 -126 80 -195 28 -325 -121 30 -80 68
2357 68 127 -40 154 301 34 -177 70 38 -224 -107 186 146 -140 -107 -26 -44 40 77 -54 -229 142 10 173
2380 173 182 55 97 -164 -205 24 118 -12 74 89 -5 -132 -229 -381 139 -152 -377 -93 -77 -113 -32 -185 130 -295
2404 -295 -43 317 70 206 467 156 -11 155 53 108 -439 157 203 -151 13 -28 -146 -198 217 30 -34 -86
2426 -86 276 59 163 367 161 101 279 -125 -287 225 147 -253 -53 51 63 -554 -187 40 -129 -95 465 146
2448 146 -105 156 141 103 -50 222 64 -270 165 205 -148 -253 65 -53 220 -238 -235 -215 -68 -297 222 -22
2470 -22 -93 11 -38 -227 -106 81 61 180 147 -64 -286 -42 159 14 -108 264 85 -178 -347 -72 -218 -141
2492 -141 414 170 87 195 -16 -162 28 269 59 100 198 -96 -352 -374 28 341 160 88 -72 -326 -197 198
$$ packed form
2334B0P8q8K67j77J24l95K61Q0j88K97j89n5Qk0j49K06k75K23l53K04J51j10J48
2357F8N9j67J94J47k67k11K47l2k62J17K93m0k86L3Q1j8Q4L7j31j75L71j32J63
2380A73Rj27M2k61m1K29R4j30Q6J5r4j27r7j52N20k91k25K84J6l6Q1j53L15m25
2404b95K52L60k47J36K61l11j67J66j02N5n47N96M6l54J64m1j18n2M15j87o4n2
2426h6L62k17J04K04k06o0J78m04j62N12p8m00K00J04J2o17L67K27j69L4N60l19
2448A46k51K61j5l8j53K72j58l34M35M0l53j05L18j18K73m58LK0J47k29N19k44
2470b2p1J04m9j89J21J87k0J19l3k11k22K44K01j45j22L72j79k63j69K75j46P7
2492a41N55k44q3J08k11j46J90K41k10M1R8k94k56k2M02L13j81p2j60k54J29L95
$$ plain form
2514 198 229 -187 569 426 -341 -68 -90 -8 -163 134 264 -208 -271 117 -177 -277 0 -100 -517 211 164 11
2536 11 -361 266 367 -181 243 195 56 -332 -77 96 36 18 312 -209 -269 -213 105 -278 -89 325 194 -281
2558 -281 0 140 -30 -74 57 7 9 306 356 -319 112 -84 2 -423 13 260 -337 -155 161 -161 -369 436
2580 436 708 -77 -180 251 119 -312 126 679 -18 -160 105 171 -493 -39 474 -278 80 384 -190 -222 140
2601 140 -148 -371 54 540 223 -207 97 371 -530 -98 426 156 -212 248 146 -453 -120 182 165 -180
2621 -180 132 -155 -674 -135 722 -17 10 225 404 -332 24 369 203 146 308 217 -512 -278 392 -258 -308
2642 -308 186 78 -563 -100 295 -120 -504 220 287 -235 32 385 -157 -136 48 -189 -180 22 194 26 -664
2663 -664 127 202 -604 -3 651 -142 -223 508 199 -32 188 529 -483 -277 563 256 -281 -181 9 -342
$$ packed form
2514A98L1m16P56j43p67K73k2Q2j55K97J30m72o3L88k94j00K77j00m17P28m7j53
2536A1l72O27J01n48M24m8j39l88K55J73o0j8K94n21o0N6L18l83J89M14j31m75
2558b81K81J40j70m4J31n0KK97N0o75M31j96Q6m25M36K47n97J82L16l22k08Q05
2580D36K72p85j03M31j32m31M38N53o97j42K65O6o64M54N13p52L58L04n74l2L62
2601A40k88k23M25M86l17m30L04K74r01M32N24k70l68M60j02n99L33L02j7l45
2621a80L12k87n19N39Q57p39K7K15J79p36L56L45j66n7J62r1p29K34O70o50n0
2642c08M94j08o41M63L95m15l84P24O7n22K67L53n42K1J84k37RK02J72j68o90
2663f64P91P5q06O01O54p93q1P31l09k31K20L41j012K06Q40l07n37J00J90l51
$$ plain form
2683 -342 -619 180 128 -197 -80 157 -456 -285 356 207 -191 98 421 -124 -169 365 321 -276 144 129 -204
2704 -204 -39 196 13 -159 131 246 -396 -140 269 224 -634 125 391 -196 -91 530 35 -190 183 166 -312
2725 -312 -209 491 -224 -304 114 113 -197 -132 -7 -63 -612 120 313 -26 -158 310 -56 -509 267 180 -376 -271
2747 -271 289 44 -51 228 51 -299 -134 242 -446 69 93 -47 5 -91 192 -138 -143 140 236 -71 -131 -7 48
2770 48 -141 -236 289 -268 53 -46 -322 -186 97 357 -28 -50 275 40 -60 36 83 -211 405 288 9 103
2792 103 53 -130 61 -144 17 -140 106 620 184 241 135 74 -150 -86 239 208 57 393 181 -143 -200 282
2814 282 -50 -270 -62 169 71 -104 211 91 -463 -161 92 -92 -70 44 -73 109 181 314 37 166 67
2835 67 -161 -70 -119 -61 -33 42 -31 -130 -229 -107 -83 -72 49 27 -96 -64 -38 230 216 121 127 2 2 248 -140 154 60
$$ packed form
2683c42k77P99n2l25J17K37o13J71O41j49l98K89L23n45m5N34m4n97M20j5l33
2704b04J65K35j83j72K90J15o42K56M09m5q58P59K66n87J05O21m95k25L73j7m78
2725c12J03P00p15q0M18jl10O5J25n6n49P32J93l39j32M68l66m53P76q7n56J05
2747b71N60k45r5K79j77l50J65L76o88N15K4j40N2r6K83l30nK83R6l07o0J24N5
2770D8j89r5N25n57L21r9k76J36K83K60l85k2L25k35j00R6M7k94O16j17k79R4
2792A03n0j83J91k05J61j57K46N14m36N7j06o1k24O4L25l1j51L36k12l24n7M82
2814B82l32k20K08K31r8j75L15j20n54L02K53j84K2J14j17J82P2J33k77J29r9
2835F7k28R1m9N8K8P5p3r9r9J22K4J1J21k2j23L2K6K68j4r5Oj25%K46l88K94r4
$$ plain form
2862 60 137 -256 -185 -122 -49 -138 72 45 45 223 -143 -53 10 169 81 28 -212 17 -120 237 -52 -43 -170 -57 -166
2887 -166 -185 126 -34 -1 -112 -122 -68 -11 -230 78 189 -145 -56 69 85 -27 -122 -5 -133 -60 150 117 124 4
2911 4 82 -27 75 193 -106 -29 -53 -74 -169 -29 80 213 -79 126 443 412 -19 -211 46 122 -26 67 32 48
2935 48 -177 -207 -115 -203 -85 -38 298 -147 37 63 -66 -250 -47 -297 -121 -34 116 48 -7 48 104 139 -86 36
2959 36 -87 25 180 86 -142 165 -62 336 113 58 -160 -129 -40 20 -216 -364 12 2 51 -267 -139 210 -171
2982 -171 65 215 42 27 -62 -73 33 35 -24 -43 27 149 13 -248 -199 -45 83 -107 105 126 -88 -320 -314 199
3006 199 180 470 -71 114 -52 -155 59 -20 -45 315 140 -125 157 -243 157 -106 81 -68 -26 -193 126
3027 126 71 -11 201 -157 16 13 161 18 14 -62 227 -87 174 37 -82 5 -195 -239 -282 -26 44 -46 255 -131
$$ packed form
2862F0P7l93P1O3P3q9K10k7%J78l66R0O3J59q8n3k40K29j37L57k89Rj27J13j09
2887a66j9L11j60L3j11j0N4N7k19L08J11l34Q9J25J6j12r5J17j28P3K10l3Pj20
2911DP8j09J02J18k99P7k4k1r5J40J09J33k92K05L17l1m31j92K57P6j48R3l5J6
2935D8k25l0R2q8J18M7L36m45J84K6j29j84K03k50J76Q7J50o8n5N5N6L5k25J22
2959C6j23J12J55r4k28L07k27L98k23n5k18L1Q9O0k36j48L76j0M9l18J28L49l81
2982a71K36J50j73j5q9j1J06Kn9j9P0J22j36k61M9J54J28j90K12K1k14k32ON13
3006A99j9K90n41J85j66j03K14p9k5L60j75k65K82m00M00k63J87j49M2j67L19
3027A26n5q2K12l58J73lJ48j43mp6K89l14K61j37j19Q7k00m4m3K56P0r0L01l86
$$ plain form
3051 -131 -104 -214 -169 88 -4 350 494 -140 117 -39 -162 61 -94 99 -24 133 -42 138 -175 104 106 8
3073 8 -110 69 134 -253 -391 29 141 175 188 25 -281 -111 -84 64 14 88 23 75 -402 8 -235 29 307
3096 307 116 -16 -14 -23 102 80 222 290 -3 -25 -389 -520 -93 -121 166 -91 17 -150 56 -95 -121 -36 -137
3119 -137 374 29 -73 -34 -128 -34 -36 386 188 147 155 3 -115 -76 -129 -30 40 -36 -213 -372 -34 -292 -43 5 55
3144 55 142 -130 47 -246 225 232 23 211 63 -103 8 -302 -164 -1 -45 -52 171 -145 -106 -51 77 -154 -2
3167 -2 427 105 -58 205 114 -107 -77 180 107 -419 -208 131 -243 -149 -115 -82 132 98 -71 -52 -26 273 201 153
3191 153 232 -23 161 50 -76 -187 233 -2 -7 -54 -111 -234 -591 -230 63 -35 -192 -77 49 -31 230 163 27
3214 27 -199 5 -8 -58 18 -35 -60 -89 -306 -121 135 -376 51 -128 13 139 175 -63 151 250 -17 251 162
$$ packed form
3051a31K7j10M5K57r2L54J44o34K57j56j23K23j55J93j23J57j75J80l13K79Kr8
3073Hj18J79O5l87j38M20J12L4J3j63l06J70K7J48n0P4o5N2m77M10k43K64K78
3096C07j91j32KrJ25k2J42O8k93k2l64j31M27k8K87k57J08j67K06j51k6Q5j01
3119a37N11l45j02L9r4R4kM22j98m1Qj52j18L9n3R9P0p6j77j59L38k58K49M8N0
3144E5Q7k72J77k93M71Pk09J88j48j66J11l10J38J63m4pK23l16L9N5J28k31J52
3167bM29l22j63K63r1k21L0K57p3n26K11L39l74R4L4L3K14l4j69J9K6K99p2m8
3191A53P9k55J84j11j26j11M20k35nm7n7j23l57L61K93r8j57J15J26q0K61o7j36
3214B7k26K04j3n0P6n3k5k9k17J85K56n11M27j79J41J26L6k38K14R9k67K68q9
$$ plain form
3237 162 35 -36 244 -71 -28 -258 110 -32 -166 192 21 -234 -92 -99 54 -132 14 108 42 -62 -35 -53 -10
3260 -10 176 17 25 -9 -99 103 -37 156 49 -28 47 22 -87 -194 192 -94 -271 -227 72 40 290 276 143 -55
3284 -55 -38 -20 -245 44 -144 -249 34 83 132 -150 -16 107 8 -164 -206 42 12 16 147 -195 252 -119 29
3307 29 -133 -244 18 -142 -181 -102 -155 -264 -32 -40 190 -154 25 -134 18 -148 -150 -192 72 100 -58 11 270 329
3331 329 -157 5 41 51 -117 -115 -58 -69 -117 -190 217 46 -274 106 219 -144 88 269 -261 82 -111 -87 265
3354 265 -28 66 0 -3 -135 -8 -74 19 -113 -13 -110 116 -74 112 194 183 82 0 -231 -37 -17 193 53 -30
3378 -30 263 17 -73 -132 -44 223 78 138 54 -198 126 181 -181 11 89 -120 -1 171 -5 175 11 -81 -18
3401 -18 -37 7 -7 27 170 -130 -137 -228 -31 132 263 -5 147 74 -185 -17 116 162 -171 -255 -15 117 125 -160
$$ packed form
3237A62j27p1K80l15M3k30L68j42j34L58j71k55J42pJ53j86J46R4o6j04K7j8M3
3260a0J86j59Ql4r0K02j40J93j07p7P5k5j09j07L86k86j77M4K99l2K50j4j33j98
3284e5J7J8k25K89j88j05K83M9M9k82J34J23r9j72m2K48l0MJ31l42M47l71J48
3307B9j62j11K62j60l9P9n3j09K32qK30l44J79j59J52j66km2K64K8j58O9K59N9
3331C29m86J62L6J0j68KN7j1m8p3M07j71l20L80J13l63K32J81n30L43j93K4L52
3354B65k93R4o6lj32J27o6R3j32J00r7K26j90J86Q2j1j01q2k31J94K0K10j40q3
3378c0K93k46r0n9Q8K67j45O0q4k52L24N5l62J92P8k09J19J72j76J80j64r2O3
3401a8j9M4j4L4J43l00pr1J97J63J31k68J52p3k59J68J33M6l33q4K40J32Qk85
$$ plain form
3425 -160 159 17 -79 -204 -81 45 -182 161 -171 217 351 18 -190 110 169 -86 71 177 -200 -264 -5
3446 -5 -27 -418 100 -17 -194 115 179 -10 65 -55 213 -35 117 -146 -12 193 -185 -143 -288 32 137 180
3468 180 -139 -258 -208 -167 -209 183 193 -179 -30 173 -79 -256 64 -6 -43 -169 329 26 -414 220 -196 -252
3490 -252 202 175 -415 24 215 -41 -97 250 150 -57 137 242 -62 -118 -63 -20 -141 1 0 112 -350 -24
3512 -24 34 -397 -21 143 -124 -209 -297 -93 -55 13 49 -18 62 -72 363 -355 -6 46 -125 172 68 472 -37
3535 -37 -233 183 129 -116 -16 180 -290 76 398 -35 -181 -29 165 11 -119 241 -40 -481 -191 -31 -243
3556 -243 52 182 -133 -559 -193 -7 -179 -92 143 86 -236 140 84 -139 23 86 92 -172 284 102 -219 -104
3578 -104 350 -157 -67 159 -12 -403 -172 50 -4 -58 381 141 -234 -175 221 -14 -82 378 35 -321 190 249
$$ packed form
3425a60L19j42r6j25J23J26k27L43l32L88J34l33k08L00N9k55J57J06l77o4K59
3446ek2l91N18j17j77L09O4j89P5j20K68k48J52k63J34K05l78M2j45L20J05M3
3468A80l19j19N0M1m2L92J0l72J49K03k52j77L20p0l7j26M98l03m40O34m16n6
3490b52M54k7n90M39J91k56n6L47j00k07J94J05l04n6N5M3j21J42jJ12m62L26
3512b4N8m31L76J64k67q5q8K04L8O8L6o7Q0j34M35p18L49N2j71K97j04M04n09
3535c7j96M16n4k45J00J96m70L66L22m33j46J52J94j54j30L60k81m41K90J60k12
3556b43K95J30l15m26L66J86j72Q7K35n7l22L76n6k23J62O3Ok64M56j82l21J15
3578a04M54n07R0K26j71l91K31K22n4n4M39k40l75N9L96k35o8M60l43l56N11N9
$$ plain form
3600 249 -260 -229 197 178 -321 5 359 -448 -213 165 102 -300 115 398 -191 -162 249 -153 -125 387 269 74
3622 74 -179 186 -282 -81 181 246 -212 -172 276 226 -146 -56 121 10 -14 215 -2 -255 313 112 -154 -79
3644 -79 304 68 -175 -290 27 -651 -62 250 -243 -209 130 -30 -335 189 176 -45 -145 236 -80 -131 185
3665 185 12 -196 -79 -2 234 -521 269 384 -459 -46 85 12 -358 -119 262 -340 81 388 -328 216 169
3686 169 254 -204 -47 91 -189 -301 322 160 -151 -156 266 180 -311 49 96 -91 -69 147 -76 18 30 244 -274
3709 -274 -237 136 -367 92 246 -117 -250 -251 138 -248 -127 89 164 -183 -23 -80 57 -278 85 92 -126 119
3731 119 117 -194 -19 172 -167 14 -173 302 -218 64 4 5 -95 120 349 -93 139 -107 10 -152 312 -126
3753 -126 50 -239 89 -13 -67 -49 185 -78 -129 -71 -299 -131 38 222 -78 234 -61 -135 139 159 70 -35
$$ packed form
3600B49n09L1M26j9m99L26L54q07K35L78o3m02M15K83n89K9M11m02K8N12j18j95
3622G4k53L65m68K01K62O5m58M0M48n0l72R0J77j11k4K29k17k53N68k01k66P5
3644g9L83k36k43j15L17o78N89L12m93L4L39j60l05N24j3k21j00L81l16n1L16
3665A85j73k08J17P7K36p55P90J15q43M13J31p3l70K39L81o02M21L07p16N44m7
3686A69Q5m58J57J38k80j12O23j62l11nM22q6m91L60M7j87K2K16k23R4J2K14n18
3709b74L7L73n03M59J54l63j33jL89l86J21K16P5l47J60n7J37l35L63Pk18K45
3731A19kl11J75J91l39J81j87M75n20K82o0Jj00K15K29m42K32k46J17j62M64m38
3753a26J76k89L28j02n4J8K34k63n1N8k28J68J69J84l00L12k95p4K74K0q9j05
$$ plain form
3775 -35 219 -129 -69 -34 -103 -328 -96 20 252 27 -135 -154 90 19 32 181 230 120 424 145 -103 -105 26
3798 26 125 -149 17 -204 60 -180 147 -74 200 -166 64 -51 -88 -11 -264 -226 14 219 -14 -98 -17 -271
3820 -271 20 -48 -114 -174 62 13 92 -122 71 20 -271 -55 -100 369 358 -4 -8 132 10 -185 135 -2 196
3843 196 136 440 -91 58 -93 -30 -290 180 70 40 42 -219 16 -53 -273 -169 208 305 -170 -154 215 5 120
3866 120 195 21 -49 108 -25 -35 179 82 29 -83 -33 -146 -428 136 -14 -124 48 30 95 -62 62 11 175
3889 175 -321 -140 -246 -83 -116 130 -102 -61 91 -260 53 264 4 -144 -72 -142 62 100 -15 -2 28 3 52
3912 52 -159 -20 184 -61 -219 -118 -74 108 48 201 -69 -95 -25 -114 -10 152 -13 -57 -57 -9 151 -107 -79 -168
3936 -168 150 219 -100 175 41 -128 375 -180 42 123 -62 -127 -137 114 171 -192 226 234 89 -177 65 117 305
$$ packed form
3775c5K54l48O0L5o9k25K32J16K32k25j62j9K44p1J3J49M9j10L04k79k48kJ31
3798B6R9k74J66k21K64k40L27k21K74l66K30j15l7P7k53L8K40K05k33q4Q1k54
3820b71K91o8o6o0K36m9P9k14J93n1k91K16m5M69j1l62mJ40j22j95L20j37J98
3843A96o0L04n31J49j51O3k60M70j10l0Kk61K35o9k20J04L77R7m75J6L69k10J15
3866A20P5j74p0J57j33j0K14r7n3j12N0j13k82N64j50j10J72j8O5j57J24n1J64
3889A75m96J81j06J63l3K46k32M1J52l51L13K11k60j48P2p0K04L8j15J3L0k5M9
3912E2k11J39K04k45j58J01M4J82o0J53k70k6P0q9J04J62j65m4%M8J60k58K8q9
3936a68L18O9l19K75j34j69N03n55K22Q1j85o5j0K51N7l63M18Qj45k66K42N2J88
$$ plain form
3959 305 262 -28 -148 -224 154 -91 -94 195 11 143 -59 195 52 224 51 182 -121 -163 22 62 108 -110
3981 -110 203 -243 -97 -73 191 -156 -199 -99 -217 -13 -210 66 -46 -160 109 62 62 -88 -268 -52 13 11 76
4004 76 -54 183 -53 -75 21 179 -121 -59 75 -189 -57 86 -232 83 181 -78 48 40 -108 92 13 78 -83
4027 -83 -228 -133 11 -107 99 -153 -27 -179 -47 -190 -24 113 -68 -164 50 66 15 208 -20 142 -103 3
4049 3 -142 -84 -144 58 17 5 128 109 47 40 -239 -220 153 79 77 40 0 178 23 -258 134 1 -198 -92 -71 -9
4075 -9 -251 -132 -271 42 86 -41 -104 27 102 -212 -154 164 65 -99 54 -130 -123 41 342 -53 -99 -166 -47 -136
4099 -136 -22 26 -237 161 273 262 -113 104 168 157 -14 43 -138 -13 97 -197 2 82 171 56 186 -156
4121 -156 -52 26 -106 -9 -325 1 -85 -228 -286 103 161 -108 -130 -71 -133 -111 -80 64 -299 100 1 -338 -111 9
$$ packed form
3959C05m3k90j20p6L78k45lK89j84J32k02K54j43J72j73J31l03m2J85M0M6k18
3981a10L13m46J46K4K64l47m3J00j18K04j97K76j12j14K69m7%j50j80K16O5kO5
4004G6j30K37k36k2R6J58l00O2J34k64J32J43l18L15R8k59J26qj48K00p9O5j61
4027h3j45R5J44j18K06k52J26j52J32j43J66J37j81r6K14J6n1J93k28J62k45J06
4049Cj45N8o0K02m1j2J23j9o2pk79J9L73p4kl7m0J78j55k81L92j33j99J06K1O2
4075ik42J19j39L13M4j27o3J31P5l14N8L18r9j64J53j84PJ64L01l95m6o7J19q9
4099a36J14M8k63L98J12j1l75K17O4j1j71N7j81J25J10k94J99Q0Q9j15J30l42
4121a56J04P8j32R7l16L26q6j43n8L89N8k69k2N9o2K2L1J44l63L99r9l39K27J20
$$ plain form
4145 9 53 59 6 -125 -258 -77 -174 103 -165 125 228 -29 258 -70 -151 -93 -146 -196 7 1 -155 111 51 -70 86
4170 86 124 -49 -135 -19 -161 5 -10 -75 138 141 -136 -39 102 -38 219 -31 151 74 16 -30 -121 -140 18 102 -57
4195 -57 290 102 129 293 -34 -63 187 211 -14 11 110 122 239 -94 108 42 -68 16 116 -75 69 32 212
4218 212 45 -112 115 7 -140 163 3 109 -318 74 166 -12 -81 34 13 -325 131 126 -140 50 45 85 -38
4241 -38 -110 -24 38 19 90 -111 -46 262 -181 -62 -59 -22 106 -225 -104 141 -59 156 -30 -38 -23 65 -152 1 89
4266 89 102 404 8 40 195 -93 97 163 -126 -98 178 41 54 123 -161 -105 -66 -122 -95 -144 158 45 199 111
4290 111 187 176 -182 -111 -31 -60 16 -142 135 3 310 34 230 -118 77 -216 -58 2 -154 379 -87 -47 -311
4313 -311 -8 139 139 163 -123 107 25 234 111 -193 171 56 36 -117 13 -11 -205 -22 57 156 -46 50 -51
$$ packed form
4145IM4On3j31j33J81r7K77k68K90J03k57K87l28q1N8n3n0K03oj56K66o0j21J56
4170H6L8j73q6J16j42J66j5o5K13Lk77R7J41j40K57k50J82p7n8m6r1j9J58Q4j59
4195e7L47j88K7J64l27k9K50K4k25K5R9J2J17l33K02o6j10Q4J00j91J44l7J80
4218B12j67j57K27j08j47L03j60J06m27L92R2j78o9J15k1l38M56nk66J90nM0j23
4241c8p2Q6O2j9P1k01O5L08m43J19LL7J28l31J21K45k00K15j86qJ5Q8k17J53Q8
4266H9J3L02l96L2J55k88J90O6k89K8K76j37J3O9k84N6L9n6K7m9L02j13J54q8
4290A11P6j1l58P1Q0k9P6j58K77j32L07k76J96l48J95k93J58O0j56N33m66M0k64
4313c11L03J47%K4k86K30q2K09j23l04L64j15k0j53J30k4j94J83P9R9k02R6j01
$$ plain form
4336 -51 -155 70 1 37 -10 -91 70 -247 67 30 -61 36 -89 -51 285 -161 52 107 -59 -126 -99 45 -72 -45
4360 -45 112 -94 -46 -184 185 237 -181 -279 -52 232 -84 -35 88 159 28 35 114 130 362 113 -18 283 -11
4383 -11 -309 -7 58 -201 -55 -36 -55 -81 -160 9 -168 189 -12 18 -251 -89 10 -152 6 -60 -271 -227 -85
4406 -85 50 222 123 167 -57 -363 -21 151 -237 309 182 168 349 -150 16 -1 -58 -297 8 95 -11 143
4428 143 116 77 54 -357 -144 88 -126 -267 -202 7 55 -50 189 40 214 -160 -25 -87 185 195 120 -165 -8
4451 -8 -175 -76 -320 -63 40 -99 -29 141 211 -223 83 -340 -36 -8 156 190 -52 -241 -41 141 15 -13 -237
4474 -237 -223 272 -369 136 -125 103 -241 -218 -212 -80 -85 -399 46 -41 -99 36 -96 32 -83 2 97 -98 197
4497 197 47 -334 -143 11 171 131 -136 -98 -153 -70 -128 93 335 87 -225 -236 -153 -110 -349 -171 -115 295 -49
$$ packed form
4336e1j04K25o9L6m7q1J61l17L14l7r1R7j25L8L36m46K13N5j66o7K7J44j17K7
4360d5J57k06M8j38L69N2m18r8K27K84l16M9J23P1j31PP9J6K32k49j31L01k94
4383a1k98L02O5k59J46J9j9k6p9J69j77L57k01L0k69J62R9j62J58o6k11M4J42
4406h5J35J72r9M4k24l06L42J72l88N46j27j4J81m99J66j7n7k39L05Q7j06J54
4428A43k7l9k3m11K13K32k14j41O5K09M8j05K39j49J74l74J35o2K72J0p5k85J57
4451hj67R9k44K57J03j39P0J70P0m34L06m23L04K8J64L4k42j89K00J82j26k8k24
4474b37J4M95o41N05k61K28l44K3OJ32nl14M45q7n8J35j32J28j15Q5R5j95K95
4497A97j50l81J91J54J60m0k67L8n5Q3n8K21K42k48l12j1Q3M3k39J78N6M10l44
$$ plain form
4520 -49 32 17 171 69 -123 -207 -97 63 148 -265 202 25 70 14 -46 -24 52 -61 -100 186 138 187 -202 140
4544 140 108 98 -158 -54 88 -105 -54 85 -140 258 -131 204 -150 -125 113 -93 17 -131 -31 11 79 290
4566 290 5 -120 -104 -139 -164 -231 1 -12 -1 -189 176 -10 -136 -9 140 98 214 158 -125 -151 -155 -195 -102 -120 335
4591 335 172 -109 102 16 -215 -50 -120 -117 -101 -145 -12 -197 -106 33 -134 -195 -136 22 19 -163 -309 -101 -195 -215
4615 -215 -57 -176 -28 -76 -76 130 162 6 -38 76 -26 143 223 -101 -83 -17 -19 -244 60 -173 -110 -37 -106 264
4639 264 -27 26 -229 39 3 -20 -91 -173 -330 45 -139 53 48 112 189 267 -74 -40 126 -55 -225 -228 75 208
4663 208 -152 49 -282 31 241 -83 96 -66 208 -32 -127 -241 1 -85 142 -36 8 -66 -248 -331 -130 362
4685 362 35 -119 107 51 256 -78 -207 16 44 103 -13 -175 -534 -60 -107 -164 152 143 71 206 -206 -58 42
$$ packed form
4520d9Q1j5J54j02j92q4J10J60Q5m13M67j77M5n6o0K2P6j13l9K86m8M9l89L42
4544A40l2j0k56J04J42j93N1J39k25L98l89L35l54K5K38k06J10j48J00M2O8K11
4566B90k85j25J6l5k5o7K32j3J1j88L65j86j26J27J49m2J16n6k83k6mm0R3j8M55
4591C35j63k81K11q6k31J65p0LJ6m4J33j85R1J39j67o1N9J58lj82j46K08r4k0
4615b15J58j19J48m8%K06L2j56m4J14j02J69Q0l24J8O6kk25L04k33O3P3o9L70
4639B64k91N3k55K68l6k3p1q2j57L75j84J92nO4P7P8l41L4J66j81j70lL03J33
4663B08l60K01l31L13K10l24J79j62K74k40r5j14K42q6K27j78M4p4j82q3K01M92
4685C62l27j54K26n6K05l34j29K23K8N9j16j62l59M74m7n7L16rp2J35m12J48J00
$$ plain form
4708 42 82 -13 -181 100 132 233 60 -151 214 -66 38 -30 -187 47 50 193 -7 49 100 -131 -184 85 -128
4731 -128 -113 116 -43 59 183 80 40 -15 152 314 -42 -199 -110 182 -30 168 -82 133 -130 -172 -79 -124
4753 -124 19 133 82 68 195 -47 -162 79 -252 50 7 213 167 -22 -20 -189 3 -183 -37 72 -26 22 5
4776 5 53 3 -84 179 -70 66 102 173 209 -36 59 186 24 -62 308 69 100 146 171 164 189 17 -167 -225 -330 -112
4802 -112 65 -197 -50 144 -84 25 -35 -37 -200 -221 -118 87 -72 -77 -15 182 -268 9 56 -130 14 155 -39
4825 -39 -120 -40 -74 -44 -139 -65 -86 133 171 -69 296 -187 -229 -54 -186 100 0 70 -129 42 56 -175 -195 -176 47
4850 47 -16 98 -252 -378 179 14 -153 92 145 143 -251 -324 100 -94 93 -32 -79 37 -349 49 -297 158
4872 158 37 62 1 -190 -38 -207 28 230 251 -321 169 39 33 -84 252 55 -19 110 -53 95 -54 5
$$ packed form
4708D2M0r5j68K81L2J01j73k11L65k80J04o8j57K34LJ43k00N6N1k31n3K69k13
4731a28J5K29j59J02J24j03m0n5J67J62l56j57Q9K92k12J98k50K15k63m2R3m5
4753a24J43J14n1j4J27k42j15K41l31L02m3K06m6j89Kj69J92j86J46J09r8M8j7
4776EM8n0q7K63k49J36L6P1L6k45R5J27j62q6L70k39L1M6K5pK5j72j84n8j05K18
4802a12J77k62J47J94k28J09o0kj63k1J03K05j59nO2J97m50K77M7j86J44J41j94
4825c9q1Q0l4L0r5P4k1K19L8k40L65m83m2J75j32K86j00P0j99J71J4k31k0J9K23
4850D7o3J14l50j26N57j65j67K45N3kl94p3M24j94J87j25m7J16l86L98l46M55
4872A58j21K5o1j91J52j69K35K02K1n72M90j30oj17L36j97p4J29j63J48j49N9
$$ plain form
4894 5 -40 -62 -25 -235 -104 45 -118 31 -75 -168 -95 147 173 -90 -176 153 -1 0 -3 41 88 148 -49 84 -138
4919 -138 7 72 28 76 430 28 -16 132 -270 -182 -4 63 -15 172 -124 -208 169 71 -153 74 45 314 -71
4942 -71 22 -63 -82 2 -81 -104 257 100 -151 22 26 98 -152 -145 -159 13 39 158 58 70 174 171 103 211 235 111
4968 111 -288 -100 147 111 75 288 -152 -11 -137 -170 -63 61 64 68 -87 -37 134 -182 -146 96 19 -103 -61 79
4992 79 -199 -112 149 36 -99 -94 90 -82 -148 214 230 61 272 79 -8 -154 196 212 26 68 174 -22 -195
5015 -195 -111 93 74 174 -111 93 72 109 -53 63 -94 -134 20 -103 -266 -228 204 20 -31 -53 13 126 -63
5038 -63 94 -65 -103 188 -188 -22 -189 -208 26 82 -75 146 101 -145 26 -109 -3 152 18 4 29 273
5060 273 -113 180 -42 -95 111 -63 -68 -233 0 31 -74 61 -162 -143 -276 70 -239 -70 -152 -116 62 14 -101
$$ packed form
4894Em5k2L7k10J31J49j63J49j06r3P3K42K6k63q6L29j54JlM4M7O0j97J33k22
4919a38J45O5m4M8L54m02m4J48m02Q8J78O7p8J87k96q4L77r8k24K27k9K69l85
4942g1R3q5j9Q4q3k3L61j57k51J73MP2k50Pj4J72K6J19j00J2J04lo8J08K4j24
4968A11l99J88K47l6l6K13m40J41j26l3J07J24LMj55N0J71l16L6K42p7j22M2J40
4992G9k78Q7K61j13j35NJ84j72o6L62J6j69K11j93q7j46L50J6j86M2J06j96j73
5015a95Q4K04j9J00k85K04k1L7j62J16j57m0J54j23j63L8M32j84n1k2O6J13j89
5038f3J57j59l8K91l76J66j67j9K34N6j57K21m5k46J71j35J06J55j34j4K5K44
5060B73l86K93k22n3K06j74nj65K33L1j05J35k23J9j33L46l09J69q2L6J78m8j15
$$ plain form
5083 -101 15 -307 -40 -56 47 89 292 78 73 314 13 52 -36 93 -49 96 -12 189 37 26 -22 133 -62
5106 -62 -29 56 288 -152 179 -301 -224 -131 45 130 -18 216 -134 -140 -313 65 -62 -132 349 34 -109 -206 48
5129 48 20 -121 119 -46 -249 11 -64 -8 118 -92 -100 -6 -68 -80 -153 -195 -41 115 -37 225 49 -18 216 -109
5153 -109 6 -208 50 131 -118 93 166 -302 91 327 156 80 4 -171 104 -162 149 16 53 -181 125 -91
5175 -91 269 111 93 205 72 46 -48 -167 -242 34 -24 112 171 -54 32 -29 108 20 158 203 -271 -71 67 -107
5199 -107 122 35 -2 39 -125 82 -131 -11 420 -19 31 40 -20 -130 -177 -89 -190 -141 67 -35 138 152 155 216 154
5224 154 -327 -171 -107 -156 -41 10 180 31 75 152 114 -35 119 -123 152 -57 -273 76 230 208 -84 89
5246 89 234 51 92 -57 -21 -277 -33 -264 -220 49 39 76 -51 160 -160 -218 -31 386 25 218 199 -107 -80
$$ packed form
5083a01J16l22K67j6J03M2K03k14nK41l01L9q8J29j42J45j08K01j52j1m8J55j95
5106f2L3Q5K32m40L31m80P7R3J76Q5j48K34l50oj73L78j27p0M81l15j43r7K54
5129D8k8j41K40j65k03K60p5N6J26k10qR4o2j2p3m2J54J56j52K62j76o7K34l25
5153a09J15k14K58Q1k49K11P3m68L93K36j71p6p6j75K75k66L11j33L7k34L06k16
5175i1L60j58j8J12j33k6r4j19p5K76n8J36N9k25Q6o1J37q8J38M5m74K00J38j74
5199a07K29q7l7M1j64K07k13J20M31m39N0Ro0j10m7Q8j01M9K08j02J73J4LO1o2
5224A54m81J56O4m9J15N1J70j49M4P7l8j49J54k42K75k09k16L49J54k2k92J73
5246H9J45j83M1j49L6k56K44k31M4K69j0L7j27K11l20n8J87M17l61J93j9l06K7
$$ plain form
5269 -80 -316 14 -109 -78 -16 -259 -136 153 155 -25 -155 0 96 -163 -52 -29 63 62 269 -245 -173 59 -21 -176
5293 -176 262 -134 -23 62 -101 120 161 298 -159 -171 -131 -62 85 48 -4 27 -20 257 99 -20 30 259 234 59
5317 59 -22 -175 -38 -28 97 -193 -281 -206 4 -200 -21 -54 69 106 106 173 -81 48 132 -201 -112 22 -250 15
5341 15 -29 -147 109 220 6 82 -76 14 100 26 -108 -74 -131 -200 262 99 56 -136 68 229 -53 -142 25 361
5365 361 -201 51 -129 211 -10 146 159 133 198 155 308 -191 -156 62 248 -117 118 -18 -411 -180 -39 82
5387 82 -204 -58 -132 74 -3 -23 165 -72 218 -23 107 185 -295 51 -156 50 -125 52 -228 -112 -117 55
5409 55 284 4 18 -96 443 -153 -197 -171 -6 261 -220 183 14 241 -5 -57 65 -65 -39 -188 77 75 -158
5432 -158 56 23 53 -53 -182 -15 -148 -6 -67 -42 -302 111 -92 256 -83 150 138 -269 54 161 -124 -55
$$ packed form
5269h0k36L30j23L1O2k43J23K89Kj80j30J55R6k59J11K3R2jK07n14P2K32q0j55
5293a76M38l96J11Q5j63K21M1J37m57j2M0O9J47l7n2L1m7K77j58j19N0K29k5j75
5317E9q1j53J37J0J25k90q8P5K10k04J79l3J23L7%O7k54J29Q4l33Q9J34k72K65
5341A5m4j18K56J11k14P6j58R0Q6p4j34L4n7o9M62j63m3j92K04J61k82q9J67L36
5365C61n62K52j80L40k21J56J3k6O5m3J53m99L5K18J86l65K35j36l93K31J41J21
5387H2k86J46p4K06p7k0J88k37K90k41J30P8m80L46k07K06j75J77k80J16nJ72
5409E5K29k80J4j14N39n96m4K6J65K67m81M03j69K27k46n2J22j30K6j49K65kk33
5432a58K14l3L0j06j29J67j33J42o1K5k60M13k03L48l39K33j2m07L23J07k85O9
$$ plain form
5454 -55 6 46 180 117 -37 -49 -136 38 253 120 -8 -164 189 -167 30 158 7 -75 191 55 -211 32
5476 32 50 59 130 -261 66 -185 -19 -56 -565 303 359 -56 64 -284 117 86 -67 -59 -125 27 27 144 -239 474
5500 474 38 -105 -130 -148 -42 -277 -127 69 -92 -258 59 89 -221 165 97 140 184 82 51 23 135 58 95
5523 95 62 -161 -42 -160 181 150 -129 -136 33 264 25 -48 -149 5 -48 -114 -286 108 -16 139 35 -86 8
5546 8 13 65 20 -106 41 146 24 -192 -79 122 89 76 1 -129 -168 48 -189 -20 -212 -28 110 123 107 -78
5570 -78 32 147 55 -79 16 -29 -84 -52 -346 30 -126 -225 -210 -92 -104 -49 299 212 -122 76 -115 -194 -65 -90
5594 -90 144 -22 245 61 -262 103 -16 95 -176 123 -210 -82 -185 -145 -239 117 82 -146 -104 125 -59 -271
5616 -271 26 -17 65 -300 98 183 -26 -139 -18 141 -43 1 33 -63 -72 -65 95 -23 -294 -134 6 150 106 -147
$$ packed form
5454e5O1M0J34o3j54j2q7J74K15j33j28j56L53l56J97J28j51q2K66j36k66K43
5476C2J8RP1l91L27k51J66l7n09Q68N6m15J20l48M01l1j53Qo6J52%J17l83P13
5500D74m36j43k5j8J06k35J50J96j61j66L17L0l10L86o8M3M4j02l1k8J12p7L7
5523I5l3k23J19j18L41l1k79pJ69K31k39p3j01J54n3o6j72L94j24J55j04j21R4
5546HNN2m5j26J47J05j22k16J13K01l3j3p5j30l9K16k37J69j92J84J38J3j6j85
5570g8J10J15r2j34R5m5n5L2k94L76j56r9J5J18j2N5L48q7l34J98j91p9J29k5
5594i0K34j66K67j84l23L65j19J11k71K99l33J28j03M0r4L56l5k28M2K29j84k12
5616b71K97m3Q2l65L98Q5k09j13J21J59j84M4L2r6rPJ60j18k71J60J40J44m4k53
$$ plain form
5640 -147 135 154 116 -174 33 -80 -156 248 112 121 -294 153 234 1 63 81 74 11 174 -76 32 -64 51 152
5664 152 -72 144 97 -76 343 285 -137 -55 -392 -162 162 84 169 254 -3 -53 -451 106 10 25 233 -23 -75
5687 -75 74 51 110 52 -61 117 192 -2 74 6 -75 13 -386 25 -109 -282 -117 156 113 -156 -184 189 -117 -108
5711 -108 -164 -146 -209 11 -160 -91 409 4 -147 115 -31 -266 -191 -245 239 -255 -64 202 -66 -12 79 272 46
5734 46 234 -9 7 -197 200 40 21 64 168 -247 104 109 -82 -57 -133 117 2 102 -193 256 -117 171 236
5757 236 55 -204 39 -7 213 -22 -15 -110 259 -89 8 -61 -60 82 -106 137 -74 -32 -51 155 -259 76 -170
5780 -170 -82 198 -110 -275 -177 62 -75 -294 44 -171 27 51 143 -151 20 107 -213 130 159 -105 -181 -84 211
5803 211 -180 40 194 33 -18 60 145 -19 -247 230 22 93 -162 -30 23 -142 83 161 183 0 -6 -231 -37
$$ packed form
5640a47K82J9l8k90K07j13p6M04j36Rm15M47Q1k33O2J8po3J63k50J08r6J15J01
5664A52k24K16m7j73M19n8m22Q2l37K30L24p8Q5Q5k57n0l98N57r6J5K08k56n2
5687g5J49k3N9n8j13J78P5j94P6o8q1Q8l99M11j34j73J65K73m3k69k8L73l06R
5711a08n6J8o3K20j71O9N00m05j51K62j46k35P5n4M84m94J91K66k68N4R1J93k26
5734D6J88k43J6k04L97j60j9M3J04m15L51Nj91K5p6K50j15J00k95M49l73K88O5
5757B36j81k59K43m6K20k35Pr5L69l48R7o9JJ42j88K43k11M2j9K06m14L35k46
5780a70Q8K80l08j65R8K39j37k19L38k15J98K4R2k94J71Q7l20L43K9k64p6R7K95
5803B11l91K20J54j61n1P8Q5j64k28M77k08P1k55J32N3j65K25P8K2j83ok25J94
$$ plain form
5826 -37 206 -133 -65 178 235 -98 -52 -51 67 34 -189 407 -71 310 259 191 -39 30 23 120 68 -42 114 -66 391
5851 391 -11 77 -109 120 61 160 86 -218 381 -419 150 72 -3 259 110 246 34 182 160 -1 75 230 87
5874 87 64 -59 -48 -109 170 48 74 -95 -60 6 34 -14 -79 -53 120 -120 113 69 106 -95 -120 -422 69 -173 -82
5899 -82 22 -132 -237 -24 -54 -92 -128 94 -26 113 -205 28 -28 0 -48 -75 98 -123 -136 214 -282 22 31 84
5923 84 -94 123 -103 128 204 9 194 -88 241 7 -15 -37 -88 57 33 72 -76 -11 -150 56 -15 46 76 -163
5947 -163 -21 -87 -269 53 -15 -28 55 -133 166 -34 143 216 145 -136 91 -118 -54 -136 14 54 -49 -140 18
5970 18 -105 44 -107 -254 67 174 -86 98 -87 100 274 -9 302 -13 110 229 22 75 39 -126 -122 -66
5992 -66 62 156 -243 -177 76 -71 199 11 55 132 -230 188 5 -192 253 -173 151 -97 -202 -227 7 -41
$$ packed form
5826c7K43l39O8K43N7l33M6JJ18l3k23N96m78L81n1o8k30O9pR7n2j10J56j80M57
5851C91m02Q8j86K29n9R9p4l04N99q00N69p8p5K62j49J36k12J48k2j61P6J55j43
5874H7k3j23J1o1K79j22K6j69L5O6K8m8o5K6J73k40K33m4L7k01k5l02M91k42R1
5899h2J04j54j05K13l0l8l6K22j20J39l18K33n6K8m8k7J73k21j3L50m96L04RN3
5923H4j78K17k26K31P6j95J85k82L29k34k2k2n1J45k4L9j48O5j39K06p1O1L0k39
5947a63J42o6j82L22o8j3Q3j88K99k00J77P3p1k81K27k09O4q2J50M0j03r1J58
5970A8j23J49j51j47L21J07k60J84j85J87J74k83L11l15J23J19k07N3l6j65MN6
5992f6J28R4l99O6K53j47K70j88M4P7l62M18j83j97M45m26L24k48j05k5K34m8
$$ plain form
6014 -41 114 93 -85 3 35 -32 13 328 17 -114 399 109 -188 -121 131 -147 109 -31 25 -244 304 -24 98
6037 98 -5 -17 3 222 110 207 7 119 -21 -28 105 88 169 21 114 20 -305 -251 -130 -90 -164 -141 203 -66 214
6062 214 -119 8 86 16 -10 174 -114 246 23 -119 -6 64 -217 53 249 -105 125 134 77 -75 -89 131 -228
6085 -228 53 98 176 104 306 176 -82 -154 120 -81 38 -190 43 -21 -89 90 -69 -272 -69 74 19 -79 -111
6108 -111 16 -70 5 124 136 88 151 -98 109 200 -136 68 -329 20 237 26 -8 -73 106 -47 30 -43 -190
6131 -190 96 -25 -214 123 -32 295 -320 80 110 -27 214 -93 20 -33 -334 347 -329 -147 92 -87 135
6152 135 -185 -99 25 73 -89 197 152 -18 52 -205 -21 39 56 -73 330 249 31 -233 44 -29 -127 112 53
6175 53 -109 -73 -33 232 -113 142 -119 -94 23 -146 259 -8 -31 -155 362 -94 -45 -76 32 -128 10 95 -168
$$ packed form
6014d1J55k1j78Q8L2o7M5L15l11j31N13k90k97O7K52k78K56j40N6k69N48l28J22
6037I8j03j2K0K19j12R7k00J12j40pJ33j7Q1j48R3r4l25N4J21M0p4K3L44k69K80
6062B14l33J27P8p0k6J84k88L60k23j42J13P0k81K70J96l54K30Rn7j52j4K20l59
6085b28K81M5P8p2K02j30k58p2K74k01J19k28K33o4o8J79j59k03K03J43n5r8l2
6108a11J27q6P5J19J2m8O3k49K07R1l36K04l97L49K17k11l4o5J79j53P7p3j47
6131a90K86j21j89L37j55L27o15M00L0j37K41l07J13n3l01O81o76J82K39j79K22
6152A35l20Q6J24M8j62K86m5j70P0k57J84O0J7j29M03q1k18k64K77p3r8K39n9
6175E3j62L6M0K65l45K55k61K5J17j69M05k67k3j24N17m56M9l1J08j60J38Q5k63
$$ plain form
6198 -168 158 -76 -230 -91 -273 -49 -138 -77 -253 -376 60 22 -110 95 160 197 -87 209 48 -143 146 -57
6220 -57 122 58 140 -101 -35 71 141 75 -127 156 82 -125 119 1 27 254 64 -46 110 251 -73 -7 -200
6243 -200 83 142 -29 180 -89 -189 83 4 -22 -247 157 279 -28 80 -24 -39 -288 -62 27 -254 26 264
6265 264 -41 31 -102 103 -153 -81 42 62 165 89 83 260 -14 -30 -203 59 -32 143 -28 -121 -201 -57 140
6288 140 322 18 -6 271 55 -76 237 -211 -217 -276 212 -57 -22 -231 121 -183 -46 -152 75 -93 119 -178
6310 -178 -322 159 196 -230 -84 258 44 -160 95 -238 -77 -208 -430 138 -340 -25 -42 -109 38 -203 0
6331 0 -181 26 246 83 20 -104 -98 22 -301 -89 105 92 1 16 159 -111 -347 92 18 109 356 82 -23
6354 -23 -243 156 47 -90 87 25 -243 -263 -291 109 70 41 58 -105 42 -71 -7 118 -26 54 25 -87 -24 -40
$$ packed form
6198a68L26k34j54J39j82K24q9O1j76j23M36l8j32K05O5L7k84K96j61j91K89k03
6220e7J79o4Q2k41O6J06P0o6k02K83p4k07K44j18K6K27j90j10J56J41l24O6j93
6243b00K83N9j71K09k69j00K72p9k6k25M04J22l07J08j04j5k49K26Q9k81K80K38
6265B64l05P2j33K05k56P2J23K0J03p6oJ77k74j6j73K62r1J75j71r3q0J44J97
6288A40J82l04k4K77k16j31L13m48on9M88k69L5k09L52l04J37j06K27j68K12k97
6310a78j44M81L7m26J46L42k14k04K55l33J61j31k22N68m78L15j7o7J47k41K03
6331@j81K07K20j63o3j24OJ20l23K12J94j3r1J5J43k70k36M39p4R1K47k74j05
6354b3k20L99j09j37J77o2k68k0k8M00l9k9J7j63J47j13O4J25j44Q0k9j12O3j6
$$ plain form
6378 -40 453 120 31 216 -44 148 124 -114 87 -214 -185 91 -3 -104 -101 -63 47 82 -136 -10 -10 30 -105 -42
6402 -42 201 -117 -442 94 15 51 -77 -150 45 -96 217 -251 114 240 57 149 -48 168 91 -28 266 -46
6424 -46 -281 -45 -76 -112 68 -170 -117 88 295 78 -140 65 165 207 -152 -7 124 -49 -77 109 -207 93
6446 93 -61 120 -415 -242 -332 -67 202 65 2 157 131 -113 134 -229 13 -254 76 153 -78 210 348 11
6468 11 -77 -250 172 53 99 -213 149 1 -157 -226 78 -27 -112 49 -122 161 -32 -20 250 375 -73 76
6490 76 -94 64 197 -59 -163 -95 37 104 -114 -194 -39 -99 -7 107 66 -43 -153 73 -120 -124 82 86 -69 -71
6514 -71 47 22 -38 -111 103 -197 -103 329 190 79 -24 -5 419 72 -27 -5 27 230 6 -107 65 246 -34
6537 -34 -71 263 -94 62 -28 7 1 -208 232 -195 111 0 -50 -175 21 21 188 65 -11 25 287 219 118 64
$$ packed form
6378d0M93l33q9J85k60J92k4k38K01l01K9K76r4j01LL8J10L5k18J26%M0j35O3
6402d2K43l18l25N36p9L6j28p3J95j41L13m68L65J26j83R2j97K16p7j19K94l12
6424d6k35K36l1l6J80k38N3K05K07k17k18K05J00M2l59J45J31j73k8J86l16L00
6446I3j54J81n35J73r0K65K69j37o3J55k6k44K47l63K42k67L30P7k31K88J38l37
6468A1q8j73M22j19M6l12L62j48j58o9L04j05q5J61j71K83j93J2K70J25m48J49
6490G6j70J58J33k56j04O8J32O7k18q0J55o0R2J14m1j09j10K26j93mK06Mj55k
6514g1J18k5o0p3K14l00R4M32j39j11j03J9M24l47r9K2L2K03k24j13J72J81k80
6537c4l7L34l57J56r0L5ok09M40m27L06j11n0j25J96%J67j23p6L6K62o8j01n4
$$ plain form
6561 64 30 191 -81 -143 86 -55 59 33 -40 -134 85 51 -25 33 213 169 -52 -208 13 41 -225 -4 -114 92
6585 92 41 -220 24 175 140 -34 -41 67 176 -260 199 -103 20 45 -53 -50 16 -89 -97 -214 -1 311 -22 -220
6609 -220 -28 -74 -9 43 -55 -15 -149 -110 -260 4 -97 -125 39 -4 -72 -47 -33 209 81 311 313 212 647 183
6633 183 -23 -128 -60 -173 -203 157 126 18 -87 -43 36 12 129 -28 142 -88 134 -27 202 -87 195 69
6655 69 38 27 -154 -188 -22 8 -189 143 192 -103 -70 57 13 18 -109 131 134 249 -85 -90 144 -45 4 251 -13
6680 -13 18 337 108 56 192 45 157 -107 78 40 244 163 -296 -144 88 -271 -146 218 348 -42 -102 55
6702 55 -139 95 -104 -122 -30 -95 190 185 -22 -232 51 45 52 -198 -154 35 148 -23 92 102 -81 -11 -17 115 129
6727 129 173 137 46 110 -65 73 85 163 -13 -152 -1 89 -90 -86 -28 -145 199 -9 216 -89 -20 85 -95 11
$$ packed form
6561F4l4J61k72o2K29j41J14k6p3r4K19l4p6N8J80m4k21j56K21K8k66K21j10K06
6585I2n1k61K44J51l5j74pJ08J09m36M59l02J23K5r8LO6j05qj17K13L12l33j98
6609b20J92m6O5N2r8M0j34L9j50K64j01k8J64m3o8K5J4K42j28K30Kj01M35m64
6633A83k06j05O8j13l0L60l1j08j05M4P9k4J17j57J70k30K22j61K29k89K82j26
6655F9l1j1j81l4J66L0j97L32M9k95L3J27m4Nj27K40LJ15l34nK34j89M9K47k64
6680a3L1L19k29n2J36j47J12k64J85l8K04q1m59J52K32l59J25L64J30l90o0J57
6702E5j94K34j99j8R2o5K85nk07k10K83oPk50M4J89J13j71J15J0j83P0oJ32J4
6727A29M4l6r1O4j75J38J2P8j76j39J51R0j79MN8j17L44k08K25l05O9J05j80J06
$$ plain form
6751 11 -120 301 -106 173 -92 0 284 -119 0 -349 122 34 47 231 -17 -15 152 -32 -135 -113 280 83
6773 83 152 78 148 56 -109 -52 97 87 -116 -27 239 -32 -284 138 -170 17 42 107 157 -8 213 -49 91 -43
6797 -43 135 -46 23 197 14 -7 -183 7 41 102 283 -108 165 173 -263 -207 80 240 -114 -149 85 -210 318
6820 318 -9 112 -285 -137 129 -42 189 165 210 -144 -52 276 -121 -150 397 -126 67 -43 9 56 -180 53
6842 53 51 35 -68 -148 15 197 142 -11 169 -1 65 39 -229 54 32 52 14 13 -33 -214 4 -178 3 -195 63
6867 63 96 102 -35 102 0 58 -56 122 -196 188 95 220 -104 35 350 167 -128 -94 -23 -65 -125 -37 46 -163
6891 -163 51 -136 247 145 96 -38 68 -35 53 -27 -270 -137 -48 -166 -79 -191 -123 -215 -30 -85 66 -139 -323
6914 -323 189 240 -267 -55 -127 32 -34 -40 206 -68 59 -204 369 98 -153 -13 458 192 100 76 42 29 -201
$$ packed form
6751A1j31M21m07K79k65R2K84m03J19l49M71q8J3J84k48KJ67j84j03K2L93j97
6773H3O9p4P0r2j65N7J49j0k03Q9K66k71k52M22l08J87K5O5N0j65K21k62J40j34
6797d3J78j81O9J74j83k1j76J90L4O1J81l91K73Qm36N6K87J60l54l5K34k95N28
6820C18l27J21l97J48K66j71K31k4M5l54R2L28l97k9N47n23J93j10N2M7k36K33
6842E3kj6j03q0J63J82n5j53J80j70O6k6k68K83k2K0l8jm6j81K18j82J81j98K58
6867F3L3Oj37J37j02N8j14J78l18L84r3J25l24J39L15j83k95L4P1m2o0Q8Q3k09
6891a63K14j87L83j02m9j34J06j03Q8q0k43J33Q9j18Q7j12O8r2J85n5J51k05j84
6914c23N12N1n07K12p2J59o6oK46k74J27k63N73k71k51J40M71k66r2k4l4j3k30
$$ plain form
6937 -201 -30 -22 -81 336 -44 -155 -76 -149 -92 -264 -129 -58 -54 -170 94 25 -99 -145 127 35 -122 248 -241 -179
6961 -179 -31 144 131 -38 47 156 -23 127 -132 -103 33 -31 207 -184 9 99 157 -128 -174 59 5 -44 -62
6984 -62 -4 -103 -104 -5 -170 -111 -145 -119 54 -51 -58 -17 -4 44 148 3 -59 64 56 41 10 86 -19 -120 202 -61 56
7011 56 -86 90 31 -23 -47 141 -18 176 89 -196 78 120 -103 -53 93 -64 -152 239 -124 32 39 -229 78
7034 78 -7 238 141 26 14 204 -48 223 -140 190 198 47 176 -162 -225 56 81 31 -99 -132 -140 -149 103 108 36 251
7060 251 19 -105 -247 -52 -34 4 -79 168 -7 35 -197 -75 19 -97 -245 -201 121 19 68 -327 27 -12 -91
7083 -91 -119 -326 -52 48 8 358 192 132 -180 175 -153 110 204 -45 63 93 200 -233 -76 -50 -164 -50
7105 -50 125 195 4 247 371 117 -94 -3 -274 -3 -18 93 -285 168 339 -78 -128 91 -106 -283 240 240
$$ packed form
6937b01J71Qn9M17l80j11P9p3N7j72J35P1Mj16K64o9j24m6K72r2j57L70m89O2
6961a79J48J75j3j69Q5J09j79J50k59K9J36o4K38l91J93R0N8k85m6K33n4m9j8
6984f2N8r9jR9j65N9l4K6J73j05pM1J3M8J04j45o2J23qj5l1P6j05j01L22k63J17
7011E6j42J76n9n4k4J88j59J94q7k85K74M2k23N0J46j57q8L91l63J56Pk68L07
7034G8q5K45r7j15j2J90k52K71l63L30Qj51J29l38o3K81K5n0j30l3qrK52Np2K15
7060B51k32j24j42J95J8L8q3K47j75M2k32J22R4j16j48M4L22j02M9l95L54l9p9
7083i1k8k07K74J00m0L50j66o0l12L55l28K63R4k49J08L0J07m33J57K6j14J14
7105e0J75P0j91K43J24k54k11R1k71K71j5J11l78M53J71m17n0K19j97j77N23%
$$ plain form
7127 240 141 -226 84 -313 -142 11 77 -52 106 -107 68 292 -201 -76 172 126 -57 12 97 18 277 -130
7149 -130 79 -171 42 -100 64 23 -107 -53 44 -225 74 70 -128 -71 15 177 -165 131 18 54 38 -67 -155
7172 -155 87 48 -284 -150 41 184 -53 -71 -166 -350 -87 -230 -102 -146 -166 180 -12 7 61 -151 -178 -85 -92 170
7196 170 -100 32 158 -226 -259 -146 -11 -344 -334 117 -26 59 -15 -26 231 147 114 -84 8 66 176 71 29
7219 29 -18 -209 91 117 1 130 97 -93 -62 6 25 -100 -122 38 155 179 -528 50 -9 53 -42 -96 -18 -45 -70
7244 -70 13 -44 -137 81 -91 14 -116 -48 59 -79 9 -85 0 126 -43 93 -127 97 112 73 21 251 -86 61
7268 61 165 -75 -85 -150 -83 191 -140 91 -54 -147 32 32 -183 215 -211 -251 -168 215 -78 -32 66 -133 -115 -263
7292 -263 7 200 -39 149 236 -33 138 129 -290 -86 197 207 -165 -104 219 170 -12 -45 -28 -193 -54 -37 46
$$ packed form
7127B40r9l67L10l97J71J53O6j29J58k13J75K24m93J25K48m6j83O9Q5p9K59m07
7149a30K09k50K13j42J64m1j30N4R7k69K99mj98N7Q6J62l42K96j13L6j6j05q8
7172a55K42l9l32J34J91J43k37j8r5j84K63j43J28m4k0L46j92J9N4k12k7R3pK62
7196A70k70J32J26l84l3J13J35l33J0M51j43Q5p4j1K57q4l3j98R2N8J10j05m2
7219B9m7j91L00K6j16J29l3j90L1O8J9j25k2J60J17K4p07N78n9O2r5n4P8k7k5
7244g0Q3n7r3K18j72J05j30O8J07j38Q8r4Q5J26j69J36k20K24J5l9n2K30l37J47
7268F1J04k40j0o5O7K74l31K31j45r3J79%k15L98m26m0Q3L83k93M6R8j99J8j48
7292b63K70J93k39J88Q7k69J71rm19K04K83J0l72O1L23m9j82l3J7j65J39J7Q3
$$ plain form
7315 46 -69 -119 83 65 -45 -5 -142 -158 44 -40 -406 -243 10 19 -114 -90 273 111 -1 -139 18 -88 230
7338 230 -98 -363 12 -88 209 82 191 -154 -160 -5 168 97 243 64 -179 178 -60 25 36 177 -271 69
7360 69 203 -91 110 53 160 268 27 -142 -61 235 37 95 -103 -81 -18 -12 94 -217 127 46 -46 -267 96
7383 96 93 -20 -321 -25 170 -288 -127 -30 -111 30 86 -205 137 96 172 8 93 -67 104 -3 187 -65 6
7406 6 111 182 142 170 -127 -133 -97 -153 10 -148 114 218 66 -286 71 158 54 -30 -109 -76 198 -145 -28 -88 -3
7431 -3 175 21 113 297 -123 124 50 -94 34 204 130 29 174 71 -95 137 -150 -276 110 -77 -186 172
7453 172 -125 -112 -151 16 36 86 -229 25 29 -29 -114 -311 -127 -199 2 106 15 -95 -139 -30 396 61 -131 35
7477 35 165 -20 -3 270 247 -16 209 29 -47 -105 -77 -44 171 -140 -81 -62 31 -294 -151 94 -5 -101 -94 -15 -85
$$ packed form
7315D6j15n0K02j8j10M0j37j6K02q4l66J63K53Rj33K4L63j62j12j38J57j06L18
7338B30l28k65L75j00K97j27J09l45oJ55J73p1J46j79k43L57k38Q5J1J41m48L40
7360F9J34k94K01n7J07J08k41j69Q1K96j98N8j98K2O3OJ06l11L44q1r2k21L63
7383I6lj13l01K96J95m58J61R7q1J41N6k91L42m1P6j64Q5j60J71j07J90k52P1
7406FJ05P1m0K8k97oL6n6J63j58K62J04j52l52L57Q7j04q4p9L3K74l43J17o0Q5
7431cJ78j54R2J84m20K47p4j44J28J70p4j01J45j03j66K32k87j26L86j87j09L58
7453A72k97J3l9J67K0N0l15K54Mn8q5j97J84p2K01J04r1j10m4J09M26l35j92J66
7477C5J30j85J7K73k3k63K25j80p6n8K8L3K15l11N9J9R3l25J43K45r9r6PP9p0
$$ plain form
7502 -85 298 211 -175 152 -43 -276 -5 -163 -10 -72 -128 122 -116 -53 -150 89 20 -164 5 45 -178 -288 155
7525 155 230 -4 70 -72 141 82 10 188 -143 -212 38 87 23 -324 77 238 30 176 -115 -24 53 57 -165 49
7549 49 89 110 56 -190 -43 -49 117 -1 46 56 -130 -384 61 63 259 -80 33 72 -24 292 88 294 -229 -124
7573 -124 12 46 -51 315 -185 63 236 -14 53 -209 223 -100 -234 85 -160 -19 30 -107 237 156 271 78
7595 78 -48 98 77 -64 -34 -101 48 185 120 -21 117 48 -256 16 -101 82 104 -129 29 -292 135 -113
7617 -113 0 170 -187 122 71 287 20 -36 81 254 -124 -7 -103 -141 127 -187 -108 -47 -108 161 -131 -266
7639 -266 -90 76 -66 -163 0 201 -230 -154 342 24 -73 72 29 436 -72 71 -193 -69 -67 -84 -27 -173 116
7662 116 -30 175 31 95 -247 -356 -121 236 -93 244 226 -142 -119 -82 -102 -36 81 163 -66 303 145 56 61
$$ packed form
7502h5L83q7l86L27j95k33K71j58J53o2n6K50k38O3r7K39o9j84J69M0k23j10M43
7525A55P5k34P4j42K13n9p2J78l31o9K50M9o4l47M01J61k08J46k91R1P7Mk22K14
7549D9M0K1n4k46J47oJ66j18M7J0j86k54M45KJ96l39J13L9r6L16k04K06n23J05
7573a24J36L4r7L66n00K48J73k50O7k62M32l23j34L19k45J41M9j37L44q1J15j93
7595G8j26J46k1j41L0o7J49J37o5j41J38o9l04K72j17J83K2k33J58l21M27k48
7617a13J13J70l57L09n1K16k67n6J17J73l78J17r6l8K68l14P9O1o1K69k92j35
7639b66J76J66j42r7J63K01m31P6M96l18r7J45m3M07n08J43k64J24Kj7N7j46K89
7662A16j46K05j44O4l42j09K35L57l29L37j8l68K3L7k0O6J17Q2k29L69j58q9N
$$ plain form
7685 61 -254 -63 13 -42 11 40 36 -144 107 248 -14 -299 -116 -153 232 70 -22 130 -81 -4 127 245 -84
7708 -84 64 -241 -150 -104 112 -44 40 -115 -111 -36 -36 -277 -136 -399 -14 -141 -363 248 -55 -247 28 200 190
7731 190 -4 56 156 -50 -45 -400 -106 121 -177 -129 161 177 162 105 -99 27 -118 11 -324 -97 188 -60
7753 -60 -155 -1 -111 83 -46 154 72 52 -87 -141 239 83 105 -107 143 -119 -48 1 112 68 214 -19 -209
7776 -209 -88 36 -315 -158 -112 -60 -192 -86 -305 -195 141 101 77 8 -10 -267 181 -90 153 -14 88 -65
7798 -65 -37 -119 124 -41 -15 103 -9 -201 -272 99 12 356 -107 -87 234 60 -110 96 -16 119 283 -193
7820 -193 -38 166 292 154 -188 -8 -68 11 40 114 3 56 63 92 260 54 -23 222 -33 -118 60 58 -145 109
7844 109 10 -100 -3 -71 33 -120 97 -121 13 -135 -209 279 0 147 -210 -51 -109 -112 252 -269 277 -197
$$ packed form
7685F1l15J91P6n5N3K9mj80K51J41k62k85J83l7L85j62r2J52k11P7J31J18l29
7708h4J48l05R1M6K16j56Q4j55MP5%k41J41k63L85j27k22O11l03j92K75J72j0
7731A90j94O0J00k06Nl55K94K27k98M8K90J6j5n7k04J26j45J29l35K27K85k48
7753f0r5J54j10J94j29K00q2k0j39n4L80j56K2k12K50k62P1M9J11m4J46k33j90
7776b09J21J24l51J57M6N2j32J06k19J10L36m0k4o9j8k57M48k71K43j67J02j53
7798f5K8q2K43j65K6J18j12j92p1L71q7L44m63K0L21j74j70K06j12J35J64m76
7820a93J55K04J26j38l42J80o0P9K9P4j11N3PK9J68k06p7K45k55q5J78kk03K54
7844A09r9j10R7o8J04j53K17k18J34j48p4M88k79J47l57J59n8lL64n21N46m74
$$ plain form
7866 -197 -43 -101 201 -148 38 129 -7 36 -37 -41 -304 -243 -22 -36 -76 -123 -102 126 40 77 -153 278 -206 224
7890 224 -189 -241 -187 -35 -367 -224 123 205 -146 -57 -35 216 148 -102 -198 -177 -389 302 -38 -65 -23 87 38 -189
7914 -189 -156 -65 80 -279 -59 -115 258 86 35 -61 107 85 187 228 163 178 -87 -282 -74 -109 -17 -214 -214 -98
7938 -98 187 -117 31 15 41 248 80 181 231 103 -78 154 -19 52 -34 42 14 -7 -192 53 90 -38 -42 9
7962 9 -202 69 113 -197 137 113 -1 121 -87 51 29 222 -19 18 -160 124 143 128 -109 -163 146 -218 156
7985 156 -223 197 105 35 42 306 54 -12 -26 -11 -151 102 -195 -155 50 -159 70 7 -39 0 158 -94 -65 125
8009 125 318 181 -104 56 -27 -156 171 -12 -150 -33 174 66 -10 88 85 -84 -217 -1 92 142 59 53 23 102
8033 102 190 106 -237 47 -370 0 108 38 -204 -12 18 -63 -246 -239 42 70 3 217 -150 -76 0 52 -265 -139
$$ packed form
7866a97J54n8L02l49J86R1j36M3p3mk63O1K21j4m0m7K1K28q6L7k30M31m84M30
7890B24m13n2N4J52l32J43L47Q2l51Q9K2K51o8k50r6K1k12O91l40k7M2J10m9k27
7914a89L3R1J45l59K20n6L73j72n1r6J68k2J02M1o5J5k65j95K08l5R2j97%J16
7938i8K85l04J48j6K6K07j68J01N0j28j81K32j73P1q6P6k8k1j85K45L7j28mN1
7962Ik11K71M4l10L34k4j14J22k08J38k2J93k41L7j78K84J9j5k37n4L09l64L74
7985A56l79M20r2p0PK64k52o6j4J5j40K53k97M0K05k09K29o3m6L9J58k52K9J90
8009A25J93j37k85J60q3j29L27j83j38J17K07j08p6R8lj69j33K16R3N0q3ol0P9
8033A02Q8q4l43K84m17L70J08p0k42J92L0q1j83PK81K8o7K14l67P4P6N2l17J26
$$ plain form
8057 -139 132 -69 -3 127 -28 239 -10 -172 164 -18 -191 9 11 81 -146 38 58 14 -82 -57 57 161 29
8080 29 -4 279 -285 -67 50 -23 -47 -184 20 -106 3 161 136 129 63 75 -139 -142 28 -162 -9 34 -66 34
8104 34 223 -79 -45 -100 -3 -45 -39 -179 68 -66 -172 144 -100 112 -32 252 4 253 64 -45 -72 -135 -41
8127 -41 -4 74 49 88 -218 195 157 15 72 48 17 114 102 -227 161 -96 -142 -164 -82 -301 -162 -199 66 70 -78 78
8153 78 320 -130 -115 19 128 -60 95 5 -201 -150 293 -9 101 -83 56 236 -167 67 -222 -74 -126 -15
8175 -15 58 75 105 128 296 201 -110 -319 -92 41 54 -65 56 375 -250 157
$$ packed form
8057a39K71k01O6J30j55K67k49j62L36j82j73K00KP0k27J84K0m4r6K5J14J04j32
8080B9l3K83n64K18J17p3k4j37K04j26J09J58k5po6J2k14lJ70j90J53M3j00J00
8104C4J89l02L4n5R7m2Oj40K47j34j06L16k44K12j44K84k48K49j89j09k7o3R4
8127d1L7P8k5L9l06M13l8j42N7k4l1R7j2l29L88k57m6k2Q2k19J39l7K65Mj48J56
8153G8K42m50J5J34J09j88J55r0k06N1M43l02J10j84J39J80m03K34k89J48n2J11
8175a5P3J7L0K3J68r5l11k09K27J33J3j19J21L19o25M07
8191A57
$$ Imaginary data points
##PAGE= N=2
##DATA TABLE= (X++(I..I)), XYDATA
$$ plain form
0 0 0 0 0 0 0 0 0 0 0 0 8 -8 8 -15 16 -16 24 -32 40 -43 56 -64 78 -88 104 -121 144 -166 191 -217 249 -286
32 -286 323 -367 415 -466 526 -587 656 -731 815 -906 1003 -1114 1231 -1360 1500 -1655 1823
49 1823 -2009 2213 -2437 2686 -2964 3275 -3626 4023 -4482 5014 -5640 6394 -7316 8476
63 8476 -9986 12045 -15031 19763 -28433 49498 -214727 -91878 316973 -35617 -6730 251974
75 251974 4959 -338576 -31560 121667 -102087 27894 311381 -15372 -273545 33811
85 33811 124050 -174671 -34500 243168 12974 -164867 88048 50415 -222445 -38981 205473
96 205473 -30920 -99304 191420 82218 -261176 -83679 162251 -46330 -83477 218808
106 218808 127521 -192626 -78745 80321 -110116 -78185 217542 107563 -166298 -20132
$$ packed form
0@%%%%%%%%%%Qj6J6k3L1l2M0n6P2q3R9j20J42j66J92k25K65l10L57m08M66n35
32b86O09o90P82q81R92j113J243j387J546j721J909k117K345k591K860l155L478
49A823l832M222m650N123n650O239o901P649q505R496j0654J2034j3710J5792
63H476j8462K2031k7076L4794m8196P7931k64225J22849M08851l52590K8887K58704
75B51974k47015l43535L07016J53227k23754J29981K83487l26753k58173L07356
85C3811R0239k98721J40171K77668k30194j77841K52915l7633k72860J83464K44454
96B05473k36393o8384K90724j09202l43394J77497K45930k08581l7147L02285
106B18808r1287l20147J13881J59066j90437L1931K95727j09979k73861J46166
$$ plain form
116 -20132 97633 -134244 -119868 168161 100361 -110143 19463 90222 -122501 -94658 134253
127 134253 45546 -100448 65756 108787 -115010 -91954 97341 -3176 -104724 83592
137 83592 115984 -99612 -71987 90458 -24249 -116949 68368 108038 -68168 -26283 100408
148 100408 -36674 -120282 60294 88290 -75651 -23001 107484 -10245 -98496 29089 37517
159 37517 -77712 -149 97682 -22241 -72074 50660 23544 -91903 1131 98685 -10479
170 -10479 -48472 55843 11195 -91559 3821 84088 -17859 -36853 57486 5282 -85636
181 -85636 -1465 56392 -30315 -26874 61284 10260 -64029 7582 41651 -34422 -19040 52869
193 52869 4471 -41277 27822 35766 -44084 -23532 43502 1496 -36410 19509 23246 -37254
$$ packed form
116b0132J17765k31877J4376K88029o7800k10504J29606P0759k12723K7843K28911
127A34253q8707j45994J66204M3031k23797K3056J89295j00517j01548J88316
137H3592L2392k15596K7625J62445j14707r2700J85317L9670j76206M1885J26691
148A00408j37082q3608J80576K7996j63941N2650J30485j17729q8251J27585Q428
159C7517j15229P7563R7831j19923m9833J22734k7116j15447R3034R7554j09164
170a0479l7993J04315m4648j02754R5380Q0267j01947j8994R4339n2204r0918
181h5636Q4171N7857q6707L441Q8158n1024p4289P1611L4069p6073J5382P1909
193E2869m8398m5748O9099P944p9850K0552O7034m2006l7906N5919L737o0500
$$ plain form
205 -37254 -15988 30656 -7690 -25737 26552 22914 -30020 -13212 22687 -2835 -11753 24507
217 24507 13254 -21553 1664 19991 -16254 -20384 17790 9301 -19821 -1017 15573 -10079
229 -10079 -13245 11859 2188 -16990 3330 17957 -3259 -6675 9935 3049 -7084 6544 8897
242 8897 -8157 -5006 8990 -2217 -12880 1863 7653 -5722 -4950 3753 -3964 -7971 4035 6229
256 6229 -3824 -575 8517 3587 -2911 2034 3662 -2013 -230 3209 -581 -1798 751 -1194 -4419
271 -4419 -1760 -1586 -4912 -695 4823 -182 -6163 639 7157 2439 -2613 883 4040 3281 708 -1829
287 -1829 -720 3162 1579 -4116 -5134 -585 990 -1882 -2782 -2024 -1102 1166 1149 -1445 -567 2832 2852
304 2852 328 1213 3653 2734 -592 -998 468 396 -1439 -2596 -1313 577 -1266 -4361 -2071 2418
$$ packed form
205c7254K1266M6644l8346j8047N2289l638n2934J6808L5899k5522q918L6260
217B4507j1253l4807K3217J8327l6245m130L8174q489k9122J8804J6590k5652
229a0079l166K5104r671j9178K0320J4627k1216l416J6610o886j0133J3628K353
242H897j7054L151J3996j1207j0663J4743N790j3375P72Q703p717m007J2006K194
256F229j0053L249R092m930o498M945J628n675J783L439l790j217K549j945l225
271d419K659J74l326M217N518n005n981O802O518m718n052L496L157p59k573k537
287a829J109L882j583n695j018M549J575k872r00P58R22K268j7k594Q78L399K0
304B852k524Q85K440r19l326m06J466p2j835j157J283J890j843l095K290M489
$$ plain form
320 2418 834 -3638 -2138 3270 4129 696 -103 1765 2152 1939 878 -1003 -233 1573 1051 -1661 -3494
337 -3494 -2138 -494 -208 -2074 -3481 -1086 3053 2503 -1999 -1554 2929 2995 244 -338 2014 2895 2031
354 2031 1284 -1480 -2543 -361 169 -3086 -3350 -293 325 -552 -535 -343 439 747 -529 -1753 508 3975
372 3975 3316 1482 3522 2685 -2183 -3459 -305 -248 -1959 -1250 -54 389 476 -494 -3682 -3343 1291 532
390 532 -2474 733 5795 3077 -1008 1579 3063 80 292 1744 -2811 -5369 171 3135 -133 616
406 616 2536 -3025 -6147 -2557 -2206 -2918 3599 8160 2461 -1386 2820 -52 -4259 1743 3702 -3131
422 -3131 123 8498 -907 -10105 520 6072 -5749 -6610 5007 740 -7367 745 3485 -4492 2156
437 2156 11978 237 -7057 4520 2338 -10431 -304 12816 906 -5315 7048 350 -15230
$$ packed form
320B418j584m472J500N408Q59l433p99J868L87k13j061j881P70J806n22k712j833
337c494J356J644K86j866j407K395M139n50m502M45M483O6k751n82K352Q81q64
354B031p47k764j063K182N30l255k64L057O18q77J7J92P82L08j276j224K261L467
372C975o59j834K040q37m868j276L154N7j711P09J196M43Q7r70l188L39M634p59
390E32l006L207N062k718m085K587J484k983K12J452m555k558N540K964l268P49
406F16J920n561l122L590L51p12O517M561n699l847M206k872m207O002J959o833
422c131L254Q375r405r198J0625N552j1821q61J1617m267q107Q112K740p977O648
437B156R822j1741p294J1577k182j2769J0127J3120j1910o221J2363o698j5580
$$ plain form
450 -15230 -4049 6565 -5731 -2369 14163 1170 -14847 1298 9796 -8901 -4375 16119 5028
463 5028 -10070 2534 3511 -11366 2061 16846 -4226 -12903 8270 3150 -18279 -3068 15310
476 15310 -3207 -8985 11072 2857 -15117 4149 14288 -9810 -9671 15135 6379 -10105 6294
489 6294 10301 -13899 -9962 10942 -179 -9208 11242 9484 -16634 -10089 8430 -3506 -5964
502 -5964 15815 9130 -14155 -3253 9856 -8595 -6956 18601 8970 -13419 1425 10173 -14830
515 -14830 -13819 14216 7475 -11623 4787 11781 -13546 -15001 7359 1385 -7593 14737 18947
528 18947 -9811 -13680 4077 -2396 -8437 11824 15543 -4182 -4102 1386 -14692 -12688 14808 12188
542 12188 -9919 320 9867 -14172 -17630 12858 12790 -6808 6631 16409 -11924 -19690 7639
$$ packed form
450a5230J1181J0614j2296L362J6532j2993j6017J6145Q498j8697M526K0494j1091
463E028j5098J2604R77j4877J3427J4785k1072q677K1173n120k1429J5211J8378
476A5310j8517n778K0057q215j7974J9266J0139k4098J39K4806q756j6484J6399
489F294M007k4200L937K0904j1121r029K0450j758k6118O545J8519j1936k458
502e964K1779o685k3285J0902J3109j8451J639K5557r631k2389J4844Q748k5003
515a4830J011K8035o741j9098J6410O994k5327j455K2360n974q978K2330M210
528A8947k8758l869J7757o473o041K0261L719j9725Q0N488j6078K004K7496k620
542A2188k2107J0239R547k4039l458L0488o8j9598J3439R778k8333p766K7329
$$ plain form
555 7639 6727 -9339 9913 21778 -8381 -19189 2660 -2069 -15752 6775 21271 -1540 -8559
568 -8559 3904 -7452 -14203 11297 15395 -7833 -226 14209 -9399 -17621 13236 14171 -12392
581 -12392 -1249 14007 -11767 -18261 12578 8275 -16327 1912 18324 -9672 -14467 15229 5692
594 5692 -19506 1433 18572 -5830 -7573 17235 5191 -16724 -769 6581 -12559 -1757 19267
607 19267 -1421 -15875 7227 6586 -18881 -5205 19169 279 -11280 10285 5789 -16196 1481
620 1481 17337 -6773 -10362 17076 6303 -21395 -3063 15845 -7130 -11558 14516 7820 -15242
633 -15242 -2620 6944 -11818 -5976 18147 6607 -10946 6057 8775 -16070 -10500 16054 6512
646 6512 -7749 6975 7087 -15163 -7965 10471 -2094 -8699 11844 8680 -16896 -7930 12871
$$ packed form
555G639r12j6066J9252J1865l0159j0808K1849m729j3683K2527J4496k2811p019
568h559J2463j1356o751K5500M098k3228P607J4435k3608q222L0857R35k6563
581a2392J1143J5256k5774o494L0839m303k4602J8239J6412k7996m795K9696r537
594E692k5198K0939J7139k4402j743K4808j2044k1915J5955P350j9140J0802K1024
607A9267k0688j4454K3102o41k5467J3676K4374j8890j1559K1565m496k1985J7677
620A481J5856k4110l589K7438j0773k7698J8332J8908k2975m428K6074o696k3062
633a5242J2622R564j8762N842K4123j1540j7553J7003K718k4845N570K6554r542
646F512j4261J4724J12k2250P198J8436j2565o605K0543l164k5576Q966K0801
$$ plain form
659 12871 -375 -9207 11032 11270 -10762 -5175 9267 -3962 -7908 11823 8437 -11213 -1776
672 -1776 9149 -8451 -12643 9288 7229 -10452 333 11595 -6415 -11035 7722 4880 -8436
685 -8436 4334 11435 -6894 -7130 10498 2403 -11237 3934 11543 -8110 -9442 7750 1277 -9798
699 -9798 3481 7427 -7913 -4772 9414 -1390 -9479 6600 9398 -8088 -4163 11068 1145
712 1145 -8299 4032 5349 -7302 -2513 7326 -3168 -7044 6065 3492 -10091 -1870 9334 -1981
726 -1981 -7223 5084 4724 -5728 536 7159 -1964 -3375 6841 1991 -8035 403 6952 -3754
740 -3754 -6121 4101 1431 -5422 228 3756 -3807 -2486 5228 56 -5153 2921 6161 -2616 -2418
755 -2418 4948 1115 -3739 1732 2865 -3650 -1973 2843 -1384 -4272 1512 2531 -3224 -1820 2619
$$ packed form
659A2871j3246q832K0239K38k2032N587J4442j3229l946J9731l386j9650R437
672a776J0925j7600m192K1931k059j7681J0785J1262j8010m620J8757k842j3316
685h436J2770P101j8329k36J7628q095j3640J5171P609j9653j332J7192o473j1075
699i798J3279L946j5340L141J4186j0804q089J6079K798j7486L925J5231r923
712A145r444J2331J317j2651M789R839j0494l876J3109k573j3583Q221J1204j1315
726a981n242J2307l60j0452O264O623r123j411J0216m850j0026Q438O549j0706
740c754k367J0222k670o853N650L528p563J321P714n172n209Q074L240q777J98
755b418P366l833m854N471J133o515J677M816m227k888N784J019n755J404M439
$$ plain form
770 2619 -564 -2378 2199 2406 -1525 581 3333 174 -1611 2121 1295 -2717 -935 1581 -973 -1767
786 -1767 898 316 -2117 -690 797 -970 -1330 1190 927 -533 1071 2419 799 221 902 -69 -1258
803 -1258 -120 827 -769 -667 344 -106 -1471 -953 -193 -1441 -1107 423 -132 -8 1635 1914 160
820 160 -150 635 612 -151 210 729 236 670 382 -1005 -1133 15 -763 -1836 -1019 671 -9 -53 1399
839 1399 861 -202 391 1014 -508 294 1908 449 -708 921 1052 -1023 -1089 -215 -1211 -1474 -76 303
857 303 -925 556 945 -894 -857 1075 537 -228 1031 1915 129 273 1458 -382 -1529 307 139
874 139 -2048 -863 1641 272 -1710 -271 -80 -1185 -749 1121 433 -87 1392 2328 -121 -329 1249
891 1249 410 -1001 -937 606 292 -11 -73 -256 -661 -697 -786 -1327 -1017 760 624 -37 824 2236 605 -1132
$$ packed form
770B619l183j814M577K07l931K106K752l159j785L732q26m012J782K516k554p94
786a767K665n82k433J427J487j767l60K520k63j460J604J348j620n78O81r71j189
803a258J138R47j596J02J011m50j365N18P60j248L34J530n55J24J643K79j754
820A60l10P85k3p63L61N19m93M34k88j387j28J148p78j073Q17J690o80m4J452
839A399n38j063N93O23j522Q02J614j459j157J629J31k075o6Q74r96k63J398L79
857C03j228J481L89j839L7J932n38p65J259Q84j786J44J185j840j147J836j68
874A39k187J185K504j369j982J439J91j105M36J870o88n20J479R36k449k08J578
891A249q39j411O4J543l14l03o2j83m05l6q9n41L10J777j36o61Q61J412j631j737
$$ plain form
911 -1132 291 396 -1316 456 2239 75 -965 1150 377 -3742 -1460 1490 -1481 -3096 1712 2714
927 2714 -1341 -241 3103 -57 -2185 1623 1338 -1965 796 3307 -494 -1742 2544 600 -3765
942 -3765 -1192 1151 -2384 -2568 2548 1182 -1964 1407 2268 -2959 -1643 3290 237 -2584 2903 3947
958 3947 -1643 -951 3007 -429 -4110 -18 1317 -2154 -148 2247 -1099 -3106 1282 1388 -2331 346
974 346 3273 -446 -3002 1143 2172 -193 921 2512 -695 -2938 -564 114 -2045 859 3597 -212
990 -212 -3748 -446 765 -2752 -1774 2818 2318 -889 26 1006 -846 -513 2016 405 -1233 1691 1565
1007 1565 -3306 -2854 2432 822 -2148 1291 1715 -3036 -2615 1729 -447 -1454 4418 3634 -3544 -1808
1023 -1808 3826 -556 -3606 2907 3902 -2639 -1520 3035 -881 -3782 1311 1054 -4170 -430 3849
$$ packed form
911a132J423J05j712J772J783k164j040K115p73m119K282K950k971j615M808J002
927B714m055J100L344l160k128L808k85l303K761K511l801j248M286j944m365
942c765K573K343l535j84N116j366l146L371Q61n227J316M933l053k821N487J044
958C947n590O92L958l436l681M092J335l471K006K395l346k007M388J06l719K677
974C46K927l719k556M145J029k365J114J591l207k243K374O78k159K904K738l809
990b12l536L302J211l517R78M592n00l207R15R80j852L33K529j611j638K924j26
1007A565m871M52N286j610k970L439M24m751M21M344k176j007N872p84p178J736
1023a808N634m382l050O513R95o541J119M555l916k901N093k57n224L740M279
$$ plain form
1038 3849 -768 -2366 2244 923 -3158 966 4121 -258 -969 2637 -708 -3852 1523 3260 -1853
1053 -1853 -734 3025 -2033 -5331 311 2528 -2562 -418 4391 775 -3562 -54 1148 -2215 -18
1068 -18 4026 2008 -704 997 28 -3827 -2002 2132 1755 49 625 -771 -3541 -2123 -68 1249
1084 1249 2802 3428 -444 -4129 -2356 750 1112 2708 4398 1976 -2605 -3559 -1917 -576 1157 3304
1100 3304 2280 -1834 -3060 -1325 -1197 -1232 2122 3838 425 -2066 -78 557 -1136 487 2689 1723
1116 1723 -356 58 -1165 -2946 -596 1882 100 -323 1220 23 -3076 -1756 457 219 1659 2754
1132 2754 40 -2320 192 1047 -1237 523 3870 788 -2658 -1304 250 -1428 -251 2220 -178
1147 -178 -2268 -90 382 -1891 540 3347 396 -1919 367 1246 -820 327 2660 993 -1412 -80
$$ packed form
1038C849m617j598M610j321m081M124L155m379p11L606l345l144N375J737n113
1053a853J119L759n058l298N642K217n090K144M809l616m337L508J202l363K197
1068a8M044k018k712J701r69l855J825M134l77j706N76j396k770J418K055J317
1084A249J553O26l872l685J773L106L62J596J690k422m581r54J642J341J733K147
1100C304j024m114j226J735J28l5L354J716l413k491J988O35j693J623K202r66
1116A723k079M14j223j781K350K478j782m23J543j197l099J320K213k38J440J095
1132B754k714k360K512Q55k284J760L347l082l446J354J554j678J177K471k398
1147a78k090K178M72k273K431K807k951k315K286Q79k066J147K333j667k405J332
$$ plain form
1163 -80 -454 -1598 522 1935 -838 -2072 230 56 -2042 -452 2185 397 -1090 192 416 -625
1179 -625 1230 1879 -276 -388 1822 300 -2307 -549 1680 -387 -1706 212 285 -1031 -480 228 -1029
1196 -1029 -177 1802 252 -1374 594 1580 -739 -1100 1580 1997 -503 -210 38 -1340 -1079 886 -191
1213 -191 -842 1176 541 -2101 -1550 1188 1131 -864 302 1104 -352 -272 1120 201 -223 857 124 -1755
1231 -1755 -531 1106 -90 -1297 154 370 -982 -648 426 -191 -768 565 265 -194 821 1830
1247 1830 141 -532 416 329 -757 188 927 -275 -733 228 -86 -1031 -158 157 -896 -913 589 232 -424
1266 -424 749 1218 4 -415 688 348 -225 322 91 -637 28 281 -320 -711 -322 -146 -841 -672 250
1285 250 336 288 359 128 -177 340 324 -5 -181 517 101 -448 307 669 -295 -509 -521 -739 -813 -375 -283 -206 151
$$ packed form
1163h0l74j144K120J413k773j234K302j74k098J590K637j788j487J282K24j041
1179f25J855O49k155j12K210j522k607J758K229k067j319J918P3j316N51P08j257
1196a029Q52J979j550j626J968R86k319l61K680M17k500K93K48j378K61J965j077
1213a91o51K018o35k642N51K738n7j995J166Q02j456Q0J392r19m24J080p33j879
1231a755J224J637j196j207J451K16j352L34J074o17n77J333l00m59J015J009
1247A830j689o73R48q7j086R45P39j202m58R61l14r45Q73L15j053j7J502l57o56
1266d24J173M69j214m19J103l40n73N47k31p28O65K53o01l91L89J76o95J69R22
1285B50Q6m8P1k31l05N17j6l29j76O98m16n49P55L62r64k14j2k18p4M38R2P7L57
$$ plain form
1308 151 265 -159 87 445 290 156 16 181 322 451 452 -180 -204 258 -123 -696 -510 -512 -381 -262 -214 454
1330 454 274 319 127 31 -164 166 444 225 140 224 597 178 -235 -131 -308 -233 -330 -698 -388 512 40 -178
1352 -178 29 -134 -369 -291 292 288 207 550 518 -137 141 548 142 -915 -456 145 14 -627 123 75 -395 -445
1374 -445 -75 -333 103 314 22 242 791 549 -45 354 419 -370 -215 175 -309 -461 314 332 -640 -540 -84
1395 -84 -594 -969 62 425 244 391 511 460 64 -20 -24 37 164 63 120 -155 242 -287 -547 -509 -601 -616 -139
1418 -139 -246 -110 730 858 122 -229 170 534 -182 -459 212 714 750 182 -68 -165 13 -781 -1074 -407 -290
1439 -290 -309 104 342 -125 694 701 -368 -632 715 906 -602 402 1498 609 -322 -301 -647 -1011 -12 407
1459 407 -486 -178 1192 -506 -1009 503 631 -555 -269 645 -369 -457 1503 1084 -506 203 614 -1152
$$ packed form
1308A51J14m24K46L58j55j34j40J65J41J29Jo32k4M62l81n73J86kJ31J19M8O68
1330D54j80M5j92r6j95L30K78k19q5Q4L73m19m13J04j77P5r7l68L10R00m72k18
1352a78K07j63k35P8N83mq1L43l2o55K78M07m06j057M59O01j31o41P50m8m70n0
1374d45L70k58M36K11k92K20N49k42n94L99O5p89J55L90m84j52P75J8r72J00M56
1395h4n10l75J031L63j81J47J20n1l96q4mO1J27j01N7k75L97n29k60L8r2j5M77
1418a39j07J36Q40J28p36l51L99L64p16k77O71N02L6n68k50r7J78p94k93O67J17
1439b90j9M13K38m67Q19Pj069k64J347J91j508J004J096q89r31K1l46l64R99M19
1459D07q93L08J370j698n03J512J28j186K86R14j014q8J960m19j590P09M11j766
$$ plain form
1477 -1152 -1573 593 266 -811 199 599 -904 -948 279 -57 -815 608 938 -352 174 1463 286
1494 286 -457 541 182 -768 -291 871 -553 -728 721 262 -1314 -528 506 -444 -481 513 260 -182 471
1513 471 687 -38 301 532 -276 -278 317 218 -35 213 501 -141 -925 -136 -890 -914 418 922 272 -118 144
1534 144 371 -145 -71 560 530 77 -21 -153 -186 -198 698 480 -460 -600 -479 -707 -988 -52 764 472 113 -13
1556 -13 -746 -473 94 461 859 1040 585 -172 -556 -293 163 -146 256 -72 -654 -516 -332 -454 86 1275
1576 1275 624 -649 -643 -91 -332 -250 1108 1609 725 -172 -644 -902 -608 268 207 436 5 -180 -981 -756
1596 -756 -522 244 896 717 -610 -940 -131 -78 248 1171 1498 529 -704 -969 -983 -375 666 826 217 -148
1616 -148 -784 -1248 -871 338 1053 493 597 -389 -724 -205 360 521 1052 980 -82 -1259 -591 525 52
$$ packed form
1477a152m21K166l27j077J010M00j503m4J227l36p58J423L30j290N26J289j177
1494B86p43R98l59r50M77J162j424j75J449m59j576P86J034r50l7R94k53m42O53
1513D71K16p25L39K31q08kN95r9k53K48K88o42p84P89p54k4J332N04o50l90K62
1534A44K27n16P4O31l0m53r8j32l3j2Q96k18r40j40J21k28k81R36Q16k92l59j26
1556a3p33K73N67L67L98J81m55p57l84K63M56l09M02l28n82J38J84j22N40J189
1576A275o51j273ON52k41Q2J358N01q84q97m72k58K94Q76o1K29m31j85q01K25
1596g56K34P66O52j79j327l30Q09N3L26R23L27r69j233k65j4O08J041J60o09l65
1616a48o36m64L77J209P15n60J04r86l35N19N65J61N31p2j062j177O68J116m73
$$ plain form
1635 52 29 727 41 -848 -466 -492 -767 14 1167 318 -316 101 242 -218 124 736 554 157 460 -222 -776
1656 -776 -527 84 -387 -182 1065 164 -814 -767 -161 -628 -70 1040 610 -198 -104 93 -82 132 694 566
1676 566 -192 181 -19 -898 -264 493 91 -625 -42 210 -747 -217 284 154 -166 634 731 24 397 120
1696 120 -297 -281 415 361 -292 296 419 -378 -786 -328 -49 -123 -205 316 -119 -170 462 106 -348 397 556 380
1718 380 56 117 283 -62 164 -9 -159 53 -274 -408 -622 4 345 -309 -296 172 -122 -325 72 451 405
1739 405 366 465 268 -103 -62 74 -384 -161 371 17 -391 -3 217 -111 -230 -510 -312 -171 424 158 2
1760 2 144 649 225 157 163 356 108 -238 45 128 123 109 -115 -925 -140 -148 -358 55 69 418 243 121 172 -2
1784 -2 267 47 151 -130 -22 147 43 131 -137 -90 -243 -396 -357 -184 27 26 -88 311 380 95 391 77 -97
$$ packed form
1635E2k3O98o86q89L82k6k75P81J153q49o34M17J41m60L42O12j82l97L03o82n54
1656g76K49O11m71K05J247r01r78M7O06m67N58J110m30q08R4J97j75K14N62j28
1676E66p58L73k00q79O34P57m02p16N83K52r57N30N01j30l20Q00R7p07L73k77
1696A20m17J6O96n4o53N88J23p97m08M58K79p4q2N21m35n1O32l56m54P45J59j76
1718C80l24O1J66l45K26j73j50K12l27j34k14O26L41o54J3M68k94k03L97L79m6
1739D05l9R9j97l71M1J36m58K23N32l54m08L88K20l28j19k80J98J41N95k66j56
1760BJ42N05m24o8OJ93k48l46K83Q3nj4k24q10P85qk10M13J4L49j75j22N1j74
1784bK69k20J04k81J08J69j04Q8k68M7j53j53L9J73K11jj14L99O9k85K96l14j74
$$ plain form
1807 -97 -19 246 470 294 297 106 -280 -388 43 -392 -440 -79 -83 -486 4 172 -32 53 505 -28 -162 220 407
1830 407 -121 226 254 68 -518 -85 -36 -594 57 114 -132 -508 141 178 -197 74 -103 -88 -216 443 198 -12
1852 -12 589 118 -255 153 -104 -556 -11 56 -274 -335 417 165 -376 -285 142 54 -229 110 201 243 431 671
1874 671 1 -15 222 -287 -139 66 64 -308 309 20 -354 -410 -291 -44 -389 141 295 -46 331 377 88 -217
1896 -217 44 76 -153 121 319 73 18 202 -281 -122 -173 -406 -601 -164 -238 -168 -97 429 146 -355 75 -13
1918 -13 -151 183 312 276 -137 14 -97 -259 -310 -2 -366 -366 -321 -106 -36 283 248 103 109 25 -165 303 62 -198
1942 -198 23 168 335 484 435 -133 -646 -539 -106 152 101 173 175 -112 -169 -294 139 26 273 142 45 -186
1964 -186 179 33 333 489 -139 -273 -477 -51 -321 -71 112 105 63 -180 -41 -263 65 -345 -230 -172 617
$$ packed form
1807i7P8K65K24j76Lj91l86j08M31m35m8L61mm03M90J68k04Q5M52n33j34L82J87
1830D07n28L47K8j86n86M33M9n58O51N7k46l76O49L7l75K71j77J5j28O59k45k10
1852a2O01m71l73M08k57m52N45O7l30o1P52k52n41R1M27q8k83L39R1M2J88K40
1874F71o70j6K37n09J48K05kl72O17k89l74n6J19K47l45N30J54l41L77M6k89l05
1896b17K61L2k29K74J98k46n5J84m83J59n1k33j95M37p4P0P1N26k83n01M30q8
1918a3j38L34J29l6m13J51j11j62n1L08l64%M5K15P0L19l5j45Oq4j90M68k41k60
1942a98K21J45J67J49m9n68n13J07M33K58n1P2Kk87n7j25M33j13K47j31r7k31
1964a86L65j46L00J56o28j34k04M26k70K50J83pm2k43J39k22L28m10J15N8P89
$$ plain form
1985 617 867 330 76 -83 -57 -396 73 670 673 -95 -830 -593 -684 15 524 249 -283 -377 -248 -574 -161 835
2007 835 593 230 361 188 -645 -531 221 219 -111 452 246 -574 -654 -119 -462 -407 321 1021 86 -512 -10
2028 -10 -428 -320 670 764 211 298 143 -511 -536 629 206 -78 -83 -13 -612 -292 344 285 -324 11 453 -63
2050 -63 232 589 -24 -443 128 593 136 201 254 -270 -644 -324 164 230 656 164 -369 -629 -305 143 32
2071 32 391 468 -19 -312 46 35 253 358 276 -228 -81 -96 -84 -374 -520 -487 -144 182 461 318 -394 -794
2093 -794 -574 -210 460 1058 1171 312 -662 -1042 -354 99 250 969 118 -763 -705 -747 -403 167 470 588 -17
2114 -17 -639 -142 77 98 587 447 179 133 -189 -297 -184 113 277 -15 95 470 -293 -733 -299 -26 -61
2135 -61 258 365 39 -292 77 185 -173 605 760 203 -218 279 243 -303 -141 123 203 -402 -147 61 -330
$$ packed form
1985F17K50n37k54j59K6l39M69N97Lp68p35K37r1O99N09k75n32r4J29l26M13R96
2007H35k42l63J31j73q33J14P52kl30N63k06q20q0N35l43N5P28P00r35n98N02
2028a0m18J08R90R4n53Q7j55o54k5J165m23k84nP0n99L20O36n9o09L35M42n16
2050f3K95L57o13m19N71M65m57O5N3n24l74L20M88O6M26m92n33k60L24M48j11
2071C2L59P7m87k93L58j1K18J05q2n04J47j5J2k90j46L3L43L26K79j43p12m00
2093g94K20L64O70N98J13q59r74l80O88M53J51P19q51q81N8m2L44N70L03J18o05
2114a7o22M97K19K1M89j40k68m6l22j08J13K97J64k92J10L75p63m40M34K73l5
2135f1L19J07l26l31L69J08l58P78J55n57m21M97l6n46J62K64Q0o05K55K08l91
$$ plain form
2156 -330 -199 138 114 -147 -12 220 -214 -230 142 387 -284 198 718 -316 -306 216 -50 -350 145 -9 -310
2177 -310 -70 430 -84 -574 60 -42 -327 199 528 9 -128 152 80 -573 -17 622 -62 -224 99 -132
2197 -132 -881 -29 -67 -62 -112 387 -144 -608 163 430 -389 -158 282 282 -425 -59 620 -79 -313 489 -117 -563
2219 -563 -16 193 -422 -251 393 -28 -494 126 514 -607 -44 374 222 124 592 188 -254 -37 271 -197
2239 -197 -395 237 101 -119 -357 -4 13 -264 189 41 -406 243 395 200 199 559 250 35 -9 -4 -202 -268
2261 -268 214 -78 -382 -83 1 -137 -201 -94 -158 -442 -193 547 213 222 155 96 -94 217 15 -62 -56 169 86 -87
2285 -87 115 -109 -303 -246 -129 47 -234 66 113 102 310 24 163 -295 56 -82 -80 -68 196 257 -67 -10 -69
2308 -69 -520 -415 -83 56 -316 58 58 -41 158 286 184 13 184 188 38 237 352 99 36 120 -119 -199 -659
$$ packed form
2156c30J31L37k4k61J35K32m34j6L72K45o71M82N20j034J0N22k66l00M95j54l01
2177c10K40N00n14m90O34j02k85N26L29n19j37K80p2o53N56O39o84j62L23k31
2197a32p49Q52l8Nn0M99n31m64P71K67q19K31M40%p07L66O79o99k34Q02o06m46
2219e63N47K09o15J71O44m21m66O20L88j121N63M18j52r8M68m04m42K17L08m68
2239a97j98O32j36k20k38L53J7k77M53j48m47O49J52j95jL60l09k15m4Nj98o6
2261b68M82k92l04K99Q4j38o4J07o4k84K49P40l34Ro7n9j90L11k02p7OK25q3j73
2285h7K02k24j94N7J17J76k81L00M7j1K08k86J39m58L51j38KJ2K64O1l24N7n9
2308f9m51J05L32J39l72L74%r9J99J28j02j71J71Mj50J99J15k53o3Q4k39q0m60
$$ plain form
2331 -659 -235 -450 -37 -12 118 216 -64 -90 -132 -213 -39 79 11 282 259 38 -171 -215 -79 -258 -287 -195 -146 31
2355 31 5 5 13 -115 -102 60 7 266 316 226 144 0 286 -1 -61 59 -70 -5 71 46 3 -48 -10 -289 -427 239
2381 239 95 -355 -150 -26 373 305 464 222 -207 -92 362 -368 -79 1 19 119 259 -67 -156 -58 -122 -84
2403 -84 -196 67 160 -159 175 469 21 207 374 -82 -134 239 272 54 118 -2 -3 -259 -121 108 -473 -69
2425 -69 -8 -55 -217 370 -42 -207 22 189 -54 140 233 194 -47 -25 282 -243 -56 66 -302 -549 -122 -1
2447 -1 38 59 197 -199 -252 309 288 -250 49 77 221 88 111 -14 -40 74 -61 -325 0 183 310 -268 -180
2470 -180 4 -180 -283 -10 272 96 352 106 371 -27 -87 331 -13 -1 133 -44 -420 -251 -77 -190 22
2491 22 38 -86 -205 -108 -234 55 369 450 413 -111 224 -47 -398 -28 481 203 -134 -194 1 -336 -155 -70
$$ packed form
2331f59M24k15M13K5J30R8k80k6m2q1J74J18o8K71k3k21k09m4J36j79k9R2M9J77
2355C1k6%Qj28J3J62n3K59N0r0q2j44K86k87o0J20j29O5P6k5m3n1L8k79j38O66
2381B39j44m50K05J24L99o8J59k42m29J15M54p30K89Q0J8J00J40l26q9R8o4L8
2403h4j12K63R3l19L34K94m48J86J67m56n2L73L3k18O4j20jk56J38K29n81M04
2425f9O1m7j62N87m12j65K29J67k43J94R3l9k41K2L07n25J87J22l68k47M27J21
2447aL9K1J38l96n3N61k1n38K99K8J44j33K3j25k6J14j35k64L25J83J27n78Q8
2470a80J84j84j03K73K82j76K56k46K65l98o0M18l44J2J34j77l76J69J74j13K12
2491B2J6j24j19R7j26K89L14Q1l7n24L35k71l51L70N09k78l37o0J95l37J81Q5
$$ plain form
2513 -70 -25 124 281 -197 -409 -295 274 -39 -65 334 311 -61 -220 244 -14 -46 -19 37 -351 -102 26 -242
2535 -242 -374 65 238 -72 -4 120 -109 120 42 306 200 150 278 -52 -205 2 221 -120 220 -68 40
2556 40 -192 -223 31 -308 -34 187 -31 -103 -67 -42 16 -117 311 94 -76 150 225 -230 -296 -66 4 -338 -42
2579 -42 249 -251 -78 -149 100 -296 9 417 -26 -113 221 232 -381 394 272 -178 124 203 -119 -372 -360 72
2601 72 -306 38 197 -266 -431 -223 107 -184 -218 413 235 -487 255 137 -720 27 416 318 -364 3 -167
2622 -167 -501 -50 396 334 -199 206 61 -418 -212 455 101 -270 215 386 -169 -5 643 137 -369 412
2642 412 28 -271 -177 396 -153 -654 -6 277 -359 -194 415 -62 -433 57 270 -1 193 431 -65 -375
2662 -375 121 207 -226 -84 268 -196 -578 181 22 -214 -62 228 108 -326 287 180 -327 -319 290 112 -99
$$ packed form
2513g0M5J49J57m78k12J14N69l13k6L99k3l72j59M64k58l2K7N6l88K49J28k68
2535b42j32M39J73l10O8J24k29K29p8K64j06n0J28l30j53K07K19l41L40k88J08
2556D0k32l1K54l39K74K21k18p2L6K5N8j33M28k17j70K26P5m55o6K30P0l42K96
2579d2K91n00J73p1K49l96L05M08m43q7L34J1o13P75j22m50L02P9l22k53J2M32
2601G2l78L44J59m63j65K08L30k91l4O31j78p22P42j18q57P47L89r8o82L67j70
2622a67l34M51M46o2n33M05j45m79K06O67l54l71M85J71n55J64O48n06n06P81
2642D12l84k99R4N73n49n01O48K83o36J65O09m77l71M90K13k71J94K38m96l10
2662c75M96Q6m33J42L52m64l82P59j59k36J52K90j20m34O13j07n07QO09j78k11
$$ plain form
2683 -99 444 135 -553 67 258 -212 -406 578 160 -526 -206 -191 -276 -86 487 244 -287 43 495 -97 -159
2704 -159 364 83 -137 216 160 -341 -191 94 -104 -238 5 524 157 -209 -103 -279 -484 410 311 -51 -125
2725 -125 205 240 -252 234 226 39 -67 27 -37 -115 -116 4 -102 -200 102 -98 -322 130 -52 -166 166 666 163
2748 163 -138 341 328 -54 -221 174 218 -175 109 92 -175 -168 48 -82 -343 172 182 -68 -155 438 192 -74
2770 -74 -1 -94 45 -200 257 211 -236 195 108 -103 29 -163 -253 -248 173 418 68 3 270 -214 -247 126 187 -12
2794 -12 -99 258 72 -146 9 -34 -45 -63 223 -140 -157 57 80 -247 -44 214 -137 -194 -6 -218 -493 71 0
2817 0 -69 294 227 148 -151 67 139 -240 186 -106 93 -98 385 -286 -168 75 58 251 41 500 36 120 81
2840 81 285 -54 143 43 -22 -74 153 295 -250 -123 -148 -74 110 -151 127 -45 59 91 -35 -252 37 -157
$$ packed form
2683i9N43l09o88O20J91m70j94R84m18o86L20J5q5J90N73k43n31L30M52n92o2
2704a59N23k81k20L53n6n01J50K85j98j34K43N19l67l66J06j76k05Q94r9l62p4
2725a25L30L5m92M86qj87j06R4o4p8jJ20j06r8L02k00k24M52j82j14L32N00n03
2748A63l01M79j3l82j67L95M4l93K84j7k67PK16j30k61N15J0k50q7N93k46k66
2770g4P3r3J39k45M57m6m47M31q7k11J32j92r0NM21K45l50o5K67m84l3L73O1j99
2794a2q7L57j86k18J55m3j1j8K86l63j7K14K3l27K03K58l51n7J88k12k75N64p1
2817@o9L63o7p9k99K18P2l79M26k92J99j91M83o71J18K43j7J93k10M59m64Q4l9
2840H1K04l39J97j00o5n2K27J42n45J27k5P4J84k61K78j72J04L2j26k17K89j94
$$ plain form
2862 -157 -73 -68 143 98 63 -253 9 147 -91 -16 8 -13 -223 -120 88 -113 135 190 -71 62 -40 -166 55
2885 55 131 224 158 -67 190 -37 -10 -21 -212 -199 -93 -56 64 112 264 135 -41 -24 -151 160 164 3 126 74
2909 74 348 169 -226 -230 105 -157 259 -185 -48 -227 -62 -235 -41 166 -126 -61 -306 18 190 15 -62 -52
2931 -52 -70 -175 188 -191 -175 -96 -22 104 129 -5 30 8 -73 -99 -262 81 221 -10 -182 178 -157 -86 9 -112
2955 -112 -97 -77 89 -102 61 -194 12 97 98 -79 31 -79 73 -151 168 -23 -60 100 87 -68 46 31 -23
2978 -23 84 187 -6 50 -250 311 148 -367 -231 -263 -102 26 369 342 275 51 -273 -365 141 157 76 -11 -122
3001 -122 151 -77 79 35 59 -80 99 27 -232 -190 48 -42 207 -2 -60 -198 166 -113 -260 98 354 0
3023 0 -193 -180 -127 -208 210 61 51 63 -11 -119 -226 -136 -46 -187 246 346 172 -177 2 -127 -98 -21 -68 203
$$ packed form
2862a57Q4NK11m5l5l16K62J38k38P5K4k1k10J03K08k01K48N5k61J33j02j26K21
2885E5P6R3o6k25K57k27K7j1j91J3J06L7J20M8J52j29j76J7j27L11Mj61J23n2
2909G4K74j79l95mL35k62M16m44J37j79J65j73J94K07k92O5k45L24J72j75p7J0
2931e2j8j05L63l79J6P9P4J26K5j34L5k2q1k6j63L43J40k31j72L60l35P1R5j21
2955a12J5K0J66j91J63k55K06Q5Jj77J10j10J52k24L19j91l7J60j3j55J14j5n4
2978b3J07J03j93N6l00N61j63n15J36l2J61J28L43k7o7k24l24r2N06J6q1q7j11
3001a22K73k28J56m4K4j39J79p2k59M2K38r0K49k09n8j38L64k79j47L58K56l54
3023@j93J3N3q1M18j49j0J2p4j08j07R0R0j41M33J00j74l49J79j29K9P7m7K71
$$ plain form
3047 203 -129 -263 -192 -133 -8 76 103 19 -370 403 -247 -95 30 -83 -18 216 79 -228 -117 97 -170 341
3069 341 15 -80 -9 -398 35 -325 67 42 239 40 218 -138 -93 -249 94 316 306 336 59 76 -217 -241 23
3092 23 -18 266 99 18 -104 -189 -90 67 147 392 217 -238 -189 -186 -106 29 199 40 227 27 -158 -263 -201 -183
3116 -183 73 271 -31 -326 -119 -120 68 174 69 151 -145 -85 -78 -79 -221 61 -70 -31 -13 -3 -39 40 133 322 86
3141 86 -113 10 -296 69 -54 93 -97 91 -190 364 98 -126 -61 18 -116 183 93 -319 233 6 -260
3162 -260 234 -8 -336 -71 50 -338 -218 189 253 -29 183 -207 0 286 -65 26 -165 -83 -37 -13 -27 132
3184 132 101 -38 190 -268 70 232 -34 -103 -331 164 162 -178 216 14 51 97 37 -162 -1 42 -13 120 -142
3207 -142 -59 -88 -201 36 119 134 1 189 148 -310 120 -31 45 -183 169 172 80 233 -63 34 -173 53 -11 56
$$ packed form
3047B03l32j34P1N9J25Q4K7q4l89P73o50J52J25j13O5K34j37l07J11K14k67N11
3069C41l26r5P1l89M33l60L92k5J97j99J78l56M5j56L43K22j0L0k77J7k93k4K64
3092B3m1K84j67q1j22q5R9J57Q0K45j75m55M9LQ0J35J70j59J87k00j85j05O2J8
3116a83K56J98l02k95K07jJ88J06j05Q2k96O0Pjj42K82j31L9J8J0l6P9R3J89k36
3141H6j99J23l06L65j23J47j90J88k81N54k66k24O5P9j34K99r0m12N52k27k66
3162b60M94k42l28K65J21l88J20M07O4k82K12l90K07K86l51R1j91Q2M6K4j4J59
3184A32l1j39K28m58L38J62k66o9k28M95kl40L94k02L7M6o0j99J61M3n5J33k62
3207a42Q3k9j13K37Q3J5j33J88m1m58M30j51P6k28L52Lr2J53k96R7k07K26o4O7
$$ plain form
3231 56 -203 -102 -89 -112 -60 -155 229 35 258 337 58 370 -119 82 234 346 -67 -8 3 196 -65 -29 92
3254 92 -10 -92 1 -261 -131 212 32 89 241 -15 77 -64 140 86 71 -130 44 148 -32 -38 -20 20 -147 68
3278 68 -6 19 -218 377 -40 17 -84 -195 214 16 10 -166 -22 -277 -77 5 -373 -61 -170 -222 -206 -206 34 -101
$$ packed form
3231E6k59J01J3k3N2r5L84j94K23P9k79L12m89K01J52J12m13N9J1J93k61L6J21
3254I2j02q2R3k62J30L43j80N7J52k56R2j41K04n4j5k01J74J04j80oJ8M0j67K15
3278F8p4K5k37N95m17N7j01j11M09j98oj76J44k55K00Q2l78L12j09n2J6%K40j35
$$ [...]
8191I5
##END NTUPLES=NMR FID
##END=
