##TITLE=1H_LR-724-R2-CR16
 200.13MHz, CDCl3
 8 sc
 
 19ns.26.2.2025
##JCAMPDX= 6.0         $$ Bruker NMR JCAMP-DX V2.0
##DATA TYPE= NMR FID
##DATA CLASS= NTUPLES
##ORIGIN= UXNMR, Bruker Analytische Messtechnik GmbH
##OWNER= pz
$$ XWIN-NMR		Version 3.5
$$ Wed Feb 26 15:41:21 2025 Russian Standard Time (UT+4h)  new_Human@DPX200
##.OBSERVE FREQUENCY= 200.1313
##.OBSERVE NUCLEUS= ^1H
##.DELAY= (6, 6)
##.ACQUISITION MODE= SIMULTANEOUS
##.ACQUISITION SCHEME= undefined
##.AVERAGES= 8
##.DIGITISER RES= 18
##SPECTROMETER/DATA SYSTEM= spect
##.PULSE SEQUENCE= zg30
##.SOLVENT NAME= CDCl3
##.SHIFT REFERENCE= (INTERNAL, CDCl3, 0, 14.3821)
##AUDIT TRAIL= $$ (NUMBER, WHEN, WHO, WHERE, WHAT)
$$ ##TITLE= Audit trail, XWIN-NMR		Version 3.5
$$ ##JCAMPDX= 5.01
$$ ##ORIGIN= Bruker BioSpin GmbH
$$ ##OWNER= new_Human
$$ C:/Bruker/XWIN-NMR/data/yarkov/nmr/H-C/1/audita.txt
$$ ##AUDIT TRAIL=  $$ (NUMBER, WHEN, WHO, WHERE, WHAT)
(   1,<2025-02-26 15:38:57.06 +0400>,<new_Human>,<DPX200>,
      <created by zg, POWCHK disabled, PULCHK disabled
       configuration hash MD5:
       00 E9 B6 7A A2 85 ED C7 34 08 36 98 17 FE 4E 26
       data hash MD5: 16K
       72 76 F4 22 09 DF 96 1E 48 B4 EF 17 1E 59 3A 2C>)
$$ ##END=
$$ 
$$ hash MD5
$$ 0D 96 13 58 EB 31 60 B1 5E AF 37 51 7C 90 DB 04
##$RELAX= 
##$RELAX= 
##$RELAX= 
##$RELAX= 
##$RELAX= 
##$RELAX= 
$$ Bruker specific parameters
$$ --------------------------
##$DU= <C:/Bruker/XWIN-NMR>
##$EXPNO= 1
##$NAME= <H-C>
##$PROCNO= 1
##$TYPE= <nmr>
##$USER= <yarkov>
##$AMP= (0..31)
100 100 100 100 100 100 100 100 100 100 100 100 100 100 100 100 100 100 
100 100 100 100 100 100 100 100 100 100 100 100 100 100 
##$AQSEQ= 0
##$AQ_mod= 1
##$AUNM= <au_zg>
##$AUTOPOS= <>
##$BF1= 200.13
##$BF2= 200.13
##$BF3= 200.13
##$BF4= 200.13
##$BF5= 200.13
##$BF6= 200.13
##$BF7= 200.13
##$BF8= 200.13
##$BYTORDA= 1
##$CFDGTYP= 0
##$CFRGTYP= 5
##$CHEMSTR= <none>
##$CNST= (0..31)
1 1 145 1 1 1 1 1 1 1 1 1 1 1 1 1 1 1 1 1 1 1 1 1 1 1 1 1 1 1 1 1 
##$CPDPRG= <>
##$CPDPRG1= <>
##$CPDPRG2= <>
##$CPDPRG3= <>
##$CPDPRG4= <mlev>
##$CPDPRG5= <mlev>
##$CPDPRG6= <mlev>
##$CPDPRG7= <mlev>
##$CPDPRG8= <mlev>
##$CPDPRGB= <>
##$CPDPRGT= <>
##$D= (0..31)
0 0.7 0 0 0 0 0 0 0 0 0 0.03 0 0 0 0 0 0 0 0 0 0 0 0 0 0 0 0 0 0 0 0 
##$DATE= 1740569936
##$DBL= (0..7)
120 120 120 120 120 120 120 120 
##$DBP= (0..7)
150 150 150 150 150 150 150 150 
##$DBP07= 0
##$DBPNAM0= <>
##$DBPNAM1= <>
##$DBPNAM2= <>
##$DBPNAM3= <>
##$DBPNAM4= <>
##$DBPNAM5= <>
##$DBPNAM6= <>
##$DBPNAM7= <>
##$DBPOAL= (0..7)
0.5 0.5 0.5 0.5 0.5 0.5 0.5 0.5 
##$DBPOFFS= (0..7)
0 0 0 0 0 0 0 0 
##$DE= 6
##$DECBNUC= <off>
##$DECIM= 32
##$DECNUC= <off>
##$DECSTAT= 4
##$DIGMOD= 1
##$DIGTYP= 9
##$DL= (0..7)
0 120 120 120 120 120 120 120 
##$DP= (0..7)
150 150 150 150 150 150 150 150 
##$DP07= 0
##$DPNAME0= <>
##$DPNAME1= <>
##$DPNAME2= <>
##$DPNAME3= <>
##$DPNAME4= <>
##$DPNAME5= <>
##$DPNAME6= <>
##$DPNAME7= <>
##$DPOAL= (0..7)
0.5 0.5 0.5 0.5 0.5 0.5 0.5 0.5 
##$DPOFFS= (0..7)
0 0 0 0 0 0 0 0 
##$DQDMODE= 0
$$ [...]
##$SUBNAM0= <"">
##$SUBNAM1= <"">
##$SUBNAM2= <"">
##$SUBNAM3= <"">
##$SUBNAM4= <"">
##$SUBNAM5= <"">
##$SUBNAM6= <"">
##$SUBNAM7= <"">
##$SUBNAM8= <"">
##$SUBNAM9= <"">
##$SW= 18.0517328524113
##$SWIBOX= (0..15)
0 0 2 0 0 0 0 0 0 0 0 0 0 0 0 0 
##$SW_h= 3612.71676300578
##$TD= 16384
##$TD0= 1
##$TE= 0
##$TE2= 300
##$TE3= 300
##$TEG= 300
##$TL= (0..7)
0 120 120 120 120 120 120 120 
##$TP= (0..7)
150 150 150 150 150 150 150 150 
##$TP07= 0
##$TPNAME0= <>
##$TPNAME1= <>
##$TPNAME2= <>
##$TPNAME3= <>
##$TPNAME4= <>
##$TPNAME5= <>
##$TPNAME6= <>
##$TPNAME7= <>
##$TPOAL= (0..7)
0.5 0.5 0.5 0.5 0.5 0.5 0.5 0.5 
##$TPOFFS= (0..7)
0 0 0 0 0 0 0 0 
##$TUNHIN= 0
##$TUNHOUT= 0
##$TUNXOUT= 0
##$USERA1= <user>
##$USERA2= <user>
##$USERA3= <user>
##$USERA4= <user>
##$USERA5= <user>
##$V9= 5
##$VALIST= <valist>
##$VCLIST= <CCCCCCCCCCCCCCC>
##$VD= 0
##$VDLIST= <DDDDDDDDDDDDDDD>
##$VPLIST= <PPPPPPPPPPPPPPP>
##$VTLIST= <TTTTTTTTTTTTTTT>
##$WBST= 1024
##$WBSW= 4
##$XGAIN= (0..3)
0 0 0 0 
##$XL= 0
##$YL= 0
##$YMAX_a= 1085050
##$YMIN_a= -1145690
##$ZGOPTNS= <>
##$ZL1= 120
##$ZL2= 120
##$ZL3= 120
##$ZL4= 120
##$ABSF1= 10
##$ABSF2= 0
##$ABSG= 5
##$ABSL= 3
##$ALPHA= 0
##$AQORDER= 0
##$ASSFAC= 0
##$ASSFACI= 0
##$ASSFACX= 0
##$ASSWID= 0
##$AUNMP= <proc_1d>
##$AZFE= 0.1
##$AZFW= 0.1
##$BCFW= 1
##$BC_mod= 2
##$BYTORDP= 1
##$COROFFS= 0
##$CY= -3
##$DATMOD= 1
##$DC= 2
##$DFILT= <>
##$DTYPP= 0
##$F1P= 0
##$F2P= 0
##$FCOR= 0.5
##$FTSIZE= 0
##$FT_mod= 4
##$GAMMA= 1
##$GB= 0.15
##$INTBC= 1
##$INTSCL= 1
##$ISEN= 128
##$LB= 0.25
##$LEV0= 0
##$LPBIN= 0
##$MAXI= 10000
##$MC2= 0
##$MEAN= 0
##$ME_mod= 0
##$MI= 1.114404
##$NCOEF= 0
##$NC_proc= 0
##$NLEV= 6
##$NOISF1= 3.799351
##$NOISF2= 2.8
##$NSP= 1
##$NTH_PI= 0
##$NZP= 0
##$OFFSET= 14.38212
##$PC= 1
##$PHC0= -1184.745
##$PHC1= 9.192253
##$PH_mod= 1
##$PKNL= yes
##$PPARMOD= 0
##$PSCAL= 0
##$PSIGN= 0
##$REVERSE= no
##$SF= 200.129724274929
##$SI= 16384
##$SIGF1= 3
##$SIGF2= 2
##$SINO= 400
##$SIOLD= 16384
##$SREGLST= <1H.CDCl3>
##$SSB= 0
##$STSI= 0
##$STSR= 0
##$SW_p= 3205.1282051282
##$SYMM= 0
##$S_DEV= 0
##$TDeff= 0
##$TDoff= 0
##$TI= <>
##$TILT= no
##$TM1= 0
##$TM2= 0
##$TOPLEV= 0
##$USERP1= <user>
##$USERP2= <user>
##$USERP3= <user>
##$USERP4= <user>
##$USERP5= <user>
##$WDW= 1
##$XDIM= 8192
##$YMAX_p= 0
##$YMIN_p= 0
$$ End of Bruker specific parameters
$$ ---------------------------------
##NTUPLES= NMR FID
##VAR_NAME=  TIME,          FID/REAL,        FID/IMAG
##SYMBOL=    X,             R,               I
##VAR_TYPE=  INDEPENDENT,   DEPENDENT,       DEPENDENT
##VAR_FORM=  AFFN,          ASDF,            ASDF
##VAR_DIM=   8192,          8192,            8192
##UNITS=     SECONDS,       ARBITRARY UNITS, ARBITRARY UNITS
##FACTOR=    0.0002768,     1,               1
##FIRST=     0,             0,               0
##LAST=      2.2672688,     0,               0
##MIN=       0,             -1145690,        0
##MAX=       2.2672688,     1085050,         0
$$ Real data points
##PAGE= N=1
##DATA TABLE= (X++(R..R)), XYDATA
0@%%%%%%Qq%%%qJ2mQj6K0k5K4k7M0m8M8n3O5q0R2j00J12j28J46j65J83k04K30
35A22k59K88l16L50l89M31m74N18n71O31o93P59q33R16j010J111j223J351j497
54g88J668j862K085k354K684l090L600m263N160o426Q308j1320J6689k7971N9950
69D2070l04930q82830R35010N64616p42438O28426Q45126j117422p65180Q99467
79A01915n9123p02591R67473O75241j298668l84730J141012k64798q95320Q28596
89A09007N82837r97449m5520R05995n47984o85265Q74712K29127r26298M43307
99e7531R57239q53667p89021Q13078J19309p82974O05836Q61359p77994n30275
109d34641O13719k96927o68861Q84906P15332q72168k48462P41101m45800p41470
$$ y = [0, 0, 0, 0, 0, 0, 0, 8, 0, 0, 0, 0, -8, 4, 0, 8, -8, 12, -13, 11, -16, 24, -24, 24, -29, 36, -44, 48, -52, 60, -68, 78, -87, 96, -108, 122, -137, 151, -165, 185, -204, 227, -247, 271, -300, 331, -362, 397, -436, 480, -530, 581, -642, 709, -788, 880, -982, 1103, -1251, 1433, -1657, 1943, -2320, 2840, -3586, 4722, -6598, 10091, -17880, 42070, -262860, -1145690, -210680, 353936, -388502, 239924, 1085050, -32372, -797552, 101915, 42792, -659799, 307674, 982915, -315753, -700483, 440529, 175731, -719589, 109007, 691844, -305605, -351125, 554870, 6886, -678379, 196333, 425460, -500838, -57531, 899708, 46041, -742980, 70098, 189407, -593567, 12269, 873628, 95634, -434641, 179078, -117849, -786710, 98196, 813528, -58640, -307102, 433999, -11801, -753271]
119g53271P79010N59536p02329J628N83384n88447n09196P99563K17830p21546
129c33838L01847O21306p02182m97145P15995J12415n57387M18459M75589o57176
139a02117k67173N80577j88039m85935N80986L98842o44828j01223N50243l01412
149A9921m65603M99949K43010n18176J02269M72589l65118l18488M71302K7589
159A69244m92713K68608M47835m13617k55265M32288m6733m00212L10311L30173
169C49919l88644j32222L22574k04171k97542M22717K56226l97992m1265K99547
179A89147k47311k56438L66032J53098l04673Q1380K36000k71875j51304L31790
189A25846P666l02496J39932K05700k45143o9479K81299o8816k45832J66020J36456
$$ y = [-753271, 25739, 585275, -117054, -115426, 467958, -120489, -629685, 169878, 387708, -333838, -31991, 589315, -112867, -610012, 105983, 218398, -338989, 79470, 555059, -102117, -369290, 211287, 23248, -462687, 118299, 517141, -127687, -228910, 321333, 19921, -445682, 54267, 297277, -220899, -118630, 353959, -11159, -329647, 141655, 169244, -323469, -54861, 392974, -20643, -275908, 156380, 109647, -290565, 19746, 349919, -38725, -170947, 151627, -52544, -350086, 72631, 328857, -69135, -110400, 189147, -58164, -314602, 51430, 204528, -100145, -18765, 217235, -54640, -205944, 125846, 133512, -168984, -29052, 176648, -68495, -137974, 143325, 74509, -171323, -5303, 131153]
200A31153k23206l705K25040j12148j69305J87693Q2579j84529N0916J58931j64515
211b1096j27246J84674M1230j49001Q2051J19752j56275q0626J39955j8005j13798
222i8385J05153Q2962j29674j3722J24624n6015r3471J03296M3023j17775J7006
233c2978J08773n8025o7509P8085J0434q3007L2652N3322p3731k0894Q5820j6047
245A6895p1675N4438N5220o5160k7509N1877r920k8111M5317J4083m5851J4749
257D353L4809m6428l2381M8275J2362m2870O998K9796j8855j1796K1076r534j8502
270b2697K3117J2499k3682O738K8350j2835k1073J6509J0536j7080k980R135p911
283a374m672R264n891r033J0954L240j6574j001J7314K447r030K411N936K59J312
$$ y = [131153, -92053, -95758, 129282, 17134, -152171, 35522, 118101, -66428, -15512, 143419, -21096, -148342, 36332, 77562, -71439, 10612, 130364, -25911, -106537, 33418, 15413, -98385, 6768, 89730, -39944, -53666, 70958, 14943, -78528, 24768, 67791, -49984, -32978, 75795, 17770, -49739, 28346, 38780, -44227, -11575, 41747, -31984, -52878, 32942, 16895, -54780, -342, 54878, -10282, -37791, 14086, 4166, -23945, 21372, 35455, -10396, 4353, 39162, -7266, -39647, 8628, 20990, -21880, -14882, 14914, -3941, -15737, 5339, -4195, -22697, 420, 12919, -10763, -4025, 24325, 11490, -9583, 6926, 17462, 382, -2598, 6537, -1374, -6046, 3218, -2673, -11706, -752, 2488, -14086, -15087, 2227, 4674, -4356, -1945, 3991, 4250, 5562]
298E562p2l598M487O752p351j0477L094N065n803n442J843L649P23j499m385n7
314g509N169O34l337K956Q875K549k123m66K31k178m343k426k56L280K605k520
330A141l782O81j031n570l502L077M542K829L809L908R19q86p21m579m335L349
346a51O454Lj758K623j922p164k840l074o252K560R860p21l551J0735Q126j0395
362B533q450K843j561l22J1817M907l841P142K279k1824j3642J4257L093j4487
376a5256O381J6913m923n068P989q516j2906J2016M146j5911J3069L1114j2352
389A6696k3613J5766R467k4567m779J3856j3319n966K4757Q76j7272K1870J0279
402B4051m7769k0757L9182J0484j7320K6593K2649l0119j2250J5916k2739j4423
$$ y = [5562, 5490, 1892, 6379, 13131, 5780, -4697, -1603, 3462, -2341, -7783, -5940, -2291, -1568, -3067, -7452, -7509, -2340, -1706, -5043, -2087, 6788, 9337, 7214, 6748, 6979, 4801, 458, -1968, -2224, 1056, 3661, 1141, -2641, -1960, -2991, -8561, -12063, -8986, -4444, -1615, 2194, 6102, 7021, 6135, 5414, 835, -3500, -151, 6303, 6306, 4548, 7171, 5249, -1915, -4755, -7829, -14081, -11521, -1661, -2382, -5933, 4802, 12928, 2533, -5917, -3074, -4635, -4957, 6860, 11767, 7926, 15068, 17347, -4477, -18119, -3862, -769, -15256, -8875, 8038, 3115, -1953, 6036, -2480, -15386, -3370, 776, -15135, -2066, 29048, 16696, -6917, 8849, 18316, -6251, -11030, 2826, -10493, -16459, 8298, 9174, -8098, 13772, 24051, -23718, -44475, -5293, 5191, -12129, 14464, 37113, 6994, -5256, 10660, -12079, -26502]
414b6502M2350R177m3660J0760M1005k9615l3122L3425P554l6610J3147K6169
426A4078l1982l997M9774p279l9072L2800K1262n9132j5456N3077j837k5670M0378
439B6944J4534n6513o351L2742l4161k2366O0860J3971n2192J9314M4859m7363
451e722l5706M6667M299l5870M0183L6014n5561j8340M7756k0603m0170N4749
463A7696L0790p0106k0866M5450j4325j3546O5082J0310p6052p235L6315l4104
475c0591n995Q1028J4077o4529K248K4682m5375o884N7444j3566m8271M0382L5803
488D0453m8113j1228L9264k9247m1385M5302L2057l1504P635K6697m4143k4897
500c9109N9621K1792m4735j097J4416m1812j0018O0233J9925k6222M287j0237
$$ y = [-26502, 15848, 25025, -18635, -7875, 33130, 3515, -29607, 3818, 11372, -25238, -12091, 14078, -17904, -21901, 27873, 20594, -18478, 14322, 35584, -23548, -39004, 14073, 12236, -13434, 26944, 41478, -15035, -21386, 11356, -22805, -45171, 15689, 29660, -22532, -3218, 41641, -5722, -41428, 5239, 9538, -26332, 13851, 49865, -5696, -24036, 23720, 3117, -37053, 17696, 48486, -21620, -42486, 2964, -11361, -24907, 40175, 50485, -25567, -32802, 3513, -30591, -36586, 44442, 58519, -6010, -3762, 20920, -24455, -31339, 26105, 12539, -35732, 4650, 40453, -7660, -18888, 20376, -8871, -50256, -4954, 27103, -4401, 3234, 29931, -14212, -39109, 20512, 42304, -2431, -3528, 10888, -30924, -40942, 19291, 39216, 12994, 17281, 7044]
512G044n4689l082N1674O971j1120L2333P937m4338j2711J8842j2187o652L0581
525A0603J2330j1651P366n537l7529n008L5005Q740j2976J796p001k1077L688
538b1251K2866J4281J2073l425l6621k6450J7521K2054R394J5811L557k0583j1477
551b250l626j6955Q99K3556j391q228K8434J4422l6735k3849O056j0231Q410N2546
565C1058J5693l7796j1545r53l3422J2975O7830J871n4305m285M150l5516K1622
578b2623P1969p840m9232O169j2801n1452L6939P8783k1923l6046L9262q955o7398
591d5148K2796N1618m0329j6144O5055p573n6898L6696K5996p8848j3773Q0809
603B4257o544m5045N3070J6057q6055K419P8497k6199l6020O6252l362r7154K2207
$$ y = [7044, -47645, -50727, 947, 7918, -3202, 29131, 37068, -7270, -19981, -1139, -13326, -19978, 10603, 22933, 11282, 18648, 13111, -24418, -29426, 5579, 14319, 1343, 3139, -3862, -24939, -21251, 1615, 15896, 27969, 24544, -12077, -38527, -21006, 1048, 10442, 26253, 29810, 9227, -2250, -5876, -22831, -21932, 1624, 233, -7995, 20439, 34861, -1874, -25723, -19667, -29898, -21488, 31058, 46751, 8955, -2590, -3543, -36965, -23990, 43840, 45711, -8594, -12879, -8729, -44245, -22623, 49346, 41506, -7726, -1557, -14358, -65810, -28871, 49912, 27989, -8057, 31205, 22250, -45148, -22352, 29266, -11063, -27207, 37848, 30275, -26623, 10073, 36069, -42779, -56552, 24257, 17713, -27332, 25738, 41795, -44260, -41841, 36656, 10457, -25563, 40689, 37327, -59827, -37620]
616c7620Q1661l7717k3136P4926k4068j03611L0399O3818n2360J777R4936l0663
628C8342r1881M6473L8152q0375J0690J00387l5811o8735O8579K1231r3680J7779
640b8849Q2361n7540m8062Q7265L861r6091L6153P4985p0085l2216R2804j2814
652C1772r0899M8190N5897p5750k399J00137l1827q5490N7005L2158r0397J1771
664c9832R9355l8252o2742O7953R184r5526K4487Q3274n4138l8870Q5610k312
676C8191r1133L8879O7227o8540k4358Q6629j7908q0421N0240M7399p4566k177
688c0538Q3462l7140p1076N9734K9215p8825J5061Q2652m0886n2531O2360Q980
700C0468p5192K7449O5363n2162l1317P1637m596p3409L3018M9811n7610k0058
$$ y = [-37620, 44041, 6324, -16812, 58114, 34046, -69565, -39166, 24652, -27708, -25931, 69005, 38342, -53539, -7066, 31086, -49289, -38599, 61788, 25977, -42758, 25821, 47052, -46628, -28849, 53512, -4028, -52090, 35175, 39036, -57055, -20902, 54083, -16002, -48218, 44586, 31772, -59127, -10937, 44960, -30790, -33189, 66948, 35121, -50369, 6636, 38794, -51603, -39832, 59523, 21271, -41471, 26482, 35666, -59860, -35373, 47901, -6237, -45107, 40503, 38191, -52942, -14063, 53164, -15376, -39734, 46895, 28987, -51434, -1194, 46205, -28361, -30538, 52924, 15784, -55292, 4442, 33657, -45168, -30107, 52545, 11659, -40872, 21488, 30468, -44724, -17275, 48088, -4074, -35391, 36246, 31650, -41759, -8741, 41070, -16540, -36598]
712c6598O5608j2865n5524M1357L0877n9816p92O4291k4531m8154M5854K0677
724C0384n6564Q457N5289k8187l3961M1673J697n1703K0941M4128l7028k2086
736b6960M5636m572m6475K4330L4317l4516j0969L8718j0687l1772K9644J8804
748B5498l8369o48L7144j7318k7937K8554J1812l3777K308K6867j6704j4544K6195
761I081O67k8193J1224K3347j8486r798K3565j279k1809J1143J4590j5710m033
774e691J7265p648j7191J2603R552j5473n69J4133p078j0906J0664M676j1909
787g572L922J1620o752n781J0726J991j0480J453O098o311k251P145p65o535L572
802H0K605p872k047O072M2m208L814N058j419n26J827k916j896K391R5k420L688
$$ y = [-36598, 29010, 16145, -39379, 1978, 32855, -26961, -27753, 36538, 12007, -36147, 9707, 30384, -26180, -17723, 37566, 9379, -24582, 17091, 18788, -32915, -11974, 32154, -4874, -26960, 18676, 14104, -32371, -8041, 26276, -8240, -19209, 19509, 8822, -22950, 6694, 25498, -12871, -13519, 23625, 6307, -21630, 6924, 18736, -15041, -12733, 14134, -2570, -17114, 9081, 9748, -18445, -7221, 16126, -2360, -12158, 11407, 10128, -11681, -538, 14052, -1658, -5691, 11574, 3926, -13265, -662, 8890, -6583, -7152, 6981, -97, -11003, -339, 4337, -7572, -3650, 7970, 1218, -4563, 6163, 8154, -2326, -873, 5225, -1086, -3337, 3808, 3043, -3492, 80, 2685, -5187, -7234, -1162, -1120, -5328, -1514, 3544, 2125, 1599, 3426, 510, -1386, 1005, 1100, -1320, 2368]
819B368L970k621l720Q2r29l529j294Q81J446L188K729j124q60J240j069m300
835c542q9L784K414L44K035P42j728j677l337m505o06L389M99J57M382K658m061
852H59l496R60j835k060L661L621P03L411L269n092m407J952k364p190L180P678
868B850k195j911O287j370q224J70J750n499K301J0852j45m889P311K617j2151
883b246l347Q851m062o442R875N426q293J451O152j1385q364J0539P58r788R694
898a181J3948j0738o826J2271k385j4486O836Q877j1295J380J6698n683j2888
911e472J1644J421k2361j23K0037o041r102J8703M434j9875K871J1819j6070n332
925a3447K2644j028j7849J5334J5081k2605r095J9992p390j9626J6058J2172j8256
$$ y = [2368, 6338, 3717, -3, 79, -850, -4379, -5673, -4792, -3346, -158, 2571, 1447, 587, 1827, 758, -3542, -3631, 153, 2567, 2911, 4946, 5688, 3960, 2283, -1054, -5559, -6165, -2776, -2277, -2120, 2262, 4920, 859, -2637, -1677, -3512, -5572, -1911, 1710, 2413, 5824, 9093, 4001, -406, 1546, -818, -8008, -4828, 2850, 655, -1256, 5031, 3661, -4563, -4393, -2643, -8142, -5841, 5011, 4866, -23, 7288, 9905, -2246, -5593, 3258, -804, -7246, 2629, 8055, -238, 1213, 7365, -4020, -12384, -1845, -1087, -10875, -1181, 12767, 2029, -4797, 7474, 5089, -9397, -2561, 6316, -4979, -3599, 13099, 7416, -5472, 6172, 7593, -14768, -14891, 5146, -895, -9997, 8706, 13140, -6735, -3864, 7955, -8115, -13447, 9197, 8169, -9680, 5654, 20735, -1870, -10965, 9027, 1637, -17989, -1931, 10241, -8015]
938h015L351K1167j5214j6408K1328J647k8036R039K7447j3577j0639K5098q75
951A6313k8348P283J3722k2200o98L0890q413k3306K1450J1796l3702l457K9166
964A0496j1369j8154K6442R666k7203Q087K2066k4711j2587L3399l271l5232J6485
977e886K5987k5478o649L3759j0316l3205J6479J1259k8557J1246M0141j8069
989A0711k7323K7147L622l9460J1293L7393k0175j7612L1665k834l5501J8566
1001b508K4458l4070q530L8669j1375l3724K9002K1374l7179q87L8436j8579k8990
1014b3903L1010Q365l8131J4008M0434k5936k1204L4568q109m7510K0866L8935
1026B3393k7564p739M1306j6829m6693K4793K5224l2679O287M4595k5223l8118
$$ y = [-8015, -4664, 16503, 1289, -15119, 6209, 7856, -20180, -11141, 16306, 2729, -7910, 17188, 16313, -12035, -4752, 8970, -13230, -13928, 16962, 8549, -14757, 6693, 18489, -15213, -18670, 10496, -873, -19027, 7415, 17081, -10122, -2035, 20031, -4680, -17267, 16132, 12861, -22371, -5886, 20101, -5377, -12026, 21733, 11417, -21788, -5309, 5950, -22607, -11361, 28780, 10711, -16612, 10535, 14157, -25303, -14010, 23383, 3208, -14404, 17261, 14427, -21074, -2508, 21950, -12120, -20650, 18019, 6644, -27080, 1922, 23296, -13883, -14770, 23666, 5087, -23903, 7107, 15472, -22659, -8651, 31783, 5847, -15357, 19211, 11102, -36408, -15542, 23393, -4171, -11910, 29396, 12567, -34126, -9333, 15891, -16788, -10501, 34094, 8871, -29247]
1038b9247L5091J4424m0987J4353M2464l4084l3584L8266O020l8205K3790L5964
1050C4265l7938j9384L8857j2785m1240L6363L4316m0646n912M5852j9817m4168
1062c2237L0143K0614l8163J1027M4314k9472l2735L8585K252m8636K1243M7980
1074C4915l3561k7819L9938k291m1579K7670L5806l7365j1058L9429k1600m2744
1086d0259M2386L3331m3074k886M1722k8434m2665L6309K0314l4857J5891L7739
1098C5517l7473k9084M2064K233m3833K5679M2214l7605k4282M0790k356l8326
1110b4462K5174K5795l8705n431M0363j9162l5972L7720K2534m4499p12M2962
1122B5605j9676l4452L0976J2729l3114J5392L5373l0718k4210L5167l023m1003
$$ y = [-29247, 5844, 20268, -20719, -6366, 36098, 2014, -31570, 6696, 12716, -25489, -1699, 34265, -3673, -23057, 15800, 3015, -38225, -1862, 32454, -8192, -14104, 31748, 11931, -32237, -2094, 18520, -19643, -8616, 35698, 6226, -26509, 12076, 14328, -34308, -13065, 34915, 1354, -26465, 13473, 11182, -30397, -2727, 33079, -4286, -15344, 24085, 2485, -40259, 2127, 35458, -7616, -10502, 31220, 2786, -39879, -3570, 16744, -18113, -2222, 35517, -1956, -31040, 11024, 13257, -30576, -4897, 37317, -288, -24570, 16220, 13864, -24462, 712, 26507, -12198, -17629, 22734, 3572, -32400, 5320, 27854, -16645, -17357, 25605, 5929, -28523, 2453, 15182, -17932, -2540, 32833, 2115, -22095, 13072, 10049, -30954]
1134c0954K4509M0188l1125k1918L1314o729l2451K4241K5591l0763n044L2228
1146A9087j8379k7853L4788K0179l8824l646L3731j5658k4615K7906J1055l0090
1158a2319N368K3503k2233j2259L2980k446l6580J3908K9746k0730j3010K7932
1170A3860k126k8209J1032J7573j7869J143K4717j5256k5731K1212J5176k5028
1182i506j351K5827r993k2003J5239J0575j6646M623J5927j5996j0144K2943K258
1195A1753k3075P514J9065j5978j2385J9681L611j6492M116P786j3059j157J7761
1208I141n415j4568J2134Q634j7990k492J9256q26j2583N233M803r991K104J0476
1222G916p291n667J0691J46j5620K678J3766m922q259P554K927q343J490N519
$$ y = [-30954, -6445, 33743, 2618, -19300, 12014, 5285, -27166, -2925, 22666, -8097, -13141, 19087, 708, -27145, 7643, 27822, -11002, -14648, 19083, 3425, -21190, 6716, 17771, -12319, -6951, 16552, -5681, -17940, 15040, 12594, -23986, -10078, 19668, -1062, -14072, 13860, 11734, -16475, -5443, 12130, -5739, -4596, 20121, 4865, -20866, 346, 15522, -9506, -10857, 14970, 4977, -17026, -1787, 8788, -7858, -3235, 12692, -3304, -13448, 9495, 11753, -11322, -3808, 15257, -721, -13106, 6575, 10186, -6306, -2190, 5596, -7463, -8620, 9141, 3726, -10842, 1292, 9926, -8064, -10556, 8700, 7874, -4709, 524, 5327, -4664, -2560, 7916, 625, -5042, 5649, 5795, -9825, -7147, 6619, 1697, -6562, 992, 3919, -4424, -2934, 2585]
1236B585m618q68Q633j638q428N138O132p962m153P658N32o411K640L670m383
1251a473j018L969k668l566N120K246o117R25O001j150l967L576K191m043j529
1266a503J910j382l33M133M0l975K65J870l522k505L465K244j475M80J600q20
1282D92j2J432j044k153R96J583j256k87K194N14j949r26m94j107q51J439M47
1299i82Q3J221J214q73m23m9n23r74R54J386M35K17N98k58j843j039m93n97k92
1318b238J415N81K3N73O36j235j086J92K31K71R24J117J037K12l44j367j555j15
1336g28m42l45O37J539L54p01l80n65j072l09J86L04J538J855O20o23K66o64k032
1355e62j107R46M76k0J222J060p28q48q30k903n68K028J011l38K099K453j103
$$ y = [2585, -2033, -2901, 5732, 4094, -4334, 804, 6936, -1026, -5179, 2479, 3011, -3400, -760, 2910, -1473, -2491, 1478, -1190, -4756, 364, 2610, -3507, -2582, 3419, 2269, -1698, 1878, 4069, 26, -1503, 407, -975, -1308, 2825, 2865, -1110, -845, 1025, -2497, -5002, -1537, 707, -768, -288, 1312, 492, 480, 1912, 868, -1285, -289, 1294, 38, -249, 1945, 2459, 510, -416, -910, -2017, -2868, -1429, -982, -899, 322, 1536, 663, 240, 191, -332, -1306, -352, 1034, 1469, 1686, 2284, 2026, 183, -856, -1349, -1946, -2238, -823, -242, -219, 354, 990, -245, -1331, -1139, -908, -637, 287, 1404, 2441, 2653, 2309, 942, -613, -728, -1170, -1515, -878, 661, 1015, 314, -66, -631, -1703, -2012, -1826, -1522, 16, 1871, 2491, 1868, 2134, 1470, -562, -1669, -723, -247, -267, 955, 2015, 1287, 439, -391, -3294, -3862, -1834, -823, -1161, 938, 3391, 2288]
1372B288k111Jl26r42O8R86k13K303K002j918l229P57l79l626o02M032K348o03
1390H36P85L49k166J61j07k616l06M990J576l587J671L763k998n331K56R04j257
1407c077K033K591j716P61L107l642n460L927M048m820j815O661K080l093J311
1422B896p0m246m29J865l864o44Q878J980q096j073N913l997n725M118L276k051
1438a269K542L206m657l28N904m060q623N089P464n044l326P060N72p062O83K312
1454D63m924J028O696m180m663R185M348r628j237P531m197p461N787N561m136
1469A73K931L521p840m736P256q57q910O042J0003o972n679Q197O4p939K690N012
1485B956n866N20R406m111p853P889M421j1081j249J0084l967q558N910M404n553
$$ y = [2288, 177, 178, -148, -1090, -1022, -36, -249, 2054, 4056, 2138, -1091, -334, -713, -4339, -4941, -909, 1439, 836, 1621, 1970, -196, -35, -142, -2758, -3064, 1926, 3502, -85, 1586, 5349, 2351, -2980, -2724, -1820, -3077, -1044, 1547, -169, 592, 3699, 57, -5403, -1476, 2572, -2248, -4063, 2598, 4678, 1585, 2896, 2826, -1420, -1849, 16, -3848, -4492, 4386, 6366, -1730, -2803, 3110, -887, -6612, -2494, 782, -1269, 1273, 4479, -178, -506, 5398, 1338, -7285, -2196, 5268, 224, -3102, 3958, 4530, -2532, -1849, 463, -4461, -3433, 3263, -917, -5580, 3605, 7953, -1675, -2912, 4619, 422, -7039, -1252, 4309, 173, 3104, 6625, -1215, -5951, 1305, 448, -8462, -2420, 7583, 611, -5068, 3129, 3193, -4746, -2056, 2956, -2910, -2390, 7016, 2905, -4948, 2941, 7362, -3719, -4968, 5116, 1149, -7409, -1499, 2905, -2648]
1500b648L188P035q082o936P315N60q007P897J1291p063q049N153r38p815N574
1515a525P637o178k008P287m823q724P986O078q884j823Q672k749o626O779M057
1530E156p185J585P419o541o075P012R63q457M792R728m832o075L964l548q478
1545a0572O403R467k910n39N185o842j0157N778Q063k859Q17N355o206q066M980
1560b103M586l238L167M075q735o409O146L268k613M132M314o507m089L644j145
1575a507k634N851L683m524l55M024l347o167K264K316j461L194M285m788m471
1590c637K041q37k645O333N458m375m012M58j742k49O564L071l784j891j061n541
1606e849m17P837L901l236q01j065n328r54M988J654P52L448j756o475J98M415
$$ y = [-2648, 540, 7575, -507, -7443, -128, 432, -7575, 322, 11613, 4550, -3499, 1654, 716, -7099, -1525, 6112, -66, -2074, 5213, 390, -8334, -348, 5730, -3154, -4977, 3695, 946, -5680, 1099, 5156, -2029, -444, 6975, 434, -5641, 1371, 2334, -6123, -1331, 8397, 3565, -2510, 1454, -2094, -10572, -4169, 5298, 2388, 1849, 7034, 192, -9965, -4187, 3876, 1017, 1834, 7189, 983, -7083, -2103, 2483, -755, 2412, 6487, -2248, -8657, -2511, 757, -1856, 2276, 6590, 83, -4006, -362, -1507, -4141, 1710, 5393, 869, 514, 4538, 1191, -4976, -2712, -396, -1857, 1337, 5622, 834, -3637, -1596, -2433, -5078, 1255, 6713, 2338, -1674, -1216, -2958, -3207, 3357, 6428, 2644, 753, -308, -5849, -6266, 1571, 5472, 2236, 1435, 370, -4958, -5912, -924, 730, 1482, 4930, 3174, -3301, -3103, 1312]
1622A312j701j223N055K85m135k34N63k725J138M097k490k437M261Q06o278k58
1638c964N513l65j486L255o35m252J083J811l239J588P039k568p319J758K198
1653D17m095Q67O286n64l611J284j758m596M058O838l382l381M548r27o644K500
1669b160O031k118k297K774k175l727L745K411n607J61O438k527n121M890K903
1684C621n278q74M270j398r65L939j201n590K568N293m479k717N489k76p280J665
1700c213M559j743J69L883l322m985M542K055m388R73O347k720n067L586K065
1715B741l769J47K905l390j847N164J15m607J967L404m622k652N291J025l833
1730a961J895K671k992J26L642k161l960L063J661m176K60N398j071m025J544
$$ y = [1312, -389, -1612, 3443, 3728, -407, -641, -78, -2803, -1665, 2432, -58, -2495, 1766, 2572, -3706, -3964, 1549, 1184, -302, 2953, 2318, -1934, -851, 960, -2279, -691, 6348, 3780, -3539, -1781, 417, -3678, -2811, 3475, 2911, -700, 584, -1174, -5770, -1712, 5126, 1744, -1637, 2911, 1984, -4660, -2160, 3871, 1753, -544, 2230, 55, -3672, 73, 2484, -3123, -2962, 3476, 949, -4172, 718, 3621, -1657, -2531, 1739, 341, -624, 3315, 2114, -3476, -908, 4385, -94, -2811, 2678, 2402, -4878, -3213, 1346, -397, -228, 3655, 333, -4652, -110, 1945, -2443, -1470, 4877, 2157, -2910, 676, 2741, -1028, -881, 2024, -1366, -3213, 1951, 2066, -2541, -574, 2830, -1792, -4444, 847, 1872, -1961, -66, 2605, -387, -261, 3381, 1220, -2740, 323, 1984, -2192, -1932, 3466, 2395, -1630, -86]
1745h6J36k746M96L340j728r09M018m81l974J561L074k764k202K560R74j647J532
1762A154J213l043p09K542j980k770L239J957k628n5L078q62k548J686K57j930
1778a399Q80K394r43j157K355k16l180l33J790j457n77K182Q21j427M38M02j682
1795a109m18J490k31j134K078J358j317l10J064q45j601J84M82n09O14J396r86
1812B06n98O89o42j214J64J241k48L23J224L94n10l07k44q37o69J062L1K15O80
1831I60J41r85o17j6o30o63K93J406J44R3R74mm41o85k10p80O00R67M91kJ41j30
1853A047r11j128J09j99n50J102M78M30K36P5p07o67L77l62k87J221J168n8n55
1872H19L64o56j086l33q1j26M80J048N1n86Q84k64j350q63J694k9p24J371J144
$$ y = [-86, 50, -2696, -2200, 1140, -588, -1497, 2521, 2040, -1934, -373, 2701, -63, -2265, 295, 1269, -378, 1154, 2367, -676, -1385, 1157, -823, -3593, -354, 1603, -1025, -1080, 1998, 1136, -1412, 274, 531, -1399, -519, 1875, 932, -225, 2130, 1914, -1266, -1599, 191, -1266, -1843, 339, 1160, -267, 171, 573, -1109, -1527, -37, -268, -1402, 676, 2034, 717, 407, 1471, 626, -975, -791, -309, -818, -204, 1192, 206, -392, 297, -345, -1559, -1395, -154, -402, -79, 1145, 1539, 1029, 722, 478, -359, -1028, 34, 65, 280, 960, 1101, 116, -501, -517, -1147, -1810, -1517, -111, 33, 126, 1100, 1096, 655, -30, -240, -1020, -420, 547, 1038, 1036, 1177, 1047, 136, -992, -883, -1082, -1632, -530, -52, 378, 614, 689, -18, -685, -308, -670, -957, 264, 1432, 1374, 819, 1183, 527, -559, -892, -973, -1099, -619, 429, 480, -106, 778, 514, -836, -1699, -5, -34, -758, 613, 1757]
1891A757o11q2j09j393o16J127j54j439J643J792j359j343P05l91j575P58R47
1908c43O6Q38J835j299j553J343Q7k351k09K745lj889J345O78j808k73R69j720
1926a542r36K417K59j918K127K814k722j845K000j53k637J596K334j228Q5K167
1942B818k063l323K047Q80k800J53M756j230k664J904J073l589L61L294j785j152
1958a320L437K1m084J618L840l325k364K968Lm354J989L878j833j283L021k091
1974A21m159K391L349l027N39M670j600m659K577J881m390J76M562j538k575L569
1990A887K00m896O61M287k764k258M673K95n084J591M402k448j571M341j597n473
2006c754K178L976l038k88N136j958n742K142K518m183J87N835j171l857L086
$$ y = [1757, 1146, 1064, 955, -438, -1054, 73, -81, -1520, 123, 1915, 556, -787, -82, -473, -2048, -1290, -343, -277, 561, 2396, 1097, -456, 887, 974, -1377, -1586, 1159, 1156, -733, 612, 1290, -518, -791, 178, -1542, -2478, -61, 198, -1720, 407, 3221, 499, -1346, 654, 501, -2136, -540, 1794, 566, 651, 2818, 755, -2568, -521, 359, -2441, -2288, 2468, 1238, -1426, 478, 1551, -2038, -1677, 1617, -168, -1320, 2117, 2138, -1946, -328, 3512, 187, -2177, 791, 794, -3560, -1571, 2307, 474, -809, 2212, 121, -4038, -1647, 1702, -1325, -786, 3884, 2284, -2375, 202, 2083, -2307, -2131, 2431, 893, -1682, 1887, 2087, -2809, -2148, 2139, -625, -2883, 1790, 2085, -2999, -1408, 2994, 546, -1025, 3316, 1719, -3754, -1576, 2400, -638, -926, 4210, 2252, -3490, -1348, 1170, -3013, -2826, 3009, 1838, -2019, 1067]
2021A067J327n003L50M855j676l086M591P96o119P57M859k502k344M870q09n878
2037c945J156M460k390n50N327j787o329K519L619m400O91N755j653m840K557
2052A90K661m684n56M183j868k951M686J620n769j49M153k613k146N490J865n542
2068a430o20L369k754n85N500K41n495N34K050l468j19O161k33n256R11K186l100
2085b108l7M258o79l249L102J072m248P74L460k205l370M190K675l656n81J811
2101A209k631j570L882P12k457J195J497m172j352N224J169k916O98J513l062
2116a061r16L085k1j716K122P76l875k17K979j971k020K856K334k479l72J145
2132F49j478j246K211J181j180J219R77l256j680K651J346j307K75J244j851j687
$$ y = [1067, 2394, -2609, -2259, 2596, 920, -2166, 2425, 3221, -2898, -2141, 2718, 216, -2128, 2742, 1933, -3945, -2789, 1671, -719, -1269, 4058, 2271, -4058, -1539, 2080, -2320, -1629, 4126, 2473, -2367, 190, 2851, -1833, -2389, 1794, -74, -3025, 1661, 3281, -2488, -2637, 1516, -1097, -3243, 2247, 4112, -1430, -2050, 1319, -1435, -2020, 3480, 3721, -1774, -1240, 810, -2658, -2777, 3384, 3151, -2105, -1194, 992, -2108, -2145, 2113, 1434, -1815, 1287, 2359, -1889, -1115, 2345, 140, -3230, 960, 3635, -21, -602, 1209, -1422, -2992, 890, 1602, -855, 340, 1837, -2335, -3687, 1537, 2706, -210, 488, 2001, -1061, -1977, 1108, 1087, -629, 1493, 2269, -1606, -1823, 1156, -815, -2835, 21, 2355, -124, -496, 649, -829, -2075, 136, 1317, 137, 1356, 2333, -923, -2603, 48, 1394, 87, 362, 1606, -245, -1932]
2148a932J030N28p35J620J072k219m20J781j385j119J559K026r94n63R05r32j283
2165a061M06J037k12O60L27k125j173J245J179o35R42R34j340j692L56N09O11
2182c2J029P44n61q14k17j249m21J458R53n85k81J40r6j331J67O88N55N56k86
2201D17m61j68J82M5L06M47N82p49j066m64M32P22L05L60k74m87j093r12Q89P09
2221b78R39L60p0q64l81m7m10K90J270J22m65l20N58n94q29m8N70j24K38K88r53
2242g48N06N73k34k73N83J41p02q29J292J79K78M47j63j124q42K84m98QJ928L07
2262A113j122k89P78j136n11P74P73o04K53P46o21N24K24p65j087Q79K69m47j15
2281c64R52J23j230K09L97n06j12L56k84L23J090M28j122k09L54j233m2Q82K93
$$ y = [-1932, -902, -374, -1109, 511, 1583, -636, -1056, 725, -660, -1779, -220, 1806, 812, 249, 1154, 222, -1061, -655, 382, 170, 830, 1157, -968, -2141, -896, 283, -352, 590, 1524, 184, -1508, -1152, -643, -32, 997, 1741, 1180, 366, 149, -1100, -1521, -63, 890, 305, 24, 164, 68, -1263, -1096, -408, 147, 703, 417, -44, -212, -30, 15, 321, 768, 1350, 601, -465, -929, -497, 225, 530, 890, 616, 129, -964, -1876, -987, -278, 661, 1021, 951, 87, -294, -341, -751, -461, 809, 931, 466, 146, 704, 110, -719, -767, -197, -321, -83, 205, -748, -242, 331, 97, -176, 407, 548, -154, -983, 309, 488, 766, 1213, 1050, -74, -916, -632, -1130, -1122, 806, 1113, -9, -298, 480, -656, -1167, -393, 380, -224, 29, 775, 154, 678, 902, 137, -950, -71, 198, -249, -364, 588, 711, -519, -310, 87, -419, -531, -175, -459, -136, 954, 1382, 260, 51, 405, -828, -870, 12, 305]
2300C05p6M19M2o21j97k23J33r89N61Q17l1j10O19k21n12o9K24k28j46N90J30
2321D17J89M65k98p26o40J25K5m38P72L35j39P1K18m80l91N22k24j11M76O58k24
2342F02j08K00l52q19j01P6K19L53J36n0k72J99k00o98j6O91J02K12M38J80J0
2363H02n31Nn61J84J19J98k55J5N04j57n15j83L19l70j47K22J83L48N25M9n36
2384B18k21J04m02K14M04J13K83J9o51k33rj63k93m2N22J98m4J08K66N9p15K06
2406e9m6K1O60j32m86L38M21m89r00K08M61l91m00Q37M58k71K3l59l93J1K57j82
2428d13N04J125K17j303r5M9r6m56K50N57j95k16Nl10L3Q79l74j234O97N13o51
2449e14o2J032N56p53j62ok65k32N30k35k36J288J74j400m37N40q12j55J109R48
$$ y = [305, 229, 648, 690, 69, -128, -351, -218, -1207, -646, 171, 140, 30, 649, 428, -84, -153, 71, -157, -303, 287, 417, 606, 1071, 773, 47, -593, -468, -443, -881, -109, 226, 87, 158, 376, -104, -495, 27, -197, -308, 168, 826, 602, 494, 694, 342, -477, -578, -502, -283, 70, 206, 156, -116, 83, -117, -815, -831, -140, -38, 174, 612, 792, 802, 271, 276, -285, -101, 18, 216, -39, -24, 480, 323, -192, -375, -56, -426, -573, -351, -168, 180, 705, 754, 218, -3, 101, -301, -87, 317, 430, 713, 732, 81, -152, -161, -324, -617, -659, -137, 61, 17, 125, 391, 450, -265, -59, -105, -84, 576, 444, -42, 296, 717, 228, -672, -464, -3, -394, -794, 43, 501, 230, 253, -106, -499, -488, -231, -413, 91, 1216, 1433, 130, 35, 84, -12, -468, -218, 339, 144, -72, -67, -377, -344, 535, 161, -1073, -376, 137, -514, -576, 456, 1012, 259, 97, 91, -174, -406, 124, -111, -347, 941, 1115, -285, -722, -182, -994, -1149, -40, 908]
2469I08m68o0k3r16n65J558O12j197N91M40r61j378J455N99o17J39M51j192n54
2488a178J172m46j65J616J78j796j31J047l53r45J486J046o76l33L9j375k54J144
2506G6O87q47L11Q33j426j463J452R13n85Q35R1p60p52N20p6m66J444J113j468
2525D32j417J127l45r95Q48J206l58l85l1j026n82J473P61o67N52Q38j598j519
2543a686P84J625m32P9P73k99j744N25r7n9J088R84j276j337J051O7r20L63J469
2562I58R8j032M16j155k21N93R33j64n3Q67q30j998L11J358J34n16J169l10j049
2581d91k60R9L54M08J268n42j272q0M67o50J14J307P34q95l97l19j100K27P32
2600b96N47K4O31k02j439m24Q64N92m06L64P97q12r10K20N03j99R64L75j324p38
$$ y = [908, 440, 380, 357, -559, -1124, 434, 1046, -151, 440, 880, -81, -1459, -4, 595, -22, 117, 568, -624, -1178, -6, -452, -617, 999, 1177, -619, -750, 297, -56, -1001, 485, 1531, 855, 522, 561, -814, -1068, 76, 763, -84, 227, 1060, -366, -1829, -377, 536, -49, 786, 877, 117, -635, -115, -191, -657, 787, 1900, 432, -985, 142, -203, -1198, -350, 856, 498, 113, 82, -944, -1526, -53, 708, 41, 593, 1431, -167, -1686, -902, 723, 291, 370, 1143, 844, -900, -375, -472, -531, 557, 1541, 265, -1072, -21, 46, -874, -511, 958, 1056, 24, 440, -715, -936, -343, 590, 426, 373, 1240, 410, -1588, -1277, 81, 215, -301, 868, 558, -491, -751, -652, -298, 110, 1378, 836, -436, -516, -49, -699, -585, 722, 1456, 561, 164, -155, -1255, -1028, -296, 251, 275, 906, 704, -735, -1159, -295, 297, -109, 255, 1052, 240, -670, -450, 53, -146, 818, 1193, -131, -869]
2620h69N65k00m55J248R91p69j051M47O4q32P69P88m47o8P09k81j385P12L06p36
2640d94j74K026n81j376M30k29p78N45J942j86j397L40k68j335J139J730k19j017
2658I8M3q27r93J220J877o00q32J50k89j573J067J478r33l49J292j42j143Q72
2676D16N51j787n18J756J63q14J078J2j817p54K030J6n06J118m00k176L3J957
2694C58O6k58J144m04k517J59J854j63j68J552n50k255N27J180j108k25J438l06
2712C24j389J140R84j559l0Q70m57o01J304P30j543j75J080n75p31J122L51j527
2730f82m0J005n02k53J320k19j187j33Q35n49m18J623L40j273M02L56j065k01
2748f41J106l74m49J037N76j606l68J059m86l89O96K53o77p4P87l27j06R42m78
$$ y = [-869, -304, -504, -959, 289, 1280, 511, -540, -93, -29, -861, -92, 696, 249, 181, 890, 609, -776, -64, 242, -494, -668, 1358, 777, -599, -169, -398, -1176, -631, 1311, 1125, -272, 68, -200, -1535, -396, 1334, 1115, 98, 141, -686, -1679, -459, 1418, 818, -14, 136, -153, -1726, -659, 819, -114, -463, 829, 687, -456, 416, 967, -820, -1338, 418, 581, -233, 845, 857, -960, -1714, 316, 332, -174, 944, 544, -1632, -1599, 358, 424, 166, 1310, 906, -1611, -1452, 402, 239, 71, 1623, 1073, -1182, -655, 525, -583, -808, 630, 324, -1065, 75, 1059, -500, -530, 340, -117, -718, 586, 1316, -227, -402, 678, 103, -628, 494, 845, -682, -722, 283, -219, -472, 848, 629, -558, -691, 144, -405, -823, 800, 1140, -133, 269, 625, -440, -641, 465, 91, -358, 679, 1255, -351, -719, 340, -146, -535, 161, 414, -263, -337, 450, 123, 17, 959, 481]
2767D81j484N20Q38k57l00J088j44r44k84N20l06o17R04Q7l50O04L11o72j99M59
2787B55m74o79Q16O53o38Q8M24n85k27O30k61n54J40L58j00OL24L58l19l01K78
2808A92n45m0Q57j46r1l5L10o54K30j19k1j91k0N63m86L57o9n19L3J40K07k43
2830b90L59N27j6p35K57P3r8k08M5J21J46J9j29j99K10j65j18k47K13K47j35O1
2852f2N29m20l3o6K4p3K80j03k11L44J7N4l09j67R4n54K55L88j31pM04j11m34
2875b92J64J5K33k56L68J01j89J83L5k38k03j85J79k84M66j52m6L4K76j44m48
2896c83J23K14r0j3J02N13O1m69J38l74k5k35K41P9L29j76J0j79l1R8o51P04k49
2919b63M69K22l91O6k79J60M2j69j5M4O4K48j51p9p2k07O74n24Q3j9j47K20K31
$$ y = [481, -1003, -483, 355, 98, -202, 886, 742, -202, -486, 34, -272, -889, 15, 102, -248, 356, 667, -5, -204, 255, -219, -898, -82, 571, -67, 21, 445, -140, -367, 263, 2, -552, -412, -54, -154, -148, 176, 534, 215, -86, 192, -353, -393, 464, 318, 227, 192, 502, -152, 78, -41, -62, -253, -273, 290, -196, 161, 92, -427, -394, -254, -47, -290, 69, 596, 580, -155, 102, 175, 77, -131, -86, 35, 181, 200, 71, -128, 82, -83, -201, -448, -235, 12, -123, -62, 467, 47, 14, -52, -28, -101, 179, 76, -135, 209, 226, 280, -29, -196, -102, -656, -401, -13, -144, -151, 253, 142, -292, -128, -113, 120, -136, 232, 333, 144, 327, 362, 124, -79, -264, -85, -369, 97, -55, -101, -67, 209, 65, -383, -260, -46, -136, -149, -47, 466, 527, 58, 196, -178, -203, -438, -197, -118, 211, 35, 45, -134, -165, -67, -718, -14, -263, 206, 428, 37, 103, -176, -16, 26, -143, -158, -114, -50, 198, 47, -32, -104, -311, 363, -161, -78, -97, -244, -24, 207]
2942B07j6k41k0K23q8j60K22J61o2r8j6l44j60J98J34m51P55l21M5o1j1J39k70
2965b35P4L89l6j06r1J45o2J36k1n0K42o04J53o2j83N12J94j89l91Q6j75m3L03
2988a4K60M6k75R9o59N72j46K41J5m7j74J35n59K53K12k30L00n8J65l16R7l0o
3011a19P4O40k62j27j4m6l58l1K49L53N1J5m23o92K46M82m3O1J0j79m24K11K13
3034a13O8M21L32p34j54M40o53j65N58P37m18p05M29L4q23Q95J04k52m8O12m19
3055A46q02O46K50k54mM67l03m17K36O8m66M05N11n67k85L59k35l20J45R68k92
3076B56m45N57n81l98r1P63j8K76M95p26p63M83N28n61K38M47n19o23P71J35o56
3097d32O15P22j033o32P54Q4n0J51M50m94l00L26j28o76P53K34r15M62Q20p12
$$ y = [207, 191, -50, -70, 153, 65, -95, 127, 288, 226, 128, 112, -232, -392, -194, -60, -511, 244, -77, -32, -93, -104, 35, -235, -161, 228, 192, 86, -5, 140, 78, 214, 193, 143, 385, -219, -66, -128, -311, 201, 395, 206, -185, -99, -274, -317, -14, 246, 292, 17, 116, -543, 29, -117, 124, 139, 92, -82, 53, -506, -253, -41, -271, 29, -29, 136, -180, -83, -113, -119, -45, 595, 333, 206, 192, 146, -212, -243, 6, 359, 410, 425, 2, -690, -444, 38, -5, 56, 66, -113, -537, -326, -113, -45, 376, 708, -26, -180, 260, -393, -558, 0, 737, 319, -386, 43, 77, -746, 149, 253, 1, -47, 565, 146, -656, -10, 240, -14, -18, 449, 146, -271, -35, 33, -433, -28, 483, -84, -369, -10, -245, -565, -420, 548, 256, -189, 368, -213, -611, -702, 61, 43, 319, 814, 88, -675, -192, 336, -225, 13, 460, -59, -682, 89, 224, -432, 183, 905, -128, -760, -6, 78, 28, 179, 629, 135, -165, 161, 33, -643, 110, 344, -571, -109, 711, -1]
3117al29J54J70l03L46P84n80o30L45O8n05M68P66p45n62Q82m51k55P52O1n26
3138i1k46M46j44n21O59N65q62q0P41n60k08M07L28o31q1J038r09J7K13l36m91
3159g46Q27L45k18o01L74K01m02L71Q33q07k81J20j8n04J052p3n82j60O23n51
3179a97j54N32J85n42Q6M28p06L93L26r8p14L60O53p33J15L36m7n38K78K39l09
3200a07J15J86n28l78P00K53o28P9J95l15R0M21K24j58j0j60j93j51L88J28l06
3221a55K84Ll75L05N4J53l21L6J04l25K55O6r2K4M38j1l41n1k2j81P7K33k82r3
3245b17L96j62l63K75K24k40j35K64j69N96O0n31k05O3J38L01k92J02j23J98o02
3266d22N29k85K4K73j63J3L91m89q9K33j17p9KJ75J08k53K90K98n26j2k9J43J
$$ y = [-1, -330, -176, -6, -309, 37, 821, 241, -389, -44, 24, -481, -13, 753, 8, -554, 328, -123, -378, 374, 435, -91, -337, 109, -35, -556, 103, 668, -194, -274, 467, -93, -301, 106, 434, -197, -278, 760, -149, -132, 81, -255, -746, 81, 426, 208, -393, -19, 182, -220, 151, 984, 177, -104, 16, -2, -506, 546, 473, -109, -269, 354, -197, -351, 181, 366, -176, -90, 338, -368, 25, 351, 253, -461, -101, 552, -181, -66, 270, 223, -315, -37, 202, -107, 8, 194, -334, -712, -12, 241, -387, -308, -113, -428, -338, 83, 307, 149, 139, -21, -214, -365, 23, 151, -155, 129, 132, -243, 62, 116, 269, -52, -16, 88, -237, 18, 84, -8, 16, 454, 443, 102, 51, 29, -152, -75, 158, -124, -217, 179, 17, -346, -71, 153, -87, -222, 42, -127, 469, 529, -2, -207, -144, -6, 295, 3, 105, -18, 180, -422, 107, -178, -154, 119, -44, -31, 360, -129, -218, 15, -102, -181, -179, -4, 104, -149, 141, 439, -87, -99, -128, 15, 16]
3289A6j10l1M43l13K43O4l13J38k23j56K63P0k5j26M42k50j21k7K08l35L20k10
3311c3k26L00R0J17l51J38J22k01MN2L4l5j75lJ07K07J92k85r5L10k1j34j80K90
3335B24j29k29L5j53q6K97K36m58L33j8M8l03J50J85o1j63Q0L61j92n7J1r8j77
3358a64K47l7j21J03L15m10k76M88j14l04J81K77j81k1L57l20o2R5l4j47p6K22
3380A8j90P6%M3J2j44J51K30n23N47l52J73J55k53n9Q8J68k37j46N5P6J90j81
3403a03j51L66m20N61l25Q8J58k07J55J96j1k46j52J48J61k68M50j25n69M75j57
3424B4K46m18L14k57L4q6O6J28k0o2K43R7k97K11j75j08K4kn0LK52k55kJ24r2
3449e8j35J62J36k49J52J00M2k67K87k48P2r3K57m5k35r1J85QN6r3O7j77K3L51
$$ y = [16, -94, -125, 318, 5, 248, 312, -1, 137, -86, -242, 21, 91, 66, -60, 382, 132, 11, -16, 192, -143, 177, -33, -259, 41, 131, 248, -103, 35, 157, -44, -40, 12, 46, 11, -164, -167, -60, 147, 339, 54, -41, 269, 248, 114, -66, 224, 95, -134, -99, -252, -338, -41, 195, -263, 70, 52, 100, -203, -53, 132, 71, -92, -12, 349, 157, 100, 111, 13, -164, 83, 46, -75, 28, 343, -67, -343, 145, 31, -273, -92, 185, 4, -17, 340, 20, -42, 53, 19, -128, -204, 18, -172, -96, -96, -53, -41, -185, -34, 196, -327, 220, -132, 41, 196, -57, -116, -28, 140, -97, -243, -188, -112, 78, -103, -254, 112, -308, 253, -72, 16, 174, -33, 122, 318, 307, 61, -91, 57, 218, -50, 400, 275, -294, 181, 24, 270, -148, 166, -91, -57, -143, -77, 51, 31, -31, 212, 309, 12, 223, 48, -60, -36, -38, -88, -85, 167, -88, -90, 34, -58, -193, -31, 105, -144, 8, 108, 150, -117, 170, -78, -6, -99, 158, 113, -122, -213, -28, -20, 36, -57, 10, -167, -144, 207]
3473B07k76k7J73p3R1j25J11L01l24n1K6k99K94m7J12n08M97l6k34j4O45m86l04
3496c47J70o4M0J34L13l62J76j77j47L93P4r3k21K38r9K3l5L6Q0o6M1Q3k72J13
3520C1J89o9l67J56R5j83mM56m32J44rK40k47N4p6J6M2%J86k82K75j79J58k23
3544b9K65j41j59M48m07k54j22P16j90r0P7j7r5K35K07m09j11r7K07k71K42J53
3566A58Km0J53j96k64L0K28j53K55l10M5K9j79M09m09J98J08rO6j04J40l44j3
3589b00N95m79K4L6L84n87K64o9KN7R7j72k98O45n4m00J6J3L23r3j69J46j97L65
3613B49k49j52M6K73J42k67J24l04K20M7J5r6k11N4K3L1k5L82o12J30K24N5j08
3636il50J28K12J92k88J58n1p0K34l57M65m75K79k16R6J00RLj67P0Q4K03k14j41
$$ y = [207, -69, -96, 77, 4, 95, -30, 81, 382, 58, 7, 33, -266, 28, -19, 93, -415, 82, 46, -188, -202, 443, -43, -347, -177, -241, -201, -67, 246, -116, 60, -117, -264, 129, 203, 110, -111, 127, 28, 51, 16, 52, 132, 66, 107, 190, -82, 31, 220, 151, -216, -60, 35, -148, -152, 304, -128, 16, 7, 247, 0, 54, -22, -6, 36, 36, 222, -60, 215, 36, 194, -29, 236, 95, -64, 384, -23, -277, -399, 317, 127, 37, 114, 97, 2, 237, 444, 35, -76, -173, 34, -237, 5, 158, 160, 120, 273, 77, -187, -157, 71, -82, 173, -137, -92, -63, -242, 167, -242, -44, 64, 55, 121, 17, 157, -187, -200, 395, -84, -60, -24, 360, -227, 37, -32, -30, 27, 124, -48, -346, 299, 245, -155, -139, -126, 197, 104, -65, 81, -116, 249, 0, -152, -106, 167, 309, 42, 166, -138, 82, 129, 144, 48, -163, -109, -86, -55, -80, 302, -310, -180, 44, 99, -9, -359, -231, -19, 173, -115, 43, -8, -78, 156, -201, 264, -211, 68, -148, -52, 48, 57, 60, -107, -37, 47, 250, 36, -105]
3660a05k00L65J43j62k4l2j39J27K67l26RK34m73J47J53J77n8j1M0k23Q1p2J6
3683f6P6J66j07Pq5k06J50k15M21l90J32Mj01K5J57K35k64K12j02Q3q4p1P3j34
3707h4N8J86n4j05J46k31J34m5j42J30n4O6nM7K24r9j15j96m4M7K20J31O8l54
3731g1Q1Q2j70l2K3K19q3N9J1k80K68l8m4l04K73o3K43j53N9k05K60j78p2k4P
3756a32O3q5J10j85J99k21K81k22lJ91P5l61L27k11K71k00K34o4j86J39J01l72
3778b51L60n6L5r1K5n9P8mj84J40kK71j61j83L18p2k40K8P7k81K83L09l09j38
3802a07J30l08J85J28L4o3On6L6j83R7L12k17M8q5L3n1j28k6L18k88L23k49j70
3826b81K35K44k40m1K18Rj09k24N55l57n3noK81J65m22J62m3m54M18o9J72k22
$$ y = [-105, -305, 60, 203, 41, 17, -15, -154, -27, 240, -86, -77, 157, -316, -169, -16, 161, 103, 92, 132, -91, -10, -82, -66, 10, 176, 69, 76, -9, -215, -65, -280, 141, -249, -117, -113, -214, -189, -32, 203, -61, 151, 49, 132, 48, -23, 50, -84, -26, 160, 106, 1, 147, -84, 50, 5, -137, -7, -61, 5, 0, 47, 271, 172, 57, -139, -183, -136, 84, 215, 283, -71, 10, 92, -78, -110, -87, 132, 49, 108, 119, -161, 107, 69, 25, -279, -6, -69, 174, 21, 80, -125, 135, -43, -115, -139, -132, -69, -154, -44, -229, -30, -251, 30, -192, -195, -4, 71, -290, 37, -174, 97, -103, 131, 67, -119, 20, 121, -251, 109, 53, 88, -3, 22, -37, 41, 37, -147, -7, -9, 262, 101, -82, 236, 164, -76, -48, 29, -252, 31, 340, 31, -107, 23, -285, -100, 28, 62, -1, 5, -51, -15, -198, -101, 211, -6, 42, -43, -10, -61, -189, -215, 103, -185, 138, -111, -281, -46, 198, -42, -83, 135, 144, 35, -189, 366, 9, -44, -49, -55, 226, 391, -31, 131, 88, -366, 52, -17, 155, -67]
3849f7j4L94j93J70j68l13N02m12J3K16l12N6J48j77J73j77j48K39j44N62l43
3870EK2K41k66J94k54j3J72L23j85n29J99J36N9j80Q5m9K23n56L54L31m65L54
3892B01n13L15r5M9n1j32L03j4R1l58J76k14J70R1K02O0o09M94k68r6M85l95K82
3915A74m62K28RJ44o4k71L96j6L2k67K19l2o1k17M9J82J00j76J51k13n2J60Q9
3938A02N4q3l20K41M57n01J36j67L00k50j62J4J3P9j0K47k93J90M2o1j18J73o10
3961e27P40j47K35p05M01o9j66J51L61j30k49R4o6q0j3K03j59j87M23l01O4j9
3983a46K9K80p5j88K34j73J0R4J6q8J17K11k43k10J79Ok30K25J0j78l3J81k16
4006a88N8K47Qq9j68L82k06j58K25o2j40J85K28k08j10L24l05L2j34L73l00r9
$$ y = [-67, -81, 313, 120, 290, 122, -191, 311, -101, -88, 128, -184, -128, 20, -157, 16, -161, -309, -70, -214, 348, 5, 27, 268, 2, 196, -58, -71, 101, 424, 239, -290, -91, 45, 104, -76, 9, -40, 183, -373, -19, 312, -153, 201, -312, 3, -92, -43, -94, -226, 77, 63, 154, -204, -28, -242, -72, 19, 221, 281, -328, 166, -102, -198, 287, -108, 174, -288, -60, -51, 93, 29, -242, 154, 138, 170, -97, 122, 90, 29, -188, -139, 43, 143, -33, 118, -95, -147, 13, 102, 156, 73, -247, -6, 451, -50, 86, -81, 219, -31, -193, -179, -166, -87, -97, 150, -143, 47, 89, 28, -90, 83, -527, 213, 66, 301, -404, -3, -72, -238, -87, 274, 144, -105, -11, -77, -157, -170, 33, -126, -313, 110, -191, -127, -146, -117, 163, 88, -100, 134, -39, -29, 65, 81, -7, 110, 321, 78, -132, 47, 53, -177, 48, 58, -120, -153, 28, -188, -130, 117, 125, 36, -132, 250, 44, -114, 111, 49, -91, 94, 322, 114, 4, 328, 23, 55, -79, 294, -6, -105]
4028a05K22j53k45J18J05k70K94L3j43K47l13J97l7pQ9P7oJ11r7p3l15K92j00
4051g9L8K6j79K4N08k17J21k16J71n7l06J49K19k73k45L54N7l01J70K45k64%P2
4074A7P0j42k9Q6qN0J12J46l54J83L7l52J49l2J08l39L07M18p93M06R2k65J73
4097D0r1J72j80j46L44l9j95K39j80k75L33O7j42Q0J90m41O0L96j16k35kN70l08
4120A41l52L01J00k59J11J79k74j32M59k24n53M75L57o43J23J85k6l54M20L39
4140C73m40P8K48J10p38P40l09j07P5L37l27m13L0J62J41P6j41J05k57K28K80
4161B51n53M87J72m20j39O81k21m37K18J93j98n6L30n55j76P64j92l22j73O03
4181B57n4n39L26j87k85J70M02j73j23L05K51o42M68j27mk08K49R0m90M81J42
$$ y = [-105, 117, -36, -281, -163, -58, -328, -34, -1, -144, 103, -210, -13, -50, -57, 32, 109, 103, 214, 117, 44, -271, 21, -79, -41, -15, -194, -170, 338, 121, 242, 26, 197, 140, -166, -17, 202, -71, -316, 38, 95, -206, -36, 209, -55, -55, 17, 87, -55, -84, 2, -6, 44, 156, 302, -52, 131, 168, -184, -35, -67, 41, -298, 9, 427, -366, 40, 132, -133, 40, -51, 121, -59, -205, 139, 100, -95, 144, -36, -311, 22, 89, -53, 27, 217, -224, -164, 232, 116, -119, -121, 449, 141, -211, 90, 190, -69, 42, 221, -53, -185, 274, 50, -503, -28, 329, -314, -191, -6, -32, -386, 34, 373, -67, 11, 259, 369, -369, 371, 62, -45, 30, 367, 40, -373, -343, -181, -40, 36, -105, 0, -257, -29, 251, -302, 185, 357, -63, -202, 479, 258, -179, 39, 232, 34, -22, 308, -247, -423, 341, 149, -173, -346, 257, 203, -336, -10, -197, -482, -312, 90, -83, -206, 99, 350, -292, 176, 49, 45, -163, 86, 176, -314, 167, 309]
4202C09m87%O43n91j03K86K53n65J10M04j88k41L53p8l82L65J0k49q4O8n2j89
4224d08K87M25m23J27J71p5n6k61L44l09J27Q6M2l89L10K28l54J35K16q3m47J82
4246a25J36k12k7P07n99NL00m6l67K3K69J1k43L98j03k99M56Q4m78j36O76m51
4268b1k21M55k04k83Q0M38k84p9L59j97l86L01K34l67K83J90j51m15J70J86k55
4289a67m7R3J69q8J37j67j7NK01R3l5J78j20n14J72r0K49j56j43J02k18M52j5
4312G4l43J49K66j60j9J60Nk57L59J25k48j61J64j01k01L4K20K2k74J58m8r1j19
4335b86K90k4j13K84M5l41L97p7l59J76N3k42J51K44P0k76j67N4J11o1J44J6l33
4358b44J33R9J3P1J08N4p6M7k04J15k68J62m3k20L2M10p3r9L9O4l14M02j10j95
$$ y = [309, -178, -178, 465, -126, -229, 57, 310, -255, -145, 259, 71, -170, 183, 105, -277, 88, 98, -151, -235, -167, -219, -408, -121, 304, -119, 8, 179, 104, 48, -213, 131, -178, -51, 35, 77, -312, -2, 226, -128, 7, 223, 140, -307, -125, 11, -201, -228, 479, -120, -115, 185, 139, -228, -205, 64, 75, -168, 230, 127, -172, 284, 368, -110, -246, 430, -21, -242, 213, 9, -274, -194, 244, -40, -119, 240, 43, -343, -42, 192, -175, 108, 298, 147, -268, -98, 88, -167, -214, -121, 48, -40, 97, -70, -87, -82, 119, 212, 177, 355, 235, -279, -107, -197, 52, -104, -247, -145, -363, 89, 74, -269, -120, 146, -14, -33, 127, 132, -125, 234, 359, 111, -50, 114, 13, -188, -154, 66, 88, -186, -28, -76, -167, -286, 4, -20, -133, 151, 196, -145, 252, 175, -184, -8, 45, -197, -46, 198, 268, -8, -175, -121, -10, -71, 73, 89, -244, -111, -12, 1, 72, 180, 234, 158, 205, 1, 116, -152, 10, -33, -253, -221, 189, 116, 17, 56, 120, -194, 208, 98, -97]
4382i7j00J08J21N2j10L31l51k2J51p4J48l2mj61o2L9L8k26K39J51k61K96j38
4405C6R1K9p7j78J65J67j49j99K46K29k29j88M74k36k42j41K95q0R9q5j88L3j11
4428b39K17j54K78J14j97J64p4p4k62M33k51k51K12J23j0k93L67k67R4j40J52
4449e8pj82J83p6J3m5N71l39q6J18J22l91J39K45m56K54Q5j66J87n94O53k51j59
4472b40K54m1j06O0M59m91K24J66q1j04k31J38k12k54M25r6j92N34k08j03k08
4493c07P23n07k28K40K31n78N01M09l26j82K92jm31K15M92r38R2R7L28m71K89
4514f0K75l98q8M38j89j80N59k69j90j12O27m72k63M92j32l41J35L60k79k0N64
4535D57l47k68M5K18l42n6O31k03m33M52J21o60J26L84j05k28N28j15p57N92N34
$$ y = [-97, -197, -89, 32, 84, -26, 305, -46, -68, 83, 9, 157, 125, 121, -40, -102, -63, -25, -251, -12, 139, -122, 174, 36, 127, 156, 79, -99, 66, 233, 84, -115, 131, 360, 131, -57, 417, 181, -61, -202, 93, 13, 112, 27, -161, -128, -239, -22, -176, 102, 216, 19, 183, 109, 35, -227, 206, -45, -296, -84, 39, 29, -264, 103, -164, -70, -210, -58, -65, -247, -64, -140, -127, -172, 399, 60, -26, 92, 214, -177, -38, 207, -249, 5, 90, -76, 111, -483, 170, -81, -240, 14, -27, -133, -73, 386, -105, 119, 285, 204, 100, -131, 7, -205, -459, -34, -130, -322, 212, 4, -99, -307, 416, -91, -319, -79, 152, -426, 75, 484, 158, -24, 268, 267, -164, 51, 543, -395, -303, -206, 122, -349, -60, 215, -183, -271, 167, -22, -202, 357, 88, -102, -214, 413, -59, -322, 170, 38, -303, -168, 192, -87, -107, 457, 110, -158, -113, 105, -237, -293, 338, 135, -298, 154, 275, -385, -259, 125, 20, -208, 320, 205, -552, 40, 574]
4556E74o87j46M83j98k51R7N81m22j88O71k70o25L37O4l22L53M03l96m16M02K98
4577C42n12K02nqj14N85j03j069P68J33k32l14N76N1n22K60K82m64k48Q96k66
4598B38n87M91r7n48n7R13o34K18K53p3n29K20N91o68RN31k3o57K15O00p29k84
4620f07R96m43o18N07L08k54l76P00j70n38Q68P2l48j89O28n66k98P34k26n82
4640d02J68L09k94p5P63l70o80O33O7k69p2N83j8n57M60q2m47N8M06mj05M94n03
4663F3m29K91K83k64j68P13l60l85r5P09l48k21L02J83o44N70K97m42j55L46k13
4684C3j07N88m62k35j81N58k47MJ96N8o83L20J92N4j85O80r1p73j98O23j36j79
4706a71P72m03k61j65M18k72n9M39k92j45L01J8l31LL29l5m8k3J36m40J55J29
$$ y = [574, -113, -259, 224, 26, -225, -128, 453, 31, -157, 514, 244, -381, -44, 20, -302, 51, 454, 58, -358, 44, 342, -170, 32, 27, 19, -95, 490, 387, -682, 86, 219, -13, -327, 249, 300, -222, 38, 320, -144, -392, 504, 238, -349, 142, 45, -503, -560, 353, -281, -63, 190, 117, -412, -192, 399, -269, -260, 271, 248, -409, -194, 406, -323, -607, 389, -54, -672, -165, 143, -111, -487, 213, 43, -495, 373, 445, 97, -92, 536, -30, -328, 406, 180, -402, -234, 75, -219, -294, 469, 99, -581, 52, 119, -150, -222, 361, 343, -214, 246, 164, -283, -225, 181, 177, 72, 566, 63, -366, -75, 208, -56, -224, 489, 129, -256, -351, 358, 10, -211, 91, 274, -370, 200, 497, 55, -100, 246, 33, -74, 514, 52, -183, -364, 194, -53, -49, 147, 205, -478, -158, 34, 88, -97, 583, 492, -281, -479, 144, 8, -171, 601, 198, -63, -228, 190, -82, -141, 298, 6, -139, 162, 180, -151, -148, 181, 146, 98, 75, 211, -229, -74, 55]
4728E5j66r6M22j35l85Q5M27j35lK10l09j07L08l11J02j98N51j52m05M51l20J33
4750B2j77L84k70R1L19k59j99j67K23j88L8K22J26k12j98K16j40J87K95k63J73
4771B23J11k14j7j39P1J71k33q2j1Q8R6k46L6J77kj43J62j28J54l44J31L30p3
4794A18J61m64J98K07l10N0J70k16q2L3L47l99R3K34kj32OJ3P9K27j83j35J66
4817A79k41j0rn9kL8K61l70k4J58n6J21j3j82J17J16K12l20J83pj82J79j23R8
4841F4J55L0k93L6j42oJ07j3MM5J30K00l40J5k10J66Q5r2L63m04J42k7p9j45K98
4866H9k38K70q1j22K4L10q3k30L6J42j13J53q3j85J42j6j5N6p1L6j38J78l2j57
4890a28J35R5k36K43l05j0M05k10o8J49J38j62J6K08K24n11L27m52K32l29K11
$$ y = [55, -111, -207, 215, 80, -305, -220, 207, 72, 69, 279, -30, -137, 171, -140, -38, -236, 315, 163, -242, 209, -111, 22, -155, 229, -41, 50, 369, 110, -89, -256, -33, -221, -183, 39, 165, -47, -245, -29, -169, 18, 313, 50, 223, 334, 120, 103, -36, 35, 206, -27, -109, -120, -32, 64, -182, -146, 31, 29, -114, 48, -80, 74, -270, -139, 191, 118, 279, -185, 13, 220, -90, -40, 130, -86, -168, -135, 212, -187, -94, 140, 138, 6, 12, 25, 104, 331, 148, 13, 179, -62, -72, -81, -140, -142, -104, 157, -213, -237, -79, -135, -14, -27, -209, -92, 24, 236, -84, 99, 92, -90, 89, -34, 64, 219, 249, -44, -8, -150, -156, -49, -62, -58, -13, 117, 317, -23, -8, -218, -52, 33, -59, 304, -100, 42, 15, -64, -209, 89, -149, 121, 40, -82, -58, 252, 169, -61, -25, 117, 4, 157, 74, -111, 31, 15, 0, 56, -15, 21, -117, 61, 29, -128, 7, 102, -134, 109, -196, -206, 199, -11, -79, 70, 208, 46, 62, 270, 494, -17, 310, -142, 90, -239, -28]
4911b8K51k85j75M61l17k08M57p3j23kM45l39j11R0j34J97P6O6n6R6k23k88N76
4934C53j65l99K07j18K10l99M08m8k01J76r8J70j4J18j41j84J38j04K55j29L15
4955C50k02l25J7O0K4j86M30n9l52R2R7Kl22O78m23j30J60J85k40K09J35p0k11
4978h1L69l58j47k95O22j44r4J82p0k50L5J31R0j59M90j1m94J88J35k0l79M56
5000A96J07k84p5Q4k71P4K52k75k31L62K52l27R6K69j83K13M2K49q03M35Jj77
5022FmJ10J62l87J69j90j97r0N60o2l51P2L96k83m0P01l28o35N05K04n57K31R2
5045H4ll63M62J56o73L39J15n37K51K50L45p14J09L20m40K10M91M0n69M01j04
5066A70n84P7M90j84l88N86J09o73J61N76k48m26Q51j84p14N06J71k74n31Q59
$$ y = [-28, 223, -62, -237, 224, -93, -301, 156, 83, -40, -42, 403, 64, -47, 43, -91, 106, 182, 248, 192, 288, 65, -223, 353, 188, -211, -4, -122, 88, -311, 97, 49, -152, 24, -74, 96, 82, 200, 59, -125, 13, -91, 164, 35, 350, 148, -177, -160, -100, -76, -262, 168, 109, -243, -151, -54, -52, -374, 304, -119, -249, -89, 96, -144, 65, 200, 130, -81, 288, -70, -217, -512, 110, -34, -128, 54, -16, -266, -231, -100, -10, -169, 321, 310, -184, 4, 139, 119, -260, 196, 303, 19, -56, 28, -243, -169, 83, -192, -423, -61, 191, -136, -40, 229, 46, 259, 301, 550, -253, 182, 183, 6, 2, 112, 274, -113, 56, -134, -331, -421, 139, 77, -274, -202, 194, -89, -129, 572, 244, -391, 114, 318, -239, -8, 84, 81, -282, 180, 336, -337, 2, 117, -420, -169, 81, 426, -288, -179, 141, -299, -89, 402, 442, -127, 274, 170, -414, -337, 153, -31, -419, 167, 276, -397, -236, 340, 92, -334, 517, 333, -381, 125, 296, 22, -509, 350]
5086C50o7l96L85Q0l93k47Q41l23j81J80J52l53k23K78q8k44N55J93o15J64J30
5107A78l24k52P54j34m14L89M7l82k14M43o8p53N64R21j092N8O60n13j79P86k10
5128B65l10l7K10l12P6N75r7p47J62M36l95j7N70k05l87K76L84q68RP89k45n42
5150d10N11K13m53q3M29J34p47O24N64j194M6M02j94m13Q14J68p90J42N20o44
5170c61j4R10k46m37M29Q3o61K7M91j64l91M56J00o61M90K14l58n15N16L69m92
5191b15K76M5j34l96O74M7o99L81L63o26M8M43K4m86K67K71l71j62L73k04k42
5212c23M10N13r21K18M90m87L4R2L07m75j61K33L7k07N05k48k70N32J7l25k73
5233c02L62P0k27R7J15k70m1P9QR0K41n4m75L09M9p8l30L27J56l56O4K36k19N
$$ y = [350, 283, -113, 272, 352, -41, -288, 553, 230, 49, 229, 381, 28, -195, 83, -5, -249, 306, 499, -116, 48, 178, -146, -398, 356, 222, -192, 197, 244, -138, -352, 91, 23, -730, -166, 755, -337, -279, 381, -132, -311, 475, 265, -45, -82, 128, -184, -108, 467, 370, -377, -215, 221, -174, -191, 379, 174, -213, 63, 447, -421, -412, 377, 132, -410, 101, 314, -139, -222, 207, 341, -406, 218, 782, -412, -366, 36, -158, -571, 243, 411, -379, -237, 283, -361, -375, 535, 289, -148, 281, 364, -297, -270, 221, 57, -334, 122, 222, -439, 51, 265, -93, -608, -92, 277, -215, 61, 106, -28, -424, 250, 297, -402, -21, 342, -284, -236, 207, 231, -255, 12, 283, -88, -250, 123, -81, -323, 87, 600, -321, -103, 387, -100, -66, 26, 333, -142, -303, -70, -33, -240, 265, 17, -253, 279, 296, -29, -302, 60, 130, -97, 0, 115, -155, -196, -117, -109, -19, 222, 168, -307, 2, 51, -27, -357, -30, 126, -230, -166, 70, -149, -144]
5257a44R6J21l32L59j9l33L69j22L2q1K28J10m71N4K76j33j17L74J04j028N60
5278i7K21k74j2L02J84n99L87k78J28k91M94K1m30M32j00j76j20K10l66J30L53
5299A19j77l61L32L29l98L3o3K61l45L39J6r7N9L13j82j33L8j29o1p1Q7Q4n5J53
5323I1j92J88j76K72l37m3L30k9k11J11J70j14m6K2r5j66Q2K21j11j33p0r4K52
5346g8J40K16m68J57j19J76r3P6K94k69N9K75n49L04k8j03K58l74L66k61m0Q4
5368B3J10j27J9P8j40J44k60L37j11K76P4k69nk90k3L22l76L28m22O1M01R4l32
5391h8l8n2J09M1j3J32k71M50k04J7j43L9j4q1K85k77k5K13M2m06o6P9J98j16
5415a89N6L11l15J89m3J90l84K27l4k16K45o0Q2j10O9Q7k1k95J04O2Q1k01J41
$$ y = [-144, -48, 73, -259, 100, 81, -252, 117, -5, 27, -54, 174, 284, -187, -133, 143, 10, -107, 267, 371, -657, -97, 124, -150, -162, 140, 324, -275, 112, -166, -38, -329, 165, 186, -244, 188, 88, -88, -208, 2, -364, -234, 119, -58, -419, -87, 242, -156, -123, -186, 75, -270, 69, 85, -12, 47, 360, 178, 45, 83, -46, -107, -178, -91, -7, -62, 91, -101, 87, -89, 183, -154, -197, 133, 104, -107, 4, 174, 60, 14, 36, -59, -225, -143, 78, -33, -166, -236, -330, -78, 62, 278, -190, -33, -152, 24, -69, 7, 301, 32, 91, 366, -183, 121, 93, -10, 248, -126, 240, -21, -61, 23, 133, 6, 25, 103, -37, 107, -153, 184, 73, 349, 423, 154, 149, -141, -164, 158, -218, 110, -312, -251, 150, 244, -88, -126, -178, -69, -28, -41, 91, -180, 270, 66, 83, -60, -21, -35, -116, 169, -108, -133, 80, 122, -284, -350, -271, -73, -189, -133, 178, -137, 52, 9, 199, -185, 42, 8, -208, 37, -23, 59, -51, 18, 105, 84, -211, -107, -45, 36, -165, -24]
5438b4j55J52K18m05K44J73k35l7J71k7L9m4p1j11k42K34K25j63j88L92k97P6
5460g5K87j88J18j85J78l19L13O2K32l87K5J36m30K13J43J04j95N4k0k05O3p4
5482a50J98l4L57l00r9L4p0p9L0j28K25n6L1j13J22J04r2k11N5M17k53r6k39N93
5506B46l34Q1K29j3n88M88j0j62P6k36M90n70M73R4o69J97K55j6j99q4N08j60
5528I6k07J67J36l43K79j02lj38K90l78K15lR0j48M0J10k88J58O7L6n90M60J97
5551A41j86r2L05J39m74j9K75l63J27N32k95l51L35O4k55r8L23p2l02PP85o78
5573a52J84K85k50j37M48J01r18M27K74n95K88J39K13m82Q7M5k12RN69j48l39
5594a64J64K06k72j83N74k84k49K62j59k08N50R9j11l38Q1K70m01N3J71k82q2
$$ y = [-24, -179, -27, 191, -214, 30, 203, -32, -69, 102, 75, 114, 70, -1, -112, -354, -120, 105, -58, -246, 146, -151, -75, 212, 24, 142, -43, 135, -184, 129, 191, 423, 36, 61, 197, -233, -20, 123, 227, 32, 86, 66, -139, -76, -150, 48, 14, 371, 71, -28, 6, -64, -143, -113, -241, -16, -72, -41, -154, -32, 72, -20, -231, -176, 241, -12, -108, -347, 246, -88, -7, 222, 209, -379, 109, 99, -63, 13, -223, 267, -303, 170, 264, -405, -208, 47, 31, -168, -252, 256, 96, -111, 56, 192, -151, 128, 26, 23, -115, 175, -203, 12, 9, 99, -49, -9, 101, -187, -29, 38, 74, -516, -56, 141, -45, -137, 168, 307, -167, -186, 89, -274, -147, 385, 90, -261, 74, 138, -117, -215, 108, 36, -266, -259, 526, -152, 32, 317, 67, -70, 378, 479, -439, -12, 262, -333, -45, 94, 307, -175, -88, -43, -255, -246, 323, 175, -164, 0, 206, -66, -249, 325, 41, -208, 54, -105, -313, 237, 336, 225, -113, -32, 238, -163, -110, 61, -221, -303]
5615c03O51k67o95O02k2lj83L96j33l91K37N09n93r0M10m3m14O76J69p32k4L41
5637I8P1l08M67k64k81K83M80n39o3M70k86l97K60M2l04J91K13k20l62O61k17
5658er5k31O35j88n19N34Lm01J84L80k48m9L1L62p94N79J19m22J1J26J21m68L91
5681E6P0k95J91j8k1l35M66j22l3k82P70m46r0J13K50n04J58L42l91k75P09J43
5703D56p25J84K40k74j6K26O8l30p1L59k41j9N37l78J45j78K0j59L3K39kk49o9
5726b04L05l55J98K20j27n7K53l70qj47J80M9m4J47L9J51j83L05l92l21L98O4
5748A01j2j79K04l10nK66K57m21J68k4J04K2k40M18m89R9O4N0k5m9K23k69k4r7
5772a68rK66L07n49K61j41rj14M16J9n23L21M9j10J03l2J02l93K19M81n51K09
$$ y = [-303, 348, 81, -614, -12, -34, -37, -220, 176, 43, -348, -111, 398, -195, -285, 125, 82, -332, 344, 513, -219, -243, 98, 169, -139, 328, 64, -217, 66, 546, 7, -56, 414, 128, -269, -9, 33, -271, -80, 133, -87, -449, 212, -5, -100, -331, 304, 116, -403, 131, 134, -267, -83, 297, 49, 0, 31, 393, -401, 178, 297, -125, -114, 12, 133, -335, 56, 126, -169, 22, 4, -17, -352, 114, -8, -41, -323, 447, 1, -89, 24, 274, -230, -72, 270, -121, -396, 313, 456, -269, -85, 155, -119, -135, 91, 159, -171, -242, 117, -124, -143, 394, 16, 161, -17, 3, -156, -123, 116, 114, -135, -204, 101, -254, -56, 164, 37, -20, 233, -137, -145, -292, -112, -63, -107, 40, 79, 230, 47, 352, -40, -361, 37, 101, 89, -90, 114, -196, -201, 65, 322, -99, 69, 45, 149, 171, -69, 349, -140, -41, 23, 73, 48, -1, 222, -47, -71, -168, -177, 89, 396, -153, 108, -33, -42, -156, 260, 279, -244, 77, 126, 16, 119, 87, 189, -204, 15, 496, -55, 154]
5794A54j07J58l21q4L87l13K11j96J44N6j08P9k56J05j57L78n70k1P33j23j34
5815A5K63j05k41j22K08j34N1J20o0O2j25j17j08K47L4L45l56K3l9LK27j80j85
5838a74Q0J18M9Nk47Q6p1k31M31J08j91J7J95m02K56J48J80l37Q1o3J19o7k0K98
5862C68l35M9j7j9J02q0j22L02m35P6P0K19m69J92L39k67J16j9J56j84l6j47K46
5885A05r8p6J74k12K1m3K12k77J2J63K11K9j7j60J97l39J16j28L51j24j64m0L08
5908B21j99L0j18Q8o5P7J61m9j07k46J33j38K62k19K88l83K07K23k42P1k54L37
5930G8k71L05M0j30j83N3J58jJ25j01j97k7R1j11M00j63r6k61K71K25q9l6k60
5953a80J89J78k98N7J37k81P6j5j35L65n9L55l03j06p0ml6Q0Rk5J25q9j67P1M61
$$ y = [154, 47, 205, -116, -200, 187, -126, 85, -111, 33, 89, -19, 60, -196, -91, -248, 130, -440, -461, 272, 149, 15, 278, 173, -68, -190, 18, -116, -65, 55, -5, 57, -68, -185, -293, -46, -12, 333, -23, 0, -39, -36, 191, 11, -174, -94, 24, 73, 78, -169, -83, -154, -385, 46, 154, -37, -20, 175, -227, 29, 177, 357, 20, 101, 38, 157, 90, 70, 368, 33, 82, 65, 46, 148, 68, -54, 248, -187, -111, -41, 178, -291, -99, 240, -27, 89, 70, 226, 42, 6, -141, 105, 7, -69, 105, -107, -86, -129, 83, -194, -182, -19, 192, 221, 204, 44, 241, -98, 18, -110, 241, 117, -47, -87, 221, 22, 52, -66, 22, -43, 34, 195, 146, 39, -207, -74, -212, 50, -169, 119, -264, -57, 166, -76, -5, -259, 78, -193, 112, 152, 22, -161, -108, 50, 49, 174, 73, -124, -151, -60, -171, 229, 66, -30, -291, -20, 205, 116, 80, -180, 9, 187, -111, -54, 83, -198, -122, -137, -272, 93, 34, 389, 86, -20, -90, -94, -130, -50, -41, -66, 59, -30, -197, -126, 335]
5978C35n49L15O8j31M1q6n8L4J21K36k65j18r9N85k69k8j0j14l2L36k57j81K96
6001A70O8k96p9J68j23K28k9p1k52J63j16J90k34N39k66j86K65n2L0k63L24j27
6023E1n7O7J26o00O02L4j21k2l18K70k90nO53n64K08Q4k8q4K5K97m38J87j73J90
6047I4k94J32J05P6j97J94j14j66K79m2j69J62J59k03N4j03M3N8n4J46n12J33
6069b19J24K12q2j14K51kl51K26j57J97l1l3j68J2J41N7j21q1P7j20R3J85j02
6092fKM17n52j04J01O9K91k01R6Q6r0O1j37J40q9n6J53l12K2K91m73J83K99k04
6116a3r9J17L40p45M63N8r2q3L78l36o2J82j81Pk35M26q7J29J66k98j07j35J70
6139c7l9R0l5J16j90K12l63L68k56L24m2k24M02k54N5j38O5j34J5Kn4R6J35j8
$$ y = [335, -214, 101, 169, 38, 79, -7, -65, -31, 90, 326, 61, -57, -156, 429, 160, 132, 122, 8, -24, 312, 55, -126, 170, 238, -58, -137, 31, -92, 136, 107, 36, -216, -53, -169, 21, -213, 326, 60, -126, 139, 87, 117, -146, 178, 51, -6, 61, 187, -413, 189, 223, 102, 80, -238, 32, -258, -263, 390, -174, 34, 118, 90, 6, 31, 328, -110, 77, -96, 94, -200, -68, 37, 113, -84, 110, -4, -170, 109, 67, -102, 60, 219, 16, 70, -33, 10, 68, 14, 160, -352, -219, -95, 117, 35, -79, 172, 170, -181, 45, -112, 85, 54, 21, -147, -135, 6, 63, -58, -139, -62, -182, -89, 96, -6, -4, 413, -139, -243, -142, -73, 218, 17, 113, 199, 109, 170, 33, 173, 84, 28, 181, -131, -109, 182, -291, -108, 191, -13, -112, 5, 345, -400, 63, 121, 29, -54, 324, -12, -74, 108, -73, -66, -301, 125, 38, 167, 333, 35, -72, -207, -37, -76, 14, -21, 95, -95, 117, -246, 122, -134, 190, 148, -76, 326, 72, 127, -11, 54, -80, -65, -63, -117, -21, 114, 96]
6163I6j81L05J6k91r9K22N9j66r0K42l8J13o62O55O1n67N55k40k68J49M18k73
6185A6j71K25l6Jp2j09k2M12r3j23J8J12J26l37k5L23r9j76J37o6p9p8K68r3J58
6210B17k07m2O8O2k79L20k30K11l1o10K28K68J03Ro9j2j00R4q8k26L09k4J17L
6234I1KR8l76K20K55l70J72J8R5j98k49M45j80n9j8J84j66j55L55m44L63J42n7
6257A68j81j46K51j51J32j47N2j33J84J70n5j64q7K13j86K37l90K99K4J62J48
6278D00o14N03l73J03j61q9L97k41L1J71R1j73k00j47L40k22K43m7J05K38k13
6299A42k13j8O0L6K66ok68k99M38j56p0J15j06n8j19L0J20O2J09J08k46l0K89
6322A86r8P4j09l7o2q0R9L5k26J32J72k17k05J47K83j35J88o5p8j44L28o00K92
$$ y = [96, -85, 220, 236, -55, -154, 68, 127, -39, -129, 113, 75, 188, -474, 181, 242, -325, 230, -10, -278, -129, 289, 16, -155, 70, 34, 35, -37, -146, -168, 244, 151, 28, 46, 158, 284, -53, -78, 245, 146, -30, 107, 41, -38, -116, 152, 59, 217, 10, -32, 36, 98, -181, 139, -91, 120, 89, -521, -293, -25, 78, 87, 18, 6, -94, 0, -88, -314, -5, -29, 88, 91, 93, 191, -185, 35, 290, -80, 92, 110, 205, 7, -242, 203, 23, -36, -54, 130, -36, -191, 164, -280, 83, 225, 168, -13, -159, 92, -59, 73, -74, -22, -155, 29, 199, 144, -20, -107, 106, -80, 157, -233, 66, 90, 252, 400, -214, 289, -84, 19, -142, -231, 166, -75, -44, 127, 218, 45, -155, -302, 38, -184, 59, 12, 117, 355, 142, -71, -89, -29, 7, 273, 267, -1, -300, 138, -18, -88, 27, -79, -137, -256, -226, -106, -44, 65, 173, -73, -103, 186, 88, 162, 53, 16, -46, -126, -27, 8, -218, -86, 86, -131, -336, -189, 94, -41, 147, 82, 4, -140, 188, -412, -120]
6345a20J39k33P8J57n2Q1p8J82K7j54K0j31L44k33k21M91k61k2M1j25J21r2Kr5
6369a34L20j72m84N28J39k12L0n4J67j68j22P1M2J76j83l1J37k05Q8K7L6Kj23
6392a25q0K24j84J79K86q0j43j10J54j25K89m13m7J96K9N1p0l9J14k71M2J00K23
6415B00j79L3P6k45k83L82O0J00l40J90l3j51O0L9J25O8P7l46J47J28j12j97L75
6438A74l28J68j90K22k89K63N1J15k12J80k56J8p0n5K77J25k20K1J81j32l4j91
6460a82L23k44M83p3j81j52L29l21l39M50k53L00r6P3m5j32J53k60j77N68l07
6481h3k17R1M09k44r1L48k10l3J21K03l79P0P2j94K33j32L05J0j00j42R8nj15
6504A5J53K9j02j86L06n2J00l20J50j78K88m22K03J54l70J25K5J77q8k06M98l61
$$ y = [-120, 19, -214, -136, 21, -31, 50, -28, 154, 181, 27, 47, -84, 260, 27, -194, 297, 36, 14, 55, -70, 51, -41, -39, -134, 186, 14, -470, 58, 197, -15, 15, -39, 128, -40, -162, -91, -49, 127, -56, -87, 50, -155, -67, -40, -4, -2, -125, -205, 19, -165, 14, 300, 220, 77, -33, 121, -4, 285, -128, -175, 21, 50, 101, 31, -8, 106, -165, -123, -23, 200, 21, 54, 130, -115, -398, -16, 44, 144, -196, -6, -39, -190, -130, -91, 34, 102, 179, -167, -20, 108, -4, -201, 174, -154, 14, -176, 46, -243, 20, 71, 186, -26, 154, -102, -84, -154, -209, 68, 193, -27, -6, 175, 43, 9, -182, 141, -103, 380, 307, 126, -26, 303, -18, -357, 93, -160, 140, 44, 117, 72, -60, 93, -167, -344, 224, -83, -300, -209, 200, -44, -135, 213, 3, -30, 91, 294, -85, -15, 57, -137, 96, -36, 269, 279, 179, 37, 135, 130, 15, 168, 197, 95, -91, 215, 163, 263, -57, 93, -85, 203, -219, -16, 138, -232, -107, -82, 95, 7, -199, 299, -62]
6526f2O9O2J2l83K12K03p1R0ok74J4K43M3j02k78M61k09j33K20K2m71M24N4j95
6550e5L0KJ96k19J47k22J6j07N58k98j37k07L77m37M94n9k11J59J03lk80L5K40
6573A22M9l26K21j67j17Q0J22J73j14L6o7k37K6M91n80J73K21o5k66N29j10l00
6595a06J70J58m13nJ80J0j8K4K66l71J6J07R0k72K34K15o02J38J92j94J13M3j51
6618a76J45r1K33M5l06K24r6r1K58l4k79J06K47q0k09K44KJ55l94L86k07k59J62
6641a5N0k54J03J3rK78k69J96m58K78J82o8j34J90q0j71K96J98p8l73L26r2k49
6664a40N4L09l51j90N94j45m65K40K94m29j29O19K8m32M3l0K07J09q5j26l0J71
6686A16J3k11NR1M9k18K09j35k69L17J91l14K92M6j69j24M8J80j52j74N11o22
$$ y = [-62, 7, 69, 81, -302, -90, 113, 42, 132, 126, -148, -134, 109, 152, 50, -228, 233, 24, -109, 111, 133, -338, 86, 140, -55, -25, -23, 173, -46, 101, -121, -105, -212, 346, 48, -89, -296, 81, -356, 138, 79, -132, 27, 130, 127, -153, -118, 122, 171, -155, 66, -101, -218, -138, -16, 157, 43, 79, 12, -225, -199, 292, -288, -115, 106, 41, -225, 304, 194, -106, 64, 222, -191, -196, -16, -6, -24, 0, 266, -105, -89, 18, 108, -164, 70, 285, -317, -179, 13, -181, -68, -25, -176, -31, -122, 111, 156, -150, 74, -22, -113, 145, 111, -168, -62, 185, 105, -104, 140, 142, 297, -97, 289, 82, -177, -15, 35, -219, -116, -103, -112, 166, -103, 93, -365, -87, 95, 27, -107, 83, 3, -168, 128, 326, 248, -125, 201, 109, -140, -86, 223, -128, -318, 276, 131, -334, -94, 200, -229, -358, 261, 289, -143, -100, -130, 77, 186, 101, -25, -55, 116, 129, -82, -77, 14, 63, -155, 54, -81, -350, -33, 158, -156, 136, 182, 13, -111, -63, 117, -35, -209, 302, -320]
6708c20M3N20l70O7RK36l40k6N38k39j11j65K86k30J19KJ02m12K36J82n63J32
6730c04O95n36L8J80p3j38m5M58j63m22K54k9k2J6J43m3J71n6j78k60L65J92m19
6753a76J49l9J82k32K16K34n69M19k9l44OK08j7m79K07L46k94J00R0K3k47J38
6775a08L73k35j24K2J00j77J77K9P0n78J71o6J74J92M02n23J92K42m24J11j2R0
6797I8l17M5M58k16l9l5J50m58K87L6M4m0j64J64j70J1K87j70L2R5R7k00o3M2
6821b6l3J67J49J79l08k84K14k89K49K31k19k52L91m18O12m49L90l17k34K08Q7
6842D8J95L9m99J52r4K20j12o8N3J02jj42L6N9K6R9m04K31L14k16j24l33M78j72
6866a13K26r9m6KJ00L2j09j50K86k86J0j1K94k5j64Pn1K34n2j9j24q1R3J13J7
$$ y = [-320, -277, 243, -127, -60, -51, 185, -155, -181, 357, 118, 7, -158, 128, -102, 17, 19, 121, -291, -55, 127, -436, -304, 391, -145, -107, 73, 0, -138, -183, 275, 112, -310, -56, -85, -107, -91, 52, 9, 180, 124, -54, -314, 51, 243, -176, -27, -66, 116, -116, 100, 334, -235, 184, 155, -189, -183, 25, 8, -471, -264, 82, -212, -112, -22, 1, -246, -108, 265, 30, -94, -72, 28, -149, 28, 57, 127, -451, -280, -346, -172, 20, 422, -101, 91, 333, -91, 20, 8, 98, -219, -174, 284, 68, 29, -6, 144, -314, -27, 9, 53, 13, -151, 13, -157, -146, 141, -29, 3, 98, 195, -5, -68, -26, -59, 108, 257, 436, 128, -156, 58, -231, 18, 249, 30, -222, 169, -249, 363, -86, 304, -13, -247, -39, 48, 243, 282, -217, -65, -159, 61, -51, -119, -66, 36, 35, -107, -71, -12, 14, 113, -291, -60, 254, 38, -86, -419, 59, -113, 113, 14, -32, -30, 70, 102, -7, -157, 129, -157, -147, -158, 136, 111, -53, -46, -97, 137, 85, 66, -58, -139, -46, 67, 84]
6891H4N0l69L15k43N1J27j13p2M07l18j6L59n82J57L5O4K21o9j68O6J03L9j92
6914f4nK14j95j9j24J82M0j28Q6j95K6L88l2r0j21l3J87l9p8J61r5p3K12k79j22
6939a96LL12J5k19r5L52k92L23j99p1k01K13N2O8RN3N7j12j17J01o6L5M7l79L30
6964B3Q2j52q3K33r7j56J98l05K34lL9p2j66M60k08R1l63L70L6l86j94L20k15
6987c14L35j03J85j84j77L64j70k41K82K0P2J5j80L74j8j56l6j90L47k33JK8K71
7010B92k34m02L86L8J54n17M65Nk75r2L47l6k43j38L76j86J05j87k6N0K32Q2j79
7033A7j9M0k18j27M45l14J62p0P2Q4Rj57J08L6q9k56J74K98o4kJ34l55K63J2l18
7058a35M65k88k61L71l43M2M4M7m5K32l07L19j59o7oP2q0K44k48j68K87M3j78
$$ y = [84, 134, -235, 80, -163, -112, 15, -98, -170, 237, -81, -97, 262, -320, -163, -128, -64, 157, 88, -80, -14, 89, 128, -64, -69, 145, -50, -69, -193, -11, 29, -99, -13, -208, -182, 206, 174, 84, -37, -70, 117, 78, 0, 161, 66, -7, 205, -74, -196, -193, 119, 134, -85, -180, 172, -120, 203, 4, -67, -268, -55, -3, 65, 74, 127, 184, 72, -45, 56, -10, 25, 72, -307, 23, 105, -47, -130, 103, 6, -150, 48, -257, -23, -26, 13, -59, -225, 235, 27, 118, -245, 125, 161, -225, -419, -99, -314, 21, -82, 103, -81, -258, 106, -64, -305, -23, -3, 69, 84, -96, 278, 260, 104, 68, -122, 225, -8, -7, 21, 292, 58, -344, 42, 80, 234, -283, 182, 187, -88, -180, 167, 131, -112, -250, 126, -60, 45, -142, -168, -118, 114, 196, 17, -2, 38, -180, -307, 138, -176, -14, -84, -12, 72, 81, -76, 32, 68, -21, -277, -103, 195, 131, 129, 263, -92, 171, 183, -135, 330, 42, -219, 152, -191, -149, -105, -58, -103, 129, -178, 141, -18, -85, -91, -19, -99, 145, -103, -271, 16, 59, -119]
7081a19J30r2J81q8j61J71j22J88j31J86j1j07q1K5k09J90K00k25J58o6P5j02
7103a0K41n09K03K99l06J54J47k87j62J10J69Q4O1l33m2o0J33K95m95L77P0Lj93
7126e1j23K68o7J0R9j18J20j94j23N5J37K26k98r5K31j54J12r6j22K51k07L54
7148B15j72k26K53q7j3J81k47J4l9J92m77L14J92k08N64m39m0K70k63n1j4J92
7170A11j36k4Q1j01J81R5j79OJ46O7j11l76J67J49k43J48J88m32M14q1J17l11
7192a24K10j43J01R7j26p4l61N82k78QK44j85j79J18Q4J95k26K76j80j2P1L18
7214D16p03L88r8N8P8l79L63J19L0K45n47J03j16M8J42l31L85pl08K34j53J5K16
7237A98l9k63J38J60j13k15J57j17K67k94K33Oj15JK19l86R2K09o2r5n2J14q1
$$ y = [-119, 11, -81, 100, 12, -149, 22, -100, 88, -43, 143, 132, 25, -56, -31, -240, -50, 150, -75, 83, 17, 92, -10, 231, -278, -75, 224, -82, 72, 219, -68, -230, -120, 49, 133, 194, -139, -181, -241, -108, 187, -308, 69, 139, 142, -51, -174, 94, 27, 37, 136, 18, 138, -56, -179, -124, 13, 239, -59, -154, 77, -77, 35, -61, -183, 68, -139, 215, 43, -183, 70, -17, -30, 151, -96, -82, -121, 71, -406, -92, 100, -108, 456, 17, -23, 247, -16, -67, -81, 111, -25, -49, 32, -69, 112, 207, 28, 34, 180, 247, 136, -240, -73, 76, -167, -19, 169, -263, 151, 70, 187, -124, 86, -57, 44, 141, 15, -59, -420, 162, -116, -108, 136, -49, -228, -110, -26, 169, -57, 219, 39, 27, 98, 416, -287, 101, 3, 61, 139, -240, 123, 242, 272, 517, -30, 73, -43, 5, 147, -184, 201, 194, -114, 120, -33, -18, 198, 159, -104, 34, 194, 81, -134, 23, -94, 173, -121, 112, 118, 3, 4, 223, -163, -71, 138, 76, -19, -71, 43, -38]
7260c8J03j3j0j8J64n3j33J66j99J2j91L90k18j52J06J64n2k01N28l96J57l6j83
7283a03K30q1K10l06J38jm6o0%J0J43M4k7k7l73K88m8j07K98j87k3p5K38r6k36
7308a97L27k6j52j59K71K66m04J26K9Lj82J94k53O8J6L9rK79J08m72J7K11k91
7331a91J05r8L22M4j54m5P8l26K56J28j02j88M2oO2J7m7J25j2m0J00m01N74k96
7355e3O9J37m4j36R2j82M24l37kJ66n3j96J80k83J9K28J34J6l64L11k52N1O9o0
7379f6N7J55q3j05k10L82j90Q0K57k09k59K25j86Q1J49M3l9p6N3J71m09J33K28
7402A82%k87j65L44K9j49O9k86J09K9L44j54k51K32q8M4j34o6K46J32l53K60j59
7425g2j43L22k71N8K9J58q1l24L90J13j58J27k06J04j81K05n5O8o1l5j28J19q0
$$ y = [-38, 65, 52, 42, 24, 188, 135, 2, 168, -31, -19, -210, 180, -38, -190, -84, 80, 28, -173, 355, -41, 116, 80, -103, 127, 46, 256, -50, 88, 87, 41, -19, -19, -9, 134, 178, 151, 124, -249, 39, -9, -116, 182, -5, -28, -103, 135, 39, -197, 130, 104, -48, -207, 64, 330, -74, 52, 81, 84, -98, 96, -157, -89, -73, -34, -43, 236, 344, -128, -111, 100, -191, -86, -184, 138, 182, 28, -17, 61, -265, -9, 119, 17, -171, -129, -135, -73, -56, -103, 22, 10, -30, 70, -331, 243, -53, 16, 153, 109, -27, 65, -117, 307, -30, -32, 134, 81, -115, 65, -218, -199, 29, 163, 179, -185, 126, -126, -75, -6, -66, -9, 146, 63, -42, -252, 130, -60, 20, 277, 68, -191, 34, -152, -71, 78, 121, 82, 6, 59, 230, -179, -46, 182, 182, -105, -270, 74, 103, -46, 23, -263, -154, -125, 219, 65, -186, 46, -42, 2, -132, -198, 48, 180, -173, 87, -72, -215, 107, -164, -106, -77, 81, 0, -324, 66, 179, 21, 148, -58, 46, -135, 70, 15, 83, 22, -13, -141, -22, -102]
7448a02l1o0N2J50J54J36k97r5J9K30k34K19J22j90q7k4k8P4o6J17l7L57j90j82
7472GJ03j45j1O3R0J83k96r9J7M59l64j32N04n36M4M43m24K17k21L26J25k35l6
7495H2Qk23j3J62L06k84j55K96k23K3l25K93j58k35N30m67J46K24j46L09k6l93
7517b69M46l24J93J74m46J37Q7m3j8N1l5O1m9r7J22j10L46m0k36R0k16j08J17
7540a67J57J22l69M18l14K54j53j51M4J88M63o93K09j8J20oo4K30l84j3L38j27
7562H4m49M92j95J10j40J37K10j72J16j00q9j10j47L18k79L33j95J93n6j51K2
7583f8R2K77k61J8q9r7M08k49J28j60L4j88K83j06M5J91n10L08j57Q7J68q3q3
7606a2KK36k93K84j81L2k7k2j60J69m8k74L05k02p6M34q0o3k49K06k5j47j2L86
$$ y = [-102, -133, -193, -141, 9, 163, 299, 2, -93, -74, 156, -78, 141, 263, 73, -14, -38, -66, 8, -58, 59, 22, 379, 189, 7, 110, -35, -46, 17, 107, 290, -6, -105, -88, 371, 7, -125, 379, -157, -113, 330, -94, 123, -98, 228, 353, 118, 82, 90, -133, -146, 16, 322, 38, -117, 179, -44, -21, -346, -53, -211, -446, 84, -383, -237, -13, -159, 150, 124, -269, 177, -147, 46, 220, -226, -89, -2, -45, -63, -12, -47, 14, -35, -132, -10, -120, 226, 186, -50, 40, -176, -284, -167, -10, 112, -257, 161, -153, 101, -52, -203, -159, 29, 492, -201, 8, -10, 110, 104, 40, 270, -114, -127, 211, 84, -365, 127, -68, 42, -98, 39, 249, 77, 193, 93, 4, -106, -253, 65, -214, 119, -76, 117, 61, -90, -68, 24, 301, 40, 58, -31, -128, 280, 31, 159, -1, 33, -155, 128, 22, 67, 258, -252, 56, -101, -14, 154, 71, -12, -10, 226, -67, 217, 36, 68, 41, 19, -141, 28, -20, -294, 11, -191, -267, 167, 87, 24, -225, -19, -44, -191, -203, 183]
7630A83M6l23P5R2mj47Q7p5j25j18L65k59J26L28l13L8K6l3J68j4o4J2n5K61k05
7655G2j84j7q0J65j29M32k71k0K1o3L7K33j74k18L35m4j39K25k04j16l0O3QJ54
7679E6r0l28L12P1j56r8M37k73j92L40R5j65K35k34n3j44K56m1K49M2l43k02K86
7702F0k41K75k2J08L7O1l52j88M10k18Q1n7p4j34L02J00k58J19k04K41j3j25K65
7725A73j36M3k20j9M05l71J47j38Q2M3K7k31K60k13K49j16O9j61J72O1l4J00j16
7748G6O0k73M0Q5p1J95M6k44K57j58l45L03r4L75k45j43J77j22L17P4m05OM23
7771C34j57k40j51K54J00k13R8j60m7K59k90K09J95l86L25j88J50j17O7K1K68
7792C31j47J57k19j5j97J72k22j52J69R1K50k90O28o31K73n47M09m4J8J93l54
$$ y = [183, 229, -94, -19, 73, 69, -78, 9, -66, -191, -309, 56, -203, -77, 251, -62, -24, 2, -31, 137, 123, 59, 71, 16, 277, 72, -112, -129, -209, -44, -173, 259, -12, -32, -11, -74, -37, 196, 22, -196, 139, 95, -44, 181, -23, -139, -169, -106, -98, 56, -34, -362, -50, 21, -135, -233, 204, -69, -261, 79, 174, 9, 244, 10, -43, -187, 69, 28, 277, 319, -24, -226, 60, -181, 94, 72, 180, 217, 278, -74, -262, 148, -70, 11, -46, -120, -254, 48, 148, -110, 9, -195, 46, 33, -92, 173, 37, 80, -140, -159, 246, -125, 22, -116, -34, 9, 36, -195, 65, -148, 101, -15, 54, -107, 65, 126, 92, 192, 76, 136, -137, -97, -12, -83, 112, 158, -86, 171, 13, -332, -29, -123, 252, 7, -136, 41, -81, 236, 310, -95, -89, 334, 177, -63, -214, 40, 140, -73, 25, -135, -182, 77, -213, -4, 191, -195, 130, -58, 92, -25, 42, 63, 331, 184, 341, 122, 107, -90, 82, -140, -292, -123, -32, 218, -72, 556, -75, 198, -349, 60, 16, 34, 227, -127]
7813a27J03K93m68J75L8K30j32m2j6j34J04r3K40k06P9N9p8K0j19k19L23J62l14
7836a22m8J36L98j05k64K4o6J0K0J44m5k25L51k01J49k76K02P3j03j98L71l30
7858a05J37j79J49K64k87J05l62L27k84k0L76m5%m18Q4nL52m9K17j95j75j71J91
7881i3K61j80rK7j19K54m3k21K49n9J93r6r1o1j89J60j82M5K60j53J34j77K31
7904A41k36Q3r2O8PK49l49P5rJ11j17R1J19n7j00p5R1J20m6kj69K2R5o1j18K61
7930A02J6j91n3J01J19M3j44L2J7J24r4O0p2o3J71l23J80j18K74l24K5r1L5J97
7954B3L7L3m4r7N7k8J04k53L84k86J38l30r1K76p9M4j15K92K4k05L50l75k3L29
7978A65j07j25j1K40m4k19J81k04J44K0N6j67K88j50j93j07M5K00J80k59J54m0
$$ y = [-127, -24, 269, -199, -24, 14, 244, 112, 70, 54, -80, 24, -69, 171, -35, 44, 103, 25, 45, -74, -293, 30, 192, -122, -170, -34, 364, 259, -5, 19, -47, -37, -17, 127, 82, -143, 208, 7, 156, -120, 82, 155, 52, -146, 225, -105, 32, -147, 2, 266, -21, 84, -278, 49, -235, -255, 121, 76, 76, -342, -258, -263, 89, 40, 257, 62, -113, -284, -93, 168, -12, -21, 6, -113, 141, 98, -123, 126, 67, 260, 164, 73, 12, -177, -17, -199, -154, 106, -47, 87, -90, 141, -95, -12, -104, -36, -29, 220, -129, -54, -63, 48, -69, 22, 141, 84, -16, -91, 0, 120, 74, 72, -97, -75, 20, -41, -159, 102, 118, -73, -126, -25, 94, 137, -7, 25, 42, 166, 72, 132, 60, -3, 168, -155, 25, -93, 181, -143, -118, -209, -174, 23, 60, 93, 49, -48, 9, -19, 85, -168, 216, -70, 68, -262, -353, -77, -156, -112, -227, 65, 89, -116, 234, -141, -164, 165, 58, -67, -78, 162, 118, -101, 80, -124, 20, 40, 96, -71, 217, 67, -126, -233, -188, 12, 192, -67, 87, 47]
8000D7k9j17J39l1n0O9N3j38mr5K18k79L70j58rK46l84J66j01R0P5j26L6K07j27
8025F8j38J05J6k5O7j16j78J17K8L48j61j14O0r4R5k14J73k5q5k47L63k28L10
8048A25l99N41j62j59J40j27J58l01L5P0Q5N0j21J02r5q4o1K12k09N2P1m1k4M6
8072i6J11r2J76Rk6m78L00L66p0j68l11K59R0k60K51j80K57k69L8QP3n2p7J90
8096D9j89J34Qk51K09j6O5l09J85L50l2M6j28K4r4Q0j67q2Nj4J16Q0k02J01NK50
8122B23l06Kj45L24k22J33J68k38K90j08j46J31K0j86J80N9j28p8J08p4j23L07
8144A91o1J17j46J16r1r5J48k04M5m5m4K95j69K9j27j31M80l13J24j76P5N7J08
8167A83l93J19K31j03k00J61K40m40L36o8O4O1K6j36p7q1J0J30k22Q5K01K27m64
$$ y = [47, 18, -99, 40, 9, -41, 28, 81, -57, -61, -156, 62, -217, 153, -5, -14, 232, -152, 14, -87, 3, 78, -48, -12, 195, 68, -70, 35, 51, 26, 93, -23, -201, -84, -56, 292, 131, 17, 77, -17, 78, -136, 37, 12, -73, -320, 43, -185, 125, -274, 267, 105, -54, 86, -41, 117, -184, -149, -79, 6, 56, -65, 37, -58, -142, -203, 9, -200, -148, -77, -118, -142, -96, 15, -77, 99, 108, 82, -396, -96, 270, 200, 32, -279, -20, 70, -190, 61, -119, 138, -131, -93, -85, -12, -64, -141, 49, -140, -6, 2, -249, -40, -56, 9, -300, -115, 235, 203, 249, 121, 145, 51, 131, -36, -118, -113, -127, -11, 69, -133, -32, -27, 223, -83, -81, -226, 98, -124, 9, 177, -61, 229, 121, -25, 106, 126, -60, 120, 179, 51, -27, 81, 7, -116, 191, 130, 247, 101, 217, 126, 31, 179, -25, 20, -25, -69, 226, 57, 86, -41, -172, 308, -5, 119, -57, 18, 75, 183, -210, -91, 140, 37, -163, -2, 238, -202, 134, 66, 130, 191, 217, 81, 4, -77, -67, 63, -159, -74, 127, 354, -110]
8190a10J26
$$ y = [-110, 16]
8191A6
$$ Imaginary data points
##PAGE= N=2
##DATA TABLE= (X++(I..I)), XYDATA
0@%%%%%%Qj6J6j6K4m0N6o4P2r6J20j52J90k22K64l20L84m48N20o14P24q38R63
29E15j106J269j452J651j868K109k380K683l010L362l753M184m655N166n720O331
45C326p000P728q524R394j0351J1405j2564J3844j5267J6859j8649K0676k2990
58a2113K5667k8805L2540l7072M2708m9947N9628p3302R4203j30416K10176o70930
70e37663K56675J216111r88721J51622O94224r41586r38334J098755L90548p28691
80c27060N32714P19170j240448n67297J229914R5302j038128N96653P42642r53804
90b10342l54834R77782k75116q05104P52675N06550r17247J12998R41949p03113
100B6198r27168Q74776N07399p66119K83855Q35072p75788p79709O86923J37981
$$ y = [0, 0, 0, 0, 0, 0, 0, 8, -8, 8, -8, 16, -24, 32, -32, 40, -56, 64, -88, 102, -120, 144, -176, 208, -240, 280, -334, 390, -448, 515, -591, 678, -774, 877, -991, 1118, -1262, 1421, -1589, 1773, -1980, 2204, -2451, 2715, -3005, 3326, -3674, 4054, -4470, 4924, -5427, 5978, -6586, 7258, -8009, 8850, -9799, 10877, -12113, 13554, -15251, 17289, -19783, 22925, -27022, 32606, -40696, 53507, -76909, 133267, -537663, -280988, 935123, -53598, 98024, 792248, -149338, -1087672, 11083, 401631, -327060, 205654, 924824, -315624, -882921, 346993, 442295, -595833, 820, 743462, -210342, -565176, 412606, 137490, -667614, 85061, 591611, -325636, -212638, 729311, 26198, -900970, -26194, 481205, -284914, -1059, 834013, 58225, -721484, -34561, 103420]
110A03420o11701O64915P31610r34556n49790P89496j12267p34234O80839P03035
120G30767p64904l09886O34558l21423n53393P48261M01944p79146K6519O60832
130D74129n47348n82689P50470L39485o36254J60887N09482n90937m04694O41539
140A14070O2262n17939M23958M60887o47278k77446O00577j08583n13206M32544
150B9846L77116n23386p6859M99018k58159m19416M30818J82143m89685J31887
160a16677M84928l60181l68880M37683J14468m15450J98582L77477l74113k52233
170b74396L61554l1458l02191L42116K88613m39182j75862L38962j14841k77010
180b83695L34909K23291l46024m2702K69767j89451j97881L19933Q8372l22324
$$ y = [103420, -508281, 156634, 888244, -46312, -596102, 193394, 81127, -653107, 27732, 730767, -34137, -344023, 290535, -30888, -584281, 163980, 565924, -213222, -186703, 474129, -73219, -655908, 94562, 434047, -202207, -41320, 468162, -122775, -527469, 114070, 176332, -341607, 82351, 543238, -104040, -381486, 219091, 110508, -402698, 29846, 406962, -116424, -193283, 305735, 47576, -371840, 58978, 241121, -248564, -116677, 368251, 8070, -360810, 76873, 191341, -224109, -25527, 351950, -22163, -274396, 87158, 55700, -246491, 95625, 384238, -54944, -230806, 108156, -6685, -283695, 51214, 274505, -71519, -114221, 155546, -33905, -231786, 88147, 176519, -145805]
190a45805P2757K63387j98527j39962K70695n383k75774J18876J93978k04156
200d9914p2393K29352n8563k03258J58399J31627j92983j7127J74040j13657j42566
211a57043J90053R6154j65801K1395J32123j31754j07893J52300L3712j28386
221f5140O6021R9136j26722n4546J28257k3969j12694Q4638P2492j10674q774
232e1975J19758l7113q9005P1800L9982q4105J2046P0115n6265l9181Q1624O03
244C8284q3273L3792O0939o6254m3903O1219J0824l6928L2876K3881m6704O70
256a4577M1991l0571l2839N1644K4237m5943k875L5233j6735k4480J7710j783
268A012k2667J6370J5749k3916k027K7192q893k4201J7175J7869j5225m038J5115
$$ y = [-145805, -73048, 190339, -8188, -148150, 122545, 117162, -158612, -39736, 154242, -49914, -122307, 107045, 48482, -154776, 3623, 135250, -57733, -74860, 99180, -14477, -157043, 33010, 129164, -36637, -15242, 116881, -14873, -122766, 29534, 63246, -65140, 881, 100017, -26705, -81251, 47006, 23037, -89657, -5019, 67473, -43201, -51975, 67783, 30670, -58335, 13465, 53447, -30658, -18612, 51503, -4762, -43943, 37681, 38284, -44989, -11197, 49742, -16512, -60415, 804, 11628, -25300, 7576, 31457, -15247, -14577, 27414, -3157, -35996, 15648, 39885, -6058, -8933, 26300, 9565, -14915, 2795, 1012, -21655, -5285, 10464, -13452, -15479, 11713, 2820, -21381, -4206, 13663, -1562, -5600, 9515]
281I515j092o477R420j560j1135O437L503j6603m197J6002L95j4631m44P492n99
296c974j029J674j010M556P582m295p456O934Q536m057n320L323K412k742n321
311a87n156j449L336l17m595J454P204J98m570m69K445Q25R7K442L623M857J894
328A1632l507m939q40o55n220k756L416L467j032j314pk675k615j059Q4O09P256
345a55Q822O39l141J234p64o064j617J590k550K280P544k463q462L384L304j2923
361i342r709P545N532J292J0678N812o909k14K666j5297p753J9915J0642j3768
375A090K026J5210q582j4876K921m939j2655J0657J0621j1835O509K5704j2812
388I039k8623J4008J7964j9953n593K2074j784q987K0890L108k4833O012R495
$$ y = [9515, 8423, 1946, 11366, 9806, -1329, 5108, 8611, -7992, -12189, 3813, 4208, -10423, -10867, -3375, -3974, -5003, -3329, -4339, 217, 7799, 3504, -3952, 2982, 11518, 7461, 2141, 5464, 7876, 5134, -187, -5343, -6792, -3456, -3773, -8368, -6914, 290, 488, -4082, -4551, -2106, -1281, -1184, 1258, 4881, 9738, 11632, 8125, 3186, 2346, 1691, -3529, -6285, -2869, 598, -434, -1748, -1755, -4430, -7045, -8104, -8020, -7411, -155, 8667, 9306, 6165, 7399, 6635, 571, -1046, 544, -2006, 274, 7818, 5355, -3107, 277, 3581, -9342, -19051, -11506, -5974, -4682, 5996, 11808, 4899, 4685, 7351, -7946, -15699, 4216, 14858, 1090, 3116, 18326, 9744, -5132, -2211, -7150, -19805, -9148, 1473, -10362, -3853, 21851, 9039, -19584, -5576, 12388, -7565, -13158, 8916, 7132, -1855, 19035, 22143, -2690, 3322, 12817]
401A2817l9181j7427M7457J9174k6444Q659J8354l2559k0845K4315k373j1721
413a9774L7891J5901m3001P7M2299k2338m0429L1194J9755l7407K307L1884k3269
426d910j6200M2195k618m7296J8797K9454m6348j5818O3244J2222l7593K1682
438A6811J7765n4108j3677M6431j2647k5933N0793J8765o1174j343M5549l7844
450a0612m2388N0113K4516l9408K1107L7495n0807k9174N4544J132m2843M0166
462A3841L5603o6794k8124O0536N952k9478L9641O506p9764j3134N8455q261j5317
475b0338O3313R401p8967j0033M4185k2599j1872N7824j12n3626K7621M1306m8469
488b366k7941M1760j0827m1165M1158L9527m0343j5011K7110k7437k4958N6771
$$ y = [12817, -26364, -43791, 3666, 22840, -3604, 5055, 23409, -9150, -29995, -5680, -8053, -19774, 18117, 34018, -8983, -8906, 33393, 11055, -29374, 1820, 21575, -15832, -13525, 18359, -4910, -21110, 21085, 18467, -28829, -10032, 19422, -26926, -42744, 20500, 32722, -4871, 16811, 34576, -19532, -33209, 13222, 575, -25358, 25435, 44200, -16974, -18317, 27232, -10612, -53000, -2887, 21629, -17779, 3328, 40823, -9984, -39158, 15386, 16518, -26325, 13841, 49444, -17350, -45474, 15062, 21014, -8464, 31177, 37683, -42081, -55215, 3240, -5021, -20338, 42975, 52376, -26591, -36624, 7561, -15038, -26910, 30914, 30802, -22824, 4797, 46103, -2366, -30307, 11453, 626, -40539, 619, 40146, -197, -15208, 11902, -15535, -40493, 16278]
500A6278K5550n4156j3118L0287j8497o953N8165J6551m8805j5471J876l2778
512d1071O267O1014R565l1747R522L326m5196j3375L4352M381p453K7540J2198
525B9323k3248n421O72k4107K240M0529Q829k5914o295m35j3055P477K4794M770
539B0159r132j3796k9061j2120L3087L2019J082j661n194k3370j1360Q453k47
552a1141N181K5370K086j6609J1590N868l9831k4037K2376J2043O472L5671K563
565C7602n1682j9021J8441p104J3642N6640n464o7354p173L0536j1672J4208N7814
578E9413j9303p0890RJ6645k6288L1924P2387k9170o3708K5348J0440n5716J9588
591b9321O6636k7294l2085N5650L601o5940J9285M0169n9586j9320Q5841N540
$$ y = [16278, 41828, -12328, -25446, 4841, -13656, -20609, 37556, 54107, 5302, -10169, -8293, -41071, -34804, 26210, 35775, 4028, 13550, 16876, -28320, -41695, -7343, -2962, -10415, 17125, 29323, 6075, 654, 1326, -22781, -20541, 19988, 28817, 2903, -3392, -3827, -16882, -9405, 15389, 20159, 11027, -2769, -31830, -43950, -10863, 21156, 22238, 20577, 15383, -7987, -19347, -10894, -11141, -5960, 19410, 21496, 4887, 16477, 22345, -17486, -41523, -19147, -7104, -632, 35039, 37602, -14080, -33101, -14660, -21764, -8122, 48518, 43054, -24300, -31473, -937, -12609, 1599, 59413, 40110, -30780, -30771, -14126, -40414, -8490, 63897, 34727, -28981, -3633, 6807, -48909, -29321, 37315, 10021, -22064, 33586, 37187, -28753, -9468, 30701, -28885, -48205, 37636, 43176]
603D3176o5609K6690K7363p4663p031Q7328j1883n8040M5721J5234q4013J6506
615c9221R7278k6475n4379N4110n583r5724K9103R1261l7746k9591P3604k3096
627C3541j03553L6291O7614o2105r673R6701k3248q8897N2081M5531q3684k07
639c9608R3631l6553o6551P4487K5709r6322J5961Q8049n5608n6336Q2104Q152
651C7115r6182L1284P7351o1191k8061R1358j7011r8206M5013O1700p2208o276
663c5314J00942k5642q6588N1096L4027q6155R114R3882l8916o3799P0276J6493
675C9416r2502K1044Q2679n3941m5669Q0954L585q5611L5889O7604o2656k5407
687c4615Q0807j9163q2021M8540N1912p0636o736Q3211l0440p2336N1422L1027
$$ y = [43176, -22433, 4257, 31620, -43043, -50074, 37254, 25371, -32669, 13052, 28286, -55727, -39221, 58057, 31582, -22797, 31313, 25730, -69994, -40891, 50370, 12624, -16967, 56637, 33541, -70012, -33721, 33893, -28212, -37885, 58816, 35568, -53329, -1248, 44283, -39401, -39608, 54023, 17470, -49081, 25406, 51115, -45207, -29246, 58803, 3195, -53141, 28963, 37115, -59067, -27783, 49568, -11623, -39684, 51674, 34663, -63543, -18530, 43170, -29038, -35314, 65628, 39986, -46602, 4494, 38521, -47634, -38520, 55362, 16446, -47353, 22923, 39416, -53086, -32042, 50637, -3304, -48973, 31981, 35566, -50045, -14156, 53448, -9208, -34615, 46192, 27029, -54992, -6452, 45460, -25176, -31912, 51299, 20859, -51477, -55, 30972]
699C0972p0505J2204P4427l9610m9081O4125J3929p5100J9438O4379m6385l5460
711c6667O3775K936o3939K6963M3326n2860j7019O3778j3245n8148L6298L5581
723C0779n1733m169N8977j9151m5633L6119J8313m7302J1338N0218l0125l5079
735b7448M1091P025m8371J5085M1393l1239k3448L7490m64l6035K1600K6520l4204
748a1005q824L9520p992l2260K4033K0207l2335m536L0622j0053k2155K1005P055
761A3282k9071N024K5780j5732j7099K2373M685k3454P664J9758j2862r196J7677
774H829j758j7627J1141J3946j4466n998J4420m504j3562Q413O707j1802o09J1847
788D977n027q931R676M015r975L45R392k861l469P715Q24p102J484L594o589k982
$$ y = [30972, -39533, -27329, 47098, 7488, -41593, 22532, 36461, -38639, -19201, 45178, -1207, -36667, 27108, 30044, -33895, -6932, 36394, -16466, -33485, 30293, 17048, -41100, -4802, 30779, -20954, -25123, 33854, 14703, -30930, 5189, 23502, -23800, -12462, 37756, 7631, -27448, 13643, 20668, -27703, -12618, 28775, -2464, -25912, 11578, 11114, -24921, -3321, 23199, -11005, -19829, 19691, 11699, -20561, 3472, 23679, -8656, -13192, 17430, 7377, -14778, 6227, 13282, -15789, -10765, 15015, -717, -17816, 4557, 9242, -14212, -6548, 13210, 348, -8848, 8829, 7071, -10556, 585, 14531, 65, -5933, 8487, 3983, -9579, -1166, 5541, -6261, -6870, 4977, -50, -8981, 695, 4710, -5265, -4920, 4472, 1611, -1858, 5857, 6681, -421, 1063, 4657, -1932, -4914]
804d914O883K07n411J952M029l186l090R21j198j302L898K455j136K891L639l112
820C526m228O82J043k079k62K257J503J022m09l080l295N0p11k381J140N461K952
837C191q26Q33k83j796j950j098j001K478M377N95j307J191N0o524m410J395N87
854d498r04L798M512o52k19J624m847m503L842K286l801M489Q225k241n521K720
870D310j248r185m80N001k375O80Q978p09q466K889L690j0327l000J1823J611
885C192o383Q375O975r876l177O168p816q288J1183M991r910M634J2005j1263
899H10j2329J0926K148j4010N958J4129p439k982J5058l452j6377Q463N731j7383
913a0749k87K2635k268j4994J1795N436k1766k326J5749r364p611K1507L719k0365
$$ y = [-4914, 1969, 2176, -3235, -1283, 2746, -440, -3530, -2609, -3807, -5109, -1211, 1244, 108, 2999, 6638, 3526, -702, -20, 1023, -1056, -1318, 939, 2442, 3464, 3055, -25, -3320, -3270, -3981, -6362, -5222, 239, 3191, 2365, 3198, 2915, 1119, -831, -1929, -2930, -452, 3925, 4520, 3213, 4404, 4454, -2070, -6480, -5085, -4498, -5402, -1604, 2908, 2256, 2037, 3661, -1186, -5689, -1847, 439, -3362, 1127, 9352, 7111, 1590, 4310, 3062, -6123, -6603, -1602, -3977, -3297, 5681, 4972, -3494, -605, 3085, -7242, -10242, 1581, 3192, -3191, 5184, 12159, 2283, -894, 5274, -2542, -10830, 353, 5344, -4566, 68, 12073, 810, -11519, -593, 1555, -12455, -6497, 7632, 193, -2789, 12269, 8817, -7560, 903, 6634, -10749, -11036, 11599, 9331, -5663, 6132, 11568, -10198, -12524, 3225, -6139, -13750, 7757, 11476, -8889]
927h889Q878J6636k0189j2714K1859J805j9718J3081J7177j7741n411J8845j1198
940B421k0874J7637Q990k4847M796K9899j0337j9304J9271L740k8342M099K3031
953A0180j3373n715K8610l494k9132J3576J6673k9929q332L2459l548k4264K0198
966C909J4020k8574j257K5373j6922j7298L0328N837l4355J1490L2557k1471j6948
979a3311K9632l487l6611J3393K3737k2204J145L5459j6252l6230K0685J5168
991A1124l3592N952M2156j5505k7600K6552O911l4775J1256L1143k7079j6761
1003b0218L7245j863l7550K0268K8376l4935j2524L8659j0068l5348K6047K0470
1015A8559l4348M701M1660k0907l3291K9786O352m1915J7258M6638k3945k4805
$$ y = [-8889, -11, 16625, -3564, -16278, 5581, 7386, -12332, 749, 17926, 185, -5226, 13619, 2421, -18453, -816, 8174, -16673, -11877, 18022, 7685, -11619, 7652, 11392, -16950, -12851, 10180, -3193, -8908, 19702, 16208, -12924, 652, 17325, -12604, -20936, 11523, 7975, -16289, 3909, 17929, -10645, -11902, 13471, -3451, -20749, 9579, 15416, -18939, -7449, 25108, 3637, -13311, 16321, 12834, -23777, -10384, 13353, -8851, -7706, 27753, 11501, -24729, -4044, 11124, -22468, -16516, 25640, 10135, -17465, 9087, 15998, -18777, -7521, 23622, -3457, -20218, 17027, 15164, -22386, -2118, 26258, -8677, -21201, 17458, 7390, -27958, -1911, 18559, -15789, -11088, 30572, 9665, -23626, 6160, 12512, -29403, -12145, 34493, 10548, -14257]
1027a4257L2809p657m6930K1007L8548k7772r222L9830j7982m3833L1512K8359
1039B4412l7549N58M3390k5985l9710L8155K1644l8293R474L7795l4225l0931
1051c1265L8577L230m0433K7079M0166l9638k2201M2945q325m6665K6837L5778
1063B6085l3579k654M2438k2315m1079L3993J7764m3775J0476N0320k8932m1185
1075c2443L6552J3264m1800J6490M0442l4364k5421L9388n401m1043L5697M0627
1087D1988m3403j9711M1836j4958m3688L4642L4295l5510k413L5540k9655l6826
1099c7863M0701J7297m3005J3378M4543l3067l4688M0331J1344m0021J5664L3510
1111B8124l2927j6766M0869p486l9110K9329L0142m3086j2680M4048j0900m0135
$$ y = [-14257, 18552, 10895, -36035, -15028, 23520, -4252, -13474, 26356, 8374, -35459, -3947, 24412, -13137, -12579, 30811, 4826, -34884, 3271, 24915, -13378, -3904, 33891, -334, -31265, 7312, 10542, -29891, -2812, 37354, -2284, -24485, 18460, 10135, -36530, -9693, 26085, -7494, -10148, 32290, 9975, -31104, 2889, 20653, -23122, -12646, 37674, 8742, -32443, 4109, 17373, -24427, -7937, 32505, -1859, -27280, 12108, 6707, -34336, 1361, 41988, -1415, -21126, 20710, 5752, -37936, -3294, 31001, -4509, -6922, 28618, -1037, -37863, 2838, 20135, -22870, -9492, 35051, 1984, -32704, 7627, 18971, -21050, -5386, 28124, -4803, -21569, 19300, 11814, -27296, 2033, 32175, -10911, -23591, 20457, 9557, -30578]
1123c0578K6854K5018l1814J850L5069k4519l1738L3808J1848l6936J5773M2035
1135C6670k8973l3380L0412P281l2676J6780L0168k8962j6645L1538p164l0607
1147b5558K7919K5193l7981j2029L7318o031k9005K3563J8736l0307l336K7961
1159A6443j4391j8942K8073M277l5885Q080L4066j7585k2307K4472N021k9550
1171a8228P807K4641j3982q032K2102q568k6732J9154K2004k3110q934K6072n453
1184H741k4845J2599J6491j6764l528J6721j0838j3696K0377O211k3054L279K1724
1197A3418j1748j5269J8441Q385j8378J48J2315r265m362J5915k904j7441Q471
1210b274J1718j5840n671J9606Q45j6440L572Q746p543q77J1350m027q407Q895
$$ y = [-30578, -3724, 21294, -10520, -8670, 26399, 1880, -29858, 3950, 15798, -21138, -5365, 36670, 7697, -25683, 4729, 12010, -20666, -3886, 26282, -2680, -19325, 12213, 5049, -25558, 2361, 27554, -10427, -22456, 14862, 8831, -20174, 3389, 22125, -8182, -11518, 16443, 2052, -16890, 11183, 15460, -20425, -12345, 21721, 4136, -18171, 6301, 11322, -18228, -10421, 14220, 238, -7794, 14308, 5740, -20992, -1838, 20166, -2944, -11878, 14194, 8741, -16104, -3505, 12986, -3778, -7306, 9415, -1423, -15119, 5258, 11469, -11585, -8306, 13418, 1670, -13599, 4842, 13227, -5151, -5003, 7312, -1953, -6315, 9600, 6696, -10745, -2274, 9444, -6396, -12067, 7539, 8384, -8056, -4484, 4262, -3281, -4158, 7192, 3165, -5242, 3653]
1224C653L208j3772J744J4736m467j1190N674N311q952r67P445l461l080P647
1238C529q80q472L783P677o825m587Q286L051p193J348N312m187l208M131q79
1253H86m706L908K682n783o39O139r51m587K025L078l737j384L750P19p45L258
1269C913L03m581m51K373k337k520L447K357k659r71J565j063j421J201l27j439
1285b610J325K857p95j48K067K79k504j440J374q16p12J661P22q78J3Rj088j521
1303b205n1N01m37J167K298O1m49K46k11j041o26R08K06L00J317m19n32o58n21
1322a46j491r65L09O63Q73M90J346L9m66o83r04m51J160R79J42J112P93m32j814
1341E54j043k94j133j85J026M51J011R34q30j573j37L90j305L75K231J511J14
$$ y = [3653, 6861, -6911, -5167, 9569, 5102, -6088, -414, 4897, -4055, -5022, 2423, -1038, -4118, 3529, 2649, -5823, -2040, 5637, -1188, -5775, 2511, 5562, -1631, -283, 5029, 842, -2366, 1765, 886, -3820, 88, 2770, -3013, -3652, 2487, 1536, -3051, -1026, 2052, -1685, -3069, 681, 1400, 655, 3913, 4216, -365, -816, 1557, -780, -3300, 147, 2504, -155, -1126, 439, -624, -2045, -844, -1171, -2610, -1285, 1572, 777, 629, 2696, 2975, 471, -969, 405, -411, -1123, 538, 1260, 382, 395, 404, -684, -2205, -2256, -1755, -2192, -1025, 1273, 1334, 885, 1131, 920, -121, -747, 161, 367, 667, 1984, 1565, 1033, 375, -146, -1637, -2602, -2293, -1630, -757, -267, 1079, 1118, 652, -31, -935, -1386, -226, 753, 895, 2007, 2800, 2368, 554, -489, -783, -1916, -2101, -1075, -624, 387, 1321, 491, -1082, -1219, -829, -2134, -1759, 472, 1983, 2097]
1358B097M15kj210j664p52j305O38K274R28j013J57J367k428k760L90J297l86
1375a957J705J516K75J377P96k079l531R68J051k084J75M536J108k607j154k21
1391a26k603l74J177p54J90N103J515m478L10L490k845m915J935L318O4J078J791
1408C876k535j190J507l214m728L743M922l632k539O139K248m726j121J746l301
1423b805M63L604j307n73O782J487r541k735O323j737n839M309N034l022l75K531
1439B599l926k168N141j449p635N686R022m573n773O814J594q026p92M906l143
1454a723m03O051k724n711O346M981j0368l374Q576j408p006N983P676m593j548
1469G55L458n887n208Q056K691q156M026R450o944q772O858K564q883J864O978
$$ y = [2097, 2512, 2510, 1300, -364, -1116, -2421, -1783, 491, 1419, 406, 563, 1930, -498, -3258, -2868, -1571, -1957, -252, 1264, 1539, 2916, 3712, 1633, -1898, -930, 121, -1963, -1788, 2748, 3856, 1249, 95, -126, -2729, -3103, -1926, -2680, -2490, 2613, 4128, -350, -40, 3450, 605, -4310, -2375, 943, 1007, 2085, 3876, 1341, 151, 1658, -1556, -6284, -2541, 2381, -1251, -3790, 2349, 4597, -129, -1250, 496, -2805, -2342, 1262, -45, -618, 6164, 7651, -1890, -4625, 1698, -39, -5878, -1569, 3465, 443, 68, 2599, -1327, -3495, 1646, 197, -7438, -1752, 7270, 2697, -3076, 3738, 5332, -2694, -3486, 1420, -1723, -2126, 3925, 1201, -4510, 1836, 6817, -3551, -6925, 1651, 243, -6763, -780, 6896, 2303, 755, 4213, -1674, -6882, 1174, 3865, -4291, -265, 9185, 2241, -6531, 327, 2891, -5992, -4128, 2850]
1484B850m006j974Q298k239q768O002O547r573k801J0724j427r368N436O814o230
1499B85j358N910o660q049Q240M782p180M198J0213p987j1151N999M378o309M528
1514a61Q608n937n436O624j800q887O599P677q980m283Q835p12p448M592N586
1529D877p359r47P577m235o765P598M017p498K609R191n295q958L699P54o073
1544f808O024R854m611o071K994m224p929P440J0147l911l069L723m488o913O207
1559a635P476l499o40K538o838n693P891N701m239Q2L176o545n392N523K449k954
1575b599M325M032n906k311M422j862n017L292M896j370N16K600n033n446L132
1590b329K446j995L764L848n872n444K159J913L97M947K207n801l336J277j614
$$ y = [2850, -1156, -3130, 5168, 2929, -5839, 163, 6710, -2863, -5664, 5060, 3633, -5735, -299, 6515, 285, -1073, 4837, -1823, -9872, -1632, 3150, -4030, 168, 10381, 2394, -8757, -2758, 1620, -4689, -161, 8447, 2510, -2926, 3698, 1898, -6989, -390, 7287, -1693, -5976, 2859, 2147, -5301, -709, 4877, -2482, -3429, 4148, -87, -6852, 746, 4763, -2735, -126, 9065, 3770, -5188, -1489, -735, -6808, -784, 9070, 4459, -1612, 1382, -2842, -10771, -3331, 6816, 2905, -164, 3559, -929, -7842, -1635, 5841, 2342, 1702, 4240, -2598, -8291, -400, 5301, 1062, 1144, 4320, -2225, -7617, -2094, 355, -2599, 1726, 5758, -148, -2459, 1963, 101, -4916, -1624, 3272, 1902, 2418, 5018, -15, -5461, -2329, 117, -1878, 1886, 5734, -138, -5582, -3423, -1510, -1113, 3834, 6041, 240, -3096, -1819, -3433]
1605c433R75P656K602o262l041j6k902M94N695J741k191N04j699n822J008O239
1621A548m00j982L372P09m385r79K442r75L62M099j767m121K929J148n972k91
1637d263O415k71l239J769K08m168J349L416j929R40N176j883p959J235N238k709
1653f75k22N588p81o220L26P64l022L755N776l672n328L837J241n845K252O955
1669D729k120m236K787j70l361L206L269n283j318O057j800o130L635M112n339
1684a962k165N506k40l238L113M49n207K323N932k988m152N005L64o430Q68O527
1700C705j609k537K771k472m849L704L815m302l12N561j672o120L467M004l794
1715f40q33L720j611k648M685J189n701N67M153l944l466N247J776m392P09K928
$$ y = [-3433, -2458, 5198, 7800, 1538, -1503, -1519, -4421, -3927, 1768, 3509, 1318, 1822, 123, -5699, -4691, 1548, 1148, -834, 2538, 3247, -1138, -2117, 325, -650, -288, 3811, 2044, -2077, 852, 2000, -3972, -4263, 2152, 1881, -1358, 411, 619, -3549, -2200, 1216, -713, 227, 5403, 3520, -4439, -3204, 2034, -675, -897, 4691, 3910, -2310, -1984, -1220, -4242, -487, 5289, 1617, -3711, 126, 1367, -4478, -2226, 4729, 2609, -1627, 1160, 990, -2371, 835, 4104, -1179, -2497, 3560, 1760, -4370, -735, 3377, -1962, -4127, 1379, 1139, -2099, 1014, 1463, -3744, -1421, 4511, 1523, -2629, 2376, 2740, -3690, -2822, 3705, 2096, -441, 2330, -142, -4991, -1287, 2528, -1774, -2086, 3475, 1803, -4317, -850, 3154, -640, -1473, 2247, 636, -2012, 2673, 3862, -1839, -1272, 2881, -1063, -4529, 718, 2494, -1898, -1189, 1739]
1731A739k343j239L329q59m037L043L232l434l85N099j464m720P08K241k572N1
1747a611L588j585j959K812K7m312R40L856j967k796L524J703k404R65J346k423
1763b96p91K406p08k518K362K388k806j443K469p41k419Q04J262j565Q09K546
1779A759r15j234J730J0k999K05K579m62q75J793L75j741q32L73j146n97J932
1796d5M52j482J248J030j156j013J176k02j203P19J362k29M54J052j306j216K27
1813a32j49j281K34J489K92q84J074Q3j176m73J20m07K01J484J032l25j10J76
1831A248j158n10k60K38k18N67Q86o7o17K29n20j019k71J56M11N94J318J0p2k
1851I43k71j053q47Q60M52K12K21N65j80n48m15j055n38N08J50K97J138R52o73
$$ y = [1739, -604, -1843, 1486, 627, -3410, -367, 2865, -569, -954, 4145, 2681, -2039, -1331, 910, -1662, -1611, 1977, 392, -1567, 1245, 1272, -3040, -2100, 1756, -211, -3007, 517, 2220, -184, 781, 2127, -296, -1087, 1319, 611, -1907, 455, 2843, 37, -1406, 1063, 322, -2097, -1293, -31, -1596, -787, 1759, 844, -390, 1340, 1350, -1649, -1444, 1135, 673, -202, 1591, 1966, 225, -607, -234, -1380, -1977, -45, 407, -1075, 173, 1203, 47, -966, 210, 8, -1195, -476, 886, 657, 1111, 2163, 857, -359, -132, -281, -1562, -1328, 161, 453, -431, 643, 726, -450, -923, -803, -1210, -1009, 475, 1507, 1182, 1072, 1248, 90, -420, -680, -442, -660, -93, 793, 726, 109, 338, -182, -1201, -1472, -1316, -905, -311, 1007, 1017, 945, 943, 672, -381, -1228, -368, 84, 296, 517, 1082, 902, 354, -61, -1116, -1654, -1146, -996, -699, 439, 1391, 718]
1870G18n40j40k42p43j1J214L43L03M87p10p44K68k90j713M4J624M48m63M18J052
1890A323j218m17J87q42j71J820M74j091J166J351j895j930N96L03j047N25J490
1907F24k72o3Q67j264k127J559Q76j631J51K789L09j743P21P52j693o83J276p52
1925c04j005K292L06k377Q29K428k830k401J795J374k007J295L229j334j592J981
1941A679j368k684J844K124k066m81M184j225l925J067J483k974p4L908j154j955
1957a617K216J125l585O46M077k149l246L168J073l207J229L964k200k853J936
1972E77m76m268K374M572k829j234L878r06m993K008L472l297m79M546n90m015
1988a660K952J379m931k46M892j575l535L683J359n375Q75N104k361l084L403
$$ y = [718, 178, 38, -204, -947, -958, 256, 599, 902, 1389, 679, -65, 203, -87, -1800, -1756, -132, 316, -147, 271, 1323, 105, -312, -125, -967, -1138, 682, 1156, 65, 1231, 2582, 687, -1243, -647, -344, -1391, -866, 624, 352, 289, 1156, -108, -2235, -676, 200, -1431, -1280, 1509, 1818, 75, 796, 1548, -145, -828, 448, -304, -1309, 983, 1289, -1088, -259, 2169, -661, -3062, -1267, 107, -1900, -605, 2624, 1290, -302, 1679, 311, -2373, -529, 1595, -471, -952, 3232, 2007, -1918, -851, 632, -2342, -2416, 1492, 338, -1617, 599, 1724, -1861, -1215, 2862, 713, -2533, 635, 1708, -1499, -270, 3694, 1494, -1359, 577, 101, -4167, -1793, 2779, -50, -1284, 2594, 1688, -3305, -1297, 2175, -1122, -1601, 2945, 2355, -1660, 1292, 2671, -2260, -2506, 2386, 811, -2724, 959, 2318, -3057, -2182, 2922, 561, -2523, 880]
2003H80J29m646J822N437k315j765L820j346n825J713M784l267j132N133j140
2018B282n406K023K759m498l60N910j281l883L841J412n619K79N878j255l770
2033a688L369P92o166R66N849j533k860L703j156n732J541M855k218j604M712
2048B830k8o347K336L794l752p32M184k32m201L869J721n524j375N321j434k897
2064b467M083K284o504j187M707r72j171M125K64n893J66M215k343n06N085l13
2080C573o188L2L594j790j236M283m44m033J643K221l553m72M027j064l394L623
2096H22L161m202j631K800j063j759L486J386l728m93K185k868j514M899J450
2111B931l995l83K338k184j371L722R69k174P88J346l342m39L272m17k399J728
$$ y = [880, 1009, -3637, -1815, 3622, 1307, -458, 3362, 2016, -3809, -2096, 2688, -579, -1711, 3422, 2282, -3124, -1101, 1658, -2840, -3200, 2710, 1429, -2454, 1387, 2799, -2820, -2541, 3337, 2082, -1688, 1681, 2473, -3693, -2727, 3122, 1589, -1271, 2432, 1276, -4456, -2915, 1940, -278, -1882, 2830, 2802, -3545, -1209, 2585, -1167, -1899, 2285, 2053, -2148, 1721, 3442, -2082, -3457, 1864, 430, -2467, 1616, 3900, -2604, -3791, 916, -56, -1227, 2898, 3162, -2731, -2565, 1650, -693, -1199, 3886, 3573, -2615, -2583, 1011, -779, -2015, 2268, 1824, -2209, -566, 1655, -1898, -2370, 1657, 593, -2801, 822, 3983, -219, -1850, 950, -113, -1872, 1614, 3000, -728, -1221, 964, -1904, -3418, 1481, 2931, -1064, -1447, 891, -1293, -2664, 1058, 2027, -147, 641, 1987, -1355, -1794, 1478, 1061, -1338, 390]
2127C90K562l252j670J984q96j185K196J656k208j37J129j871j283L181K145k232
$$ y = [390, 2952, -300, -1970, 14, -882, -2067, 129, 1785, -423, -560, 569, -1302, -2585, 596, 2741, 509]
$$ [...]
8191I4
##END NTUPLES=NMR FID
##END=
