##TITLE=1H_DE-80H_X3
 200.13MHz, CDCl3
 8 sc
 
 19ns.26.2.2025
##JCAMPDX= 6.0         $$ Bruker NMR JCAMP-DX V2.0
##DATA TYPE= NMR FID
##DATA CLASS= NTUPLES
##ORIGIN= UXNMR, Bruker Analytische Messtechnik GmbH
##OWNER= pz
$$ XWIN-NMR		Version 3.5
$$ Wed Feb 26 17:55:03 2025 Russian Standard Time (UT+4h)  new_Human@DPX200
##.OBSERVE FREQUENCY= 200.1313
##.OBSERVE NUCLEUS= ^1H
##.DELAY= (6, 6)
##.ACQUISITION MODE= SIMULTANEOUS
##.ACQUISITION SCHEME= undefined
##.AVERAGES= 8
##.DIGITISER RES= 18
##SPECTROMETER/DATA SYSTEM= spect
##.PULSE SEQUENCE= zg30
##.SOLVENT NAME= CDCl3
##.SHIFT REFERENCE= (INTERNAL, CDCl3, 0, 14.3821)
##AUDIT TRAIL= $$ (NUMBER, WHEN, WHO, WHERE, WHAT)
$$ ##TITLE= Audit trail, XWIN-NMR		Version 3.5
$$ ##JCAMPDX= 5.01
$$ ##ORIGIN= Bruker BioSpin GmbH
$$ ##OWNER= new_Human
$$ C:/Bruker/XWIN-NMR/data/yarkov/nmr/H-C/1/audita.txt
$$ ##AUDIT TRAIL=  $$ (NUMBER, WHEN, WHO, WHERE, WHAT)
(   1,<2025-02-26 17:53:04.34 +0400>,<new_Human>,<DPX200>,
      <created by zg, POWCHK disabled, PULCHK disabled
       configuration hash MD5:
       00 E9 B6 7A A2 85 ED C7 34 08 36 98 17 FE 4E 26
       data hash MD5: 16K
       8F 87 63 9D D4 99 60 AF D7 82 76 09 D3 42 61 A1>)
$$ ##END=
$$ 
$$ hash MD5
$$ 91 95 D5 FE 59 9E D7 3F 9E 38 1F 69 0D E6 F1 52
##$RELAX= 
##$RELAX= 
##$RELAX= 
##$RELAX= 
##$RELAX= 
##$RELAX= 
$$ Bruker specific parameters
$$ --------------------------
##$DU= <C:/Bruker/XWIN-NMR>
##$EXPNO= 1
##$NAME= <H-C>
##$PROCNO= 1
##$TYPE= <nmr>
##$USER= <yarkov>
##$AMP= (0..31)
100 100 100 100 100 100 100 100 100 100 100 100 100 100 100 100 100 100 
100 100 100 100 100 100 100 100 100 100 100 100 100 100 
##$AQSEQ= 0
##$AQ_mod= 1
##$AUNM= <au_zg>
##$AUTOPOS= <>
##$BF1= 200.13
##$BF2= 200.13
##$BF3= 200.13
##$BF4= 200.13
##$BF5= 200.13
##$BF6= 200.13
##$BF7= 200.13
##$BF8= 200.13
##$BYTORDA= 1
##$CFDGTYP= 0
##$CFRGTYP= 5
##$CHEMSTR= <none>
##$CNST= (0..31)
1 1 145 1 1 1 1 1 1 1 1 1 1 1 1 1 1 1 1 1 1 1 1 1 1 1 1 1 1 1 1 1 
##$CPDPRG= <>
##$CPDPRG1= <>
##$CPDPRG2= <>
##$CPDPRG3= <>
##$CPDPRG4= <mlev>
##$CPDPRG5= <mlev>
##$CPDPRG6= <mlev>
##$CPDPRG7= <mlev>
##$CPDPRG8= <mlev>
##$CPDPRGB= <>
##$CPDPRGT= <>
##$D= (0..31)
0 0.7 0 0 0 0 0 0 0 0 0 0.03 0 0 0 0 0 0 0 0 0 0 0 0 0 0 0 0 0 0 0 0 
##$DATE= 1740577983
##$DBL= (0..7)
120 120 120 120 120 120 120 120 
##$DBP= (0..7)
150 150 150 150 150 150 150 150 
##$DBP07= 0
##$DBPNAM0= <>
##$DBPNAM1= <>
##$DBPNAM2= <>
##$DBPNAM3= <>
##$DBPNAM4= <>
##$DBPNAM5= <>
##$DBPNAM6= <>
##$DBPNAM7= <>
##$DBPOAL= (0..7)
0.5 0.5 0.5 0.5 0.5 0.5 0.5 0.5 
##$DBPOFFS= (0..7)
0 0 0 0 0 0 0 0 
##$DE= 6
##$DECBNUC= <off>
##$DECIM= 32
##$DECNUC= <off>
##$DECSTAT= 4
##$DIGMOD= 1
##$DIGTYP= 9
##$DL= (0..7)
0 120 120 120 120 120 120 120 
##$DP= (0..7)
150 150 150 150 150 150 150 150 
##$DP07= 0
##$DPNAME0= <>
##$DPNAME1= <>
##$DPNAME2= <>
##$DPNAME3= <>
##$DPNAME4= <>
##$DPNAME5= <>
##$DPNAME6= <>
##$DPNAME7= <>
##$DPOAL= (0..7)
0.5 0.5 0.5 0.5 0.5 0.5 0.5 0.5 
##$DPOFFS= (0..7)
0 0 0 0 0 0 0 0 
##$DQDMODE= 0
##$DR= 18
$$ [...]
##$SUBNAM0= <"">
##$SUBNAM1= <"">
##$SUBNAM2= <"">
##$SUBNAM3= <"">
##$SUBNAM4= <"">
##$SUBNAM5= <"">
##$SUBNAM6= <"">
##$SUBNAM7= <"">
##$SUBNAM8= <"">
##$SUBNAM9= <"">
##$SW= 18.0517328524113
##$SWIBOX= (0..15)
0 0 2 0 0 0 0 0 0 0 0 0 0 0 0 0 
##$SW_h= 3612.71676300578
##$TD= 16384
##$TD0= 1
##$TE= 0
##$TE2= 300
##$TE3= 300
##$TEG= 300
##$TL= (0..7)
0 120 120 120 120 120 120 120 
##$TP= (0..7)
150 150 150 150 150 150 150 150 
##$TP07= 0
##$TPNAME0= <>
##$TPNAME1= <>
##$TPNAME2= <>
##$TPNAME3= <>
##$TPNAME4= <>
##$TPNAME5= <>
##$TPNAME6= <>
##$TPNAME7= <>
##$TPOAL= (0..7)
0.5 0.5 0.5 0.5 0.5 0.5 0.5 0.5 
##$TPOFFS= (0..7)
0 0 0 0 0 0 0 0 
##$TUNHIN= 0
##$TUNHOUT= 0
##$TUNXOUT= 0
##$USERA1= <user>
##$USERA2= <user>
##$USERA3= <user>
##$USERA4= <user>
##$USERA5= <user>
##$V9= 5
##$VALIST= <valist>
##$VCLIST= <CCCCCCCCCCCCCCC>
##$VD= 0
##$VDLIST= <DDDDDDDDDDDDDDD>
##$VPLIST= <PPPPPPPPPPPPPPP>
##$VTLIST= <TTTTTTTTTTTTTTT>
##$WBST= 1024
##$WBSW= 4
##$XGAIN= (0..3)
0 0 0 0 
##$XL= 0
##$YL= 0
##$YMAX_a= 332302
##$YMIN_a= -343042
##$ZGOPTNS= <>
##$ZL1= 120
##$ZL2= 120
##$ZL3= 120
##$ZL4= 120
##$ABSF1= 10
##$ABSF2= 0
##$ABSG= 5
##$ABSL= 3
##$ALPHA= 0
##$AQORDER= 0
##$ASSFAC= 0
##$ASSFACI= 0
##$ASSFACX= 0
##$ASSWID= 0
##$AUNMP= <proc_1d>
##$AZFE= 0.1
##$AZFW= 0.1
##$BCFW= 1
##$BC_mod= 2
##$BYTORDP= 1
##$COROFFS= 0
##$CY= -3
##$DATMOD= 1
##$DC= 2
##$DFILT= <>
##$DTYPP= 0
##$F1P= 0
##$F2P= 0
##$FCOR= 0.5
##$FTSIZE= 0
##$FT_mod= 4
##$GAMMA= 1
##$GB= 0.15
##$INTBC= 1
##$INTSCL= 1
##$ISEN= 128
##$LB= 0.25
##$LEV0= 0
##$LPBIN= 0
##$MAXI= 10000
##$MC2= 0
##$MEAN= 0
##$ME_mod= 0
##$MI= 1.114404
##$NCOEF= 0
##$NC_proc= 0
##$NLEV= 6
##$NOISF1= 3.799351
##$NOISF2= 2.8
##$NSP= 1
##$NTH_PI= 0
##$NZP= 0
##$OFFSET= 14.38212
##$PC= 1
##$PHC0= -1162.71
##$PHC1= -33.60778
##$PH_mod= 1
##$PKNL= yes
##$PPARMOD= 0
##$PSCAL= 0
##$PSIGN= 0
##$REVERSE= no
##$SF= 200.129724274929
##$SI= 16384
##$SIGF1= 3
##$SIGF2= 2
##$SINO= 400
##$SIOLD= 16384
##$SREGLST= <1H.CDCl3>
##$SSB= 0
##$STSI= 0
##$STSR= 0
##$SW_p= 3205.1282051282
##$SYMM= 0
##$S_DEV= 0
##$TDeff= 0
##$TDoff= 0
##$TI= <>
##$TILT= no
##$TM1= 0
##$TM2= 0
##$TOPLEV= 0
##$USERP1= <user>
##$USERP2= <user>
##$USERP3= <user>
##$USERP4= <user>
##$USERP5= <user>
##$WDW= 1
##$XDIM= 8192
##$YMAX_p= 0
##$YMIN_p= 0
$$ End of Bruker specific parameters
$$ ---------------------------------
##NTUPLES= NMR FID
##VAR_NAME=  TIME,          FID/REAL,        FID/IMAG
##SYMBOL=    X,             R,               I
##VAR_TYPE=  INDEPENDENT,   DEPENDENT,       DEPENDENT
##VAR_FORM=  AFFN,          ASDF,            ASDF
##VAR_DIM=   8192,          8192,            8192
##UNITS=     SECONDS,       ARBITRARY UNITS, ARBITRARY UNITS
##FACTOR=    0.0002768,     1,               1
##FIRST=     0,             0,               0
##LAST=      2.2672688,     0,               0
##MIN=       0,             -343042,         0
##MAX=       2.2672688,     332302,          0
$$ Real data points
##PAGE= N=1
##DATA TABLE= (X++(R..R)), XYDATA
0@%%%%%%%%%%%%%%%%NnQj6J6j6J6k4L2l2L7m5N1n8O6p5Q4r5J07j20J36j50J68
39I0j88K09k34K58k86L17l50L85m22M65n11N65o25O88p61Q42r33J036j154J295
59F86j461J661j909K223k639L219m080N495q230J5440p2538k33300m7609N9685
73b83357J26350J93146K05632R0366l8216j27346j81238j92300j12259J7497J32132
84a69593J80584J70180J09834J0220j10980j84848j80387j11621p956J06033J74697
95a3837J70014J10997K0452q8455j68641j76172j13578j7714Q3675J53451J63499
106A23691J13816L2339o4802j48410j68982j17522l1687O0257J36611J59750J18168
117B13229L9359m9095j25569j59259j26329m2550N2424J19594J41333J19767N6837
$$ y = [0, 0, 0, 0, 0, 0, 0, 0, 0, 0, 0, 0, 0, 0, 0, 0, 0, 5, 0, 8, -8, 8, -8, 8, -16, 16, -16, 21, -24, 27, -31, 35, -40, 44, -51, 56, -64, 72, -78, 90, -98, 111, -123, 135, -151, 166, -184, 201, -221, 244, -267, 298, -327, 361, -400, 442, -491, 545, -609, 686, -775, 886, -1023, 1200, -1439, 1780, -2300, 3195, -5035, 10405, -62133, -295433, -343042, -283357, -157007, 36139, 241771, 332137, 293921, 166575, -14663, -206963, -319222, -301725, -169593, 10991, 181171, 291005, 301225, 190245, 5397, -174990, -286611, -294567, -188534, -13837, 156177, 267174, 287626, 199171, 30530, -145642, -259220, -276934, -193259, -39808, 123691, 237507, 269846, 205044, 56634, -112348, -229870, -261557, -201300, -64689, 95061, 213229, 252588, 203493, 77924, -81335, -207664, -250214, -197790, -78196, 63137, 182904, 239741]
128B39741l4457j13591j41144j21474o2064K7766J06933J35542J17145O5160j4747
139B04810r6638j36765j22950o4243J6611R0074J27675J17343O5365p635p4902
150A18745j18172j19467p3669J55O9699J12030J16292P7996Q992o4133j11771
161A6697j15638p7215j0421N8518J04096J10465P7658J7414m9551r7410j08598
172g3985q1556k2028M4885R1371J02811Q2063K9364l7043q7150j01984q1919l2274
184a67445L1496Q1937R9328Q1286L4503k4537p5026r7807q2700l6701K0555O8027
196f7084R3038Q3243M0181j5616o2310q7949q2979m4236J0836N7124Q3871Q1888
208I0007M8285n439n4951q2163p9286m8865O81N0609P9049P7427M8613L677m3182
$$ y = [239741, 205284, 91693, -49451, -170925, -232989, -205223, -98290, 37252, 154397, 219557, 204810, 108172, -28593, -151543, -215786, -199175, -109101, 18574, 135917, 201282, 193647, 118745, 573, -118894, -192563, -192408, -122709, -10679, 105613, 183609, 192601, 128468, 16697, -98941, -176156, -186577, -128059, -23963, 86502, 164160, 181574, 132023, 34613, -73985, -155541, -177569, -132684, -41313, 61498, 143561, 172925, 135882, 48732, -53252, -135171, -167445, -135949, -54012, 45316, 126602, 161105, 136568, 61542, -36265, -118965, -155666, -135111, -67084, 25954, 109197, 149378, 133762, 71452, -16497, -99476, -143712, -132876, -75752, 8119, 90007, 138292, 132853, 77902, -4261, -83547, -132412, -131731, -81122, -2073, 75354, 123967, 127644, 84462]
221H4462p3574p5334n0995r859L6274P0755P6944N2780J1479l3437o7668p4984
233e3157n2716j2785K8500O2548P3145N4055J5673k4833n6516o9426n6426k1044
245a12982K0931N3982O7824N6377K3246j7982n1553o3788n4912k5870J2891M7465
257d4371O3158N4980K7921j0138m3994o0195n3639l0453M540M0232N9454N4790
269F2285K9739l515l5302n5236n3220l2459o0L1382N2849N4181L4077J000k9350
282E6371m8822n2011l6019n053K6144M7713N1772L6202O012k3787m2860m7868
294c2206l7135j1979J9695M2493M8939L6893J1770j7418m0066m6321l6511j4513
306g6359J3789L7592M6285L7314J4401j1549l3231m3075l7301j8562P774L1569
$$ y = [84462, 10888, -64446, -115441, -125300, -89026, -18271, 58673, 111453, 122932, 89495, 21827, -53157, -105873, -118658, -90158, -27610, 45535, 99590, 115263, 90430, 33914, -35512, -91938, -112982, -92051, -38069, 29755, 86132, 109378, 91396, 39843, -23945, -78857, -104727, -91836, -44371, 18787, 73767, 101688, 91550, 47556, -12639, -66278, -96731, -92191, -51959, 7495, 62285, 92024, 88509, 53207, -2029, -55249, -87708, -87768, -56386, -3537, 50644, 84721, 85721, 56371, 7549, -44462, -80481, -85534, -59390, -11677, 40095, 76297, 82309, 58522, 15662, -32206, -69341, -81320, -61625, -19132, 29807, 66700, 78470, 61052, 20986, -25335, -61846, -76359, -62570, -24978, 21307, 58621, 73022, 61473, 28242, -14833, -52134, -70696, -62922, -31353]
318c1353M3838L8480J7630q491k8707l9418l7075k0501M320K6880L9402L6822
330D1827K1679k965k4522l6398l5670k3584j537K2728L6786L5953K2374J166j9797
343C8040l3164l3934k3566n072J6947L2785L5040K3936M747j5070l0086l3334
355b2731k5330p301J2963K9481L3300K5048P300j2056k5337l0927k5429j0609
367e1628R074K5175L1497K5811J0576q942k3532k9050k5016j2502N804K1949K9628
380H844K5166J2032m701j9486k7104k4594j4178J724J8569K7663K5147J3604k481
393D0205j6567k5029k4422j4759O0J5064K4722K4563J5239N12j3877k2172k3970
406b0431j6399k475J2570K2137K3625J5754K803j1021k0716k1978j6461m568R193
$$ y = [-31353, 12485, 50965, 68595, 60104, 31397, -8021, -45096, -65597, -61277, -34397, 5005, 41827, 63506, 60541, 36019, -379, -36049, -59633, -61170, -38442, -1656, 34297, 56671, 57837, 38040, 4876, -29058, -52624, -57696, -40749, -7964, 27076, 51012, 55759, 40689, 10603, -22731, -48061, -55362, -42399, -12918, 20382, 45430, 52730, 40674, 15337, -15590, -41019, -51628, -42554, -17379, 14118, 39929, 50505, 41563, 18031, -11019, -36035, -48537, -42733, -20784, 8844, 34010, 46042, 41341, 21855, -5249, -29843, -44021, -42297, -23728, 3935, 29082, 42686, 40205, 23638, -1391, -25813, -40572, -40512, -25448, -726, 23837, 39076, 39588, 25711, 3539, -20431, -36830, -39305, -26735, -4598, 19027, 34781, 37584, 26563, 5847, -16131, -32592, -37160, -27967]
419b7967K0130K2279J6887M949q288j8528k1675j6353o621O843J7150K1724J6518
432B7048O606n871j5982j9857j6995p188M337J4576J9740J7420Q041l755j4248
445A3872j8756j6904q857K611J3245J7840J6736R005j583j1336j7154j6475j0018
458b7774O69J0450J6848J6859R848j93r835j5939j6131j0380o26Q745J4901J5771
472A3213J0880J605p588j4022j5354j1541k542P314J3716J4818J1020K910o296
485A8133j2985j4346j1062m075N802J1949J4264J1670M293m865j1086j4099j1509
498a7916m487L984J0491J2885J1605N054l459r224j2717j1672n816K540R025J2668
512B961J1799N764j531q589j2274j1415o003O35P762J1629J0935O322M8o929j1073
$$ y = [-27967, -7837, 14442, 31329, 36278, 27990, 9462, -12213, -28566, -35187, -28344, -11194, 10530, 27048, 33654, 27783, 11801, -8056, -25051, -32239, -27902, -13326, 6414, 23834, 31875, 28120, 13872, -4884, -21788, -30645, -28034, -14789, 3051, 19787, 28792, 27209, 15873, -1281, -17756, -27774, -27105, -16655, 193, 17052, 26900, 26707, 16872, 933, -15198, -25578, -26204, -17459, -2558, 13213, 24093, 25698, 18110, 4088, -11266, -22807, -25349, -18035, -4319, 10499, 21519, 24429, 18133, 5148, -9198, -20260, -24335, -18533, -6584, 7680, 19350, 23643, 18778, 7692, -6407, -17916, -22403, -18419, -7928, 4957, 16562, 21616, 18157, 8933, -3784, -15456, -21272, -18732, -9707, 2961, 14760, 20524, 18993, 10404, -1870, -13285, -19288, -18653, -10891, 738, 11673, 17995, 18043, 11114, 41]
527D1j0905o911n1O146J0507J1271P082P75o057j0332j0804o993j009M993R379
542b868J0410P552J665l823r444j0219p703k010L953Q859R829O978L079l466q662
557D130r731p027l072K807P794R177P480L576j761p421r204p970l322J837O907
572e800Q511P527L716j447o234q154p656m190J127O095P889P289M664m69n566
587G302q174p424l892Q7M659P448P005M564L47l999p000p809m705j83M052O700
603a022P073M989P85l658o548p075m472j448L125O019O303N316J920k774n663
618B870o943m854j733K514N404O312M988J946j876n327o192n370j878J831M400
633c908N873N420K376j048m636n874n293k411J471L956N183N466K653p08m102
$$ y = [41, -10864, -17775, -17826, -11680, -1173, 10098, 17180, 17955, 11898, 1566, -9238, -16231, -17240, -12247, -2868, 7542, 15094, 16759, 12936, 3492, -6727, -14430, -16440, -12487, -3628, 6201, 13179, 16258, 12792, 4130, -5601, -12628, -15700, -12893, -5099, 4078, 11558, 15134, 13373, 5952, -3252, -11222, -14544, -12707, -5800, 2711, 10238, 13954, 12507, 6273, -1881, -9537, -13727, -12600, -6505, 1384, 8673, 13337, 12868, 7302, -872, -8296, -12188, -12101, -7442, 6, 7011, 11575, 11922, 7923, 923, -6886, -11591, -11774, -7722, -1022, 6051, 11040, 11825, 8167, 1619, -5456, -9928, -11376, -8251, -2232, 4071, 9387, 11307, 8533, 2870, -4073, -8927, -10660, -8146, -2742, 3570, 8558, 10504, 8628, 3301, -2891, -8261, -10139, -8308, -3908, 1965, 7385, 9761, 8713, 4077, -1797, -7090, -9501, -8030, -4074, 1109, 6575, 9228, 8520, 4418]
648D418n393n142k710M77L729M898M926L474l23l128n004n356l024K09L042M466
664d41M518L373N54k414m863m848l463o91K910M147M761L437Q51k101m179m883
680c332l314q99K060L601M127L642J182j307l416m745l546j007J095L336M722
695B199L458J550j108l473m420l408j304M15L117M129L522J765m09k954l907l494
711d322j848K91K715L856L320J919r7k239l647l535k191L9K119L212L778K037
727E407L22k215k972l620k231j72K135K839K967K347K40j324k921l281k070o38
743e187J385K692L058K710P72j574k441l239k203r78J017K542K964K278J224r04
759D116k469k977k434j209P46K520K576K687R49o10j940k600k433r23K05J357
$$ y = [4418, -975, -6117, -8827, -8350, -4621, 277, 5203, 8677, 8354, 5226, 222, -5134, -8158, -7949, -4907, -441, 4077, 7450, 8004, 5590, 727, -4121, -7584, -8275, -5365, -1218, 3543, 6980, 7831, 5730, 1551, -3332, -6646, -7545, -5485, -1884, 2243, 5885, 7067, 5760, 2344, -2401, -5947, -6954, -5859, -2523, 2199, 5657, 7207, 6099, 2626, -1794, -5202, -6506, -6091, -2974, 1155, 4677, 6442, 6033, 3079, -828, -4322, -6170, -5879, -3164, 692, 4012, 5931, 5834, 3595, -52, -3587, -5778, -5739, -3620, -408, 3370, 5407, 5729, 3514, 542, -3078, -5309, -5481, -3346, -507, 2460, 4807, 5047, 3723, 802, -2479, -4549, -5187, -3802, -1110, 1948, 4658, 5430, 3856, 1415, -1824, -4027, -5005, -3988, -1446, 1518, 3796, 5020, 4116, 1647, -1330, -3764, -4973, -4227, -1707, 869, 3556, 4505, 3895, 1955, -645, -3078, -4001, -3796, -2439]
775b439K926K215J728l36j647k803k374j384L57J566K243K588J246L0j524k409
791a7k448j426j41J546K150K192J801M35j661k096j975j712m66J197K076K141
807A596J701M52j293j844j940j816o67J136J680K262J702M89o06j995j716j718
823b577n06J38J757J779J974N17k67j237k167j857r38M33J238K173J827O31j68
840B750j031j915j481j105m7J110J712J487J232O2j274j641j772p79o0Q86J778
857h8J789P12K23j120j036j697j188l59Q58J619J373J418m5n06j713j412p20n24
875b416L02J741J275J179O24n11j645j039j546o58O02J240J603J182L90l76j002
892I45j382j255p22O24O69J357J263N52j9q10j359j437o28J0J142J051J467O51
$$ y = [-2439, 487, 2702, 4430, 4094, 2447, -356, -2730, -4114, -3757, -2191, 52, 2640, 3886, 3916, 2392, -17, -2465, -3891, -4032, -2486, -336, 1856, 3657, 4092, 2431, 335, -1640, -3352, -3818, -2621, -545, 1596, 3297, 3749, 2456, 612, -1328, -3144, -3811, -2675, -995, 1267, 2969, 3458, 2852, 857, -859, -2577, -3083, -2945, -1188, 591, 2565, 3082, 2815, 1578, -589, -2446, -3384, -2951, -1713, 460, 2287, 2918, 2750, 1719, -196, -1677, -2782, -2829, -1719, -7, 1480, 2712, 2774, 1500, -141, -1913, -2692, -2752, -1866, -88, 1701, 2413, 2636, 1516, 480, -1217, -2405, -2764, -1906, -287, 1086, 2504, 2459, 1953, 240, -1172, -1892, -2416, -2114, -373, 902, 2081, 2705, 2194, 549, -490, -2036, -2694, -2092, -852, 751, 1933, 2323, 1947, 945, -437, -1692, -2414, -1790, -1121, 236, 1499, 2051, 2032, 1222, -137, -1574, -2202, -2192, -1050, 1, 1468, 2119]
910B119o5j041j091j000p48j1R04J058R12R29r0p05r93j154q89r9P56R34J045
929G71P63K07k15q49j349r31k35K84J280Q21R16oq2j074q16q97m03M56O30J250
949E21Q20K23k17q01q55r14k59j82P79J175R87L23j89p72r21p99m78J69O98R55
969B63N31Q37j05o47j027o52n63pO84M01J258M14q0o08n27p06n59k16M83Q00Q73
990H47M05k88k03j50j030p25k47N46M41Q09R99j20m01o02n17o48l52J46O28O71
1010B09Q50o9j32l35q44l54n74L00O00O23O04K41j07m55o90k93l57l9M60N02P27
1031H67J2J8n00l35q57l5K94L9N28L80L49K51o38j63q23m44j78O61N10N02J68
1052F06K32k14m23n83m82m7J12N28M40N49M6R6n16m72m81l32N4M85M61N37N6J14
$$ y = [2119, 2054, 1013, -78, -1078, -1826, -1837, -933, 125, 1037, 1966, 1876, 1171, 178, -976, -1865, -1964, -1208, -274, 771, 1534, 1741, 1526, 677, -672, -1603, -1838, -1554, -274, 547, 1463, 1457, 1375, 301, -515, -1412, -1815, -1359, -729, 521, 1341, 1564, 1347, 546, -309, -1223, -1482, -1664, -885, 290, 1277, 1600, 1411, 639, -282, -1081, -1559, -1390, -692, 263, 794, 1631, 1526, 879, -148, -800, -1363, -1370, -686, -285, 973, 1387, 1307, 699, 172, -534, -1093, -1309, -826, -26, 847, 1252, 964, 761, 611, -419, -1144, -1391, -845, -404, 405, 1404, 1284, 883, 281, -236, -884, -1236, -1090, -462, 209, 1059, 990, 858, 523, -321, -675, -1249, -949, -349, 274, 878, 1119, 1012, 557, -133, -426, -783, -822, -362, 140, 867, 879, 897, 397, 62, -795, -830, -536, -497, 31, 411, 760, 1011, 373, 210, -613, -1057, -1235, -574, -64, 438, 606, 838, 624, 201, -382, -864, -911, -799, -271, 169, 718, 764, 860, 344, -128, -609, -941, -887, -402, 59, 596, 652, 766]
1074G66j99o43n58O4k61L97K25Q52J4K42n86l29n46J48k74K86N88M96M7m5l02
1095C82l46m68J5j91O9L78N37N24m18J61r39j9l61l4L80L11M93L23nm05j67m39
1117b19R8m93J36N87L34n4K98P2m93m90l80l20O7L42O29K83j66K12j11l28o51
1138f47rJ79L01o7Q18J2n7N6o82k89l23J05o6Q59o8K65o1k99J88n90l47L46J29
1161b47L19L22L2J19l46j03L6n21L3q8J77Q53j35o7m0k87k25j47r0k3J44L41M59
1184E16j44K21o32k41j31Qr5N64J76K06J08j82k71j12k58p4Q2J21K98M6l1K60
1206D35k91k07k84qJ70k43L19L69K1O4k63j88j01j69J47n0K52K09K04K16l93j39
1228G0m87J2J23J46P0M6K63L1J30n33j48J03k10J75k22O07R3k5K44j55n04j22
$$ y = [766, 567, -76, -634, -570, -831, -434, -209, 643, 657, 899, 313, -16, -562, -414, -688, -402, 186, 682, 729, 684, 382, 36, -432, -417, -608, -539, -161, 376, 900, 482, 643, -296, -315, -676, -710, -330, -19, 474, 797, 792, 387, 220, -219, -121, -614, -478, 109, 443, 389, 687, 759, 266, -224, -604, -924, -857, -515, 114, 397, 231, 443, 332, 4, -647, -656, -477, -176, -243, 575, 587, 530, 586, -96, -385, -708, -603, -669, 190, 122, 387, 326, 27, 215, -375, -722, -376, -247, 72, 394, 426, 545, 199, 96, 132, -389, -356, -444, -267, 586, 451, 384, 344, 57, -168, -315, -405, -428, -284, 57, 516, 372, 593, -39, -280, -411, -403, -498, 66, 242, 448, 556, 374, 103, -9, -267, -341, -259, -138, 160, 206, 175, 435, 144, -63, -347, -355, -185, -428, -109, 260, 281, 345, 82, -106, -207, -376, -229, -279, -27, 182, 386, 602, 209, 70, -417, -405, -282, -136, -66, -20, 243, 274, 404, -129, -277, -174, -384, -209, -431, 176, 269, 244, 488, 333, -171, -293]
1250b93O5N3m5L55L58j52jj94j74J40o39K57J45J10R5M8l96M64l17o8j46j75N6
1273d54N84Q9j3K9L4r4l29K3k5J37j55J94J57J04m02J50j37qm4j81L12L9J51J97
1297C58j85k23P6n33L18q1L47k19L19j25J49k91j13L2j53K63L5J27RL40l00k54
1319a04j69K21j95n8O6j07M61J4J88k22j83K23l55K29j94K04N2L8J1k60o9J08
1341a01p5K54l66J98L82Mj41j66k12L02k62j65L35K23J14P6k10J9k12k8O7l73
1363c37L01M8N5L75o1k18L5j48n8o7P2J80j16p7J1L44l21J39j43n2P6J78k20R8
1387I4O9k53J35p9n2JJ72k74J5K85K6J85L2m04j6j80J39K60qj0O4q1K05N6k67
1412A14k44l5j93j63O66J50k17k80M31l67J03k89L61jJ04P3j71j63J68l10J11
$$ y = [-293, -228, -175, -220, 135, 493, 341, 340, 146, -28, 112, -527, -270, -125, -15, 80, 128, -268, 196, -121, -189, -335, -510, -454, 130, 219, 206, 235, 269, 175, -154, -131, -156, -19, -174, 20, 177, 281, -121, 29, -108, -116, -160, -341, -29, 10, 161, 358, 173, -50, 26, -507, -189, -270, 77, -142, 177, 52, 201, -90, -203, -171, -324, -61, -26, 101, 110, 450, 150, -104, -273, -52, -247, -305, -239, -346, 115, 129, 317, 95, -88, 135, -220, 9, -185, 19, 71, 109, 120, -140, -209, -101, -176, 78, -288, -90, 292, 296, 155, -11, -223, 79, -183, -348, -13, 210, 324, 400, 190, 209, -3, -31, 36, -337, -36, 12, 67, 442, 381, 163, 198, 50, -8, -75, -3, 177, 61, -16, -5, 339, 18, 157, 14, -38, 38, 216, -4, 94, 163, -90, 45, -34, -86, -85, 87, -187, -172, 113, 139, 324, 356, -48, -64, -244, -105, 155, 147, 137, 201, 120, 325, 381, 114, -130, -165, -358, -521, 145, 295, 78, -202, 229, -138, -35, -324, 37, 36, 140, 213, 42, -121, 47, -263, -152]
1433a52j15K32j05J57J6L6lK1k31n1K77l46J92K27J41m2J30l75l1L10k80j13J56
1456E1O7J60q2k21L6J28j08k97o6J03K01Q7q4q6N5J14j14M3m2J45k44N62l74Q8
1480A22l60K16J9L0Q7m54M76o6j38j79L71k97K45K6k25M34l95L62j61m0lJ18o8
1503A20l47L58k32K47j74M1L18k59r4N2k37J94k12Q1N3K14lj4k6q8J40j67k5O9
1527Ik47J53K59kj14k00J1K8j18O1J89J30k58J57M4j24N0k67L45J13k50P7k44
1550a98N00l58M26n63M3N05l10Q3j73L95n14J18Mm8N8K1rPJ45J2q7n1K4N9k58
1575a69k42L71k5P3p0K30n31N10l73K37L0j13P9j8R8J8O4m9k09j13J56M04l55
1598CN6l3N4J32J09l06j67J32k23K08j12M75j34k33O7q2m5m8M42o40L96J29k05
$$ y = [-152, -267, -35, -140, 17, 33, 69, 66, 87, -144, -195, 82, -264, -72, 155, 296, 254, 384, 9, -22, 288, 8, -105, 51, 118, 278, 196, -25, 11, 139, 31, -266, -332, -229, -28, 59, -25, -111, -56, 58, -56, -13, -55, 90, -154, 408, 34, 122, -238, -22, -3, 27, 114, -340, 136, 70, -68, -247, 124, -173, 72, 98, -127, 307, -88, 274, 113, 73, 70, 188, 120, -227, 131, -101, 146, -28, 13, 331, 72, -22, 30, -207, -13, -225, -144, -91, 123, 120, 106, 80, -8, 132, -35, -60, 9, -238, -85, 174, 172, 58, -142, -131, -103, -221, -160, 29, 159, -99, 58, 102, -22, 28, -239, 106, 219, -31, 46, -198, 302, -56, 370, -193, -150, 355, 45, 128, -45, 350, -164, -46, -42, -90, -32, -11, -20, -13, 132, 144, 57, 6, 30, 89, -169, -411, -40, -65, 8, -62, 168, -363, 147, -226, 11, 41, -72, 7, -11, 87, 105, 169, 120, -89, -202, -46, 358, 3, 59, 26, 80, 212, 321, 15, -152, -20, -243, -35, -147, 328, 194, -39, 28, -54, -99, -147, 295, -345, 51, 180, -25]
1621b5K66j80M1M0k58k7Q5mL0M3Q7j16J47k32N1N7j11K26l7k81K92r2r4N6k1j25
1647a82J6N7J30K8J14n2k44J90k21K15j17J21j3J26l56K58N3k54O0q9J86k5l26
1670c25M49oj14l9J6m1P7n6n6j34K26j2P3j20J4M1j16J36j73K19N5q3P9l03J87
1695fP9k57Q7K9j03L04N4o7k34k0O8J68N7m18R7L65k33N1J57j97k28j3j50J05
1719c05L52jj85j9L81k32j64L20k14N7J68l69L08J7k98L9J85j14P3lJ86j73p2
1742f3O9j77K73r0l3N5K7j66J77l90L23K31j76J13j14j25o9J92J39j00J58p2j12
1765G0j3n9j34J84k89L95l34Q9J01r1J57K6r5k29M59j48m6j46n7L0K28j67J36
1788F7k7K8k42K83j42K2K55l01r8K68l63j12K01N8K00K90l75j68K20j12jL2j74
$$ y = [-25, 241, 61, 102, 142, -116, -143, -58, -62, -32, 11, 98, -18, 129, -103, -52, 5, -106, 120, 83, -198, 94, 2, -92, -36, -57, -182, -166, -109, 21, 49, 163, 111, -133, 57, -164, 51, -66, 55, 42, 168, -188, 70, 123, -131, -71, -160, 26, 1, -325, 124, 118, 4, -35, -19, -60, 17, -39, -95, -229, -3, -15, 58, -62, -48, -7, -123, 13, -160, 59, 114, 31, 110, -193, -6, 73, -184, -97, -68, -171, 133, 187, 120, -114, -134, -66, 102, 159, -259, -162, 203, -30, 21, 178, -19, -247, -260, -410, -305, 47, 46, -139, -158, 223, -9, -173, 147, -67, -10, 158, -211, 97, 114, -184, -145, 40, -74, -1, -4, 182, 9, -63, 6, -171, 102, 12, -21, 34, 61, -105, 72, -318, 5, 236, 60, 173, 59, -66, -135, 57, 196, 96, 254, 182, 70, 57, -2, -136, 48, -241, 154, -180, -91, 10, -81, 76, 102, 7, -222, 237, 89, 43, -103, -160, -130, 98, -69, 67, 40, 68, -174, 109, -33, -11, 244, -57, -155, 113, -250, -362, -161, -103, 97, 387, 12, -156, 64, -48, -49, -17, -191]
1811a91J83j12N8m3L57l87J06j4J55k19R4j64K76p6n7j69l3J21M6R4K7L6k82J43
1835e1j26J23J77l66M27l07L15k77j4L4J55j3l20L39l34K06p6OJ98k64j7M04k53
1858c4K3o9P9J53k36K08k17L29j96l34M16j48J24l63L85k98J57j0o9J82j56RK5
1881d0J58k45L1K14k12J75j51K09p6k21K57n09J05N84k17j04K21o08K64J42j7
1902d0q5p2N38l31rN2j71K0n6o3J39k4r6O7L0L30J0r2k34j22K47j95L27l90K80
1927F0J32j83j70L26l25L8J67j21o3K01j89M8q5K58n9j82K85j31j04n7J59J7l40
1950c18K96%l55J97L47L9K8m5m33J10L8J40J83j73p9Q0j32N4J72k29J81j59j00
1973a58J48J02j35J92K2j79kk51N5K62J30m76L94k40J32j32J00O0J8j05L0n4k4
$$ y = [-191, -8, -120, -62, -105, 252, -135, -29, -43, 112, -107, -13, -177, 99, 23, -34, -203, -236, -115, -69, 25, 52, 88, -194, -51, -177, -54, 123, -243, 184, -123, 192, -85, -99, -65, 90, 77, -243, 96, -238, -32, -108, -102, 96, -168, -185, 219, -34, -11, -80, -1, 152, -84, 124, -93, 236, 40, -294, 122, -26, 98, -265, 120, -178, -21, -31, -100, 82, -74, -65, -40, 118, -127, -96, 118, -94, 81, -70, 139, 63, -158, 99, -410, -305, 279, 62, -42, 179, -429, -165, -23, -40, -125, -197, 341, 10, 1, 53, -118, -98, -154, -217, -78, -102, -198, -131, -101, 229, 239, 147, -87, -209, 38, -157, 170, -220, 60, 192, 9, -161, 165, -160, -122, 45, -76, -139, 62, -127, -79, -164, 94, 35, -147, 138, 7, -97, -154, 5, 22, -318, -22, -22, -377, -180, 167, 206, 234, 189, -244, -134, -96, 44, 227, 54, -25, 55, -77, -23, 149, -80, 101, -58, -158, -10, 92, -43, 149, 171, -8, -10, -261, -206, 56, 186, -290, 104, -136, -4, -136, -36, 24, 42, -63, -33, -87, -111]
1996a11O9j03k1R4J95k46K97j64O5nm9k09J50l40L43MJ04lj81MJ42Rm19M42J01
2021A68k08J96k28L49j90L7l42L56l1l2m16J98J60o7Q9J85j76n2K63l81O6J45
2043H9j07L07k14j38J29J1J25j65J5O6k72K36j39J71j67K34o2j39m0j87L47j97
2065i7J18l04J90K28k19P4j67K59K3k27P8M94n91R7j47N2L19m39K70Jn4j1R7p8
2089c4J12k1k16M5L40p7k99L25k56J15k27N25k72j77LK31qj70jK50k72n7J73r
2113B3p7q1J50N0j16K04j93p1L0K09o9l01J83j03J54j92K72K5N2j00j84L53O9
2136B87l81k34M13K36n00j11L56j31J63n5Q9k62r9J74J11J4O1k26J15q7J52L5
2158A20k35J00O7j50K67J02l32j43J19K20p4J53m90J8M16j00j7qK17k37r9j64
$$ y = [-111, -42, -145, -166, -72, 123, -123, 174, 10, 75, 70, 21, -188, -38, -378, -35, -31, 73, 70, -111, -107, 35, 44, -375, 67, 168, -40, 156, -72, 277, 87, 124, -218, 138, 107, 75, -341, -143, 17, -50, 39, 224, 48, -4, 259, -122, -56, 89, -18, 289, 75, -63, 66, 77, 202, 37, 52, 118, -154, 82, -57, 114, -53, 181, 119, -20, -60, -247, 100, -97, 21, -283, -93, 135, -84, -10, -177, 82, 105, -122, -44, 450, -141, -44, -191, -139, 180, -259, 11, 12, -42, -53, 44, -34, 78, 57, -159, -114, 226, 149, -150, 175, -81, 34, -193, 332, 60, -117, -114, 117, 109, -61, -62, 188, -84, -141, 32, 23, -54, -135, 15, 65, -51, 153, -40, -111, -81, 128, 59, -242, -59, -162, -8, -200, 72, 97, 149, 49, -135, 218, 287, -94, -328, 85, 321, -179, -290, 66, -65, 98, 43, 132, -130, -229, -55, 56, 70, 131, -95, 20, -67, 85, 120, -115, -15, 52, -98, 169, 271, -61, -204, -85, 135, 61, 214, -276, -258, 158, 58, 41, 33, 250, 13, -86, -250]
2180b50K61J73l76J13j93K79K40k02L7rj18K11n18N04o2R0N7l02J01l84L82k12
2202a78J25J29l06L38l08P7K31j78P8K20m05K9K32k89K49j28k88L02J33j41l2
2223a10L51l05n7K88k55J76N6k00K24j89K1j5J44l20n4K39n1M19l69k32N72k92
2245D1j59R1K36l49L22K9j95K5j90M1J87o8k1K6O9o3rR2K33m40J67k9k52K48q2
2270e0L49l47J28j28r4M9K87k50J54J0j78P8J6k9q7K13o0J57k14J61j27R1m1r1
2294cQ7M0k16R4q5K07j14J48J84j59k29J59lm27J79j72K48J36j06PK47k88M8J43
2318A25j37K1l2K3J43j38K0J50k64J92n10N02o7j29k1K3J29K70l78J55J09l87
2340b01K07J42j13J05k23M4J11R7j78K16k23o4J71M7k80O9K77M0m43P9O0K1N1
$$ y = [-250, 11, 184, -192, -79, -272, 7, 247, 45, 82, 73, -45, 166, -352, 152, 90, 180, 237, -65, 36, -348, 34, -178, -53, 76, -230, 108, -200, -123, 108, -70, 8, 228, -177, -148, 84, -205, 44, -84, -372, -70, 63, -78, -110, 241, -64, -121, 167, -88, 88, 144, -56, 168, -21, 0, -15, 129, -191, -245, -6, -57, 362, -7, -239, 333, 41, -118, -27, 209, -140, 182, 211, 16, 41, -149, -108, 79, 11, -10, 16, 85, 22, 13, 105, 338, -102, 65, 36, -216, 32, -50, 299, -48, 80, -48, -142, -93, 194, -56, 98, 108, -70, 8, 24, -5, -92, 121, 61, 218, 4, 165, 38, 129, 88, -3, 84, 124, -92, 2, -83, 124, 10, 158, 342, 183, -46, 113, 110, -317, -138, -310, -62, 74, -32, -25, 222, -66, -18, 125, -12, 9, -23, 0, 143, 5, 25, 175, -89, 103, -407, 95, 28, -101, -122, -99, 30, 300, -78, 77, 186, -201, 6, 148, 35, 140, -83, -39, 72, 169, -9, 207, -16, -80, 91, 138, -142, -73, 204, 244, -199, -120, -60, -39, 12]
2363A2k17l6q6R8J9K62j47j42J2K88J04k3j1j9k57L66m12J86R7p4q1J71k6j51
2387f7Q3j14J31j24O4j48rL86k95J00L72n34Q5k26J10J02j53K93jp7r2M7o2L35
2411B06k98J68q7j06K88j46J2k19J12r8K12r6J2J27j42K40P1k84J43k46P8j9K6
2434d6J04p6J17o4j87K51P0l92J73O9j08R2K2J8j62j59M93k22K25J21n93N32l83
2457a05K42N6j0k83L29l69k5K06r9P5M3p3p7j3J65q5m3o5L9J9n9j2K73k66L16
2482A79k11Q4qk0R4k73k29L33k90L18R8J0R8j09j75l96M58L61j30k10p7kJ16j49
2506a30K39l6j25jM8r5J22j42L7K33j59O7J21k96p5K24j9j71K27M5m97M20o7L82
2530C52m31j04K91j91P9J51J65m18J38j05K15j68j2P9j15J49j09L10r8l03L58
$$ y = [12, -205, -241, -327, -229, -210, 52, -95, -237, -225, 63, 167, 144, 133, 114, -143, 223, -189, -3, 94, 20, -61, 110, 84, -67, 16, -98, 33, -91, -27, -175, -184, 202, -93, 7, 379, -155, -70, -296, -186, -84, -237, 56, 55, -22, -114, -67, -129, 206, -92, 76, -11, -117, 171, 25, 37, -182, -70, -168, 44, -52, -40, 87, -55, 185, 256, -28, 115, -131, -53, -72, -46, 58, -18, 99, 35, -152, 99, 169, -223, -50, 19, -89, 3, 25, 43, -119, -278, 215, -7, 218, 339, -254, 278, -105, 137, 193, 183, -100, 229, -140, -165, 41, -58, 17, 60, -13, -90, -103, 62, -23, -66, -131, -92, -73, -132, -144, 129, -137, 179, -32, 52, 44, 24, 118, -155, -384, -51, -341, -23, 75, 85, 183, 74, -101, -497, -39, 322, 192, -18, -95, -97, 19, -130, 109, 73, -52, -53, -5, -100, 22, -120, -83, 150, -9, 58, 179, -117, -192, 32, 13, -158, 69, 114, -383, 37, -30, 352, -79, -183, 108, -83, -4, 147, 312, -106, 32, -73, 142, -26, -38, 41, -74, 75, -34, 276, 178, -125, 233]
2551B33k73J15J66k22o1r4O5L38l86L90j72J62k60j04P2R0j1J48m15L8J62O2k80
2574b37M68k69J7J74j7j61J82l12Q7J46p2J59R7l40P7q3P0R0j06j9K94m59L92
2597A78k71l5M8J38L4l79K54k5M2N2j42J89L35m27j43J79Q6j68R2K7k13j72L62
2620D1K3J6k10J44k9j53K96Kk1K41k43j85Q8j99M37k86J83j77J64k37LN8L12m50
2644a82L19KJ27l84J78j33J92j10j18N71o31K17m60L47L8o9N7mp1K10l45K00L12
2667B63l23K46j17K7j88J08L1J7L7N3j09J54m12J03J56l7l91N11j1o2m9J32j52
2690a3J05K34l25N2k70j2J81J44K7k91J71N8j01r3K4k4L15j11m8j02J71M5l14
2713a77J58K10k71k8N7J2J80j51n0o9K86k22L6k10j64M12K42j82j51Q2N3k42J86
$$ y = [233, -40, 75, 241, 19, -42, -136, -71, 267, -119, 271, 99, 261, 1, -103, -31, 59, 48, 196, -219, -181, -19, 43, -237, 231, -38, -21, 153, 136, -25, 157, -155, -68, 78, 6, 165, 262, -78, -1, -84, -14, 76, -30, -49, 245, -214, 178, -93, -128, -80, 58, 92, -287, -33, -58, -16, 36, -106, 83, 418, -9, -152, 27, 113, -55, 37, 64, -149, -321, 41, 64, 80, -130, 14, -15, -168, 128, 130, 109, 350, 107, -78, 10, -189, 248, -38, 145, -32, 132, -105, -102, -44, 268, -182, 137, 139, 266, -118, 60, -73, 119, 9, -109, 462, -169, 48, -412, -65, -27, -96, -39, -43, -114, 96, -249, -49, 263, -60, 186, 69, 96, -92, 16, 47, 64, 101, 154, 45, 199, -213, -110, 46, 9, -382, 129, 118, 56, 7, 139, -13, 92, 326, 1, 53, -217, -229, -48, 96, 123, -168, 3, 61, -40, -133, -109, -133, 182, 71, 23, -79, 92, 137, -177, -19, 191, -80, -108, -51, -39, 141, -10, -60, -129, 157, -65, -29, -239, -403, 9, 251, 69, -82, 0, 53, -189, -3]
2736cj16N0J6J80j7j22j47n1K81J04J6l50J39j96J29O2J35k99L71n0K3J53j25
2759A83m7j36J62j07L00k90K17k54J85j87j18J52k9o6Q7o1J40K24l34q7QK34l37
2782a61M6R4K09j61J2j06R1m4K37l22K1K10k30r0J62l2J37J39j96j17j14L21k9
2805G7J09k48K18j20k54J42J94r2j2J18r4k04L49m50M48K5k49j65J57K02m50M62
2827A63l8N5p1J05k70o0L1k13L99l16K12j34J82k43L63k4j18Q3k09J6n4K20j56
2850g7K94k22m9l6K22k93J68j21J46K16l90J14pJ61k79n1K50m9J25L2k25MR0M5
2874F8K83k83M3k57J78j1l5K06j87J70m37K71K24j02l71J09L33l50L08r1p2n9
2896f2JL25l39O1J65Rl15L4K47kk79O3J9m3P6p5J61P8k18J24l7J80K3J49m85J87
$$ y = [-3, -119, -69, -53, 127, 110, -12, -159, -210, 71, 175, 191, -159, -20, -216, -87, -25, 110, -189, 182, 132, 155, 308, 183, 136, 0, 162, 55, 355, 65, 282, 28, 213, 26, -92, 60, 31, -35, 52, -9, 131, 355, 21, -66, -58, 176, -161, -115, -21, 188, 27, 39, -67, 24, -20, 217, -105, -84, 126, -104, -194, -32, -64, 73, 212, 16, -101, -215, 106, 77, 186, -62, 156, 36, -218, -76, 118, 26, 14, 132, 38, -166, 183, -267, 181, 206, -43, -208, -51, 151, -299, 163, 125, 180, 109, 214, -56, -116, -85, -298, 101, -215, -3, -137, 45, -198, 165, 141, 23, 106, -103, -87, -141, 79, -77, 217, -5, -54, -90, 132, -161, 7, -114, 32, 248, -142, -28, -35, 126, -153, -204, 46, -3, 122, 154, -71, -67, 23, 68, 351, 68, 111, -146, 32, 21, -14, 192, 5, 175, -262, 9, 233, 131, -240, -131, 202, -148, 160, 69, -3, -62, -61, 264, -75, -14, 151, 160, -155, -121, 126, 124, -155, -92, -73, -116, -40, -115, 46, 124, -94, 30, -7, 173, 196, 345, -140, 47]
2922D7j03j40J63K01j59m0j31L76k26m5O8L4r3R7L11m11j31M66m02L5Rl7J90L0
2946A09l8k48K95j90K13j17l4L68m66j7K66n3m1J64k46L31m77J72l46K71j88N89
2968C17l96Q1j32J52oJ50jm1K37m94J57l38K69J58N3j22j02j6P1O5n3J36O7k81
2992f9R9J08j5jJ7N7j64k3Q3k41J50J10Pl10M3jk0K44j97K44j3j62J26o3K11m75
3018b55K22K01j40n2Q7R0k79l2J66rk55J98k6k3K67k92R6J7N0m3J57j03j30r9
3042a87K10j87J29o2J09j36J88J18J28l77L8K94l49n3o3K11j0J93q7q9K3j49J50
3065D2o8M4j78m1K03j61J95K76j08j58k76Q2K03l50L66k8qJ64j26L4l16J38J81
3088A10k0r4qj40J95l69M77j72Q6n8j6J18j06j7J9Q7l41K86n5j93q5K42J37j91
$$ y = [47, -56, -196, -33, 168, 9, -31, -162, 214, -12, -57, 11, 45, -48, 49, 360, -51, -182, 284, -118, -83, -74, -111, 79, 109, 71, -177, 118, -72, 141, 24, -10, 358, -108, -125, 141, 88, 47, 211, -35, 296, -181, -9, -355, -84, -272, 317, -79, 2, -130, 22, 16, 166, 165, 124, 361, -133, 24, -314, -45, 113, 166, 44, -58, -74, -3, 62, 9, 145, 212, -69, 30, 138, 123, 122, 139, 196, 32, 9, 92, -149, 1, 111, 118, -192, -149, -150, -170, 74, -123, 121, 108, -54, 72, 9, 220, -255, -33, 168, 28, -24, 63, 153, -126, -158, 8, -1, -256, -58, -84, -107, 160, -132, -36, -19, 31, -12, 145, 42, -88, -187, 23, -164, -35, -97, 12, -124, 64, 182, 310, -67, -29, 265, -84, -137, -200, 11, 1, 194, 107, 18, 41, -108, 42, -26, 18, -160, -201, 2, -159, 36, 312, 204, 46, -230, -148, 55, -295, 71, 43, 35, 199, 73, 107, -209, -71, 110, 90, -4, -12, -152, 43, -326, 151, -21, 65, 7, -9, 109, 3, -14, 5, 92, -249, 37, -18, -211, -296, -54, 83, -108]
3112a08J89J48n64M33k34M52m51m9oM53k22m56M73j16j4j13J41O3J98n0j11j09
3134e3nj37K38j72J86kj61J59k20J32rM5q9L42l07K32n5k60J15O4l10M7K81k78
3158b17k9J26K03k73J76j38N9k26J90l18L31K89k84K11k48K01K8q5J37l72K56
3179A7j02J23j20K35N7k06j29K72j89J8j61rJ33np2K1J10r5P2K9J38k40J7K76
3203A90k14J08Jj6J80k82K05j86Q9n7L4qk5m1R8m5j26J97l86K34M9j6L01l85j0
3228a11K39J8k83K08J0m2j51K04k95L16M1j94K48n8k99K6J86q0j6L4K1o8K51l01
3252i6j98N07j13J32k72n6k64K93pJ1Q8l2Q8o9J58k05K11j86j20K26j55j5KJ32
3276F0R9j35J3j92J09J96k20L3k11J27K78j78l0j66Q1K81k71K3K18j17j3n0J71
$$ y = [-108, 81, 229, -335, 98, -136, 316, -135, -184, -190, 263, 41, -415, 58, -58, -72, -185, -44, 19, 217, 167, 56, -53, -58, -195, 43, -129, 57, 55, -106, 53, -167, -35, -44, 1, -88, 254, -53, 179, 124, -136, -21, 43, -267, -220, 61, -217, -246, -120, 83, -190, -14, -152, -93, -319, -129, -447, -116, 173, -111, 100, -148, 53, 81, -4, 133, -239, 17, -85, 38, -82, 153, 210, 4, -125, 147, -42, -24, -185, -194, -61, -66, -138, -117, -7, -102, -30, -1, 137, -103, -86, 190, -24, 84, 85, 69, 249, -33, 172, -14, 75, 18, 52, 44, 19, -22, 76, 31, -95, 102, -284, -50, -1, -17, 284, -101, -111, 128, 146, -137, 71, 81, 39, -112, 92, -203, 113, 154, -40, 208, 150, -149, -123, 63, -17, -33, 1, 22, -46, 205, -96, -294, 213, 100, 232, -40, -96, -360, -67, -74, -63, 25, -7, 81, 12, 170, -35, 176, -10, -130, 96, -59, -74, -72, 60, 159, 24, 37, -155, -46, 150, -70, -37, -248, -121, 157, -21, -51, -217, -136, 145, -126, -103, 115, -2, -15, -65, 106]
3299A06j64oK62q1j45J38k79K14J26j77L2J49j13j9n5j36O4K68j58j73K75k67
3321a39J41j08J0N5K15l88M62k15K31q4o5l72K04j25J28J00k7M4q2j15J28M7r7
3344e2j32J84J85j82l8oK34l56K6K79j32K5l4j57K79j99j92J47N2J8K57k05j8
3367a7j27J98P1Q4l87Q2K26J22k73J7k39K17J5P1Mj37n3j26K95j50J32J88m07
3390a94P3l9J45j52%K4J29j7R9P1P1l79J11J44k38L61j66J29L9r9k66J56J31j93
3414f0Pj26Q7j53J76J12pO4j7j70j6K29j29n8J23k13J68j96J69K00j53P2P3o0
3438A22j92l0K01k44k34L13K40L1n09K63L57k92j06J85J2j5j89K11J20k92n9M27
3460C20k19l7k2j04J19k16K4K01j71mK81k90L77j32m30K27J90o4k5N9l0J58m68
$$ y = [106, -58, -64, 198, 117, -28, 110, -169, 45, 171, -6, 26, 175, 62, 43, -12, -148, -84, 184, 26, -147, 128, -139, 2, -106, -96, -41, 174, -214, 248, 33, 264, 180, 115, -257, -53, -178, -50, 50, 23, 67, -15, -130, -2, 45, -52, -184, 0, 185, 3, -35, -41, 193, -163, -137, 142, 10, 35, 1, -156, 123, -76, -268, -121, -69, -51, 206, 1, -17, -144, 54, 125, 209, -178, -96, 130, 252, -21, -4, -243, -26, -11, 60, 64, -73, -126, -252, 43, -107, 25, 213, -194, -121, -160, -15, -167, -167, -143, -14, -31, 68, 139, 210, -169, -58, 86, -152, 209, 43, 172, 211, 112, -154, 2, 133, -60, -53, -179, -92, -245, -69, 43, 36, 100, 83, -87, -103, 126, -3, -61, 62, -151, 17, -179, -10, 190, 37, 109, 182, 122, -70, -100, 101, -143, -377, -64, 176, 207, -302, -39, 318, 26, -80, 105, 117, 102, -87, 124, 244, -48, -107, 320, 101, 64, 42, -62, 57, -159, -135, 66, -105, -109, 172, -118, 259, 127, -303, -76, 114, 50, 25, 84, 54, 212, -256]
3483b56J26L68l56k04L27j38L21K8j19N2k96k4K91Q2N6k22k49J82L39l83J30j70
3505a15J7M8j60K79m5j08o2L51k65M6l0J28k7l06L39j92O1J86j63j30O7K35j45
3528IJ36j23p0j66J35K12k81P5J92k35J05N2k05K42j87J62j50O5q3J60N6j90K62
3551A73l03j28K29j4J28p9o1O8K56l19J67j93J02J21R4l34K72j54q7j4o1k6R4
3574f9J6P3M6j34m6K04J41k92j47O3J20J18q2k77K61m3J13j28J52l58L61k58r3
3597b59RJ36J26O1j88L23k52J85j54K81m17M39l34q5K03J71l04Q7M05o19K26N4
3619I4m2l95K94R0q5J08o5J25j04n8j31L19o4k21J71q7K12P0q3j31p0j15J82k8
3643a4J20k1K9j12N7O4J32k38m1J64m7J03m38L74P8k66j96K07L47n71J12K95j75
$$ y = [-256, -130, 238, -118, -322, 5, -133, 188, 216, 97, 149, -147, -171, 120, 202, 258, 36, -213, -31, 308, -75, 55, -115, -98, -50, -210, 69, 24, -84, -146, 205, -60, -14, -44, 84, 57, -249, 90, -102, -41, 145, -18, -148, -81, 154, 9, 145, 22, -48, -214, -79, 133, -148, -73, 119, -116, -11, 41, -164, 78, -109, 53, -97, -32, -115, 45, 101, -89, 173, -130, -258, -29, -43, 85, 6, -55, 13, 269, -50, 117, -76, 26, 147, 241, -93, 179, 25, -62, -76, -137, -163, -69, -53, 20, 66, -68, -114, 90, 231, -61, -208, -145, -25, 93, 11, -266, -5, -48, 65, -63, 89, -269, 92, -166, -259, -250, -114, 12, 73, -115, 208, -44, 141, -13, 268, -149, 290, -44, -129, 74, 245, -59, 28, 433, -186, 40, 94, 52, -343, -49, 41, -44, 64, -1, 124, 20, -38, -169, 150, 86, -135, 36, -51, 161, 231, 148, 17, -53, -168, 14, -14, 106, 85, 114, 2, 59, 123, 255, 17, -24, 140, 93, 196, -242, 132, 210, -56, -252, -45, 302, -269, -157, 138, -37]
3666c7j68n0K18N3R5j63L73j75n02L93j72Q6J45l92K25R3P5j69P8n6nj71J75j28
3690a79J77Q5m4J23l29L96r6n00K74k42L02J11j84qK62l08L41n18K90Q1j75q3
3712b24J41J49j02mJ01j83L50m58J87M11o49L97l58J92R6%nr7K9l4r8P2K41k45
3736i1L54k60l0K43k04J48K0q9k07P0N9J97k42j14J73N5k46l0J08J81o9K20l52
3759a06L04r3k28J69J72j41j20J74j82J39j23K4j63Q2J78J34l12J58j4J92k94
3780e0P0N1k05n9J50j30K87k82J96O1l58J25K67l82K63N0P2Q9l20K27j28K13J
3803B08k79j03J13j68K88j95J44j9J33j15q5r4K09r5n3J75J97N2k05N5l37J49
3825b5Pj47J15j92K45O6j50J85j27n6j19L55J18o3m6Lq2N0k74L23n7k14K10k4
$$ y = [-37, -205, -255, -37, 16, 111, -52, 321, 146, -356, 37, -135, -49, 96, -296, -71, 22, 97, -72, 6, -50, -55, -226, -51, -179, -2, 83, 39, 162, -167, 229, 133, -367, -93, -335, -33, 78, -106, -114, 148, -160, 181, -337, -47, 34, -141, -224, -83, 66, -36, -40, 61, -122, 228, -230, -43, 368, -281, 116, -242, -50, 46, 46, 41, -56, -27, -61, -159, -87, 154, -91, 263, 3, -27, 216, 12, 160, 180, 91, -116, -46, 13, 210, -32, -146, 27, 82, -164, -194, -86, 95, 26, 246, -106, 198, 105, -123, 46, 218, 77, -43, 131, -51, 88, -35, -11, -174, -92, 86, 220, -92, 66, 52, 244, -50, 20, 71, -134, -193, -43, -173, 114, -168, 28, 89, -269, -144, 123, -259, 4, 54, 126, 215, -105, 122, -6, 207, 208, -71, -174, -61, -229, 59, -136, 8, -11, 122, 7, -78, -172, 37, -58, -111, 64, 261, 313, 108, 163, -174, -25, -18, -165, -50, -242, 3, 69, -81, 104, -23, -79, -198, 157, 275, 212, 166, 169, 87, 137, -137, 186, 129, -85, 125, 101]
3849A01K7KK2l71J23K34j01q2K09j21J13k61M2k9j5k7K13j54K40k36j41K65K5
3872G8J12l38M31j74q1m3k27N47j94J6j51J18j49K04k47K05k37J98j61J94k06
3893a05O3j37r2K98j75n3M37r5r2q0l1J48j72Q9J22k29J20J08lrJ9k45r7L07k76
3918a80J15p7K3n5K6L88j95j6J67J21l42k00K55N8k8J98m03K93o39N00j50M21
3940B80q7L9l50J94j79K45k49q7J42o7J73k76m0K87q8j59M96m38j50o7M64r1l0
3963c8J8K64k82J45o6M8j45j69M09k35J1ok82M58r6J84j01k76N05j87j78n6k07
3986b82J38K45J4j32KJ61l8J3k76JK86j28M2j37K23j34j3l2J88k9l47N03j61k50
4010a43n2P7J92j56K08j11K58k66l31O17l63K10J08n1k83n2L47j57M3qj86L29
$$ y = [101, 128, 130, 152, -219, -96, 138, 37, -45, 164, 43, 156, -105, -63, -92, -107, -134, 79, -75, 165, -71, -212, 53, 78, 190, -148, 283, 109, 28, -15, -242, 305, 111, 127, -24, 94, -55, 149, -98, 107, -130, 68, -93, 101, -105, -42, -179, -271, 27, -148, -201, 236, 141, 49, -31, -62, 86, -86, 3, 125, -104, 16, 124, 121, 112, 131, -114, -211, 96, -180, -65, -142, -119, -174, -148, 240, 45, 29, 196, 317, -25, -225, 30, 88, 60, 258, -145, 148, -491, 9, -141, 280, 193, 232, -118, 76, -103, 142, -107, -194, -52, -119, 54, -222, -262, 25, -63, -222, 274, -164, -314, -381, 83, -8, -38, -20, 244, -38, 107, 41, 89, -56, -225, 184, -51, -40, -46, -328, 130, 34, 218, 117, -159, 346, 159, -19, -75, -282, -144, 101, 115, -17, -15, 146, 108, 121, -155, -154, 132, 4, 46, -91, 132, -2, -15, -47, 141, 112, -235, 268, 107, -143, -195, -118, 74, -82, 126, 15, 273, 7, -324, 293, -70, 140, 248, 197, -86, -138, 209, 52, 95, 87, -99, 230]
4032B30Q6l13J53m5p8k47K43L45n54K47M4J93j31n68L67m8Q0k42K74o7k34M32
4054A67n35K52K08p8J22l32L97l37L34j01k9K46n04J57J79M4k19M6j77J94m1k89
4076b96K02L38n8j76Jk62P3K98p4n9Q5J36j35Qj42J8J49k78L02j19k73J50R2j72
4100a92l5L8L07k36L3K23k33L0J17J34k20L60k04k07Q7n5l9K86k24j56J01J56
4122G1m00O8K31J31l6j22P1J17Oj41N8N2o8l7L07j02j20Lk16j35K46J06J09k89
4146i0K13k20J92P0r9j73K99k63J02o2O1L2j15J50j67K37k46K68j81J0K25j41
4168A02Rj45j40K95k92K99k65L57Kj95J13m43M67j98j37K68r3J2J98j82J42o5
4190A09l03P9M9k0K94k94L09P3k38P7O0k97k77K72m3K56j74NJ87k37m5r9L38k75
$$ y = [230, 316, 3, 156, 111, 33, -214, 29, 374, -180, 67, 111, 304, 173, -395, -28, -76, 4, -238, 36, -31, -265, 167, -368, -116, 92, 14, 136, -196, 201, -136, 198, 97, 68, 314, -190, -33, 146, 190, -29, 17, -160, 34, -7, -296, -94, 244, 186, 10, 11, -251, -178, 120, 46, -13, 72, 208, 73, 81, -61, -43, 106, -172, 130, 11, -262, -112, -20, -192, -227, -189, 118, -118, -85, 138, -95, -65, 52, 186, -34, 326, 122, -85, 2, -53, -92, 194, -30, -186, -85, 71, -329, -261, -30, 101, 65, -57, 14, 131, 137, -4, 54, 106, 38, 1, 308, 206, 86, 89, -127, -262, -16, 90, 199, -90, 123, -97, 95, 165, 66, -107, 192, -71, 31, -31, 30, 62, -53, 97, -70, 167, -79, 189, 8, 18, 243, 102, 111, -34, -174, 121, -171, 128, -137, 220, 222, 27, 140, -303, 164, -34, -171, 97, 4, 16, 214, 32, 174, 109, -194, -115, -66, -86, 208, -86, 223, 296, 58, 135, 195, -102, -379, -107, -150, 106, -68, -63, 124, -113, -158, -257, 81, -194]
4214a94J05M93k93k9J60j28R4o3K28m38R0j11K33q2j72K50K8k89mK24q1N0K14
4237B85o58L33R1n4q3J1j16O8j9L54k44J55q3l5qJ36k45K97k03j2l3j25M04l30
4261a14L39r5k84M24j01m04L42q6k68K98o3j87J60j0J29j30nK67j20r3j14K43
4283A28R8k77p5M8J26k17L97l11J17j22k7Q3N8K56n57M41k56m7l0K53k35qR2J40
4307G5j37o4K15k05L11j76J65l33J82J68lj86k89M45j45J03P2m31L57Kk39K21
4329A08M0L1j19pM2k65k0J01j59K17K50j28j11O8k3n0J16q1K1m9K80m66M69k4
4353B41k18J23l8n8J30m0L3j88o2Ojm6K76l32O7m1L36l36J47j16K05or7L0l38
4378c23L77k29L49l4l37M4j66J62J91j3j93P9J49l3J79k64J41R7m00J88j56J58
$$ y = [-194, -89, 404, 111, 82, 242, 114, 208, 145, 373, -65, 25, -86, 147, 65, -107, 143, 171, -118, -122, 102, 21, 71, 285, -373, -40, 51, -3, -86, -75, -191, -123, -142, 212, -32, 123, 40, 5, -3, 133, -112, 185, -18, -30, -63, -188, 216, -114, 225, 130, -154, 270, 169, -235, 107, 21, -247, 51, -12, -199, -39, -49, 80, -50, -55, 212, 92, -1, -115, 128, 226, -51, -126, -78, 48, -169, 228, -83, 34, -88, -115, -32, 26, 282, -275, 166, -90, -137, -167, 86, -149, -157, -65, 75, -62, -126, 89, -116, 195, 19, 184, -149, 33, 201, 198, 12, -277, 168, 23, 126, 198, -233, 124, 126, -113, 108, 148, 179, 60, 53, 95, -170, -190, -89, -248, -31, 219, 91, -20, 48, 25, -25, 91, 10, 31, -18, 262, -204, 265, 241, 23, 146, 108, 50, 180, 140, 173, -15, -77, -71, -72, -118, 158, -174, -107, -148, 188, -148, -1, -117, 88, 82, -15, 15, -323, 54, -175, 174, 140, -197, -153, -319, -157, 34, 21, -172, -93, 56, 23, 202, -62, 79, 176, -224, -36, -192, -34]
4400c4K13j52l29q3O64k65J11m22J79L37l63Q2o5J56J50j32L0m07K78L08m19J38
4422b5K08r9J95o4k78K26j52j48K45k83J25n1J75j8j23jj11M10k19qN7J86n4l03
4446a10J35j1k2J93j65M3k4o0j5l57J53L99j95k63L81j10J28j44J54M1k87J74
4468C8K34l6l20J07j1N7j21K86Rq9l55J49N8l45N71j74k61K60j02q5K25n4j09
4491f8J52k28L76k87J21op1o6K60k51J53R5q4j12J06r0L0o0P6p7j34K4J76l75
4515c40M67K57m50J7K1K40k65K80k4k50k3L8pn9n1J38j85K4k4J00J57j03K7l3
4539d8J1J08K94k66k88L32l7m06L63Kk44%r2M52k75n3J99r9J15L3K93l65rj08
4563h8Q1J75k13PJ92l77J45J28j15R4J0P0l24M53m41K50J5m6J3Q9k2l13J17J44
$$ y = [-34, 179, 27, -302, -385, 279, 14, 125, -297, -118, 219, -144, -62, -127, 29, 179, 47, 77, -330, -52, 256, -163, -25, 183, 84, 279, 215, -63, 163, 11, -137, 108, -175, -50, -101, 74, 56, -67, -68, -179, 231, 12, 4, 61, 247, 193, -110, 25, 14, -8, 185, 20, 63, 39, -21, -36, -393, -240, 159, -36, -299, 82, -28, 100, -44, 110, 151, -136, 38, 272, 236, -84, 23, 12, 69, -52, 234, 243, 154, -201, -52, 6, -339, 232, 58, -203, 57, -45, -130, 95, 41, -68, 84, -144, 232, -55, 66, 60, -11, -77, 183, -68, 85, 180, 96, -16, 90, 0, 30, -30, 46, -31, -165, -141, 35, -340, 127, 384, -66, -49, -28, 212, -53, 227, 203, -47, -70, -32, -39, -98, -149, -11, -196, -172, -196, -96, 61, -42, -15, -48, -37, 71, 365, 99, -189, 143, 106, -300, 63, 65, -179, -179, -271, 181, -94, -147, 52, -47, 68, 101, 394, 29, 20, -88, -7, 168, -45, -38, 154, -223, -78, 50, -65, 29, 39, 109, -215, 238, -203, 47, 62, 16, 29, 118, 96, -217, -100, 44]
4587D4k15L0J33m8K02J27k76mk7j38J11j70R0K24j08j57R2M09j23l19K68j84j26
4610a65L66k09K8J71k64j61J98l2O3J9J05k67J10K01k02K0J4M1j19J8j95L02R7
4633A39p7k82M84j39j74K6j60k5K17j41J2K00k7K02J09k37j61J35l42J77K13q2
4655F7j58j47K62q9J05k72J76P5pP8j91j18J13J39l77O05l11k8O5k9J83k12K60
4678A89j48J16l61K81j44J95j77L59n53K06K04q5K7J6j52r6P9R3j01k25N16j54
4700H5j71L20m05Q4J24m4N3J6P8k7j80N5o4K86R9l71P2R6J02K3n00J53J10K9L5
4725E8j14j98J83K00j62K0J07J28Q8l17L8P4N3l20J89J34k43L01k19j22R5J3j02
4748a16K25j24K4pL9K51m74M47k66J29N3r1l65J93q2J31J61k19R5K09j97l5J75
$$ y = [44, -171, -141, -8, -56, 146, 273, -3, -7, -34, -172, -61, -231, -141, 83, -25, -182, -90, 319, 196, -123, 145, -39, -165, 201, -8, 20, 191, -73, -234, -36, -68, -5, 14, 119, -148, -38, 163, -39, -19, -5, 36, -83, -65, -260, 42, 139, 62, -220, 264, 125, -49, -23, -183, -208, 9, -132, -120, 80, 53, 255, 364, 127, -34, 101, -241, -64, 149, 67, -91, -238, 24, -65, 40, -232, -56, 19, 12, 90, -101, -219, -106, 33, -344, 261, -50, -78, -13, -42, 141, -71, 189, 41, 157, -204, 77, -67, 128, -49, 310, -243, -37, 167, 82, 109, 125, -27, -123, -44, 49, -52, -277, 239, 85, -86, 234, -171, -87, 37, -7, 46, 62, 140, 113, -67, -12, -76, 210, 309, -62, 10, 106, 208, 231, -269, -116, -6, 23, 58, -56, -254, -71, 129, -33, -13, 94, 222, 310, -7, 31, 105, 158, -162, 27, 161, -82, 219, 0, -122, -27, -14, -116, 109, -15, 9, 2, 41, 292, -182, 265, -1, 128, 181, 90, -275, -82, -164, -33, 128, -91, 4, 213, 16, -19, 156]
4771A56k61J05J34k57n2J65N8L8k06R6J22L1p1k5L7p6o3J26P4j24q1K99j10r3
4795B2J11j97J24R8m51J89J97j65K82k83N9J61j32k07M83j81P5J83l77p8J77k60
4817a70K57j65J07J21l18L66l29j82K78o7m7K38J20l73J94nk66K96l67J90J72
4838E0r6j0M20k64j13K5J3j19J58J39q3R0l49O2k36N13j48L5l34L62l30J04R5
4861a6mJ36r6l6j22J09K35on0k54K5M1J50l2J36q5J42k40N2l5p7J76p0k8j69K57
4887A39l32K35N2%k63L78j64j47K56n7k4ok7J17l11K54l31L37J7m33K03j55M1
4910b21M14l63J54j70L09j18K16k57L4j74K08k39L14l16K47J08j59j11k01L31
4930FL6r6J25J17M8J6m49K48j00L47l97O1pL63l52m5J82l26R3M5J60r0P7k25J32
$$ y = [156, -105, 0, 134, -123, -175, -10, 48, 86, -120, -24, 98, 129, 58, 33, 70, -6, -69, 57, 131, 7, -74, 225, 115, 22, 133, -64, 60, 158, -293, -104, 93, -72, 210, -73, -14, 147, 15, -192, 291, 110, 185, 368, -9, -87, 90, -170, 87, -78, 29, 150, -168, 198, -131, -313, -35, -102, -149, 89, 209, -164, 30, 25, -241, 55, -312, -122, 50, -46, -56, 364, 100, -13, 12, 25, -94, 64, 203, 120, 210, -139, -77, -313, 200, 52, 87, -247, 115, -215, -111, -16, -20, 116, 20, -16, -138, -29, 206, 200, 150, -104, -79, -38, 112, 80, 216, 131, 273, 33, 85, 50, -27, 149, 79, 51, -118, 139, -193, 42, 94, 94, -169, 209, 45, -102, 154, 97, 73, 67, 40, 157, -154, 100, -231, 106, 123, -310, -107, -262, -221, 193, -170, -16, -186, 123, 5, 221, -36, -2, -176, 32, -207, 107, -209, 38, 146, -13, -124, -325, 6, 42, -54, 71, 188, 236, 252, -197, 51, -49, 298, -99, -38, -45, 318, -34, -79, 103, -223, -130, -85, 75, -15, 62, -163, -31]
4955c1P7l34K55K66l26J45q2k16K29k26L82k64K79j40pK27r7j30k09M1K29j80
4977a12J67p9O1nJ09L8j50m1n1j52L05jN3j96M2j44L26mk7l02J58j17K40r5k4
5002aJ8L7J18k52O1M9J89M5m92J31p2L15j85J09j26j63J01J60J38J2k21N4J6L22
5026C63k20l89J09J03K49l59K72j44J57j87j87L56k30o0J06J61j92l0K65j35N8
5047F6l8n0J3k51J30k9J87k18K44k76K06K7O7j84K48n10N37L2l14K51q4l73L47
5070B8LJ11j34K4j11K4q2K7J09p6J85L6p1j7P9l63J52O2L29k51m9j67o9M40r1
5095A28j58Q3J0k26r5L47J3j21K74k80k8P6M3j04L8k03L83j63p0L16l10j56L4
5118a69J55k1q8J90k71M20j16R5j18L3k66L18j02k80L33j45j08J46k45J73M29
$$ y = [-31, 46, -288, -33, 233, -93, 52, -30, -246, -17, -243, 139, -125, 154, 14, 7, 234, 137, 7, -202, -161, 68, -112, 55, -24, 37, 32, 141, 179, 29, -12, -63, -215, 90, 89, 142, -54, -12, -156, 170, 166, 139, -163, -5, -122, 118, 23, -1, 17, 54, 172, -80, -19, 30, 219, 264, -228, -97, -169, 146, -39, 70, -56, -219, -118, 42, 180, 192, -29, 25, 41, 363, 143, -246, -137, -34, 215, -144, 128, -16, 141, -46, -233, 123, -107, -167, -61, 100, -92, -122, 143, 8, 66, 28, -22, -9, -260, -130, -159, 28, -190, 54, -222, -16, 11, 78, -106, 142, -368, 169, 201, -113, 138, 54, -319, 28, 31, 142, 8, 32, -79, -55, -137, -110, -1, -77, 108, 144, 73, 56, 135, -228, -76, -14, 315, 64, 15, -152, -221, 219, 128, -30, 53, 63, -163, -258, 89, 102, -19, 255, -25, -53, 23, 66, -38, 0, -203, 180, 17, -53, 263, -47, -203, -169, -14, -35, -123, 67, -204, 216, 100, 195, 77, 110, -156, 162, 60, -220, 113, -32, -140, 6, -239, -66, 363]
5139C63l64L9m9m3M4K21k63N7N3J30l99Q5J57o4J09o3k15K44P6p4pnO6Q7L7o8
5165A54o2K09l57K90l89J75J19k03L0P4R3j64K61l39J54L0j50O7K07l74L25l26
5187a76L0j00L32j81m4k41M87n7K7j07K53j70J31k09l2K93l57J89n1J3J33K69
5209D32l35r7%j14j50J64K91l29j19J1K49J96k77k4j5Q8j06J19o8J95k54r5L06
5232F8j9k3j51R9M1J29j8j62lj08J98lj56K6O6J95j13J83L8j63k44J59oR9m12
5257b80L65L6n6k08o8J72j10J47J55Q4k86K53k46k5J2K7k2m0K38k00m3O9Q8m0
5281B2J89m01J41j37J66l3l6J92p6N9k20K33j17j79J64K0J14J48l96J61j17N7
5303d6K3K70k45M0p0K91k68m6K9P7Q4r9k28L4J22j00J49RK2K5o5o2L38m68K49
$$ y = [363, -1, 38, -11, -54, -10, 211, -52, 5, 58, 188, -211, -126, 31, -33, 76, 13, -202, 42, 118, 44, 37, 32, 98, 185, 222, 154, 92, 301, -56, 234, -155, 20, 139, -64, -34, 40, 133, -31, 230, -109, 45, 75, -75, -8, 199, -175, 150, -176, -146, -246, 86, -95, -139, -380, 107, 50, 77, -30, 223, 53, 184, -25, -57, 236, -121, 68, 17, 30, 163, 432, 97, 0, 0, -114, -264, -100, 191, -138, -257, -246, 3, 199, -78, -102, -117, -29, -135, -16, -84, 111, -143, -238, 68, 49, 26, -125, -26, 15, 144, 126, -36, -39, -147, 51, 48, -108, -82, -16, 179, 66, 249, 287, 124, -120, 39, 33, 132, -280, 85, 121, 65, -143, -211, -39, -149, -2, 153, 237, -49, 204, -42, -67, -55, -28, -50, -90, 148, -52, -95, -26, 62, 22, 211, -190, -49, -186, -20, -53, -89, 103, 27, 86, -134, 99, -18, -197, -33, -13, 101, 249, -147, 14, -103, -46, -23, 247, 2, 42, -28, 263, -5, -51, -22, 55, 139, 40, -188, -154, -32, -132, 17, 26, 48, 73, 8, -54, 284, -184, 65]
5328F5J18l82L67l03LJ25J95j93j34J23j13J87l41L87O1m4qj90O3n4J39j1qj63
5352a11K70K2p1k26M81m02j03J83k51L85k09m7r0L57j37Q4k23L2o4J02P0J42j30
5375F4k1m6J19j72M2k27J0J61k0Rj45J71k2L9j26J8J12L61o56J55K43k62q0K2
5399b51K36j86Q0M00m39J18k8n9L24j84j2R3l59K16L0Q9K5j8N9q3m0j61J09J31
5423I0l6j21K91m11J84Q0j56j84K6M41j13J28L9k33O0j07k42M4L22j5q8k28L36
5446A07J9j35N5K6o0R0j00q6L3j02R4j04q0J94j31j16M17j07j88J11j46N8M56
5469C05k79rK50j10q3L9JOQp6J5n5J05j92L25k5j96j02K56j70J09j85o0J2J52
5494D1Lj01K66j95m30L20J53Q6j36l02J42R8j14j49M18p1j91P7J24j48LJ31J1
$$ y = [65, 183, -199, 168, -135, -132, -7, 188, -5, -139, -16, -129, 58, -283, 104, 165, 121, 113, -77, -14, -68, 71, 60, 52, -111, 159, 181, 110, -116, 365, -37, -140, 43, -208, 177, -32, -79, -169, 188, 51, 135, -88, -56, -120, -18, 52, 194, 64, 43, -3, 116, -56, -14, -241, -231, -70, -90, -81, -226, -55, -77, -38, -164, -146, -34, 327, -329, -174, 69, -193, -273, -251, -15, -201, -121, 279, -160, -42, -70, -129, 195, 11, -1, 92, -267, -51, -21, 68, 93, 75, 134, 51, 11, -150, -41, 90, 54, -67, 224, -187, -3, 77, -79, -263, -237, 204, 91, 219, 258, 25, 85, -22, -264, -220, 102, 87, -1, -229, 107, 126, -9, 46, 72, 12, 102, 2, -84, -51, -153, -59, -163, -243, -49, -180, -296, 121, 14, -174, -63, -209, -151, 305, 26, 17, 267, 157, 74, 113, 114, 120, 128, 52, 67, 12, 117, -75, 250, 225, 29, -73, 183, 13, 122, -63, -123, -111, 41, 44, -57, 209, 14, -416, -96, 57, 143, 7, -295, -153, -55, -169, -318, 100, 29, -162, -85, 39, -109, -106, 25, 36]
5517C6K2j44M02n54L85k28j71L70o2R6p6j17o9nm7O8J77K0O8k06k77K49j33K8
5541a68K94R2j94j14N9M0k49L55M2k56M26j53j98Q3J97r5k51j11K24j3P2m57L62
5564a3J22j83j11J05l7K32j6l8m3r7j39J86J70q2K7q3K5q0K17l10K17M9o1j37
5588h0N3O5J7j32K94j52k21J67k42K37J52j63k81M36j10K3j23KP4P5L2l66L30
5611H7l04K82n5J2m4K7J04Q8k59j59K72k0m4qK9k75L43L6k46Q0m8n9L90k19k89
5636b79L85j68j3J47j15L09l70L19l03O5L4J5Q3M19m67j02N1K7O6k82K03n7J15
5659H2r5R2l50K92o5j4K28l41qK99n1l54K68L76l13j97J27k86M72j39Lm5K1k4
5683b2k40J68M66l05l71j58O64n0j91o7J97j29N7n2m5J37J72j62J57l96K9J14
$$ y = [36, 58, -86, 316, -238, 147, -81, -252, 118, 56, 152, 76, -41, -110, -115, -162, -94, 83, 103, 171, -35, -312, -63, -196, -168, 126, 218, 24, -90, -31, 9, -240, 115, 157, -99, 327, 174, -24, 59, 256, 161, -90, -201, 23, 10, 82, -375, -13, 109, -74, -185, -80, -117, 115, 99, 61, 18, -79, -218, -32, 138, 56, 83, 0, 25, -55, 162, -148, 69, 118, 57, -80, -27, 38, 55, -77, 217, 65, -156, 11, -231, 6, 158, -5, -286, 150, 40, 63, -60, -58, 16, 91, 123, -243, 87, -217, 65, 10, 22, -22, 5, 109, 197, -62, -221, 51, 31, -13, -21, 8, -267, 76, 112, -134, -54, -102, -161, 229, 10, -279, 106, -62, -75, 72, -43, 266, -104, 215, -88, -23, 11, 26, 109, 528, 61, -41, 10, 37, 103, -179, 24, -33, 82, -13, 79, -271, 21, -44, -58, 170, -171, -179, 120, 69, -285, -17, 359, 46, -151, -24, -310, 162, 23, 26, -19, 2, -22, -262, -94, 372, 67, -304, -462, 202, 152, -39, -106, 91, -38, 19, -33, -78, 59, 231, 69, 226, -170, -141, -27]
5705b7J15j32K29o9J89n15K15N5k33L44k26M0n5K5P9Q0k16J55%j52k79M41R9l31
5729a69J16j3K68m2k11L39j11p6N1o9j28L8K06j67j61L32k18j5N9M6N5k8k15P6
5753c7JL49k33J27j84k46L64q6R6p2n9k6K71k85P7j26K3qJ12j55l6k5J89j82L03
5778A52N7l77R3J04m4k82M30j29K90j33k31j75M26l46J41J45J1m8P4m93L78L5
5800G8l35J15L29j58L0k67K56k8l7k5k42K20J19J30k9k82J62k71K10O6j62P3n7
5823a05K10r2K45k40J69l4l22L71m1J83l31k3K0j5l9j79N04k80R6j49l1K32o0
5846H9k56K73n6j17P0o8L1K33j45k95J13J08J96P2k70K34j56J95k73k02R2L23
5868A91r5j48K56j30j12J5LQ1j8k61L83k02O3j5k21L43j61j5J72k11J40k53J08
$$ y = [-27, 88, -44, 185, 116, 305, -210, 5, 60, -173, 171, -55, -15, -70, -45, 34, 114, -102, 53, 53, -99, -378, 63, 162, -169, -53, -66, 202, 160, -51, 288, 177, 101, 152, 83, -45, -7, 199, 32, -129, 203, -15, -30, 29, 75, 130, 102, -113, -37, -36, 313, 80, 207, 23, -223, 141, 55, 151, 79, 20, -6, 265, -20, 57, -69, -46, -54, 58, -97, -133, -158, 31, -151, 152, 209, -168, -75, 29, -15, -297, 133, 4, 294, 161, -70, -245, 181, -165, -24, 121, 132, 84, 158, -335, 43, 78, -257, -142, 187, 29, 59, -208, 48, 20, -17, -42, -284, -64, 55, 185, 156, -126, 36, -235, -25, 41, -121, -48, -105, 105, 13, 258, 18, 187, 153, -169, 202, 161, 344, 13, -10, 10, -5, -44, -223, 281, 1, 97, -52, -83, 149, 89, -167, 106, 50, -67, 3, -65, -34, 199, 54, -241, -128, -20, 176, 248, -22, 212, 56, 251, -22, -224, -132, 191, 96, -52, 204, 74, -38, -23, -20, 61, 43, -218, 165, -37, 26, 11, -210, 133, -28, -43, 129, -82, 58, -195, -87]
5891h7J23l62R9K44K60n64L09l1m1l0K24k66J77Nl30K80p9K4k43M79l74J11J17
5914D5O3o3n5PJ54K01k68P2j30O0k2L5P7l11K51l03K04N4j88lMK04k56K09k64
5939b23J16M07l68j22J37J02r9N9j35J04J2k55K32n2J23l10K35j08L74k20kJ56
5961A63j51O2n9k83O1J76m8j56J97l3q1J88k01M5K26q8j52O3J03K78k46j67k09
5984c12L59q7J38r1J6P0J08M5k47K50j20J10j70q2j30J48j55O5K7J05O4p3M9r5
6008hO0n8n6KJ00j46j79J3K06N2K48l63J57J40J5o6L34m72j00K70r9p7N6J04q2
6033E1k40O7K28j30j33N19k05k0J51k24r4J61l71K39r6K83j17m58N61J46l67P2
6055B3q3n6K0J46Rk3J24k82pj0L70j42k23j26N33p8k33M1k1p1K82ok86J95j51
$$ y = [-87, 36, -326, -227, 17, 277, -287, 22, -9, -50, -80, 144, -122, 55, 60, -270, 10, -69, -45, -288, 191, -183, -72, 45, 108, 45, -10, -3, 151, 352, 84, 156, 26, 86, 64, 99, 176, -135, 116, -187, 17, 71, -117, -120, -116, 88, -168, 41, -223, -107, 300, -68, -190, -53, 49, -50, 9, -126, -22, -10, -265, -33, -85, 38, -272, -37, -145, 229, 9, 7, 163, 12, 74, 15, -268, -207, -31, -79, -235, -38, -71, -152, 36, -165, -120, 106, 18, -134, -71, 32, 310, 64, -103, -312, 47, -40, 98, 7, 23, 93, 201, 246, -1, 249, 129, 239, 69, -13, -143, 5, -150, -85, -58, 47, 111, 38, 87, -8, 52, -6, -62, -60, 40, -106, -285, -272, -66, -14, 234, -129, 28, 168, 183, 117, 451, -21, -121, 149, 50, -27, 29, 133, 51, -189, -122, 106, -24, -157, 362, 157, 137, 288, 64, -30, 131, -240, -1, -97, 186, 69, -389, 172, 318, -49, 23, -60, -116, -96, 50, 59, 36, 160, -122, -129, -139, 231, 89, -134, -260, 273, 195, -38, 3, -18, -89, 193, 187, -99, 96, -55]
6080e5J09Q2m3J59m52K98j31o9M14k10m5m6j02J01j40M8K87l24L64j99o5P1l46
6103b94L6J20K30L2j26K34k55J14j3l69N55m72J91K01R3k88O6J14r9K7p5j29J44
6126C7j71pL15j74j62M00l72n2K11j66M2j52L99L3j25m0J65j60l4k16N2J49O6
6149C8J90k97K20q5k05J02J9oN2J29o1n0L34l44q0j89J73K84k54n3L4K44k13j27
6173a45P1K48j81jR9o8o8J02J7J8J68m6j20l4q0J27Q0j23M6l18L47O6m51R3o1
6198b14J68O3J70k49K20k33K62j76K02m50K49J56k94R7K10p50N19K64k14J0k6
6219a6j79J46J42k7r0k18K86q9Q7l44N0R6K59m42N92k81j04m8J30p1K3j05J9O5
6243a19J54j02K03J54n73L98m00L03o4J28o1p9J60J18j21N9n1j57J83k13j20J86
$$ y = [-55, 54, 136, 93, 252, -200, 98, -33, -102, 312, 102, 57, 11, -91, 10, -130, -82, 205, -119, 245, 46, -19, 52, -294, -258, -138, 92, 124, -2, 232, -23, 91, 78, -291, 264, -208, -17, 184, 277, -11, 55, 169, 70, 97, 22, -107, 37, -134, -141, 174, 0, -162, 238, -134, -186, 25, -141, -99, -251, 148, 181, 56, 16, 181, 21, -13, -229, -177, -28, 38, 228, -69, 151, 66, -139, -37, -18, -24, 28, 157, 96, 46, 380, 36, -44, -233, -60, 224, -30, -83, -49, 195, -18, -145, -74, 174, -7, -8, 91, 23, -45, 57, 74, 92, 260, 214, 94, 60, -20, 107, 187, 64, 110, -208, 139, 205, -246, -153, -214, -46, 17, 187, -62, 158, -75, 187, 11, 213, -237, 12, 168, -126, -29, 181, -569, -50, 214, 0, 10, -16, -195, -49, 93, 66, -24, -242, 44, -45, 42, -302, -252, -156, 103, -339, 253, -28, -132, -180, -50, -121, -98, -203, -184, -119, 35, -67, 136, 290, -283, 115, -285, 18, -46, 82, 21, -58, 102, 220, 99, 158, 107, -50, 133, -80, -200, -14]
6265a4J73l25K53k7q8q3O3J65o4j24J10r7j3P3J43l2j86J50O6k03k2j08mJ58o1
6290i7k01K52o8K41l80L85N6l8k52Q8Q9j23n6n1L00j40j02j62M59k55K43P5l20
6313e7R8k4j44J12M4q1M6oK49k9j89N4K40l73l26M20j30K48j11r2L41l41K42J87
6337C78n83L48r0k90K80l88L52M7K6p1p3K10l75N66k72L4k63J28J22m2j63M1P0
6360hO9j27q9J16O8j62J57j15j04L27k17J87J43k38j42K75j27J83j58Oj40J79
6382H3j76J9K95j74J06j97J36j1j00J41q8J55m17J60j5L07m7k06N4j45Kq5K29
6405B6j8l0P7qk80L70k00L03k90O7m7k8K69k53j94L27M1j92J19j30L08q8N0l37
6429a38J71j45K10p7j14K27k68K15j71rK17j77J8p0J55J66k18l8k11M38j99K74
$$ y = [-14, 159, -166, 87, 60, -28, -111, -48, 117, 53, -71, 39, -58, -71, 2, 145, 113, -73, 77, 143, -60, -82, -190, -194, -36, -97, -298, -46, -114, 127, -253, 132, 188, 150, -102, -14, 75, -48, -104, -155, 145, 5, -97, -259, 200, -55, 188, 263, -57, 41, 17, -127, -15, 29, -52, -6, -12, 237, 208, 19, 73, 313, -60, -386, 34, -96, 152, 41, -51, 290, -51, 191, 378, -205, 143, 53, -237, 43, -345, 7, 54, 80, 9, -64, 146, -229, 337, 65, 99, -164, -36, 86, 44, -119, -78, -8, 61, -66, -155, -39, 29, -133, 24, -91, -195, 132, -85, 102, 245, 7, -135, 140, 13, 196, 38, 44, -96, 83, -93, -74, 221, 47, 153, -44, 92, 81, -19, 122, 34, 189, -228, -68, -83, 224, 177, -29, 25, -120, -118, -203, 26, 8, -22, 55, 47, -233, 137, -63, 240, -50, 17, -30, -58, 211, -42, -236, 91, 132, -60, 59, -71, 237, 149, 199, -138, 33, -112, 98, 21, -93, 134, -134, 81, -90, -99, 118, -59, -41, -111, 44, 210, -8, -46, -257, 181, -18, 256]
6451B56q0K6j94N6m2k63K52J62Rk92K01k04K22j65Q9j06o0K63J94m35J00J50l95
6474b56L73j57J24k97K04Qp2J05J7J58j35j49J56O0k14Q6J59k07K37q4k07K23
6496A32n9j54R7j37J33P4o4K34l25J40Ro3J67m3n9J12k23J22q6J7O1O9p2j90P0
6521c8j95K41J37j74J28jJ98j79J65k86l50M25J79k69m6J09N1k5k9J73o2N7%j72
6545C7R6k23o9L2l2r9K45J08j53k5J93j54J56p2j95K05l16K70J10l09J82Ok0j93
6569b20K54K1J62m01K81lN5O1k13M1J37Nj2l65J71r6J17j44J09j17M5J88r6j55
6593a75K82l8J08j72j60N6J64n3n5Nj09K40R5k16NR4j48K37l16K45k57L7q9M4
6617a76L58k86L6J90Q2M2m56J76K38j91M1Q3l9l71L90j06RJ03k99j5J99m6l8K0
$$ y = [256, 176, 202, 8, 64, 22, -241, 11, 173, 182, -110, 91, -113, 109, -56, 33, -73, -133, 130, 324, -111, -11, 139, -256, 117, -40, 84, -213, -9, -1, -73, 32, 49, 207, 72, -77, 79, 139, -75, 11, 170, -37, 200, 116, -91, 132, 73, -81, 16, -121, 12, 86, 22, 256, -69, 71, 80, 17, 184, 141, 82, 194, -29, 93, 7, 24, 85, 154, 82, -108, -38, -233, 8, 145, -29, 99, 98, 296, 117, 282, -4, -354, 71, 250, -19, -65, 44, 95, 70, 41, 214, 152, 209, 209, 37, 133, -90, -159, -127, -159, -258, -13, 95, -58, -83, 110, -44, 112, 40, -155, 50, -266, 4, 114, -195, -13, -7, -27, -220, 34, 55, 217, -184, 97, 94, 149, 210, -3, 38, 175, 180, 168, -197, -26, -122, -5, -149, -40, -157, -112, 76, -20, -175, 107, 69, 177, 5, -155, -99, 65, 12, -43, -38, -147, 93, 188, -28, -23, 71, -77, 160, -156, 89, -168, -131, -220, -176, 182, -104, -68, 122, 204, 246, -210, -34, 204, 13, 54, 137, 98, -273, 117, 11, 20, 123, -176, -191, 8, -38, -76, -56]
6641e6k88K19j3J12p5K44l0j1j99J67j15j44L38j13j92O9J57k22O3r0k1L46o4
6664H2j62L08j47j90j01K43m4Q1j29Q6o4RO6n0K06k55n4M36k32p5j52o3j1M10
6688A98n8j64J09k06L3N7J48k69k24N13j19r2J48k36q6L30j60K2J5Jj11P4qR4
6712IPp7j15J79j3l6l9L5N9k29L01qj54L9L3lj23J1O3k1r0K60j65P8j10J09J97
6739A97l64J4L59k16j90M18q3j06j86J1L9R2Q5J15j84q9PM1L15k70j58J64k52
6762b41L56K3j74l0k7J55p2J6k70K70m5l1q6J11J04r6N6P9r8K25k17N4n1j43L89
6787B57k83J73l28R0M0L9M9J18l6R5k26j73L24k56K42j23R0j1o1J5L0O9j34j74
6811a74K94p1j55Q9j22K8K24j60j26J53J73m44M10k86J49J09O3k98J87j1P2l1
$$ y = [-56, -344, -125, -138, -26, -101, 143, 113, 102, -97, 70, -45, -189, 149, 36, -156, -87, 70, -152, -89, -179, -200, 146, 82, -80, 228, 81, -109, -210, 33, -11, 70, -59, 27, -37, -28, 38, -12, 194, -61, -115, 321, 89, 14, -138, -201, -212, 198, 140, -24, 85, -121, -88, -31, 117, -152, -376, 137, 18, -74, 74, -162, -248, 82, -78, -56, -41, -40, -151, -77, -85, 9, 16, -61, -176, 3, -10, -46, -85, -50, 9, -220, 81, 73, -81, -42, -9, -12, -135, -124, -61, -82, -172, 88, -77, 1, -109, 0, 197, -167, -153, 206, -10, -200, 218, 135, 29, -157, -146, -107, -15, 70, 185, 1, -88, -81, -40, 275, 5, -153, 11, -241, 115, 138, -36, -66, -93, 62, -10, 6, -264, 6, -39, -70, -156, -45, 59, -37, 19, 98, 0, 225, 8, 62, 11, -132, 257, -26, 147, -181, -91, -51, -12, 37, 155, 119, 214, -12, -185, 139, -117, 125, 2, 92, 81, 20, 35, 65, 134, 0, -174, 120, 49, -106, -17, -139, -111, 113, -47, -173, -20, 153, -291, 119, -167, -18, 91, 154, -144, 43, 32, 104, 73]
6833G3L9K39k10l59L00m3k55J79M1P1o8K80n28K97R6k91K11n5j22Q2K7nJ93k40
6857d8L98l40j14J35k7k6L1K1R5J31rj63j20N9j64Q6M25l95K3n0K5K11j77ORq5
6883f3L14k77q2M1KK89j31l56J65K37l54K55j32L7L42l89k9L10n0n9p4O3q3j11
6907a35J30j79J59o2J61Q6k25J22r7J4q7L42k39j11R0p1K68j39k06L08oj82K71
6930B12j12j05K59k29K54m97K36p9j52K11j77L96j4k66L35j88k0k07K55J67k43
6951C6j80MN3p5J8N46l39q2O6O0k43J66j9lR5j10J38L8j28k46K58m6j3J68p7q8
6977cJ35M2L0j68j31N5K33k06J51k58J52j34o3J87Ko0j63M30j63J98m05K71k48
7000a16J02J0J49j52K2k76L11J08j86K30j87p9K36m63M55l97M10k22J54l7j04
$$ y = [73, 112, 351, 141, -218, 82, 39, -216, -37, 4, 75, 7, 287, -241, 56, 152, -139, 72, 17, -105, -23, 4, -1, 192, -48, 350, 10, -104, 31, 4, -22, 9, 30, 125, 256, 247, 84, -36, 23, -141, -55, 370, -25, -2, -52, -27, 184, 7, 13, 22, -63, 251, -26, -108, -67, -65, 224, 93, -263, -98, 139, -215, 40, -92, -55, 287, -102, -131, 179, 129, 70, -4, 59, -24, -135, -5, -184, -25, -87, 74, 160, -65, 57, -40, -26, -113, 229, -10, -121, -31, -102, 166, 27, -179, 129, 123, -59, 212, 100, -5, 254, 25, 279, -218, 18, -61, -213, -2, -179, 217, 203, -63, 272, 84, 64, -143, 112, 279, 36, -144, -140, -87, -162, -144, 402, 63, -19, 47, 107, -136, 30, 11, 8, 103, -7, 131, 169, 41, -205, 53, 7, -6, 162, 85, -3, 132, 174, 204, 36, -95, -40, 193, -13, 138, -120, 32, -102, -165, 22, 24, -36, -199, 231, 68, 266, -139, 132, -116, -14, -4, 145, -7, 15, -261, 50, 158, -28, 202, 15, -64, 172, -291, 164, -233, 177, -45, 109, 72, -32]
7021c2J05p3J73q1k4j12q9P2J04J3N4l50K77r1k5M0k9O7J69q8J28Qk31J07k09
7046a17oR8j52J99P5j95L7J51P0j51P0q6%P1oPO5K5K1k99m7L43j12J13k54N5J04
7073G9P1k57j78%L42j00o8M23j7n55J71K80k71l5N8K60j72n6j61N54l91M0J4j48
7097a17J65R6k26J02O2j58J92j6l42L18L0j30Q5n7K7L32k85j84M2l8J63j73J99
7120H7j24J43K06l47K80n02K49P0M1j98R4J59k39K8P3k16j0J95K1j06J18k0M1
7143D3oJ18k4k14R1k26L0L38l84OL63k9j01Oj66J72j15m5K23k20J10j39M11l16
7167g4J12j86J31K36O8j84j82N2K9J90k81k4K43j75K38l73K1K53K5j60j19N2k65
7190c73N84l42R4K9j8J37Ok74J8N8K39j44J5l6K9j07J03KM2op1Q4p6l44K23Q8
$$ y = [-32, 73, 0, 173, 92, 68, -44, -133, -61, 43, 56, 110, -240, 37, -54, -79, -39, -68, -1, 168, 80, 208, 216, -15, 92, -117, -123, -25, -177, 22, 97, -98, -61, 90, 160, 9, 79, -7, -7, 64, 58, 65, 130, 155, 176, -123, -170, 173, 61, 174, -80, -25, 79, 150, -107, -285, -285, 57, -43, -111, 312, 295, -260, -89, 191, -80, -115, -57, 203, 31, -25, -186, 368, -23, 17, 31, -117, 48, 144, -82, 20, 82, -76, 116, 100, -242, 76, 106, -24, 61, 4, 31, 363, 78, -106, -64, -102, 61, -112, 87, -37, 106, 312, -35, 245, -257, -8, 62, 103, -95, -1, 158, -81, -53, 20, -196, -206, -11, 10, -96, 22, 2, 43, 37, 155, 131, -83, 8, -218, -188, 150, -234, -228, 135, 106, 5, 11, -155, 17, -98, -143, 80, -140, -30, -169, 242, -74, 38, -148, -17, 219, 287, 103, -79, -27, 2, 192, -89, -113, 130, -45, 193, -180, -159, 94, 119, -41, -160, -108, -373, 211, -131, -37, -8, -26, 111, 117, -157, -139, -81, 158, 14, 29, -7, 22, -85, 18, 20, 62, 56, -15, 69, -7, -351, -128, -40]
7216d0K86m08J36j33M6J66m02N61m09K14rJ83l67L07l5L2k43M3J84j84J0K65N6
7239B59k49J7k73K92k92K85J94j83K30j04o9J36k15p0J45k48J08J02J85j33j16
7260Ak1r7Q2k05J16J67p2K8j54j90K77J92l9J0j24J67k41j4M2k6K7K05j20j23
7284a12l6rK20Mkj39j08J80nq1j73M13m75L13J88j20J21k48K68p4k7k41Q0R9K0
7309E6R7m57J94l0K20o6k04P0J82j19o3k68M12R3j71J20J70k37p1P0N3r9M5Mo5
7334f4M7L4l66M16j84o2P1K62q7k78N03n89L11N3j61Q4k27K30L07l54P4K29l63
7357a14P5K3j03K62k15J20l65M34k44jJ50p9k4m3N2R7K21l41M43m58J12Q6j69
7380h1J93j43n6L9J83k95K60j57K1j50J09M5K75k24M0J85m5n0j75K14j31o7k27
$$ y = [-40, 246, -162, -26, -159, -113, 53, -349, 212, -197, 17, 8, 191, -176, 131, 96, 128, -115, -72, 112, -72, -62, 203, 259, 10, 27, -246, 46, -246, 39, 233, 50, 280, 176, 107, 243, 28, -42, 103, -145, -37, 65, 250, 117, 1, -20, -117, -35, -240, -124, 43, -29, -1, -155, -345, -68, 124, 85, 95, -29, 138, -103, -117, -75, -101, -74, 131, 11, -112, -148, -157, 63, 67, 65, -74, -182, -2, -7, -88, -261, 152, -323, -10, 178, 58, 179, -69, 199, 125, 98, -143, -63, 36, 56, 153, -304, -110, -140, 80, 14, -190, -120, 62, -57, -120, -388, 24, 117, -54, 66, 236, -1, -72, -2, 51, -48, -3, 1, -64, -17, 17, -349, 67, -117, -179, -108, 154, 67, -211, 292, -297, 14, 67, -94, -10, -237, -7, 300, -54, 20, 249, -114, -39, -16, -119, 143, -72, 48, -317, 117, -127, -128, 22, -57, -81, -124, -72, 25, 246, -95, 348, -110, 2, 88, -81, 112, -31, -87, -48, 135, -160, 100, -57, -36, -186, -77, -32, 243, 19, 59, 244, 199, 149, -26, 188, 57, -10, -237]
7403b37J65j01J67J49l07o1M88m25M38m43J33L22m33j30N4Q6J97K8M1m7j95j17
7425b28K68k18K6L53k35J86p8K8n36L55p3M8L3M7L53k86k9j80J62r7l6j51N55
7448B67p00M38k62J46r2Q0J0J66p7m2N5p0j45L62r5%m9q1N9P7q9n9K10j98M9q7
7474a27K21Q8j32J83l86Q0J62K1K5n5L3j22J9Q2j52J49m0K18k05j4k82L58%m3
7498H1k9n6qJ19K0n1o3m6K91m08J06J71j80p9M3k3L6M6K40k41K28J18l20q0J15
7523C0j51p4M03l84K33j33j1j69N21l13J15J00l59J14O2J3q3K78k98J47j44K01
7545I8J36p3j42l42M38l3n1o2M7Pk11J11P1Q2J15j96K12m42K50p8Np5O0M9J01
7570G7l0J74k42p6L7P9j2P2Lm0M4j52Q1o5J59P3j83l29K96P7j27J31m0J98l26
$$ y = [-237, -72, -173, -6, 143, -164, -225, 263, -162, 276, -167, -34, 288, -145, -275, -221, -135, 62, 90, 131, 84, -111, -228, 40, -178, -152, 201, -34, 152, 74, 102, -434, -79, -152, -104, -71, -24, 329, 43, 14, -166, -4, -101, -137, -288, 267, -433, 5, -257, -111, -203, -123, -113, 53, -24, -66, -11, -81, -226, 136, 41, 41, -8, -89, -30, 47, -42, -101, 109, -89, -40, -127, 94, 182, 50, 233, -153, -73, 89, 110, 135, 80, 113, -9, 10, 92, -60, 89, 49, 267, 62, 48, -234, 124, 124, 81, 52, -4, -12, 107, 127, 76, 13, -33, 258, -150, -44, 127, -53, -132, -89, -112, -76, -30, 210, -31, 197, 315, -5, -85, 30, -121, -195, 208, -176, 57, -76, -87, -256, 265, -48, 67, 167, -192, -78, -16, -3, -86, 192, -106, 41, -103, 98, 234, 161, 19, -323, 115, 82, 31, -31, 16, 23, -188, -77, -6, 76, 191, -5, 207, -235, 15, -63, -58, -133, -73, -24, 77, 47, 221, -21, -97, -60, 19, 7, 79, 82, 42, 86, -66, 15, -50, 109, 182, -1, -330, -34, 43, -84, 47, 7, 205, -121]
7595a21J19J18n3q4PJ40k80J61J11k32Q1K2l9J66j11j8lQ8M7r8r5n2%J41K52j02
7621A65j94j69L14J14l94J76j7K8j62J31J32q1r7L27j78l32J4K18pj45K50j51
7643e8L46m11Q0rM8J96l22J40J13%k08N3J62j99K28j40n8NK4o6J62k40J13J26
7667H5k35K27K12k81j97K14J38o9k04L5K74j33J35j79n5K44k05J94J05l13k39
7688b47K76J15k49K81k73j72L32k2j97l2P5l6K37q0O1Q6k05M8p6J98j95MR2n8
7712c7J40J19l2l57M14m33L23m3k2l0K3l32J22K8o7K12j22Q6j71K80J2j88OJ9
7736e0K9ql5P2J19j83j04J66j10N5j09J16K81j43M6j48nK48m04K04K5J11l39J58
7760hp3M7M28m52m4K07l26K58M2k75J38J87k97J03m2kP0J34j16l66O75k74j51
$$ y = [-121, -2, 116, 63, -21, -14, 126, -154, 7, 118, -114, -33, -11, -50, 116, 5, -13, -16, 72, 119, 21, -74, -126, -126, 15, 267, 165, -29, -198, 116, 230, -164, 12, -5, 23, -139, -8, 124, 43, -54, 273, 95, -237, -223, -5, -12, -157, 93, -58, 288, -123, -43, -52, -4, 192, -130, 10, 123, 123, -85, -32, 130, -69, 159, 19, -39, -34, -10, -76, 86, -154, -41, 85, -150, 77, 289, 8, -189, 25, 163, 94, -110, -75, 199, 66, 201, 22, -33, 211, 6, 200, 305, -8, -247, 29, 144, -105, 176, -97, -269, 63, 41, -156, -188, -113, -149, 88, 8, 69, 155, -50, -2, -78, 120, -75, -71, 21, -37, 103, 222, 190, -167, 247, -186, 137, 94, 72, 42, 65, -267, -145, -117, -184, 28, -94, -8, -179, 101, 113, -75, -69, -50, -21, -29, -64, 8, 127, -56, -160, 6, -104, -49, -158, -42, 239, 96, 142, -6, -11, 237, -167, 37, 62, 173, -166, -8, -81, -34, 394, -58, -102, 105, -221, 37, 79, -196, -58, 129, -168, -65, -107, -109, -39, 95, -21, -387, 288, 14, -137]
7783a37n5J57j05K19j49n6J54j75r4J51p7J83L8qR9l64L05r0p5j12K77j45m3P9
7807b3%K62k21lM0P5o5o6j98l3L32n8j36K03k02Qm2J9L01j48J64k01J30L5j38
7832C5Ro3m8K8L73l33j75N18n64J83J43l89K99P5O8j59J29MO4M2m40O3Q2r1r6
7857b43J73K01r4J76k10j83L00n0k10K02k32J51J90J37l72j94K97j59K55l43K42
7878C4r0L3j62L64o6j02Q1m02M52k87J79N2m22N0J41J61m9Q7j82j19K77K07m51
7901b14K55qP8j76J16j97J93j35K62J19m44K20J65j88j36j65K34J58k29N8J85
7922A51l7qr0j0j11K72k02K0L6j8j0R0r1l2j7M1N8o8J62k55P3Q3l1l5r7K57r2
7949C9o7J89l18J42K96l11j16K61j90j40J72j09K62l22L77P9l21KK50k55l7J49
$$ y = [-137, -192, -35, -140, 79, -70, -126, 28, -147, -241, -90, -167, 16, 54, 46, 145, -219, 86, -4, -79, -191, 86, -59, -102, -23, -23, 239, 18, 15, 55, 130, 65, -1, -199, -232, 100, 42, -94, 109, -93, -85, -127, -108, 193, 45, 209, 8, 138, 173, 35, 44, -19, -67, -39, 334, 1, -174, 344, -220, -37, 106, -283, 16, 91, 159, 0, 129, 133, 197, 239, -201, -138, -56, -147, -243, -70, 131, 37, 213, 3, -180, 120, 70, -140, 62, -170, -19, 171, 308, -64, -258, 39, -120, 135, -208, 34, -56, -23, -185, 179, 113, 11, 92, -310, 142, -145, 34, 86, -336, -286, -145, 16, -33, 54, -128, -247, 30, 237, -214, 41, 33, 111, -65, 51, -146, 47, -88, 174, 293, -151, 69, 234, 46, -90, -255, -21, 137, -92, -34, 151, 114, 106, 16, 6, -105, 167, -35, -15, 21, 3, -7, 83, -8, -40, -57, -16, 42, -26, 136, -119, -46, 37, 6, -29, -126, 131, 39, -28, 161, -157, -15, 281, -30, -146, 115, -75, -215, -43, -152, 110, -212, 165, 244, -77, -75, 175, -80, -117, 32]
7971C2j2K56l00j21J49k6j60R7J59k29K44j14O2J93j83J64pl60J97R1j26K44j77
7994G3k00J64j6Q0J86j12m27J85J21r1J9j76J00J64JJ91j13p9K5j40J9q4K14K03
8018C07j98K6o7J29l67mL12k58Q3j95L00k21K05k45J69j32j32N8K13J60l33M9
8040a41l0K72n8lO6q0J46J37m3k53o4o8K04L71m85j42PJ1j46K29j1QM1O0j25K
8066i5m4j7K05j32m3J71J80k48rj49K3K91j85Q8N7k0m32K50L85l40L99j79k44
8089h8RJ86k25oOl6Q0O3P9j28K35l55K47J15m7k02J83k31J1J39j99K79j36q5J48
8114D2L4j20j81M95j49j83M4N9j7L35m70l9M56l83J24J05j75J36n0j58L9K5R6
8137F5P7m20M34l53P0J76j4j07q4L3L02j08L3J44o2k82K56p1l6r2r9L1J4J0O3
$$ y = [32, 20, 276, -24, -145, 4, -22, -182, -85, 74, -155, 89, -25, 37, 230, 47, 211, 204, -156, 41, 132, 6, 250, 73, -127, 37, 21, 101, 287, 175, -252, -67, 54, -37, -18, -194, -94, 70, 71, 262, 149, 70, 95, -45, -26, -110, 104, 307, 109, 135, 68, 197, -170, -174, 138, -120, -37, -232, 68, -153, 52, -193, -24, -156, -288, -230, -17, 143, -190, -141, -171, 101, 43, 40, 106, 26, 172, 309, 266, 13, -51, -119, 85, 456, -29, -171, -164, -153, -299, -70, -81, -73, -32, 28, -97, -95, -139, -156, 49, -83, -126, 45, 225, -23, -32, -181, -158, 133, -52, 36, 93, 73, -359, -109, 276, -64, 335, 156, -88, -79, 107, -118, -124, -118, -154, -74, -11, 68, -60, 175, -180, 67, 182, 135, -67, 116, -115, -104, 35, -164, 115, -21, -106, 42, 76, -44, -225, 270, 121, -62, -18, 41, 24, 359, -111, -150, 306, -77, 47, 152, -23, 113, 63, -95, -56, -31, 65, 142, -278, 156, -197, -127, 49, 35, -72, -156, -123, 179, 71, 104, 248, 186, -96, 160, 89, 53, -39, -138, -107, -93, -83, -20]
8162b0PK6l2R8o4J23k44P1R6k0L2l16MJ92K29j85q0J08J56K23l92m0P1L0k10J84
8188D7K7R0K01
$$ y = [-20, -13, 13, -19, 79, 15, 138, -106, -35, 61, 41, 73, -243, -239, -47, 182, -3, -83, 25, 181, 404, 12, -28, 43, 73, -137, 47, 74, 164, 365]
8191C65
$$ Imaginary data points
##PAGE= N=2
##DATA TABLE= (X++(I..I)), XYDATA
0@%%%%%%%%%%%qJ6j6J6k4L2m0M8n6P0q6J01j17J36j57J84k11K44k84L25l71M22
33B24m77N39o06O83p68Q58r59J068j188J319j461J618j788J974k177K399k645
50a387K913l209L539l904M311m767N285n879O565p369Q327r495J0951j2823J5341
65H399j8928K4492l4387N7400k16426j10494K86750J43000J55137L7359p2944
76B59358k08348j81491j44398m3249N8671J80937J97758J50972L6661n7686j49124
87A00061j87241j66444n8317N6360J50385J85075J58251N8315m8621j33427j73111
98e8714j60413p3110M1183J34046J69889J49426P1156l0472j14907j57465j53847
109a83228q5857K2294J14842J54726J46907Q5508j3016j02537j46279j44508r3245
$$ y = [0, 0, 0, 0, 0, 0, 0, 0, 0, 0, 0, 0, -8, 8, -8, 8, -16, 16, -24, 24, -32, 38, -48, 53, -64, 72, -85, 99, -112, 132, -152, 173, -198, 224, -253, 286, -320, 363, -405, 453, -506, 562, -626, 693, -768, 850, -938, 1036, -1141, 1258, -1387, 1526, -1683, 1856, -2048, 2263, -2504, 2781, -3098, 3467, -3902, 4425, -5070, 5881, -6942, 8399, -10529, 13963, -20424, 36976, -179450, -289944, -3194, 139806, 294943, 332302, 259358, 51010, -130481, -274879, -318128, -259457, -78520, 119238, 270210, 306871, 249185, 100061, -87180, -253624, -311941, -255581, -105196, 79879, 238130, 296445, 247824, 114397, -58714, -219127, -292237, -251054, -117008, 52881, 202307, 273463, 242991, 128084, -29381, -183228, -269085, -246791, -131949, 22777, 169684, 255192, 242176, 139639, -6640, -151148, -244393]
120b44393N02R6140J49588J41381Q2704K135p5590j33604j44105r2352r662P0106
132a57150J28591J42810R4645J2895o1452j17915j38432j03165k4981N9700J18626
143d5828J32418R7020K6305n0679j07138j22745r6723l6817L8443J01656J23491
154E9403R8235M1011l0499r3201j21428j03496m5577K7980Q9251J16399R9935
165A38013M6927k1183q0018j09598r9093n1939J3471P3732J07559R8055N2575
176A68501p797o5033j02023r9685n6886K959O0325R7456R8476N9947J046n5136
188A02150r1973r4489o3042p731N1571Q7609R1136O3355J2819m4510q4233q9058
200f6396o3569j7232L7486P9351Q8218O5048K0759l0946p4250q8598o7359k2400
$$ y = [-244393, -243891, -147751, 1837, 143218, 225922, 228057, 152467, 18863, -125242, -217594, -227256, -157150, -28559, 114251, 208896, 221791, 160339, 42424, -96008, -199173, -224154, -164454, -45828, 86590, 183610, 209915, 159236, 52098, -70647, -167370, -204187, -165744, -64088, 59403, 157638, 198649, 168150, 74949, -46479, -149975, -195552, -167572, -78321, 38078, 138013, 184940, 163757, 83739, -25859, -124952, -176891, -163420, -89688, 17871, 115926, 168501, 160704, 95671, -6352, -106037, -162923, -159964, -99639, -2183, 96293, 156240, 157286, 102150, 10177, -84312, -147354, -155085, -103514, -15905, 75231, 138586, 151405, 106895, 22662, -66396, -129965, -147197, -109711, -30360, 57858, 122906, 143665, 112719, 38469, -50129, -117488, -139888]
212a39888K7467O8539Q5268O7867K4641k4737o3003p9449o7183k8530J8707N7405
224e2896P6829O8703L4694j4273n5759p5353o8391l6001J0953N2375P0705O5888
236G7474L7942n937m7793o7875o3527l9233P91M1513O6208O4551M1331K139l8695
249F8889o3505o3916m1340l886L2816N8518O3379M3421P895k9819n5748o1729
261d5025m3851r438K5395N1421O0154M6212J2940k4446m9561n6726m4868j6148
273i3941J9113M5936N5695M5807J9386j5117m4673n4796m4679k0009J1379L9668
285c6231N3017M5958K1724r609l7875n1153m3589k1907N687L2020M8816M6269
297E3127K5871l883l1821m7032m4698k5830J490K7818M3545M4465K8197K44k6395
$$ y = [-139888, -112421, -43882, 41386, 109253, 133894, 109157, 46154, -33295, -100478, -129008, -110301, -52896, 23933, 92636, 127330, 113057, 57298, -18055, -86446, -122447, -111494, -59119, 11586, 77474, 115416, 109479, 61686, -6189, -69716, -108949, -108158, -66645, -437, 64114, 105445, 107584, 68889, 5384, -58532, -99872, -103758, -70942, -12424, 50955, 94376, 102271, 72452, 16704, -45025, -88876, -98314, -72919, -21498, 38656, 84868, 97808, 73362, 23801, -32925, -77793, -93941, -74828, -28892, 26803, 72610, 91996, 76879, 32206, -22590, -67269, -87278, -75899, -36231, 16786, 62744, 84468, 74859, 36984, -14169, -57758, -79665, -73978, -41958, 6858, 53127, 78998, 75115, 43294, -3738, -48436, -74266, -72776, -44958, -1413, 43052, 71249, 71493, 45098]
310D5098m1854m1565k7860l896K1926L9570M2626L0660O043k1519l9635m0494
322c0900k8187p691J6465L5498M0385L0704R327j4935l4052l9096k9684j0121
334f2287J1625K9947L9024L2366J2132j2014k9312l7223l0130j2780Q030K5468
346b5154L4822L2584J6241p124k5978l3457l0412j6068M005K2626L2486L1035
358C5606J7816l067k2414l1276k9059j7086N00J7988K9805L0447J9682Q46j7884
371C1904k9226k9323j8354j830J4233K6504K9363K0192L245j4420k5526k7374
383b0612j9848m757J1528K3586K7667K1985O195j1620k3067k6797k0218o796Q611
396c4143K1126K5435K0955Q134p083k0650k4599k0203q804N614J8421K4198K1281
$$ y = [45098, 3244, -38321, -66181, -70077, -48151, -8581, 34045, 64705, 70748, 49229, 9594, -30900, -59087, -66778, -50313, -14815, 25570, 56274, 65601, 50666, 16614, -22482, -52166, -62287, -50662, -20715, 18309, 50675, 62807, 50793, 21481, -15742, -45872, -58652, -50622, -25154, 9668, 42252, 58493, 51369, 25391, -8066, -38478, -54546, -50541, -27915, 4571, 35606, 53422, 50355, 27941, -3335, -32394, -49480, -48980, -30992, -1187, 29260, 48942, 49788, 31904, 2678, -26645, -44999, -46829, -32596, -6092, 23271, 43463, 46708, 32288, 6762, -20612, -40460, -45217, -33689, -10103, 17564, 39549, 45744, 34124, 11057, -15740, -35958, -42754, -34143, -13017, 12418, 33373, 41507, 34424, 13774, -10825, -31028, -39832, -34218, -15797, 8401, 29682]
409B9682R615m805j7815k3488k0156j0190L517J5222K2090K0966J1429k503j4777
422A8787k0844k0833j1322J258J3250K0387J9837J2684k48j2923j9537j9109j2582
435c1195j207J0836J8327J9601J3365K352r977j7676j9215j3099l053Q811J6578
448e552J8718J3346L217p610j5746j7619j3908m216O187J4585J8140J4228N037
461B8807n469j4347j6531j4463n366M658J2887J6342J3409O329l482j1763j6244
474e233j3600o532K425J1133J6072J3609O865j703j0416j5275j3478p315J327
487b2121R130J3848J3612P911j87q629j3836j3195q049p95Q448J3102J3154Q328
501B0721R77p382j2012j3271q580j680O307J1697J2420R561J885n599j1255j2164
$$ y = [29682, 39297, 34492, 16677, -6811, -26967, -37157, -33640, -18418, 3672, 24638, 36067, 33564, 18787, -2057, -22890, -34212, -32954, -19704, 683, 20520, 33204, 32956, 20033, 496, -18613, -31195, -32402, -21566, -3239, 16362, 29727, 32079, 22102, 4426, -14789, -27888, -30941, -22130, -5552, 13166, 26512, 29729, 22119, 6373, -11246, -25154, -29370, -23183, -8598, 9542, 23770, 28807, 23338, 8991, -7540, -22003, -27369, -22711, -9824, 6518, 19927, 26256, 22774, 11011, -5233, -18833, -25365, -22940, -11807, 4265, 17874, 24739, 23036, 12620, -2655, -16133, -23448, -22121, -12991, 857, 14469, 22380, 22193, 13564, -272, -13467, -21516, -22311, -13863, -761, 12393, 20721, 21698, 14316, 2304, -10967, -19547, -21227, -14920, -3223, 9197, 18758, 20643, 15044, 3789, -8375]
515h375r418k534N499J0260J1808R026K904m183r350j1675r696l561L568R361
529f366J1184R748L953k650q904j1045r279m797L014P803J0636R081M636j945
543A5069p082j0280r278n208J252P046R955Q963N853p65o758r315r225n392N45
558a4620N795Q707Q916N203L50n094q255r065o087k08M705Q489Q567N750R62m080
574A0035p751q854n917j411L669P399Q348N890J734l122o550q642o233j875L239
589a0041O641P676O127K302k646n855p435o689k719J903O170P350O283K715j280
604A0502n385p308n931l474J459M968P137N654L345j027l883o742o481l751P85
619a0132M325O181O317L640j50l929o296n811l903R1L279N878N875L610N84k751
$$ y = [-8375, -17793, -20327, -14828, -4568, 7240, 16266, 19170, 14987, 5637, -6038, -15734, -19295, -15727, -6366, 4818, 14566, 18519, 15869, 6965, -4080, -13359, -18156, -15142, -7339, 3297, 12378, 17014, 15069, 7987, -2293, -11571, -16779, -15527, -8481, 1474, 10437, 16290, 15525, 8767, -548, -9773, -15165, -14620, -8825, -118, 8798, 14001, 14351, 9257, 1002, -8063, -14150, -14358, -9653, -1164, 7403, 13153, 14115, 10035, 2284, -6570, -12487, -13898, -10229, -2830, 5518, 11408, 13142, 10020, 3470, -5172, -11405, -13280, -10041, -3400, 4276, 10403, 12705, 10059, 4204, -3231, -9920, -12639, -10736, -4566, 2784, 9067, 11782, 10502, 5117, -2191, -8122, -11596, -10137, -5169, 1968, 7622, 10967, 9940, 6057, -685, -7166, -10917, -10132, -5807, 374, 6691, 10331, 10181, 6252, -44, -5855, -9758, -9667, -6388, -510, 5365, 8975, 9559, 6808]
635F808n910n947l792q94K993N741N444L947J114k546m771n915m104j252J879
650g205N187N432L922J167j260m768n488m229j415J693M323N185L930J393m91
665G376m147n287l916k602J431M022M760L671K475q06l472m483m091k114M83K966
681c734M718L977K181k86k583m534m256k351K4K421M217M251K612P6k558l499
697F76m451k660j05J743M263L793K590O77k171l198m101k830r01J742L366M362
713B795K599Q56j362l286l794k939o84J173L022L569K683J200r80k819l671l133
729d771q88N68K721L822K709J417p65k376l029l360j282N25K109L322K997J202
745D921j43k158l334k545j807L51J756K726L357J751k02j599k879k896j887l02
$$ y = [6808, 898, -5049, -8841, -9735, -6742, -1001, 4443, 8390, 9504, 6958, 2187, -3728, -7832, -9084, -7205, -2018, 3414, 7336, 8503, 7243, 2475, -3013, -7242, -8657, -6964, -2641, 2544, 6474, 7867, 7376, 3229, -2058, -5974, -8576, -7145, -3123, 1637, 5308, 7783, 6977, 3505, -978, -5069, -7183, -6700, -3734, 984, 4961, 7142, 6856, 4273, -261, -4517, -6868, -6844, -4423, -206, 4045, 6657, 6733, 4175, 676, -3775, -6435, -6540, -4797, -534, 3259, 5849, 6526, 4355, 1157, -2944, -5774, -6675, -4933, -1567, 2795, 5394, 6250, 4888, 1602, -2192, -5131, -5815, -4642, -1620, 1949, 4632, 5832, 4852, 2033, -1638, -4771, -5659, -5091, -2370, 1452, 4161, 5578, 4813, 2437, -592, -3952, -5234, -4709, -2600, 722, 3719, 4921, 4778, 2620, -714, -3259, -5066, -4715, -2959, -233, 3124, 4875, 4673, 3074, 195, -2701, -4588, -4890]
761d890J691K703L077J663K75j213k799k672j766n00J036K697K629J796Q35j087
777C475k642k400j956r50J090K115K802J956Q21j072k047k641j688r52R91J616
793a482K365K175P23k36j862k375k059j176M82J738K120K282O15J10j702k186
809d68j764j294K60J469J966K158J120N4j685j948j748j264k23J020K045K004
825A702J478l4j171j476k168j138k73O22K168J709J494l2o36j729j819j365m03
842c071Q86J515K012J137P72q44j528j584j421p60L27J626J914J233L75j1j378
859A200j898j378p44N98R12J802J289P56k18j071j532j570o82O7J146J560J499
876A736O09k35j162q85j509q31j3N69J733J465O59K23j280p93j616n12l78N34
$$ y = [-4890, -3199, -496, 2581, 4244, 4519, 3306, 507, -2165, -3931, -4431, -3395, -698, 1931, 3727, 4562, 3475, 833, -1567, -3523, -4473, -3383, -1268, 1534, 3490, 4311, 3239, 1192, -1449, -3137, -4089, -3098, -1482, 883, 3058, 3781, 3545, 1683, -692, -2751, -3927, -3445, -1707, 413, 2695, 3310, 3420, 1718, -468, -2232, -3526, -3266, -1797, 169, 2327, 3447, 3501, 1816, -132, -1880, -3144, -3367, -2347, -302, 1702, 3180, 3146, 1975, 499, -1669, -2807, -3080, -2458, -290, 1419, 2913, 2881, 2245, 516, -1303, -2668, -3071, -2185, -670, 1342, 2479, 3251, 2407, 879, -705, -2126, -2886, -2559, -933, 981, 2214, 2589, 2578, 1200, -698, -2076, -2820, -2222, -1310, 492, 1781, 2537, 2319, 1248, -284, -1854, -2536, -2469, -1323, 237, 1736, 2345, 2110, 948, 63, -1446, -2277, -2290, -1721, 12, 1477, 2136, 2359, 1079, 286, -1330, -1842, -2220, -1686]
894a686J277J608R42L60p69j230j510n27l27K33J245J193P02P27n94j098j213
911f67j065n60L78J054J386J024N92n30o43j351r27l93n2P84J510R96M21m24p73
930G60q49j231m80J78Q52R18J074N61j28n93j197j042m01n0M85J032J015M82K46
949A632p21o44j265o15o3O64Q34J146K85l1m10n31q91p75l25M32J053Q90P39N
969A409j15r50n28q26l75J92Q28P29O52L11k99m12j083n47k54kO29P15P22K85
989A081L28r57o70n67o81L53N59O77O12O70m23m44o33n87l86j17K02R95P76L55
1009A143J72p99k78r23p9l73J20J145M98N00Q1o30m25m69p34j44L98O55N38M40
1029H36K63l50l45r96Om17J79O09M40O28J44k21m93o85j43k13p5L06O77Q62r1
$$ y = [-1686, -409, 1199, 2141, 2501, 1732, 502, -1008, -1535, -1862, -1629, -384, 809, 1511, 2238, 1644, 546, -667, -1732, -2292, -1914, -860, 526, 1550, 2142, 1612, 969, -382, -1309, -1702, -1754, -970, 540, 1536, 1957, 1533, 760, -89, -1320, -1800, -1622, -770, 148, 1222, 1783, 1655, 1062, -135, -1177, -1578, -1628, -1143, -111, 904, 1386, 1632, 911, 267, -998, -1613, -1676, -1012, -178, 968, 1253, 1222, 812, 281, -610, -1385, -1710, -1278, -225, 665, 1404, 1409, 1294, 344, -184, -1010, -1385, -1193, -365, 364, 1016, 1327, 1028, 616, -467, -1014, -1268, -1270, -641, 74, 796, 1081, 1409, 452, -218, -785, -1466, -1113, -554, 123, 735, 1405, 982, 538, -95, -682, -1068, -1185, -983, 12, 788, 1143, 1315, 516, 238, -685, -764, -1137, -1017, 128, 626, 1126, 1207, 577, 152, -317, -1051, -1195, -797, -142, 396, 836, 1099, 749, 404, -592, -586, -1003, -824, -215, 225, 853, 997, 776, 283, -402, -545, -758, -833, -527, 150, 1012, 921]
1050I21K27p61m69k25m71j5L76N34N35L20J30n89m54o39j32k09N98L14L25J93
1070E09M47n81j70n26m54j46N08K41M43L53J54p3m89l97k57k52K1P04K84J52J69
1091F40K3p36q5m84J0J14L10J44M57N56Op81j95n77R7j53L84L59P9P43k63k41
1113D07m51j47l26NJ70L81N17L32k99k60l67k38j96p5L73J78K48J04nJ47m97l32
1135c31j40k81L25K16L25J11L97k60k90l39l36J3L80R4K66L04J54j24k62l18k62
1156c58j73L15J67J98jQ8N2l12j56k76K31QK43J34K13j44K12l28l30j20k30O9
1178d98L01J00M31K4J65j72n34K0k15p0Q4N98K58l24L21k61K1o14k45P3K12J18
1200b07M26r7J89l8j40l53j76J40L4l7L61J28L66k94l26k11j14Lk7J35K25N64
$$ y = [921, 1148, 387, -82, -307, -778, -793, -417, 117, 652, 972, 1102, 513, 59, -580, -712, -921, -323, -9, 316, 509, 956, 375, 205, -321, -775, -921, -413, -172, 271, 624, 778, 705, 216, -181, -438, -690, -669, 35, 319, 471, 640, 663, -73, -158, -642, -632, -518, -208, -64, 393, 949, 955, 174, -21, -598, -501, -654, -270, 89, 168, 911, 648, 407, -44, -191, -517, -512, -342, 39, 556, 888, 589, 329, -38, -276, -472, -547, -174, 4, 252, 356, 351, 498, 1, -331, -471, -752, -427, -211, 114, 225, 622, 362, 72, -267, -603, -590, -210, -116, 150, 454, 608, 484, 222, -96, -358, -531, -216, -49, 149, 148, 236, 288, -24, -180, -456, -225, -217, 26, 160, 373, 229, 441, 113, -217, -337, -567, -498, -197, -97, 334, 358, 523, 351, -183, -163, -378, -448, -364, 234, 492, 168, 489, 228, 249, -365, -610, -537, -325, -207, 219, 122, 311, 273, 133, -220, -396, -256, -222, -259, 102, 230, 596, 302, -24, -235, -349, -346, -373, -238, -13, 551]
1222E51l71k3k0l86j05n1K62Q9L92j40J84j60N2k2l80K1j49N9K63K51K2Kp6n87
1246c22J3O5n2J14L72n0J87k77l9N9j56l80L93l11L49L46n3k3l51J3pm13K17J07
1270a99j01M54J50j4k04J07j12k04P1J6k8m7K16L0J12l4j14j29R8j36j5j08O13
1293D22k23k04J87l9j98k95N8J91j47O04j25k86L03k46k09j25N24l33K12k22K07
1314E6R5O6O5j20l47q8J2O8M31PK1R3m29Q2P7j12R1K93m86N42k35j03Q3l77k64
1339d79K16J61J54M5l6O5j11M2l66J13J54l38J14K65j38J52l4P7k08p1j2J0K52
1362B7K49k51M61k44k16L7m54K51P4r7J51L68p0j38j95K84j96r4j71o2J45K43
1384A02J26k54j38K64N2l82j6J65Q3J24J65j57j02j60j51Q2J73k27N6Q2O3L77
$$ y = [551, 180, 157, 137, -249, -354, -405, -143, -54, 338, 198, 382, 222, 274, 252, -128, -107, -256, -197, 66, 317, 339, 341, 265, -322, -309, -244, -296, -182, 190, 140, 327, 50, 11, 70, -86, -466, -73, -384, -35, 311, 258, 235, -116, -103, -110, -523, -306, -199, -300, 154, 304, 290, 86, 193, 81, -123, -52, -36, -64, -111, 105, 135, 247, 213, 99, -30, 68, -68, -83, -191, 422, 199, -5, 182, 143, -55, -350, -292, -101, -248, 356, 231, -55, 248, 2, -207, -332, 192, -141, 71, -151, 56, 151, 217, 282, 162, -185, -273, -261, -193, 238, 245, 266, 359, -70, 12, 89, -23, 68, 361, -125, 417, 182, 79, 162, -215, -479, -263, -102, 52, 97, 61, 126, 15, 57, -309, -196, -42, -380, -266, -1, -139, 13, -21, 56, -152, -223, -235, -225, 27, 276, 25, 486, 242, 26, 63, -391, -140, -66, -163, -12, 356, 286, 148, -47, 237, 41, -53, -224, -286, -141, 102, 228, -26, -164, 100, 152, -230, -246, -81, 2, 126, 291, 134, 32, -128, -279, -197, -24, -251, -195, -113, -50, 327]
1406C27n21J07J47l3j95j17j7N64j85M4lj23J08k01j58RL45k24J64jl59L83N0
1429A11P1k73J13NJ02j3k14L65l6k28M0j00k33M26k97L50m06K89j42K49j88Kl33
1452c40L77k2r7L13mm70J92K73k46j30R5oJ13J79j3k67k1M0l08M23j95j7k4K90
1476A35Q4l79J59J94k59j27n0L50j49L38qj83k82J03J71j37j37j8J92P7q3r1K69
1499A69m0j79n0j40o0N45Q4k83n9o1J9k1M4j6L6k65L69O7k51L98k72J3j02m4j1
1524a10N8n7J49R7j1n4l78J58k5M5l1K75j14nk09J43K62k49j31L22l43J54J37
1547H3J00Onl1k60LMl78L70R5L45k13q5k00Q6j2j39J03J96J37j73o5K24p4l0l63
1573b76M22j48j48K81k57R2K12k11j06J8j71J94j6O0k07L30Q2PJ5n15K10K84j30
$$ y = [327, -194, -87, 60, 27, -168, -285, -302, 262, 77, 121, 118, -5, 103, -98, -256, -247, 98, -126, 38, 37, -322, 61, 111, 182, -91, 22, 27, 129, 116, -98, 267, 231, 3, 43, -57, -290, 136, -161, 189, -217, 72, -70, 179, -9, -7, -340, 37, 15, -82, 231, 227, -243, -51, 222, -24, -154, -59, -65, 48, 227, 214, -53, -74, -34, -342, 81, -114, -131, -155, 135, 219, -160, -1, 193, -66, -193, -243, 107, -42, 296, 288, 105, -177, -74, 97, -40, -177, -195, -3, 74, -9, -100, 169, 129, -50, -100, -240, -300, 245, 329, 46, -13, -74, -55, -76, -32, -48, -12, -277, 92, 159, -92, 306, 34, 47, -55, -99, -110, -52, -109, 40, 137, 126, 72, -306, -148, -173, -128, -159, 116, 2, -3, -212, -69, 193, -56, -187, 135, -208, -54, 83, 183, 189, 184, 153, -107, -104, -100, -478, -108, -13, 332, 119, 34, -166, -80, -92, -231, -128, 68, 205, 32, -33, 191, 117, 87, -276, 146, -2, -150, 131, -126, -34, 178, -33, -139, -121, -292, -98, -114, -54, -261, 69, 151, 158, 173, -342, -132, 152, 22]
1596B2j86L21k9l65J94p4j00J1L32k42Q0%L72k21Jk20J29J41j84J77k37K41J2
1619A75l4n5J83n04K09J31k19K6j39L63J8J8k68J94l10L5J38o7J92j85J14J2j07
1642h0Q8k26K90j56j86M38l8O8j25j63L93j81j12rm0N3L03k48r6L03m74q0N6J45
1666g7K05m0L2j66Q6L9l8N0q6O9L1n1p5J68k68N3n7k34L96Ol07K23k1L17n2J9
1692B22j52J63l07r3K73j2r8K04N1l57J46J71k17OL26j04n07L51P0j90p8J04L0
1715Bk17P0j65K71K6K73k63l1k78K79M1k93J71J19j59nL68j80j59K07l33J24K84
1738A52K0j44rm4l1O7K48k68J35j9l62l2L57K8r6O4j54J7o0k1K31J95l87Q7l5
1763f1jj47J73l59L16j84L59npJ14k95k77M88Q4r0k35jJ72k63J42r5K7J68J4O4
$$ y = [22, -164, 157, 128, -237, -43, -117, -217, -206, 126, -116, -36, -36, 336, 115, 116, -104, 25, 166, -18, 159, -78, 163, 175, 141, 86, 269, -235, -26, 105, -114, -88, -227, 136, 154, 172, -96, 98, -212, -177, -39, -106, 86, -99, 15, 27, -80, 8, -218, 72, -84, -270, 168, 130, 198, 73, -90, 303, 122, 10, 1, -39, 14, 317, 69, -27, 276, -198, -278, -222, -77, 128, 88, 120, -46, 40, 79, 41, 91, 5, 74, 105, 54, -21, 147, -121, -68, -125, -359, 37, 43, -264, -41, -62, 255, 203, 222, 70, 233, -74, -167, 106, 94, -4, 200, 251, -106, 40, 211, -6, 0, 326, 222, -285, 66, 136, -54, -132, -28, 2, -215, -145, -310, -39, -13, 260, -3, -34, -312, -33, 8, -285, -114, 5, -154, -159, 209, 29, -130, 77, -256, -132, 152, 172, 28, 19, -25, -56, 11, 259, -9, 126, 107, -255, -287, 70, 98, 2, 66, -88, -71, -131, -152, 79, 274, -113, -26, -61, -62, -209, -36, -395, -79, -263, 96, 91, 84, 198, -97, -374, 114, 198, 108, -127, -128, 44, -219, -77, -172, -145, 23, 37, 101]
1788A01R9m00K13n5Q6k72J90l03L06p9J96p1l3MR9l18L84p0O1k64K01j91K58P2
1812B14k56q4K89K9n08L15M7J67k55J46j21M4pM8p9k02K36R3n2n3q5k09J91J44
1836E2k43K47r7J65k9k16km4N95n30J83J76k50N4K14m50J79K85n84J43K79M8n10
1859c35K71K62k19Q5k07L2J63j92p7M10q1q5j74P8j48N2Q3j61R3J45p0K75k83
1882h3j3J30j96J46r8J17k08K75L4n6j03J53J22r0j40L5k56K51J83q2k4J5r1j36
1906a15K28n5j45l2J22M0K65k70l7L11m06K20k45J0j10L09k12K46j21J4J12L9
1928A68n41L02J17J03j71J69k27J41m4J10n6l70N86k80M6k02M53j44j42q5p7m2
1950a86L13j71N7j85K07q5o9J72m8RP9j59O5k87L16k84J63L78K7m06Q0N6l01M21
$$ y = [101, 200, -200, 13, -42, 44, -228, -38, -341, -35, -114, 82, 11, -22, -18, 81, -237, 147, 77, 138, -126, 75, -116, 142, 214, -42, -126, 163, 192, -316, -1, 46, 213, -42, 104, -17, 27, 20, 68, -11, -213, 23, 116, 64, 11, -74, -283, -92, 52, -191, 56, -41, 124, 95, -121, -123, -167, 428, -102, 81, 257, 7, 61, 275, -175, 4, 289, -295, -152, 127, 175, -335, -64, 198, -21, 64, -143, -111, 52, -140, -217, 193, 112, 27, -147, -69, -217, -165, -82, -243, -150, -5, -75, 200, -83, -96, 34, -162, -16, -114, 3, -205, 70, 104, 48, -55, 98, 220, 130, -10, 25, -231, 20, 203, 121, 97, 112, 21, -115, 113, 58, -87, -119, 3, 43, 308, 38, 1, 312, -94, 126, -119, -109, -219, 90, -122, 124, 3, 17, 129, 168, -373, -71, 46, 149, -22, 147, -80, 61, 17, 127, 71, -299, 287, 7, 53, -149, 304, 160, 18, -67, -144, -186, 127, -44, 13, -172, 35, -50, -119, 53, 5, 14, 93, -66, -1, -288, 28, -256, -93, 285, 312, -94, -14, 42, -259, 162]
1974A62P9l17K05k39k6K17j77q3J80J52k22J05K17j59K5k77K46P1j78J57m17L03
1996B4j58N1K16n3k08J66k29J63K58k87L08m40J91jJ62NKk11J49j26Q6j80j07
2019b19K84k46J79R8K3m10K13p3J53J07p3j35j36L36o1q0M8J23l28r2J96J66l13
2042b40J63m0OJ3J7l0j98J67J3M48j55k14L3J94j11r3n0J09J05p9j5j4L7p2k50
2067b56J51L46k09J9J9l14K20j21K49l9J76l23J5l8K59k55m9L68l52L07k81J77
2089F9L1Oj39L8j26O0J67O0j91j90K62K1k02M5M6R5L3Oj41MK63l23J60j15k4K78
2115A93j76K7n9J7r2K3J10l59K31L9j58K71K0j2l37L59j15K7r0M9K58j09J46l82
2139a19P8j62Q0J35J42q4j32K66nk38n6J37k42J60K73j89K49l25P5L2j01N7q2
$$ y = [162, 241, -76, 129, -110, -136, 81, -96, -179, 1, 153, -69, 36, 253, 94, 119, -158, 88, 159, -19, 138, -279, 24, -134, -83, 133, 80, -128, 38, -191, -28, 230, -57, 251, -189, 2, 1, 163, 168, 170, -41, 108, -18, 68, -112, -219, 65, -181, -2, 96, 119, -291, -78, -151, 2, 109, 36, -99, -235, 101, 40, -40, 8, 131, -197, -289, -93, 73, -240, -77, -117, -111, -98, -81, -111, -309, -142, -129, 319, 164, -50, -17, 177, 66, -27, -77, 32, 137, 58, 43, 29, 66, -6, -256, -105, 241, 32, 51, 70, -244, -24, -145, 104, 65, 241, -82, -67, -105, 154, -101, -150, 218, -134, 173, -108, 69, 100, 106, -33, 5, -121, -61, 106, 166, -25, -215, 47, 68, -134, -89, -43, 52, 85, 91, -50, -46, 217, -106, 54, -61, -85, 193, 17, 44, -15, 2, -90, -67, 43, -316, -85, -46, -204, 67, 87, 75, -262, 97, -18, 9, -81, -32, 226, 117, 263, -119, -41, -203, -123, 12, 154, 70, -62, 204, 199, -39, -95, 42, -200, -40, 233, 44, 293, -32, 43, 75, -26, 31, -51]
2162e1lQO3j75K54j61J08m0j7j15J31qm2q8J15L7j47K04l40L95N2l27J04l4M7
2187c0N8N0j11M69l35k43K33k44J73K0J3J31k96J41J38m52O18l40n8N3J22j05
2209En9NJ5J53j70L7j66K85Q1j38O0R8l4p1k08k03J54J81j3m7j33J88M3k1L6k01
2235a23O2J65P8l53Q0k7m4K94j06m0N1l90L36J66k68k40L02M2l8j9M9M4j20J89
2259I0k42J96Q1j50M3K66j90L09n21J24J58k12j19j48L16l9n7n1j7K88k17j79
2281b71J66p4n3L53m9r0L00l84K61k29J80j48j16p9L04j96K50k58K38q6n3q0Q8
2304b6J56J07j62j9k17K77J03l30r7J43J60k97K42J18j89L4j14O1L52m59J0J38
2326iN0n0k1J4j80L06m9K6k70M88m45J79O8k56L90n26J34M08j62k36P7q9K7K05
$$ y = [-51, -54, -46, 17, -158, 96, -65, 43, 3, -14, -129, 2, -6, -48, -136, -21, 16, -131, 73, -267, 128, 180, -147, -43, -77, -30, 28, 78, -33, 436, 101, -142, 91, -153, 20, 40, 53, 184, -112, 29, 167, -285, 333, -7, -65, -12, 110, 5, -54, -49, -34, 119, -51, -14, -180, 105, 186, 48, 108, 206, 172, 101, -107, -310, -156, 25, 12, -35, -168, 20, 63, 42, 78, -123, -61, 104, 182, -171, -91, -118, -162, 132, 26, -14, 37, -353, -17, 149, -119, -359, -57, -15, -53, -72, -23, 21, -99, 90, -152, 44, 125, -25, 18, 284, 94, 403, -118, 6, 164, -48, -167, -315, 1, -38, -95, -146, -163, 125, -92, -271, -105, -179, -232, 121, 72, -18, 282, -102, 159, -70, 110, -38, -154, -233, 71, -125, 125, -133, 105, 19, -34, -114, -26, 130, 237, 75, 56, -161, 116, 219, -111, -208, -65, 95, -202, 40, 158, -31, 3, -111, -50, 302, -157, -147, -9, 41, -9, -30, -16, -196, 110, 61, 87, -183, 305, -140, 39, 107, -149, 241, -285, -151, 257, 95, -141, -64, -153, -126, 79]
2350G9j41j6R5n7J42q7O7j10j58L69j66J11j86j40M13l19R8j03K46Q4j59q9j77
2373b04J59l5J27k19K62J25J21k52L3k46K17k5OL0J84l06j59j2m7L16Q7O5k97
2396g0p6J54J33P1j20l57K19N2O4J60k67J11k38M11l04J53P2j87J26k93M15k56
2418b7K37q8rl14L64j00k14O3L28k75MP8o3k27K94oNj09J17o1k04K37l33M98l76
2443a81K74j46L29l17j4K12l28O4K41k63J27j21J01j47J14L4j68J73rJ61j01k2
2465A3L01m31J43Oj8Rl85K47j78K62K38j71j32M7J36m21L31j81K22j89j41L43
2487E1O0j46K41j78O3K30k00k79L5J80J00j7k31J36KL13k67l5k20K74j41J14l0
2510E5k5k44N28m5j73m1j71K68Ql8l12J43l7oq1N41k71n3p7mk05L56k50J09J14
$$ y = [79, -62, -78, 17, -40, 102, 15, 82, -28, -186, 183, 17, 128, -58, -198, 215, -104, -6, -109, 137, 221, 62, -27, -204, -45, -80, 47, -172, 90, 215, 336, 84, 117, -129, 88, 63, 69, 99, 283, -23, -182, -194, -241, 75, 162, 227, -70, -146, 8, 141, 212, 92, -265, -46, 6, 70, 230, -37, 74, -164, 247, -57, 96, 168, -19, 107, -186, 229, -27, 210, 122, 113, -201, 163, 63, -151, -88, 240, -35, -31, 47, -16, -243, 51, 45, 50, -59, 58, -3, -207, 30, -303, 195, -181, 93, -53, 276, -41, -55, 157, -171, -107, 134, -129, -2, -123, -22, -169, -55, -21, -189, -16, -25, 136, 35, 13, 314, -117, 26, 32, 14, 23, -362, -115, -293, -31, 207, 36, -96, -49, 87, -334, -3, -184, 38, -151, -292, 51, 111, -35, 206, 28, 91, 321, 121, -158, -123, 57, 157, 140, -91, 45, 47, 360, 93, 58, -162, 112, -29, 85, 55, 30, -214, 314, 269, 96, 55, -116, 152, 160, 122, -190, -47, -84, -90, -171, 370, 99, 46, -31, -35, -240, 116, -134, -25, 89]
2535H9K98l38K4J03q4j9k30L01n33N35k70K81j38L4m02N16o2j14J0J22Oj19K6
2558C6J5k5j42J28j17K18j84P3l2Q8j57L01l14M6r7K62k98KJ12j5M7Om4O5l8K45
2584A81l76K2k7J89J46l02l1J63L0j6p2N8j19J30k3J88L9k67K08n6m00N08l26
2607a53RKk2L82l16L8N2q7RJ82r1k49K52K27l45K33j63K4P5N7k75J7q8K19J36
2632A25j37m3J03p4K6k15J83q5L43j57R9j81k1O2q3M6K74m43j61N03k25J5J63
2655A17p1J54k79K22m8j84Q8K4r4o6N5k22J42J4J25K7J13j00m04N91m61L54m11
2678c14L20L60r3k24j37j6q7K20o7K6J97l71k7L03j10L7j82M11k01J04k67Q7r2
2701a23j0K18P6n1k1l15M22l39L85k12J35k08K5Q7k01L35m8k38J16J77j35K7r5
$$ y = [89, 387, 49, 73, 176, 92, 73, -157, 144, -389, 146, -124, 157, 19, 53, -349, 167, 105, -9, 1, 123, 129, 10, 36, 51, 26, -116, 12, -105, 113, -71, 2, -30, 58, -99, 202, -112, -66, -163, 99, -199, -197, -85, -100, -53, -47, -91, -26, -64, 181, -195, -173, -200, -11, 135, -167, -198, -35, -5, -21, -93, -35, -154, -24, -47, 141, 180, -87, 121, 65, -335, 173, -153, -144, -142, -164, 218, -98, -60, -8, -95, -86, 96, 5, -244, 8, 235, -110, 123, -40, -16, 59, 116, -159, -142, -230, -11, 125, -12, -55, 48, -26, 0, -215, -32, -117, 226, 69, 168, -13, -34, 28, -55, -9, 265, -178, -339, 164, -61, -46, 117, 46, 200, -79, 143, 95, -89, -1, 23, -71, -137, -82, -304, -162, -148, -23, 4, 117, 17, -387, 204, -257, 97, -314, 6, 366, 273, 49, -88, -104, -191, 29, -38, -12, 185, -186, -213, 90, -20, 17, -165, 246, 45, 149, -118, -31, -123, -133, 85, 161, 110, 89, -226, 196, -143, 242, 30, 165, -43, -18, 69, -132, 203, 155, -83, 33, 210, 75, 102, 7]
2724Gk5k12J23j5J75j96n4J35L23r9k07J22k4J89r3k1j92K17L7k61o8J46K04k94
2748h3j8J43j40NJ98r3k47J19K18j84J30J1j18k4Q7j27J36J53j86M05m59j71K20
2771b5P5j6k7J67j31j18L5J37M9Kr9K17k75M3p8M8j94J7O7J30P3l78K12m0M35
2796C26l03K1m7m3L6J35j67j32J97K42m81L0J37o8K61n4N2j26m7J00k7J7k64J67
2820c8n1K21r5j70O8L08r3n6j01L12j9n59M84q3k44q5R4J39J63j97k29J37L57
2843B63l60J12l15L27j57k03L45pJk5L8j48P1j03K73j13j29L28l53l8M8L73k17
2866A1k39K54j05p7j31L39k90L20n6j0J67k6kj3m36O02m01Q2Q2r5N1Okl0K77k86
2892hm9l8M3P7J5o4J3K38k25k1J55k43L8j7K07j18R3r6K17j72p1J74R5l49J36
$$ y = [7, -18, -230, -107, -122, 53, -143, -197, -62, 261, 162, -45, 77, 53, 242, 149, 128, -64, 153, 190, -71, -139, 7, 211, -83, -101, 42, -98, -93, 105, 12, -235, -116, 102, -82, 48, 59, -59, -83, 4, -123, 13, 166, -20, 385, -74, -245, -25, 50, 34, 7, 174, 43, -75, -40, 97, 146, 148, 49, 266, -9, 34, -44, 4, -190, -173, -106, 24, 97, -281, -69, -109, 326, 23, 44, -3, -46, -10, 125, -42, -174, 23, 265, -216, -186, -49, -117, 144, 90, 142, 16, -31, 69, 42, 59, -205, -38, -89, 132, 37, -133, -65, 243, 150, 94, -7, 305, 286, -273, 211, 128, -116, -201, -107, 32, 195, -2, -231, -94, 263, -97, 15, -300, 27, -130, -333, 12, 5, 6, -19, 19, -129, -58, -161, 112, -1, -130, 198, -155, -193, -145, 228, 11, -228, 26, -79, -156, -287, 52, -238, 82, 26, 16, 183, 157, 155, 142, -294, 308, -93, -11, 71, -24, 27, 33, 31, 1, 278, -8, -57, -95, -52, 25, 40, -24, -11, 227, 2, -19, 136, -107, -69, -86, 121, 3, 96, 0, 217, 45, -26, 148, 243, -106, 30]
2917C0o4L1p6J95r0n5J72q6J17j44o1p7L98k73J03k87J12JNl7j5J75l60J10O43
2942D67o13M03k20M2k21J40O1J43k57J93n3l72J13N34n18K31J48l32J59k23Q4
2963i1M7P6k21L21j40j05K59l38L64j37j05J68N3j32k09L16k66L4J26m5j98L17
2985I4j75j56J57J52Lo6j4J70j26J6p5J31p0j25O4K58k00j54J56r5J63mk64j32
3009b92J87k68L6N62l33R6J47K1k58O1K1J2l03M47k51l6J91J29m3q2K4j44k52
3032c28L20J27k21M25n70O8J03J66p1j44K09r9k6k5j00K84j63L45k89M6J39k71
3054g5J08r2J02j63J05J74l24R2N2l49M26q8J53j90M3J33k69J57N2j0j8K02N7
3077B78r4j73l16K21R8N7n5J52j78R7q1o8n6k3K3K09j05Q4J26j4j20P4J68l43
$$ y = [30, -34, -3, -79, 116, 26, -29, 143, 57, 174, 30, -31, -108, 290, 17, 120, -167, -55, -54, -49, -86, -101, 74, -286, -176, 467, -146, 257, 37, 79, -142, -2, 59, 202, -55, 138, 85, -287, -174, 360, -158, 73, 221, -111, 48, -175, -91, -44, 32, -189, 132, -8, -113, 146, -192, 172, 35, -70, 98, 151, 19, -190, 126, -140, -106, 20, -25, -223, 94, -81, -237, -80, 72, 75, 9, -5, 165, 39, 55, -20, 111, 41, -84, -20, 238, 38, -116, 40, -55, 108, 104, -160, -292, -105, -373, -337, 225, -108, -12, 135, 156, -102, -41, -20, -8, -311, 136, -115, -151, 40, 169, 126, 44, 68, -76, -328, -8, 119, -102, 323, -247, -179, -76, 90, 19, -125, 84, -15, -41, -66, -166, 118, -45, 300, 11, 57, 196, -75, 33, -59, 43, -120, -15, 159, -165, -73, -21, -370, 56, -32, 121, -69, -26, 107, -162, -5, 47, 37, 19, 221, 278, 184, 11, -305, -84, 14, 71, 16, 168, -10, 87, 6, -62, -118, -141, -118, 91, -14, 70, 196, 182, 62, 136, 304, -39]
3101c9j51R9K02j86LL28k85p7J64r8K7J05l7k23M63m3k77O5k4m0J1k52N12k65
3125a8j48N21m97PM08m78J4l1N0J65k0r4J91P1p7o5p8J93l29L08o1m4j83K30l57
3150c22P0O5L10j91K3J46p0K6l2J01Q6j73j83J19M7k5nP8k04J54pJ80l40K3J29
3175EMj19P7K74j69j57l5K73j61j16J21O3m5l9M1j23N4n2MJ27P3K19k55R5j28
3200C1m4o7K62j84O4j15K10k06j04L83j92J10l13R7J72j01N2Q0j64k55M17l15
3222a82J61K57l74R0k32L28n6J1L61k43k70N3J6on2J29J80r3j30J00k4q6O3L3
3246C4J19j73K30l14p8M06j48p7K2j20J19k6K8P9P1l39o8L14p6j2J63q5m0k37
3270b08M05j97K90m33q5L10m7L2J08m70K68k02L80l80L11k05P9j08J88j0jkM2
$$ y = [-39, -190, -91, 111, -75, -72, 256, -29, -106, 58, -40, -13, 92, 55, -168, 295, 252, -25, 40, 16, -24, -13, -265, 247, -18, -166, 355, -142, -135, 273, -205, -191, -222, -172, -7, -27, -121, 70, 141, 64, -1, -79, 114, -215, 93, 32, -12, -195, 35, -322, -252, -187, 123, -68, -45, 101, 31, 57, 25, 126, 212, 39, -144, -25, 22, -3, -8, 70, -134, 20, 13, 193, -147, -124, 5, 9, -110, -33, 241, 72, -85, -120, 153, -8, -124, -3, 60, 15, -24, 17, -106, -52, -104, -100, 27, 100, 319, 64, 159, 31, -13, -80, 182, -2, 62, -53, 157, -49, -153, 230, 38, 148, -165, -68, 104, 3, 55, 135, -29, -284, 133, -182, -21, 236, -138, -48, -280, 48, -8, 3, 364, 121, -149, -96, -80, -86, -138, -9, 171, 78, -52, 48, 24, -62, 1, 34, 153, -20, 210, -104, -182, 224, 76, -1, 21, -99, 20, -6, 22, 101, 172, -167, -235, 79, 3, -9, 154, 69, 29, -208, 197, 0, 290, -143, -228, 82, 35, 67, 175, -295, -27, -229, 151, -229, 82, -123, -44, -152, 36, 26, 25, 23, 65]
3293F5k94O6j21K07J64m5J19l55K61k50qL59l51J31J28k90K62j01J32P8q9k83
3315b15J19J33O4n4J48j2n53N55l19Q8j22J5J39J79j33L1j69o0J81J30j28K14
3337B31k24Oq3j6m5M9N5K16j29K02Q5m79R1j55N8R4qk81L91J65r7j21J01m8k15
3362a57K73l5j97K38p4r8K18j54l26L25n7J19p2l24K70r7J70N4M1j90O7J18J74
3385B86k55J84k35q3q7J88j58Q3J25k8J29j21l0m4p2r4K46j07k17L03L9k55K37
3408C4J72k70K36j30l93L14J33J90m05J65J00Q2j77j36j3M18m63M2K73j63k18
3429b09k6M40j98m32Q01l87j40J79jQ8Ml21K85M6o4N1p9k85J57p7L99k70l7K91
3453B15m52J76J7K39j01j69L38n30N88l17j60M03j97k17L02k15rK36Q3m72NJ20
$$ y = [65, -229, -163, -284, -77, 87, 42, 161, -194, 67, -183, -191, 168, -183, -52, 76, -214, 48, -53, 79, 157, 68, -215, -96, 37, 101, 47, 195, 183, -370, 185, -134, -46, -168, -153, -14, 165, 32, 63, -106, -166, 15, 145, 17, 231, 7, 13, -70, -86, -131, -82, -27, 189, 60, 262, 347, -132, -41, -196, -138, -44, -52, -333, 58, 223, 126, 5, 106, 58, -157, 116, 81, -116, 122, 48, -50, 168, 14, -312, 13, -44, 75, 3, -321, -51, -148, 22, 76, 117, -73, -6, 112, 286, 31, 215, -20, -103, -190, -2, -160, -77, 48, 20, 149, 28, -2, -46, -118, -212, 34, -73, -290, 13, 52, -203, 34, 206, -64, 172, 42, -351, -37, 96, 286, -119, 46, 146, 228, 51, -85, -98, 320, -143, -101, 172, 9, -209, -235, 205, 7, -425, 376, -11, -151, 28, 27, 115, 119, -202, 83, 129, 65, 116, 37, -248, -91, -168, 231, -39, -76, 215, -237, -61, -44, 195, 94, -75, 263, -267, 321, 4, -156, 247, 50, -167, 135, -80, -89, 147, 230, -242, -237, -117]
3475a17J84j22k78M25j34K30j06j75Oj03K58r9J67k47M3J36j34K35N1j33K0L6
3497A43J13n69J38J68J47k43J91j2N6n3L5J47k86J58j34nj28j16J76J11j35J27
3519B9K1k32K44j57J84k31N84o27L88j2l03j4R1K90k76k32J89K33K6k17l0J55
3541A03j35j13J96Q5j73K4m4K27m59K47JK01j20R7l2R9p4k94L50j55P1j16J35
3564A21K4O2l0j27k18J88K24l13j55K21J38J51j64rM5L6P1k63J81k21j98K84J78
3587B26k54K88o16L04R3j13j60R7n4R6J03j40Pn8K10j71Q6J92m9j43o6J98j27
3610e1L3J78Qj08Lj03M3J00J22k78p1Q0k31L78K10n95k6K95K8K68m91L74l29r
$$ y = [-117, 67, -55, -333, 92, -42, 188, 82, -93, -87, -190, 68, -31, 136, -111, -68, 68, -66, 169, 220, 87, 107, 143, 256, -313, -175, -7, 140, -103, 88, 76, 132, 79, 114, 261, -25, 133, -1, -6, -134, -250, -74, 37, -98, 29, 50, -182, 62, -95, 89, -142, 442, -185, 203, 191, -112, -126, -35, 255, -21, -253, -64, 169, 195, -22, -52, 103, -32, -145, 51, 136, -37, -13, -57, 170, -289, -42, -41, 160, 40, 137, 105, 204, 130, -164, 186, 31, 102, -14, 121, 145, 207, 177, 50, -168, 20, 244, -69, -224, -3, 135, 286, 122, 113, 158, 194, 265, 2, 183, -38, -236, 48, 226, -28, 260, -356, -52, 41, -72, -232, -135, -189, -93, 10, -130, -123, -181, 29, -142, -56, 136, 87, -56, -122, 76, -51, -18, 160, 168, 60, 63, -40, 3, 103, 225, -53, -124, -44, -275, 103, 313, -282, -308, -13, 15, 283, -208, 166, -163, -172]
$$ [...]
8191f8
##END NTUPLES=NMR FID
##END=
