##TITLE=1H_DE-81k-TFA
 200.13MHz, CDCl3
 8 sc
 
 19ns.21.2.2025
##JCAMPDX= 6.0         $$ Bruker NMR JCAMP-DX V2.0
##DATA TYPE= NMR FID
##DATA CLASS= NTUPLES
##ORIGIN= UXNMR, Bruker Analytische Messtechnik GmbH
##OWNER= pz
$$ XWIN-NMR		Version 3.5
$$ Fri Feb 21 16:13:07 2025 Russian Standard Time (UT+4h)  new_Human@DPX200
##.OBSERVE FREQUENCY= 200.1313
##.OBSERVE NUCLEUS= ^1H
##.DELAY= (6, 6)
##.ACQUISITION MODE= SIMULTANEOUS
##.ACQUISITION SCHEME= undefined
##.AVERAGES= 8
##.DIGITISER RES= 18
##SPECTROMETER/DATA SYSTEM= spect
##.PULSE SEQUENCE= zg30
##.SOLVENT NAME= CDCl3
##.SHIFT REFERENCE= (INTERNAL, CDCl3, 0, 14.3821)
##AUDIT TRAIL= $$ (NUMBER, WHEN, WHO, WHERE, WHAT)
$$ ##TITLE= Audit trail, XWIN-NMR		Version 3.5
$$ ##JCAMPDX= 5.01
$$ ##ORIGIN= Bruker BioSpin GmbH
$$ ##OWNER= new_Human
$$ C:/Bruker/XWIN-NMR/data/yarkov/nmr/H-C/1/audita.txt
$$ ##AUDIT TRAIL=  $$ (NUMBER, WHEN, WHO, WHERE, WHAT)
(   1,<2025-02-21 16:08:13.57 +0400>,<new_Human>,<DPX200>,
      <created by zg, POWCHK disabled, PULCHK disabled
       configuration hash MD5:
       00 E9 B6 7A A2 85 ED C7 34 08 36 98 17 FE 4E 26
       data hash MD5: 16K
       E6 BF A1 80 70 D0 75 DD 94 CE DF 5C 1E BA 47 CC>)
$$ ##END=
$$ 
$$ hash MD5
$$ 55 B8 D8 5D 25 F2 5E 64 09 A2 25 D8 CA D2 8A 4B
##$RELAX= 
##$RELAX= 
##$RELAX= 
##$RELAX= 
##$RELAX= 
##$RELAX= 
$$ Bruker specific parameters
$$ --------------------------
##$DU= <C:/Bruker/XWIN-NMR>
##$EXPNO= 1
##$NAME= <H-C>
##$PROCNO= 1
##$TYPE= <nmr>
##$USER= <yarkov>
##$AMP= (0..31)
100 100 100 100 100 100 100 100 100 100 100 100 100 100 100 100 100 100 
100 100 100 100 100 100 100 100 100 100 100 100 100 100 
##$AQSEQ= 0
##$AQ_mod= 1
##$AUNM= <au_zg>
##$AUTOPOS= <>
##$BF1= 200.13
##$BF2= 200.13
##$BF3= 200.13
##$BF4= 200.13
##$BF5= 200.13
##$BF6= 200.13
##$BF7= 200.13
##$BF8= 200.13
##$BYTORDA= 1
##$CFDGTYP= 0
##$CFRGTYP= 5
##$CHEMSTR= <none>
##$CNST= (0..31)
1 1 145 1 1 1 1 1 1 1 1 1 1 1 1 1 1 1 1 1 1 1 1 1 1 1 1 1 1 1 1 1 
##$CPDPRG= <>
##$CPDPRG1= <>
##$CPDPRG2= <>
##$CPDPRG3= <>
##$CPDPRG4= <mlev>
##$CPDPRG5= <mlev>
##$CPDPRG6= <mlev>
##$CPDPRG7= <mlev>
##$CPDPRG8= <mlev>
##$CPDPRGB= <>
##$CPDPRGT= <>
##$D= (0..31)
0 0.7 0 0 0 0 0 0 0 0 0 0.03 0 0 0 0 0 0 0 0 0 0 0 0 0 0 0 0 0 0 0 0 
##$DATE= 1740139692
##$DBL= (0..7)
120 120 120 120 120 120 120 120 
##$DBP= (0..7)
150 150 150 150 150 150 150 150 
##$DBP07= 0
##$DBPNAM0= <>
##$DBPNAM1= <>
##$DBPNAM2= <>
##$DBPNAM3= <>
##$DBPNAM4= <>
##$DBPNAM5= <>
##$DBPNAM6= <>
##$DBPNAM7= <>
##$DBPOAL= (0..7)
0.5 0.5 0.5 0.5 0.5 0.5 0.5 0.5 
##$DBPOFFS= (0..7)
0 0 0 0 0 0 0 0 
##$DE= 6
##$DECBNUC= <off>
##$DECIM= 32
##$DECNUC= <off>
##$DECSTAT= 4
##$DIGMOD= 1
##$DIGTYP= 9
##$DL= (0..7)
0 120 120 120 120 120 120 120 
##$DP= (0..7)
150 150 150 150 150 150 150 150 
##$DP07= 0
##$DPNAME0= <>
##$DPNAME1= <>
##$DPNAME2= <>
##$DPNAME3= <>
##$DPNAME4= <>
##$DPNAME5= <>
##$DPNAME6= <>
##$DPNAME7= <>
##$DPOAL= (0..7)
0.5 0.5 0.5 0.5 0.5 0.5 0.5 0.5 
##$DPOFFS= (0..7)
0 0 0 0 0 0 0 0 
##$DQDMODE= 0
##$DR= 18
$$ [...]
##$SUBNAM0= <"">
##$SUBNAM1= <"">
##$SUBNAM2= <"">
##$SUBNAM3= <"">
##$SUBNAM4= <"">
##$SUBNAM5= <"">
##$SUBNAM6= <"">
##$SUBNAM7= <"">
##$SUBNAM8= <"">
##$SUBNAM9= <"">
##$SW= 18.0517328524113
##$SWIBOX= (0..15)
0 0 2 0 0 0 0 0 0 0 0 0 0 0 0 0 
##$SW_h= 3612.71676300578
##$TD= 16384
##$TD0= 1
##$TE= 0
##$TE2= 300
##$TE3= 300
##$TEG= 300
##$TL= (0..7)
0 120 120 120 120 120 120 120 
##$TP= (0..7)
150 150 150 150 150 150 150 150 
##$TP07= 0
##$TPNAME0= <>
##$TPNAME1= <>
##$TPNAME2= <>
##$TPNAME3= <>
##$TPNAME4= <>
##$TPNAME5= <>
##$TPNAME6= <>
##$TPNAME7= <>
##$TPOAL= (0..7)
0.5 0.5 0.5 0.5 0.5 0.5 0.5 0.5 
##$TPOFFS= (0..7)
0 0 0 0 0 0 0 0 
##$TUNHIN= 0
##$TUNHOUT= 0
##$TUNXOUT= 0
##$USERA1= <user>
##$USERA2= <user>
##$USERA3= <user>
##$USERA4= <user>
##$USERA5= <user>
##$V9= 5
##$VALIST= <valist>
##$VCLIST= <CCCCCCCCCCCCCCC>
##$VD= 0
##$VDLIST= <DDDDDDDDDDDDDDD>
##$VPLIST= <PPPPPPPPPPPPPPP>
##$VTLIST= <TTTTTTTTTTTTTTT>
##$WBST= 1024
##$WBSW= 4
##$XGAIN= (0..3)
0 0 0 0 
##$XL= 0
##$YL= 0
##$YMAX_a= 186711
##$YMIN_a= -165825
##$ZGOPTNS= <>
##$ZL1= 120
##$ZL2= 120
##$ZL3= 120
##$ZL4= 120
##$ABSF1= 10
##$ABSF2= 0
##$ABSG= 5
##$ABSL= 3
##$ALPHA= 0
##$AQORDER= 0
##$ASSFAC= 0
##$ASSFACI= 0
##$ASSFACX= 0
##$ASSWID= 0
##$AUNMP= <proc_1d>
##$AZFE= 0.1
##$AZFW= 0.1
##$BCFW= 1
##$BC_mod= 2
##$BYTORDP= 1
##$COROFFS= 0
##$CY= -3
##$DATMOD= 1
##$DC= 2
##$DFILT= <>
##$DTYPP= 0
##$F1P= 0
##$F2P= 0
##$FCOR= 0.5
##$FTSIZE= 0
##$FT_mod= 4
##$GAMMA= 1
##$GB= 0.15
##$INTBC= 1
##$INTSCL= 1
##$ISEN= 128
##$LB= 0.25
##$LEV0= 0
##$LPBIN= 0
##$MAXI= 10000
##$MC2= 0
##$MEAN= 0
##$ME_mod= 0
##$MI= 1.114404
##$NCOEF= 0
##$NC_proc= 0
##$NLEV= 6
##$NOISF1= 3.799351
##$NOISF2= 2.8
##$NSP= 1
##$NTH_PI= 0
##$NZP= 0
##$OFFSET= 14.38212
##$PC= 1
##$PHC0= -1185.562
##$PHC1= 16.39225
##$PH_mod= 1
##$PKNL= yes
##$PPARMOD= 0
##$PSCAL= 0
##$PSIGN= 0
##$REVERSE= no
##$SF= 200.129724274929
##$SI= 16384
##$SIGF1= 3
##$SIGF2= 2
##$SINO= 400
##$SIOLD= 16384
##$SREGLST= <1H.CDCl3>
##$SSB= 0
##$STSI= 0
##$STSR= 0
##$SW_p= 3205.1282051282
##$SYMM= 0
##$S_DEV= 0
##$TDeff= 0
##$TDoff= 0
##$TI= <>
##$TILT= no
##$TM1= 0
##$TM2= 0
##$TOPLEV= 0
##$USERP1= <user>
##$USERP2= <user>
##$USERP3= <user>
##$USERP4= <user>
##$USERP5= <user>
##$WDW= 1
##$XDIM= 8192
##$YMAX_p= 0
##$YMIN_p= 0
$$ End of Bruker specific parameters
$$ ---------------------------------
##NTUPLES= NMR FID
##VAR_NAME=  TIME,          FID/REAL,        FID/IMAG
##SYMBOL=    X,             R,               I
##VAR_TYPE=  INDEPENDENT,   DEPENDENT,       DEPENDENT
##VAR_FORM=  AFFN,          ASDF,            ASDF
##VAR_DIM=   8192,          8192,            8192
##UNITS=     SECONDS,       ARBITRARY UNITS, ARBITRARY UNITS
##FACTOR=    0.0002768,     1,               1
##FIRST=     0,             0,               0
##LAST=      2.2672688,     0,               0
##MIN=       0,             -165825,         0
##MAX=       2.2672688,     186711,          0
$$ Real data points
##PAGE= N=1
##DATA TABLE= (X++(R..R)), XYDATA
0 0 0 0 0 0 0 0 0 0 0 0 0 0 0 0 0 0 0 0 0 -4 8 -8 8 -8 8 -12 15 -16 16 -21 24 -28 29 -36 37 -44 50 -55 61 -67 75
41 75 -85 95 -104 116 -127 139 -155 170 -188 207 -229 252 -278 307 -340 378 -421 471 -528 600 -686
62 -686 797 -942 1138 -1422 1876 -2711 4749 -19887 -10858 25108 -21624 17437 96054 16382
76 16382 -44019 105710 109008 -93398 -51223 124197 -14964 -160518 6585 50742 -146495
87 -146495 -101417 87638 6797 -93101 54377 125397 15305 11288 88569 51292 -3815 20783
99 20783 20076 -36184 -58015 -29473 -20525 -59081 -67552 -617 28913 -30394 -25052 59172 42678
112 42678 -26075 28109 77069 -3082 -25331 55909 33996 -50389 -14238 36424 -21475 -53301
124 -53301 -3717 -6635 -52547 -28736 11347 -14870 -31095 16244 43014 13385 4374 40353
136 40353 45676 7548 -3975 15214 -150 -32568 -26772 -15486 -34781 -36510 -8101 -2141 -13149
149 -13149 5540 32174 24503 11561 26619 33315 9733 -2179 11083 5495 -22048 -22902 -3053
162 -3053 -12162 -30921 -14350 3774 -10918 -12486 12015 12497 -1690 12081 25724 12253 9408
175 9408 21312 14067 -40 2405 1782 -11855 -17763 -15893 -17838 -19539 -17753 -11999 -2866 1487 2244
190 2244 13975 24061 16793 12822 21831 15537 -1041 690 990 -14894 -18979 -8126 -14526 -22331
204 -22331 -8383 -1189 -9770 -2881 12282 8177 3377 13398 14541 7422 9916 11089 2563 -47
218 -47 1463 -4603 -10059 -9092 -12517 -14886 -10124 -9117 -9863 -2032 4456 3672 9707 17510 14591 11526
234 11526 15474 10718 612 -227 -1252 -12798 -16342 -10188 -11580 -15515 -8043 -1130 -2331 1731 9524
249 9524 9374 7097 9835 9351 5031 4304 3740 -610 -2579 -1837 -2625 -4745 -6035 -5817 -4996 -5044 -5393 -4764
267 -4764 -1461 -7 799 4513 7562 7928 8569 9760 7367 4689 2780 -793 -6250 -8921 -8991 -9889 -10360
284 -10360 -7823 -4851 -1835 2716 5907 7853 9114 9504 7796 5667 2895 -467 -2691 -4256 -5713
299 -5713 -6181 -4883 -3776 -3484 -1740 353 1295 1334 1719 1544 1121 995 848 719 932 2138 2245 1839 1584
318 1584 1272 -189 -2295 -2665 -3387 -4426 -3947 -3475 -2590 -488 2127 3762 4476 5962 6498 5019 2973
335 2973 1103 -1335 -4321 -5254 -5996 -6465 -5553 -3772 -2443 -467 2978 5016 4939 5473 5323 3965 2370
352 2370 846 -1253 -2510 -2516 -2846 -3049 -2886 -2254 -1895 -1021 -575 -657 158 105 -177 333 1106 1354 1733 2902
372 2902 3540 3048 2813 2215 330 -1144 -1687 -3556 -4324 -3656 -3681 -3515 -2295 -32 1561 2981 3988 4445
390 4445 4522 4275 2628 769 -326 -1058 -2367 -3178 -2953 -3076 -2286 -1286 -449 -189 745 1727 1684 1078 1779
409 1779 1547 903 734 697 707 181 416 -178 -1105 -1253 -1181 -2011 -2517 -2295 -1597 -1315 -1095 108 1428 2015
429 2015 2022 2651 2858 2312 1216 426 -449 -1189 -1682 -2164 -2721 -2265 -1263 -1201 -651 128 859 813 987 1419 1028
450 1028 736 720 122 42 499 145 -311 222 787 -418 -507 -145 -339 -1160 -596 80 -680 -437 1074 672
470 672 124 1184 1271 351 547 595 -817 -1213 -721 -1186 -2173 -605 554 -32 692 1388 975 759 1488 324
490 324 -1019 -264 174 -1745 -1853 -96 -1150 -1344 562 521 -633 740 1580 -370 -407 1351 -78 -925
508 -925 773 499 -1438 473 1797 -343 -516 1114 -533 -839 449 -670 -2573 50 1239 -1256
524 -1256 -196 1954 777 541 2572 1085 -559 1362 1379 -2033 -1703 53 -1869 -1775 222 -468 -1254
541 -1254 1804 1864 -358 423 2176 362 -151 870 -894 -1295 670 -283 -1860 -405 664 -425 153
558 153 378 -581 -627 664 -559 -1331 166 363 -238 988 860 65 776 1659 -104 -705 336 -169 -1135
577 -1135 -840 -1097 -1179 -146 220 -148 168 984 969 946 1141 104 -260 109 61 -846 -1240 -358 -322 -81 11
598 11 -258 103 733 657 -159 -220 -24 -315 -344 -496 -419 410 316 234 428 324 507 262 -192 -266 -180 -460 -507 -334
622 -334 -247 -490 125 479 -45 131 624 387 -121 414 -164 -858 49 110 -749 -283 744 256 -256 1244
642 1244 693 -217 265 401 -843 -781 123 -850 -824 280 144 -996 297 969 -134 51 854 63 78
661 78 471 303 -529 -39 229 -425 -95 457 -286 -704 71 -172 -772 -324 -297 -567 -128 120 -126 -57 442
682 442 355 393 700 137 -218 -11 -110 -533 -876 -217 -774 -329 -99 11 179 111 436 143 585 443 111 -273
704 -273 95 158 -30 38 54 -146 -126 0 -312 -200 -68 171 -462 -287 -248 -105 0 106 353 422 253 120
726 120 231 370 120 -186 -184 -360 -412 -475 -385 -112 294 -33 180 -42 232 129 72 97 -195 -108 -37 -142 -417
749 -417 -205 178 -330 129 76 -90 -183 -141 -91 -131 -34 293 -140 -197 133 -170 11 -68 -219 377 159 184 -120
772 -120 102 33 222 264 -74 296 16 -283 -7 326 22 337 -72 -383 -207 -107 -282 -356 -61 153 206 -41
794 -41 162 134 382 313 126 328 -123 21 -216 -246 -38 -299 -49 -156 -104 -88 -97 188 174 305 -25 153 165 -66
818 -66 57 314 -124 118 247 -19 250 -258 -296 -131 -179 -174 -539 20 -154 286 185 80 404 467 478 65 195
841 195 169 182 0 -197 -301 -141 -68 -331 -251 -235 32 -32 63 22 93 -48 249 335 -227 65 -23 -128 -266 -263 69
866 69 -83 137 -184 -18 -224 -179 -179 -160 195 154 479 70 361 214 268 225 -71 163 89 -44 109 78 -142 -294
890 -294 42 110 -329 -183 -64 65 -25 -6 310 -115 121 63 69 -131 175 193 177 -107 -140 -117 -333 321 36 113
914 113 -131 4 -72 363 163 -1 -17 397 63 -44 359 -95 49 3 15 68 -92 183 -239 -117 -170 423
936 423 128 109 169 156 -107 71 -45 -200 9 88 -88 -296 -16 -344 194 68 -251 85 -64 -60 125 261
958 261 -39 -224 -130 -42 36 93 176 -60 -67 63 -238 -262 14 -340 3 113 60 411 135 130 142 212 94 164 -208
983 -208 -166 4 133 34 -164 97 -20 -117 -98 222 244 251 223 5 42 187 239 199 -6 -107 -18 -88 -152 -73 -254
1008 -254 -225 93 -100 -201 -148 190 283 8 149 -89 -73 -168 114 -8 8 -9 116 -171 -164 -245 25 -148 -126 265
1032 265 342 205 145 7 212 -285 36 -39 -89 22 -85 44 149 -163 -216 -109 22 74 -122 48 -452 -55
1054 -55 117 29 248 304 243 -314 -151 -246 -336 -188 151 52 -165 -86 63 86 -79 -28 -258 47 36 335 319 198
1078 198 342 133 -292 368 264 171 -194 -55 -53 271 -136 187 -178 58 114 353 -186 -16 -30 -215 258 -12
1100 -12 50 117 -73 -74 -103 193 256 91 -5 99 -11 109 19 -73 80 63 154 -1 107 -143 -71 -283 -103 -90 139
1125 139 41 -48 46 22 -150 -142 308 152 -44 123 75 -238 98 83 -220 90 190 -206 -25 -198 -182 -64 -154
1148 -154 70 75 -223 -45 203 -340 21 110 -4 188 -178 19 -20 175 -213 -18 -39 14 51 114 60 -138 170
1171 170 204 312 150 381 78 294 -297 -115 -29 140 -256 -102 75 -70 126 47 239 -328 2 12 122
1192 122 -229 112 -66 232 178 157 0 -157 106 -67 -356 -101 80 -180 102 -35 -50 -192 25 -177 -114
1213 -114 28 207 17 -91 60 -121 31 -2 -40 229 -141 334 -213 -30 -186 -92 -47 -163 -61 -112 45 189
1235 189 -140 49 -205 -124 89 55 -24 35 -107 44 134 13 -46 -1 64 -80 -6 146 -170 -1 200 -327 244
1258 244 -145 234 -75 19 47 266 -167 -101 -126 17 -47 95 80 140 -67 -22 6 -70 -131 44 20 15 -242 -163 -175
1283 -175 -219 118 97 197 -85 82 28 57 20 -136 143 367 44 84 81 -199 148 180 46 206 -36 -47 60
1306 60 36 166 69 192 89 -341 -37 80 20 -151 -183 -180 -184 179 251 62 7 -64 -128 108 4 5 93 -85 -22 191
1332 191 -277 154 158 22 -129 103 -125 16 10 -71 -125 -167 68 -187 -165 15 111 39 -106 84 -55 22 -21 -211
1356 -211 0 -181 -47 117 75 131 53 -188 172 41 -40 -149 114 -112 106 -136 263 -76 -121 93 -14 213
1378 213 -306 159 -21 -136 197 -176 -191 169 160 87 38 -93 72 42 93 -69 -1 143 -114 -16 -172 64 -104
1401 -104 80 108 -12 -67 161 28 183 -169 -206 4 32 106 33 92 -62 245 -8 180 -19 389 -6 -356
1423 -356 -53 -80 253 205 49 97 225 -20 -56 -418 90 -57 121 53 -43 97 -124 76 -242 174 93 -35
1445 -35 25 100 215 112 27 230 32 16 138 -168 103 69 -80 10 -259 -81 123 -129 113 142 10 -8 -259
1468 -259 -123 -149 398 67 240 -63 -188 -89 208 -118 -159 76 -166 24 -65 -4 -120 -195 23 277 91 -14
1490 -14 -70 16 -450 260 67 -195 -167 112 -30 -342 37 52 359 -120 -5 -115 -93 -23 95 -119 179 22
1512 22 174 -70 70 -19 67 48 46 -169 -103 148 -84 90 -26 -31 58 -78 -251 -125 -119 -227 133 161 -43 81
1536 81 18 -64 289 486 76 -169 -4 244 -231 49 -126 85 -91 -124 -110 -198 94 81 -9 80 59 26 -85 57
1560 57 107 -50 -145 -259 -40 87 -262 -84 -203 -156 -98 -141 -34 -78 209 177 -266 10 -289 64 12 -71 132
1583 132 75 -30 -209 -7 -256 -47 56 -117 -176 140 218 -131 241 -68 -127 216 -86 -101 -39 53 -108 113
1605 113 52 -52 207 -23 -65 -186 58 91 -18 -115 -225 10 42 10 -164 -43 65 285 -52 157 252 141
1627 141 -389 54 92 -158 -6 12 45 40 32 42 -193 155 -37 182 -46 256 -14 -128 67 -85 159 62 -236
1650 -236 -30 31 -43 82 25 115 135 -18 -110 2 -169 -122 -95 -340 213 84 117 193 -94 132 -30 -273 91
1673 91 55 31 14 -217 -264 116 155 -60 -100 -38 -8 109 -172 -23 -106 50 42 7 -4 -151 145 59 249 155 32
1698 32 -119 295 170 123 32 64 -224 -200 -124 -422 -151 56 115 -328 -118 36 171 33 183 -75 16 87 188
1721 188 128 -29 -176 -111 -38 146 -44 -251 -33 29 134 24 -10 115 -370 75 -173 -314 121 242 -115 -36
1743 -36 -52 -70 -157 -81 -25 -121 -233 -174 98 161 127 -46 241 124 -220 -294 143 15 368 -39 158 9 -243 107
1767 107 -186 -240 -74 124 -108 124 111 -76 -37 182 -207 -253 -27 301 -98 -266 -51 -87 15 -199 126 -183
1789 -183 -131 90 -238 -72 -228 92 114 -30 113 -144 -175 -136 -41 -28 -78 117 130 71 -38 181 -53 20 115 -163
1813 -163 106 167 19 68 175 208 378 134 -45 310 207 52 -239 69 99 -340 -27 -50 21 -89 -212 -139
1835 -139 -131 161 66 101 -38 276 -228 -86 110 -311 149 35 13 108 169 -88 -109 -292 69 -116 -21 167 89
1858 89 61 -159 -102 -31 -60 -39 -154 7 328 -75 -79 82 -26 50 -251 136 260 -90 49 -62 182 53 -18
1881 -18 -56 -47 -140 -57 -148 -204 -34 -199 29 -54 132 302 165 140 -208 -17 -50 -31 -203 -173 93 -83 112 162 319
1906 319 32 220 -92 164 -262 37 87 283 -192 -39 -237 22 -69 -358 47 -97 354 62 70 116 19 -127
1928 -127 -96 -44 -139 26 -387 183 -44 124 -165 70 -199 -36 -25 5 -17 -50 146 52 -30 -187 188 62 60 -60
1952 -60 60 -103 74 -140 -149 -47 106 166 -194 -69 216 40 116 -165 291 -80 -199 135 127 97 142 68 18 32
1976 32 -41 107 81 -81 -130 2 -186 119 158 -21 317 253 116 -63 70 105 -142 -43 -268 9 86 -12 10 -153
2000 -153 -262 7 7 -200 20 -203 -24 -175 -256 21 -71 96 -81 96 -114 48 -9 -150 136 -5 -67 116
2022 116 -70 -202 41 206 -318 -61 -4 -57 -101 9 -93 -120 -70 -117 -55 -28 -431 -131 -157 78 166 -106 -200 -39
2046 -39 -347 -194 58 -218 -52 64 202 43 -199 -54 -212 -58 111 250 -223 381 -107 -105 -35 -3 -158 -197
2068 -197 -220 -228 103 107 -33 -96 224 -261 37 379 -241 37 27 159 168 -230 -28 -131 56 -73 -171 -53 122
2091 122 161 41 -330 -125 110 -98 -73 11 77 -50 -115 131 61 -183 6 159 49 227 -81 -249 25 -5
2113 -5 202 195 154 -79 138 -232 255 -65 -17 221 137 -20 -216 -13 -43 -34 -143 47 -185 -17 -105 -155 -65 -18 31
2138 31 2 -57 -178 199 -41 -146 99 105 -195 -303 283 53 55 -179 -80 -16 -14 243 286 -5 -53 106 -113 21
2162 21 -271 -129 -28 -69 122 41 -94 -14 -43 -127 -26 -90 -3 -26 -131 68 1 216 33 188 -16 -112 97 -6
2186 -6 137 107 177 309 61 -91 53 39 145 154 -24 -54 -424 -277 -115 -133 -90 -218 -143 118 -179 -73 142 132
2210 132 -2 -256 -12 -13 -128 27 -187 369 33 -41 0 76 12 383 120 49 -78 -242 339 -43 -95 80 14
2233 14 284 10 198 18 -54 211 50 106 29 64 118 -20 -171 210 -167 27 26 -244 107 -42 -153 -510 317
2256 317 60 134 212 48 -125 97 -55 -32 -215 85 -29 -123 246 -258 84 -92 -226 229 219 399 -78 -89
2278 -89 -336 -68 -202 72 25 -281 -141 -201 85 -85 139 -84 -31 -294 12 -50 25 -89 -113 -336 -105 -44 162
2301 162 51 130 -52 0 -25 180 58 -204 -71 31 169 84 52 13 -54 -175 222 -138 9 111 -78 63
2323 63 247 -156 -214 -205 63 -32 -141 101 320 -148 -122 -168 124 -193 -108 -374 47 -77 23 66 -87 -31 239
2346 239 -158 -86 21 -210 101 39 -153 -20 -18 -33 307 27 -239 76 -95 256 133 -175 -120 68 -57 -65 83
2369 83 74 124 62 50 211 34 68 77 20 -183 96 73 -194 -118 -57 -113 -2 143 -102 315 131 -89 -52 -158 -41
2394 -41 135 -76 299 -191 -170 -40 -93 112 218 272 64 -112 271 1 15 -34 75 208 85 -94 -100 13 96
2417 96 104 57 -11 138 157 69 26 12 191 -33 -99 -67 7 -134 115 97 69 81 38 28 67 -141 -104 50 24 182 -154
2444 -154 -11 -359 86 -194 -214 115 107 -153 0 60 182 -64 -72 -24 48 72 46 -19 42 -84 1 120 226 -13
2468 -13 -13 10 -91 -48 -6 80 18 172 -315 -198 -259 -72 72 160 152 172 320 41 15 -226 -463 -114 -29 116 -23
2493 -23 133 -242 306 30 50 6 -95 308 -125 -171 112 44 29 125 170 -89 -202 -34 -105 77 5 30 8 38
2517 38 126 28 -144 20 121 -7 169 -6 -92 -103 -182 -58 9 62 -99 54 376 -30 -40 -33 -149 202 -46 34
2541 34 4 303 157 80 181 232 -120 -34 -174 -128 60 17 -318 108 -143 -119 48 -24 -102 -54 191 186 -91 -11 126
2566 126 105 59 34 294 9 -87 -95 -65 -14 -199 164 43 -215 89 -69 92 11 73 -102 -261 15 110 -285 106
2590 106 122 13 72 -24 207 -91 85 -56 -220 -98 178 -199 229 145 102 60 157 146 2 244 170 59 25
2613 25 -154 90 1 -33 22 -52 -36 -24 -59 -4 -195 98 187 -56 -40 122 112 148 209 36 186 -110 -2 63 105
2638 105 -84 -73 -130 329 -68 -32 -152 -58 201 134 119 134 -75 127 147 49 213 -70 -77 -180 50 88 143 -5
2662 -5 220 127 -153 -128 -57 -170 62 -115 -76 23 190 -257 18 -25 -14 -62 199 -60 38 300 153 -196 -71 -271
2686 -271 25 55 -46 -57 -159 107 -58 206 14 240 -144 -425 -80 90 -274 -99 -93 -120 -57 147 317 -4
2708 -4 21 -86 37 -132 29 144 9 -136 -158 343 -85 -107 94 -235 -257 -33 -31 -264 -229 -337 -29 -94 -2 -31
2732 -31 67 11 74 30 -302 -199 5 24 -185 -45 -92 92 -153 62 25 1 -214 -86 87 -93 38 271 -1
2755 -1 -74 -163 -317 114 -54 -113 -263 86 -217 322 162 39 163 110 -184 -33 65 -132 174 259 -53 -98 -158
2778 -158 -44 130 -3 18 -120 249 -153 -14 -111 -178 -53 140 22 -56 -112 -230 34 31 159 38 108 -38 -137
2801 -137 69 -95 -162 205 181 30 71 8 12 166 -159 274 -116 110 29 -58 368 34 27 -110 56 156 -8
2824 -8 -51 -201 78 17 -231 -103 -56 -242 -96 62 -201 -226 -47 -26 -200 -61 126 12 19 230 31 4 -146
2847 -146 -104 221 19 -135 -68 15 -7 -85 -213 110 -4 64 -138 -89 131 -27 221 80 -120 236 127 -50
2869 -50 222 -166 160 102 -184 -108 44 -135 -109 -31 9 -47 178 -22 -95 24 -185 62 27 56 354 -8 -155
2892 -155 -42 -167 84 55 -4 -113 18 -2 -7 44 315 -81 38 -238 -115 30 4 76 74 -63 70 354 68
2915 68 25 151 48 -129 25 -195 77 41 75 26 -196 11 -65 133 -83 13 10 38 -197 -155 29 154 227 185
2939 185 -106 -235 27 53 -192 -43 126 9 -29 -89 -62 108 -72 56 -161 -192 165 -96 451 113 34 -158
2961 -158 -2 208 -130 -101 156 -102 -200 115 -221 -161 -81 -202 -68 10 -101 -38 -27 -46 312 156 -93 -251 -65
2984 -65 -83 -213 87 -151 -193 9 80 113 129 -146 8 147 -26 12 -267 -42 22 -71 -107 221 24 -189 -226 179
3008 179 195 30 4 27 173 -8 -112 70 -32 187 -11 -76 -129 -168 -125 -141 -20 8 235 -105 -93 -23 -42 43
3032 43 6 -81 49 -271 -139 30 -46 222 146 21 162 15 -216 -45 -356 -301 49 -56 28 -166 -74 65 61
3055 61 -83 47 -93 6 46 13 -15 -78 114 -54 284 -98 113 101 -133 51 116 233 -259 68 124 62 -305
3078 -305 -58 194 148 150 -27 107 176 49 20 114 145 -134 121 173 97 -74 77 178 36 -206 40 108 -97
3101 -97 -12 -89 -112 162 75 394 -51 -30 183 -233 -111 -239 166 24 69 103 36 40 -190 154 -71 297 -15 -96
3125 -96 139 81 -19 -158 -32 61 -360 -39 -261 140 -54 -345 169 47 14 153 -197 222 -169 20 -24 196
3147 196 44 115 120 102 195 -35 68 -85 109 62 82 -127 43 119 80 -135 -110 -110 125 -75 -285 78 182 -2
3171 -2 -96 1 -274 -15 348 59 17 -33 -65 146 -118 103 -90 -42 46 25 127 -7 -261 -9 191 71 163 -35
3195 -35 37 28 285 151 -100 -82 365 -187 34 170 92 9 140 -39 78 -127 8 -150 -95 136 -58 -131 259
3218 259 -100 -48 -172 -165 88 -133 -130 21 57 -15 187 41 -321 189 130 -132 89 128 -161 105 -278 -218 -16
3241 -16 216 36 -287 68 -35 54 85 31 98 -158 -65 -123 -37 -43 -78 97 100 90 28 145 -28 54 57 30 12 11 -57 234
3269 234 258 307 28 -273 217 -178 59 -38 -35 150 134 16 -93 -332 -167 109 -110 -222 -164 -69 105 82 -75
3292 -75 -51 184 100 154 31 -140 -61 -49 51 29 60 -8 253 168 170 254 2 -3 -76 127 -9 -29 -140 -297 -214 58
3318 58 -253 -63 121 191 -170 52 -45 66 -79 -160 -170 19 48 -69 138 -175 -38 -12 215 -55 -168 -203 32
3341 32 -132 -330 61 -8 179 -135 -133 50 -35 32 -13 -50 36 136 200 5 308 -10 50 -77 22 -212 -164 204
3365 204 -341 -86 -1 -77 13 -204 -156 -229 103 44 -128 -297 -78 -193 228 -156 21 -62 155 272 91 37 -97
3388 -97 -222 173 -174 -222 -96 108 -133 40 -72 -6 -77 -57 -30 -67 -217 17 -209 42 169 -268 210 -64
3410 -64 287 -13 70 -124 -265 -138 26 -66 100 -1 312 -106 -434 172 109 210 26 -102 -44 121 136 62
3432 62 -38 30 -156 -320 116 -213 -80 239 14 79 -54 -22 -198 127 -154 93 111 -276 -77 -222 -53 -288
3454 -288 -269 -36 -311 171 263 53 -91 56 -441 108 88 -242 -145 71 17 -201 3 39 -163 178 -195 20
3476 20 146 40 -57 -10 143 -144 144 -34 -8 -36 32 17 20 -176 160 -22 110 30 25 -189 -315 -4 -158 42
3500 42 -85 -74 -42 129 104 36 -60 321 -103 175 -227 -44 -150 42 95 216 -86 101 -117 66 81 81 146 -66
3524 -66 12 -181 -147 17 47 -270 -158 -100 -447 81 215 -41 -138 169 -37 123 -141 -273 -126 -145 64 144 -19
3547 -19 188 64 -5 179 188 -124 111 90 -92 160 -23 -141 186 -34 85 -48 170 90 72 -13 54 -147 199
3570 199 -15 -83 -162 -82 120 -32 -130 94 32 -174 -72 194 -22 -87 198 19 41 -254 -46 54 137 -36 -40
3593 -40 0 -35 101 -56 186 10 128 -106 115 -25 28 341 327 75 -52 119 -42 49 -105 -108 172 -120 71
3616 71 126 88 -46 -193 141 -97 -51 -115 -16 -232 -9 11 -24 -123 93 12 83 -25 -263 8 7 -56 -43 -46 187 314
3642 314 189 29 167 154 -17 99 25 198 -69 -150 335 -99 145 -145 100 -258 -101 61 90 -135 -131 133
3664 133 138 270 8 12 12 22 170 54 -7 -223 -398 4 -328 51 73 -14 -106 -66 -14 -84 105 146 474 75 133
3689 133 5 -80 -11 102 -96 -51 61 -320 80 40 -139 -361 -55 178 -182 250 -91 106 -204 144 -267
3710 -267 18 187 -249 56 -84 62 46 27 124 -113 -296 95 108 120 -155 -42 148 12 -258 32 288 29
3732 29 -116 198 -21 -47 -37 88 4 -156 40 1 -59 106 98 359 -212 268 -64 -231 -173 -44 -63 -74 -186 308
3756 308 177 -146 154 171 22 -130 -226 -46 114 -28 -87 180 -275 -179 -178 238 137 189 180 10 220 -235 106
3779 106 -19 2 -226 25 76 -19 211 211 9 35 -66 203 -30 -59 -175 -329 62 23 82 187 72 -159 59
3802 59 201 3 -58 -41 37 126 71 112 371 106 156 -276 -296 4 172 338 -51 19 185 149 267 -197 205 259
3826 259 -119 227 88 104 22 54 -1 177 179 197 115 246 -121 -10 -57 0 -253 -25 371 -176 -171 96 -173 -96
3850 -96 146 209 -1 187 97 -127 88 99 14 0 213 40 -14 -25 287 97 7 -25 -398 89 188 -184 189 -300
3874 -300 67 -204 28 -128 43 205 -118 -121 -119 -21 -84 172 29 -210 -12 302 125 -215 87 -40 -135 -36 60
3897 60 321 128 -127 203 12 56 267 212 -21 -24 -92 -73 -29 -59 -432 -143 51 73 176 106 233 0 178 88
3921 88 -211 -23 -97 168 -133 185 -25 63 90 38 29 59 -35 45 159 23 -101 -145 26 -317 -25 -254 -72 -93
3945 -93 -145 -298 125 -55 104 480 -111 50 -96 -68 -27 -219 -7 -174 -186 55 -313 -205 318 -183 -77 31
3967 31 -186 31 50 -29 41 61 -243 -62 -125 226 48 84 233 49 349 168 55 24 199 -76 12 -27 89
3990 89 -20 70 187 -36 -131 194 4 234 -165 -162 -133 105 58 -161 -25 -133 86 -113 26 201 -118 -43 -114
4013 -114 -107 -181 26 86 -113 322 128 130 -10 368 -38 -70 -76 161 -38 -58 -52 -72 84 -252 -136 -210 154 -213 -149
4038 -149 3 149 286 45 157 -88 147 228 136 102 84 -41 130 -32 -60 -73 -2 19 64 196 -113 109 -8
4061 -8 -133 92 -27 17 12 253 -54 262 64 -144 -150 103 43 -53 -139 46 -77 33 -105 -225 -28 112 -301
4084 -301 89 30 -188 -80 -117 -12 -25 -189 119 251 -218 -131 192 -8 138 80 -139 172 64 -164 75 69
4106 69 251 -74 94 -75 -52 79 -83 -8 211 -41 210 41 -11 19 -106 -125 -70 23 -8 -76 117 -24 -62 177
4130 177 -285 89 -84 -49 125 -68 -26 150 105 -213 91 -14 222 109 225 -23 1 37 -16 -114 -18 7 239
4153 239 -46 -6 -18 -93 -105 55 -70 -161 -126 -207 146 240 160 -55 75 -183 122 -9 76 190 -279 -73 90
4176 90 -155 -6 11 -180 -85 205 78 65 191 177 235 -138 33 39 69 96 29 -4 -120 -174 -5 -42 -98 44 -114
4201 -114 -27 57 -41 -42 236 -5 -124 -158 28 99 3 -149 -121 95 96 29 -136 36 373 -40 13 -52 360 34 43
4226 43 64 -134 122 198 -53 88 28 -204 -46 139 -7 -79 -79 -10 80 11 -190 -280 -72 59 44 296 -23 134
4250 134 58 -406 1 -1 -62 208 -18 -63 -16 168 -29 -197 -58 -258 -104 47 -4 48 82 -141 -53 -252 224
4273 224 -214 323 -180 227 -123 101 -127 -20 10 -20 -64 14 13 -200 41 -110 -202 16 -169 -188 253 -174 -16
4296 -16 -44 -100 40 298 -169 96 -1 -174 194 -23 123 -35 152 268 -116 20 -16 -52 57 -17 -51 9 165
4319 165 176 96 -233 48 66 -51 222 5 235 121 159 86 135 7 -68 -56 1 284 -192 -237 69 80 -75 -94
4343 -94 -177 143 76 -87 222 12 23 -108 -34 -107 52 84 39 -252 -167 156 -155 242 124 -18 -145 140 -62
4366 -62 267 81 -95 73 -227 -106 132 -114 198 -187 -11 2 -66 17 26 201 -219 -295 -175 109 -84 -134 -157
4389 -157 -275 -88 -119 -68 324 366 -161 -68 -35 300 -72 126 35 -194 -70 -99 -151 164 139 -54 39 96 118 32
4413 32 -177 0 11 -90 -259 69 96 58 155 187 233 291 -67 127 126 -212 -97 86 -197 199 184 114 177 131 -74
4438 -74 -13 70 -183 -20 -57 51 -70 -165 91 -35 -135 -27 12 260 -100 43 -214 196 24 72 -9 194 121
4461 121 -61 79 -162 7 -66 -63 16 -69 16 169 21 195 52 177 199 61 4 -212 89 -20 23 -209 -101
4484 -101 -157 34 142 -96 48 213 40 79 43 -77 -8 71 37 79 -5 -241 -117 -45 -340 -4 -122 -202 169
4507 169 -139 -195 -94 46 64 -84 41 -27 -135 164 -77 233 -39 100 12 -111 -72 14 -34 -52 61 371 25
4530 25 -244 -98 183 -37 -189 87 -154 139 -38 -23 -40 130 -84 250 161 97 18 -130 -89 97 10 235 267
4553 267 173 40 -34 114 53 -71 135 -72 -10 -114 304 -13 -132 65 -19 -26 -178 -175 -33 118 -15 -158 -84
4576 -84 -107 -51 -46 -11 128 82 112 -107 -45 -211 51 297 201 -258 -115 244 -73 -73 60 -30 -81 -361 224 28 -267
4601 -267 -35 -133 163 -144 -346 -108 -96 65 -262 -61 218 -277 18 -104 52 -49 51 -24 -124 -23 -128
4622 -128 29 -141 -39 -161 -151 -129 -10 -4 89 151 -8 -211 107 -59 175 -89 36 -123 -168 62 62 -136 -82
4645 -82 -90 -46 232 -88 39 144 -214 -224 -69 -125 64 45 -26 5 71 -203 -60 0 26 -46 -281 -152 7 -190
4669 -190 -157 -162 -103 -17 -4 215 -132 -217 7 -145 -145 -84 -108 91 20 -30 -210 -123 172 -116 -62 -121 -61 133 -9 -12
4695 -12 -48 -141 207 11 25 -218 -143 131 43 -80 223 -108 133 259 -177 -38 192 69 182 -110 138 156
4717 156 32 -129 428 142 32 71 55 -12 174 -219 343 35 -191 239 32 -83 42 -21 -22 3 -153 106
4739 106 -94 -53 -305 -187 135 -32 13 -80 204 -18 -33 42 -111 489 128 -235 29 156 -132 -113 212 -11
4761 -11 -255 -215 -253 159 50 -194 -221 -215 12 -46 218 -79 126 321 29 433 7 -48 -3 77 52 -123 317 48
4785 48 -34 -101 75 28 2 -127 87 -159 -21 -148 100 139 -365 59 -44 -54 133 8 4 145 -7 4 126
4808 126 -71 126 207 56 20 14 181 85 -15 -40 122 18 104 -115 227 262 -36 -107 64 -97 299 88 84 -6
4832 -6 -192 48 120 -168 30 81 -334 133 -12 -116 66 -69 -98 22 23 -189 0 -88 -101 159 -30 -188 125
4855 125 5 -148 -43 119 127 -285 -10 248 -118 195 296 59 -64 27 -37 62 -24 -35 -91 -50 -73 5 26 -78
4879 -78 -58 -100 -51 -205 53 201 189 -89 226 43 -157 158 6 -165 79 -5 -6 -32 72 -36 -49 -42 -30 -12 156
4904 156 -149 33 131 44 327 269 89 -108 96 -286 52 -8 -183 -173 -89 79 304 64 26 165 192 -61 -40
4927 -40 -179 -135 -36 98 -159 -109 207 108 -30 18 54 -251 208 -187 210 -139 -5 259 97 2 -270 -154 -94
4950 -94 257 64 95 75 3 -198 -261 48 159 -89 -160 60 70 46 73 -75 -270 9 -70 -208 150 -55 -132 128
4974 128 -236 288 171 22 87 -133 57 1 -225 57 173 -136 4 -82 23 -37 144 59 21 -391 -56 9
4996 9 127 -6 -4 199 -77 -181 239 75 -186 176 123 45 29 22 67 -170 -238 141 -202 277 -144 273 -82 55
5020 55 -118 -285 64 70 -92 -93 90 228 246 25 117 -12 -41 21 -11 -51 16 121 263 -160 134 36 -21 34 -88
5045 -88 -252 -14 110 -143 -91 20 -149 221 35 -19 41 189 159 -157 -231 -100 386 -213 -53 87 166 -110
5067 -110 -203 -112 162 -115 -87 -146 -73 261 -1 43 195 -28 179 -107 203 -110 -99 -164 -17 -261 -65 -93 44
5090 44 -111 -277 -2 -37 -251 -147 50 34 49 -18 -186 220 41 178 76 -121 -267 -150 -141 -51 193 71 17
5113 17 117 -166 -40 -7 -93 -89 111 8 36 -56 2 -208 149 -28 -342 -94 -15 100 -136 50 8 -43 -115 -143
5137 -143 9 -236 38 -186 144 -137 98 254 104 -8 174 177 113 138 -208 100 41 413 -107 16 59 -296
5159 -296 44 -32 -440 24 -18 64 -300 -284 7 16 5 38 -302 -25 141 -138 -106 66 432 -67 49 108 82 68
5183 68 -76 8 -51 -250 -43 192 19 165 -174 276 -55 -27 123 55 70 -104 -73 -2 21 -136 172 252 109
5206 109 99 49 -9 -144 289 -53 -127 -124 -188 62 316 185 -247 127 162 -24 102 -167 70 -44 26 139 37
5229 37 -16 113 -17 -154 -226 37 27 111 246 -166 25 61 94 135 182 -1 45 -74 294 111 25 -116 15 -11
5253 -11 -104 163 -52 153 -154 -67 -94 89 30 8 -179 356 43 -111 290 100 78 -66 62 136 60 77 24 67
5277 67 346 -104 127 61 -136 -7 -2 -68 186 -125 208 -220 83 -21 185 120 -119 -109 268 49 -71 -135 23
5300 23 106 -95 81 -118 13 -20 -235 -63 62 30 -90 -90 -41 -7 74 82 -187 91 -52 17 -70 146 -57 99
5324 99 151 -173 197 -44 155 59 -58 65 47 39 -53 199 214 -420 -87 217 -3 9 13 5 50 -30 -214 -49 -232
5349 -232 -27 68 255 -128 -75 -3 -368 316 -208 -23 -125 148 -175 -147 175 -1 -56 56 274 129 -116 -48
5371 -48 -115 133 -183 -103 -112 -252 321 25 -28 -91 188 -117 -16 -121 29 -250 -43 -10 -271 -134 332 61 40
5394 40 98 -173 -139 95 185 -93 33 -34 234 83 -99 159 80 122 68 9 114 79 63 -160 189 195 -189 -62
5418 -62 322 -129 1 -53 163 13 -1 57 63 -65 31 266 -319 -26 -94 4 -49 -92 10 -245 18 -96 123 217
5442 217 74 96 -48 -53 -57 116 54 86 229 165 -202 1 -41 -233 102 -126 136 -37 67 126 -419 174 -82
5465 -82 -277 133 99 157 15 -37 38 78 -10 -38 64 79 176 113 78 -116 281 176 -226 -267 -3 84 36 -179 -129
5490 -129 145 211 -203 129 -19 -229 -79 65 201 -54 247 213 -103 94 -169 -163 29 38 -100 -245 -96 -102 80
5513 80 103 48 -204 -129 6 -17 308 -14 189 -137 -17 -119 287 -11 -370 127 64 60 -133 169 38 -58 114
5536 114 297 -168 -243 287 -152 -315 -159 -147 29 -68 9 23 -166 344 91 -200 -162 -241 -126 -106 90 19 -211
5559 -211 7 6 -204 -18 125 -300 70 32 225 -9 -36 192 -58 -110 -168 54 -127 -274 -6 -14 108 -190 73
5582 73 130 129 -343 56 138 58 136 -337 74 27 22 29 -224 180 -163 250 -47 -80 115 66 38 227 -50 8 144
5607 144 -98 46 -218 102 8 -168 198 -71 -34 81 138 -15 110 44 47 -242 139 138 5 -15 -204 -205 -161 67
5631 67 112 -41 -62 -65 -18 -124 -112 33 -190 -264 87 -73 332 47 35 153 148 70 141 181 -137 211 191 103 224
5656 224 214 -70 53 76 -184 18 -101 87 194 116 -14 -8 217 90 54 114 -122 -32 147 166 -204 106 -319
5679 -319 -3 -161 148 133 133 -63 197 -151 28 -4 -234 -224 -402 -148 -115 -277 -182 -77 77 349 -92 93
5701 93 291 93 57 -88 89 271 -161 -83 -32 22 11 -98 0 -169 55 24 60 24 256 -128 -169 209 71 132
5725 132 -85 189 161 -160 285 224 -258 12 33 49 115 -166 26 174 156 99 -72 -336 -77 33 -42 158 -28
5748 -28 1 117 69 78 -277 -46 107 163 -55 -4 -139 37 114 -111 -81 71 399 84 96 -194 -367 60 25 -162
5772 -162 -186 180 274 49 78 -4 3 2 -3 126 117 -109 -99 23 119 -173 90 -46 32 -52 -225 18 159 -165 373
5797 373 -169 61 -241 -21 -71 -275 43 -88 149 -40 -106 -56 92 48 -72 -298 -21 -45 48 -35 -33 320 -235
5820 -235 96 -33 -21 -15 291 208 177 99 -114 -142 7 -398 39 54 -205 -51 54 -161 103 -136 -206 79 -93
5843 -93 47 -64 102 -7 83 24 48 24 144 29 -37 22 -101 -130 -72 65 -297 119 -99 98 7 174 -49
5866 -49 -190 317 25 177 114 -110 90 -27 215 -156 158 -133 49 58 119 121 64 -113 30 49 93 -96 42
5889 42 -34 -151 -156 6 -139 12 -153 -361 94 42 -59 -91 36 -572 337 -5 299 62 38 142 2 -41 27
5912 27 51 111 -130 -4 -58 211 -262 -138 -6 -167 -2 169 33 -45 -60 -179 -87 -53 448 65 -88 62 -94
5935 -94 -129 -43 93 120 46 106 71 -87 161 140 -6 -244 -227 49 141 -117 -155 256 -11 -101 87 29 158 -94
5959 -94 -41 245 55 229 112 267 28 -70 98 -172 61 -36 154 -171 51 195 -90 38 189 58 184
5980 184 33 251 -8 -179 -112 -78 98 354 57 150 144 87 168 -60 242 -101 20 197 107 82 -37 -28 -251 -117
6004 -117 -8 -35 101 68 -353 195 19 232 150 153 -390 85 -35 -54 -72 -1 362 -52 -34 84 159 8 156
6027 156 -5 -12 78 223 36 -299 13 -6 13 159 -107 151 23 -98 -68 40 -87 199 -329 -59 -335 -194
6049 -194 129 -40 58 60 1 -58 132 12 -181 -20 61 -208 53 -69 126 -272 -82 -163 -5 128 27 -166
6071 -166 298 282 -32 -83 108 32 -81 -34 -1 168 13 -163 107 44 22 99 275 190 126 28 -60 114 61 33 -28
6096 -28 24 -182 -218 -47 110 9 24 -26 337 -55 25 63 -91 -16 127 21 54 -2 -71 204 55 191 -48 2
6120 2 38 -178 -216 125 394 240 105 207 -56 117 -46 -66 112 -22 -26 233 209 -481 152 -220 -15 -41 90
6143 90 -138 -126 -195 330 173 8 162 -25 17 -130 59 289 224 30 -22 -81 -167 39 -86 119 54 -179 -233
6166 -233 100 -225 153 82 -195 -184 19 45 -7 173 -199 -58 201 5 54 56 -92 4 -125 24 -67 -171 75
6189 75 136 71 -130 312 156 -76 121 -15 42 -35 92 69 -32 304 63 62 -36 65 118 185 295 -165 -76 -19
6213 -19 49 346 167 93 93 -170 -113 -107 -63 -232 69 -93 3 -34 136 98 -71 144 -101 -60 106 231 -92 -62 -205
6238 -205 -199 64 47 -126 -152 108 -2 -31 -37 105 -57 168 -81 -70 -142 -127 -103 -228 298 -72 186 -295 -45 -129
6262 -129 -98 -21 -20 -126 -10 209 247 144 244 -163 -109 -191 -79 78 -24 112 -40 16 -22 -69 -100 -42 -257 24
6286 24 67 317 22 6 105 -198 186 -72 -45 204 107 20 2 58 -60 58 -15 52 -70 121 -135 246 132 -317
6310 -317 -4 153 -175 -116 -29 -26 63 44 -50 218 -20 87 -25 42 -187 -117 389 156 -90 -107 -113 99 71 -339
6334 -339 122 135 103 21 -206 113 -39 293 -7 -202 110 -247 16 -29 26 3 -177 266 68 -86 230 124
6356 124 186 -143 -62 -202 -85 -263 147 64 -16 93 -237 70 -8 82 -50 252 -242 47 25 -90 150 -105
6378 -105 -196 385 -169 123 -38 41 -159 -58 98 66 -253 -89 -2 383 -129 -18 90 -209 -266 -226 -85 -210
6400 -210 -272 276 89 325 -219 245 129 127 47 -104 -156 40 56 171 272 100 107 74 5 -198 -286 -176 -9 -67
6424 -67 -9 -33 5 -6 95 9 -284 64 1 -88 341 -142 77 112 -402 -81 -248 108 61 -367 -102 -175 -10 165
6448 165 176 -181 368 -37 -33 -27 -3 -61 58 -133 -163 191 106 11 22 136 -205 -85 -11 -246 -20 -1 137 146 138 -147
6474 -147 3 -118 -146 30 13 -134 -81 65 -122 42 -117 94 70 -51 69 -92 -169 -184 140 2 153 69
6496 69 126 3 -1 0 -79 113 -88 33 161 -271 -70 67 35 -44 115 282 137 86 -170 61 -215 19 123
6519 123 -369 -116 90 -17 259 11 16 57 71 -43 71 146 70 -18 151 -123 -187 21 131 49 -142 101 309
6542 309 163 73 107 151 39 -230 5 110 -52 262 -224 -121 -57 266 -26 77 -300 58 218 -362 32
6563 32 -35 -150 -52 -156 40 34 166 344 -22 83 -260 -1 -186 59 9 111 119 -205 99 172 -8 -205 51
6586 51 27 -82 -8 -14 -65 7 -110 47 -21 27 2 60 -128 114 133 -119 28 99 -242 -144 72 134 -126 -104 93
6611 93 155 -24 124 -76 -54 220 -168 42 -22 -29 -103 -68 -202 -64 -120 -227 133 -261 -222 145 98 -248 25 -100
6635 -100 -84 -73 131 59 69 191 -26 111 10 173 -198 -91 -60 -26 95 191 -243 273 -158 -98 -510 -352 -128
6658 -128 -42 228 -94 88 205 -133 281 69 107 -55 -59 -134 47 -145 -96 -280 -102 -100 83 -172 -388 20 37
6681 37 -139 40 -229 -40 -38 107 82 -103 -62 305 24 -223 -198 60 61 -211 56 195 132 48 197 59 -67
6704 -67 65 -89 164 -74 -79 -86 -25 285 76 83 14 56 -19 361 85 219 -112 85 -44 -64 392 -112 77 -30
6728 -30 66 -146 -82 -83 146 278 -5 -106 79 -10 -97 -36 146 120 263 -53 237 -84 141 415 86 -116 56
6751 56 132 140 85 59 -264 -15 -96 -33 119 35 38 -245 61 -296 19 49 -234 25 -125 -173 -38 -63 165 -99 207
6776 207 283 -92 193 -71 173 -33 -135 -239 73 -29 -138 -89 23 -262 191 -107 8 112 -36 -145 86
6797 86 -70 -153 -220 -242 -347 145 172 -188 304 -70 44 -19 -93 -126 -36 126 30 8 -45 232 122 -115 151 -6
6821 -6 -57 -47 184 32 -93 345 96 -98 -100 55 -108 -134 -10 299 156 -93 5 -13 -79 36 260 -170 -10
6844 -10 193 113 -71 136 149 178 -73 -1 -233 203 -237 -38 -182 -181 86 -60 -42 273 47 -197 -58 157 130
6867 130 76 87 21 181 -105 22 103 111 17 57 -166 186 -72 215 -226 33 -163 -102 193 16 -46 363 -68
6890 -68 3 -205 -18 -68 41 -73 -82 161 -148 -20 -10 -1 45 174 119 115 -78 70 26 -94 29 22 16 -31 158 36
6916 36 -223 -12 -193 47 168 102 141 -92 127 -307 -172 82 -48 -59 154 -44 -151 -43 -95 34 -324 -146
6938 -146 107 196 -254 207 -99 -11 -142 -37 -113 -140 195 -2 -298 89 -173 78 96 120 77 -70 -36 -146 -6
6961 -6 -180 66 -36 54 88 228 -193 -44 34 -90 279 195 181 -108 -225 -5 128 -231 -166 198 80 132 95
6984 95 -98 115 72 -222 -102 74 -89 -127 193 -68 -58 -25 -88 54 -332 210 167 -84 244 22 -106 -129 -58
7007 -58 111 219 -53 241 91 -32 103 -43 -74 -154 -14 -39 162 123 261 -20 237 72 184 123 127 39 58
7030 58 -12 -50 -237 45 -182 93 -7 285 40 51 -349 -76 144 -23 138 77 -97 162 -177 323 146 -40
7052 -40 -6 176 -264 -73 24 -81 58 -133 138 96 363 12 -185 262 -41 -32 -6 -172 -88 -183 -244 -123 26
7075 26 -22 58 209 -86 16 181 -111 -122 146 -62 31 198 27 -42 -102 204 13 12 163 -60 59 -259 -124
7098 -124 -135 17 -4 -99 109 85 118 -11 -24 125 -19 -74 57 26 29 109 84 46 1 -108 197 -210 -120 140 -279
7123 -279 63 128 73 163 -169 -204 -146 58 -163 33 -210 94 45 101 -40 -159 228 271 28 -61 56 281 232
7146 232 122 -195 -56 136 315 -18 -90 229 58 -41 8 -69 -184 -19 141 58 32 71 202 -117 -5 -399
7168 -399 116 -165 -123 50 -182 67 -171 85 -152 -159 280 32 -2 138 1 254 -249 182 98 -263 47 52
7190 52 -86 -243 289 182 -104 -223 -127 -158 -8 164 -238 -7 -121 84 193 53 78 261 -114 -228 -48
7211 -48 29 -54 56 136 -415 248 37 3 -95 241 -106 -48 15 125 176 -24 293 169 -94 367 303 5 145
7234 145 -131 226 -191 8 108 7 47 44 230 317 21 146 336 -160 -66 74 176 17 248 280 -188 -252
7256 -252 -103 -52 -197 -77 44 -36 169 171 28 92 33 106 -169 -152 51 76 86 10 95 -77 369 -5 -16 116
7280 116 -22 -97 -249 37 48 80 77 -220 44 -197 3 254 31 -136 82 206 -117 49 162 42 -12 -172
7302 -172 -196 -170 153 12 34 -315 -196 -50 -65 -240 342 130 60 -34 -232 -97 -53 51 -112 -40 -105 -71 -108 -184
7326 -184 -4 -180 62 -16 -16 19 -264 145 52 1 -56 111 -53 -29 -13 22 -412 -166 -147 111 166 41 -174 -132
7350 -132 -9 -32 42 -287 67 84 90 -282 56 160 124 161 -12 -144 -154 -7 -72 -62 71 53 -74 -307 -23 297
7374 297 -45 -36 -39 84 120 -31 27 53 -56 56 -129 17 156 -194 216 -201 -24 27 -120 -53 -36 -212 -198 150
7398 150 -37 -234 50 -194 -229 241 149 -118 263 77 112 57 -61 -18 30 -69 -25 43 -108 129 237 122 72
7421 72 98 -35 211 61 -169 93 -69 -232 -343 -272 -310 236 37 131 14 66 -268 91 -64 70 7 -165
7443 -165 -215 11 118 -170 20 -22 -191 -26 154 -98 55 -33 211 330 40 -240 -252 52 62 272 -46 31
7465 31 16 -152 141 -44 76 58 -29 44 50 -321 133 181 -57 410 154 58 -3 -22 96 210 165 140 -157 -227 -180
7490 -180 -97 146 86 -183 -241 84 -157 33 -373 146 96 335 138 18 -76 -72 -203 -70 235 93 35 -90 399
7513 399 -128 -215 113 18 -16 58 66 265 -310 20 -64 127 -36 -253 112 13 56 -72 271 31 57 65 -147 86
7537 86 60 80 165 95 5 45 134 -10 -156 7 47 170 319 115 74 224 -141 93 -152 -59 94 119 87 -95
7561 -95 1 -316 139 58 100 32 -111 -55 -235 -190 23 -10 -102 232 149 22 33 15 75 -231 38 -80 -68 127 255
7586 255 80 -166 10 64 204 388 -177 39 -1 105 402 -74 78 111 44 -155 83 104 34 -72 -314 34
7608 34 202 118 -200 77 90 -133 -172 10 -65 54 -94 -272 106 -26 162 16 -62 -235 -210 -18 73 65 -343
7631 -343 102 231 290 64 275 -77 66 -57 -429 -224 143 222 -67 124 -174 -107 158 41 -198 -93 -103
7652 -103 33 -166 -64 -77 -220 -55 153 -18 -240 279 147 190 34 4 -109 104 235 102 -168 -143 14
7673 14 -195 -224 286 -144 -235 -108 -9 87 -23 -59 373 -43 48 142 72 -367 -128 -331 -81 -132 24 250 170 40
7697 40 -12 229 174 -67 -188 69 -296 -131 75 -83 -71 -95 -51 -124 177 -152 -95 -238 360 -97 -72 93 -79
7720 -79 -161 -251 110 21 -388 -178 160 -155 35 -21 -114 237 -55 -214 70 -154 -169 -46 -151 -147 -43 11 71 -199
7744 -199 -4 36 81 83 63 -110 16 158 -3 -26 -128 -64 -122 435 387 99 49 21 34 -8 133 -12 -170 -140 22
7769 22 -121 154 -150 162 -143 -35 -72 -108 -32 -202 -201 45 18 -157 -152 9 8 -126 -50 45 -124 75 -66 159
7793 159 16 -125 -45 -63 -62 -85 -156 -88 -104 -7 40 72 -154 -53 238 -285 -43 -169 -12 24 1 -158 -140 -171 -19
7818 -19 302 -143 142 207 -73 163 53 191 -229 -92 149 1 1 100 206 -76 63 111 -179 36 -67 -168
7840 -168 10 -463 15 82 81 -8 -82 257 -289 -59 130 -47 -92 -78 -171 -59 -21 -30 -29 -86 15 113 -40 5 -227
7865 -227 -206 224 -18 -186 -19 -246 23 247 -233 -67 63 44 -97 -146 -241 -223 8 118 -80 36 0 -309
7887 -309 -165 38 -57 48 65 -126 59 8 96 -190 28 -166 -60 87 -189 36 352 -386 119 -39 -80 -16
7909 -16 -84 -73 87 118 90 136 86 -193 -81 -171 -168 23 -154 -58 140 12 -90 71 23 -203 184 218 -118 60
7933 60 249 -41 15 81 99 -173 12 -274 -38 49 -109 -90 26 125 -239 -12 137 -30 -57 210 76 39 -104
7956 -104 -106 -96 -9 -94 195 -106 -16 -3 -71 77 114 24 -98 34 16 -230 237 -214 202 -3 -25 149 25 -32
7980 -32 -85 165 52 17 -5 -239 14 17 79 -146 142 235 21 162 -40 89 -46 -146 -218 -40 -162 115 41
8003 41 -126 80 47 346 -201 -228 -104 -88 -51 -36 263 -22 -12 144 -114 110 220 -169 17 301 -54 42 149
8026 149 43 -145 -213 231 -34 28 104 -167 -108 -55 -399 58 29 -304 26 -119 214 -167 85 121 63 -168 -55
8049 -55 108 87 45 43 -179 128 250 40 32 -173 -124 -117 -196 -72 122 63 47 -281 -19 -104 -123 73 -69 14 81 328
8075 328 -176 -96 168 175 -125 -148 184 -177 -18 -56 41 -234 132 30 -9 181 4 108 -160 216 -69 83
8097 83 180 72 242 116 -24 -206 -12 203 -3 166 -55 71 -29 114 -118 -247 56 378 304 50 58 272
8119 272 -84 109 -7 -40 -165 -27 -83 -145 -145 1 168 -195 -77 172 31 -100 -16 190 -127 -13 9 -48 -157
8142 -157 173 -149 -257 -18 129 160 -97 334 257 97 149 -100 -25 208 111 -92 -134 151 43 96 458 -42
8164 -42 -60 -114 8 171 -52 -23 -161 250 -36 -25 201 -160 -222 -41 57 102 -164 -77 -67 44 287 198 -23 -32
8188 -32 96 2 47
8191D7
$$ Imaginary data points
##PAGE= N=2
##DATA TABLE= (X++(I..I)), XYDATA
0 0 0 0 0 0 0 0 0 0 0 0 2 -8 8 -8 8 -16 16 -24 24 -32 40 -48 56 -64 80 -92 105 -122 143 -163 185 -213 241
33 241 -273 310 -348 391 -439 490 -546 606 -676 748 -828 916 -1011 1116 -1233 1357 -1495
50 -1495 1647 -1814 2000 -2208 2439 -2700 2997 -3340 3737 -4206 4767 -5459 6327 -7459 9007
65 9007 -11253 14826 -21397 37481 -163433 -102330 186711 -129598 -165825 109895 114850 -89854
77 -89854 31285 142473 27501 -26860 83126 59826 -37593 -44407 11046 -3253 -51387 -53799
89 -53799 9922 -1654 -69016 -27677 50946 -31747 -73702 63454 86307 -58107 -20402 118125
101 118125 47059 -52012 41447 78084 -29592 -35466 31512 -25499 -84561 -27335 783 -47116
113 -47116 -41132 13553 23463 8794 24572 52140 47790 21560 24369 38865 4180 -37419 -15007
126 -15007 326 -47577 -62282 -10893 -2977 -36705 -14502 23156 5692 -1048 34232 31573 -875
139 -875 13547 39126 11586 -17038 3767 16105 -15241 -28700 -4683 -5938 -33760 -27054 -2864
152 -2864 -12086 -22688 1028 16504 5033 11306 31552 25626 13190 20029 20310 858 -8055 -5544
166 -5544 -13765 -27434 -26460 -16168 -13546 -17214 -7775 10504 13124 6537 19294 29662 13400 5423
180 5423 19082 12161 -10091 -6896 796 -15927 -21766 -5977 -9325 -20831 -6954 3613 -6021
193 -6021 -2918 12019 11179 6102 14591 18825 12866 10240 7740 3199 243 -5694 -14416 -14526 -14069 -20048
209 -20048 -17416 -7649 -8085 -6190 8788 13430 7872 15805 23585 12210 5727 12871 6108 -8791
223 -8791 -6837 -4910 -15614 -16381 -6799 -8903 -12861 -3480 2250 -655 2689 8557 6356 6528 10772
238 10772 9156 6208 7351 5772 683 -232 -2091 -7380 -9701 -9405 -11954 -11515 -7450 -6500 -4633 2654
254 2654 7685 7886 11072 15529 12164 8181 7941 4294 -2518 -5858 -8537 -12011 -11757 -9065 -8387 -6538
270 -6538 -1977 2183 4282 5632 6525 6888 6498 4822 2946 1870 327 -1244 -1199 -1151 -2347 -2419 -1525 -2649
288 -2649 -4098 -2691 -2112 -3400 -3139 -622 514 1961 5097 6020 5478 6141 6353 3447 223 -1459 -3600
305 -3600 -6644 -8347 -7585 -6997 -5828 -3063 593 3607 5987 7536 7678 6747 5616 3809 762 -1764
321 -1764 -3695 -4840 -5631 -5697 -4865 -3251 -1611 -280 1524 2836 3186 1978 1575 1533 1359 824 905 882 554
340 554 1174 1249 -2 -781 -571 -1050 -2520 -3375 -2926 -3625 -3462 -1330 320 1766 3546 4653 4774 4496
358 4496 3923 2193 6 -1682 -3265 -4292 -5081 -5688 -4835 -3191 -1438 494 2704 4316 4079 4191 4342
375 4342 3214 1840 866 -557 -2098 -2023 -2324 -3081 -2964 -2158 -1496 -1246 -621 -565 -209 232 230 504 1533 2289
395 2289 2015 2573 2908 2770 1823 1263 273 -1355 -2141 -2397 -3667 -3907 -3825 -2170 -1210 257 1391 2410
413 2410 3140 3529 3109 2645 1864 1278 -115 -1094 -1520 -1668 -1833 -2233 -1564 -853 -452 -312 -173 401 926 175
433 175 -100 530 809 957 711 660 743 692 170 -775 -603 -627 -1152 -1842 -1667 -1071 -1056 -32 335 616 1399 2124
455 2124 999 1526 1645 11 -643 -302 -722 -2009 -1802 -650 -1048 -667 538 544 -29 1142 1478 338
473 338 485 695 -190 -870 468 221 -1031 -39 1120 13 -575 530 85 -656 15 -54 -1484 -285
491 -285 1194 -456 -617 1297 1233 -307 1302 764 -1125 -464 438 -1866 -2283 87 -428 -1459 642
508 642 1477 -214 1024 2783 756 -203 1404 56 -1523 -490 -901 -2785 -1130 615 -1635 -1142
524 -1142 1715 562 -370 1422 1009 -864 1048 1641 -1329 -1099 1106 564 -880 930 427 -1121 533
541 533 830 -1900 -1568 448 -971 -1467 177 -202 -350 1751 1887 293 1191 2495 600 -154 193 -942
559 -942 -1302 -206 -1138 -1971 -279 205 -522 194 994 410 739 1861 304 -635 472 442 -857 -598 -141
578 -141 -495 73 847 -278 -194 270 -191 -653 -173 -451 -650 -190 136 -274 64 934 1139 884 629 242
598 242 -65 337 -351 -647 -1016 -425 -531 -492 -360 144 549 483 335 251 393 159 -54 -123 -451 -343 -373 -169
620 -169 -40 358 -18 219 939 342 291 474 -35 -510 -103 -402 -645 -40 120 -628 -303 890 215 -64
640 -64 443 352 -538 -91 634 -731 -358 712 400 -588 692 586 -604 -38 641 -432 -1099 491 -93
659 -93 -812 -184 84 -613 493 818 408 46 1149 251 -130 36 17 -850 -304 -146 -574 -460 85 -343
679 -343 -24 434 218 -132 -32 306 9 -167 256 -2 35 104 -129 63 229 74 -253 32 -302 -563 -20
700 -20 -71 -210 -32 168 247 402 427 324 249 367 56 -116 255 -473 -99 -486 -281 -236 -106 -5 38 -66 13
723 13 20 14 -48 293 212 37 139 -230 -173 -21 219 102 225 163 -66 -51 -144 -159 -42 -441 -236 -502 -11 302
747 302 -200 389 369 396 136 364 -106 32 -61 -108 192 -255 160 77 -150 249 417 43 26 275 -102 117
769 117 -106 -464 -346 114 -185 105 29 17 144 271 389 279 82 272 264 -118 -96 -116 82 -324 -282 -174 52
792 52 48 391 143 177 116 -41 28 -68 -2 -15 -19 18 231 111 11 92 -317 -174 -274 -377 -146 -173 -9 -303 -24
817 -24 47 31 206 525 700 442 165 190 -29 4 -112 7 -113 -75 -27 -175 -393 23 83 -122 -15 -7 62 414
841 414 -31 50 295 63 281 250 73 -31 118 -68 -17 -66 -463 -226 -425 -161 -149 -119 52 244 -82 197
863 197 134 226 278 49 97 16 -42 -203 -192 -245 42 -233 -134 29 5 129 -57 19 207 -61 192 16 -198 114
887 114 39 74 -138 -383 -101 -131 -144 -28 -110 -90 128 143 136 -145 401 192 195 140 -14 228 167 -211 -37 26 41
912 41 -53 -43 -27 -168 -3 -60 -187 75 321 94 -406 136 318 -146 -189 252 -122 -205 -55 -148 -40 -21 5 -317
936 -317 92 168 -114 98 -66 45 -66 -75 334 146 -4 255 203 -205 -71 160 -217 127 -181 -253 -57 325
958 325 246 -73 129 -135 65 44 -10 -21 -21 -81 -47 76 -290 -62 -75 -160 -76 91 137 -99 307 -38 36 -126 109
983 109 -33 195 0 200 237 270 -333 65 -119 13 49 -79 106 -87 -90 -158 -91 -86 -47 125 197 -71 -83 107
1007 107 -307 15 -268 14 -204 73 29 24 29 -32 -61 149 181 298 -70 101 58 62 30 223 -20 -256 -15 -79
1031 -79 82 108 196 -3 -168 127 -59 220 -68 -116 -155 20 6 -44 44 -224 -1 35 159 24 144 -114 -10
1054 -10 9 22 32 -202 -148 165 4 -376 122 229 99 108 17 29 -255 -79 -132 281 -205 -326 155 166 -153 -205
1078 -205 -6 35 185 -65 -183 -64 -32 98 -21 -16 53 -170 -113 165 -156 72 -14 161 -11 -43 109 -401 150
1101 150 46 -152 -48 147 -119 4 -148 -9 -5 -126 18 109 131 -99 51 69 62 -69 71 -75 107 69 -5
1124 -5 -91 -64 -135 102 -66 -351 -96 0 -149 -20 109 279 -7 299 141 130 158 -301 -33 -271 116 -18 -33
1147 -33 22 63 -103 63 -5 45 -82 243 82 18 54 -33 114 64 183 104 56 -210 269 38 -163 -54 89 -32
1171 -32 3 316 177 -12 -26 16 85 64 200 139 -44 9 -225 -38 -158 -28 -72 59 -65 13 43 -307 -186 122
1195 122 245 9 287 94 92 23 -163 227 -92 -24 194 -72 -109 -63 20 22 -207 -133 -132 -171 -132 -127 36 -103 -20 260
1221 260 -21 -79 -116 39 193 148 161 -52 -35 -295 -185 -146 -197 -301 -73 210 89 -227 -272 -259 -253 57 131 -271
1245 -271 -135 -37 118 -83 -162 -66 -319 32 -133 -111 60 -138 84 -245 -46 102 -225 77 125 -94 379 85
1267 85 189 -7 247 -200 -363 187 78 -63 -230 62 21 76 174 -32 -88 35 -150 49 -369 -145 217 -135
1289 -135 -144 41 -180 -20 150 -138 172 -137 163 242 -33 -205 -35 124 59 63 -37 -221 -158 37 -73 -173
1311 -173 -85 32 21 -208 -247 96 97 175 215 -48 316 -251 -126 -78 -39 191 -13 353 126 -248 -212 75 34 108
1335 108 -54 77 -20 -44 -134 71 -111 71 -277 214 170 -130 -7 57 -325 -50 -285 -197 219 22 87 -9 22
1358 22 -88 2 29 118 95 -357 224 68 73 -51 -110 -126 -58 46 -85 -126 165 56 -140 -65 168 50 81 38 -206
1383 -206 79 179 16 -28 -155 -62 361 95 41 132 -38 -84 -117 -473 -83 -41 -165 -5 -237 275 65 -264
1405 -264 -60 211 97 -131 -252 -71 80 54 -102 -45 -165 -34 172 -74 -88 -45 79 -43 78 69 -158 -12
1427 -12 166 82 -305 109 -2 58 -357 -313 -109 113 94 -120 -59 -34 -240 53 -211 89 163 128 -130 -99 33
1450 33 4 -129 123 206 -100 240 158 -20 -14 -137 -120 -195 -45 -13 184 -66 243 -152 1 234 28 139 -93
1473 -93 -65 1 -90 -111 -80 -196 -27 -259 -232 98 48 -30 -76 -104 -113 -13 -13 113 -286 125 177 -85 199 401 35
1498 35 108 17 76 58 -9 -205 -106 -244 -147 -21 136 10 190 -124 -214 -69 247 92 115 -49 -36 -259 -151 -339
1522 -339 -243 95 2 231 74 17 -186 -226 -189 -69 82 168 -166 22 -94 236 35 158 73 53 141 -17 -35
1545 -35 -246 113 -5 -57 -251 249 22 252 -78 32 -92 145 47 63 127 -23 169 85 312 -109 91 114
1567 114 121 -128 1 -92 54 -120 -88 -95 120 -237 -223 -5 -95 -170 111 111 -102 -77 46 211 -202 81 -171 -10
1591 -10 120 -27 -108 -356 -64 62 83 -141 -72 56 132 -76 -293 116 108 -120 233 -246 -322 8 -65 198 -27
1614 -27 203 -107 8 -16 -105 327 89 -7 80 256 30 -37 -120 61 216 125 377 -219 127 32 -204 9 -1
1637 -1 54 -136 246 -86 -166 129 -70 125 -214 58 -44 267 -114 196 16 81 -199 -306 56 61 133 -185 92
1660 92 -105 -306 62 77 270 -43 -119 167 20 194 -73 -206 72 38 -2 114 -172 142 4 -103 -234 284
1682 284 -164 378 137 -332 124 -396 156 -7 -297 -11 -110 50 23 -122 25 -135 146 -227 75 262 -33
1703 -33 221 83 44 -83 48 -158 53 -104 130 103 -160 44 -239 -71 -19 102 114 -77 70 -139 144 164
1725 164 28 52 78 38 46 -155 7 -37 -320 -161 -106 -131 134 -48 -139 71 -318 142 1 44 -86 -97 -18 -67
1749 -67 7 -70 -98 109 -211 -38 270 -44 -53 -24 -280 81 -279 -204 -64 -94 18 83 -8 -179 235 37 163 136
1773 136 -34 -145 -164 -112 127 205 79 117 -84 -57 13 -10 -467 304 -302 -107 -97 -180 -96 51 -147 -97 106 28
1797 28 -59 -225 -43 -339 21 -98 -161 29 105 124 189 4 -24 117 -184 149 62 -130 129 -1 99 -113 14
1820 14 77 -98 154 -111 -109 125 182 65 23 -17 -35 5 -39 -81 210 174 159 58 188 -100 -141 82 187 -143 270
1845 270 197 326 89 -200 -50 25 58 181 33 101 -107 237 267 39 161 190 -83 99 25 -182 -145 -237 -14
1868 -14 44 160 31 180 144 200 -239 198 -7 -119 -65 111 159 37 49 -333 -252 -119 29 34 -83 326 22
1891 22 51 56 -223 -8 -295 113 17 236 -174 210 34 -44 169 -149 254 41 -225 -36 -24 159 -160 -54
1913 -54 -132 147 -16 -237 -23 77 116 142 40 131 -203 59 -51 24 -95 -167 -78 -13 109 6 110 -273 127
1936 127 106 92 6 43 -371 4 71 46 4 22 -30 67 234 -10 157 -51 -97 11 -6 9 297 123 -109 -29 166
1961 166 -50 -107 38 191 -3 86 127 -64 -21 328 -189 -143 72 63 16 -94 -55 48 -18 -83 121 -297 -106 -75
1985 -75 -326 195 -75 -137 260 261 -67 -121 -85 7 26 18 -290 137 43 -2 -87 342 -31 -13 221 171 217 163 300 -114
2011 -114 143 112 238 178 37 558 -82 -39 10 -281 -120 -220 -10 40 -6 -89 203 -144 12 128 9 190
2033 190 106 126 16 94 -23 -49 177 -34 125 -112 -39 35 -19 195 -32 -30 -58 -8 -74 91 -54 34 133 2 104
2058 104 -79 106 -242 120 -137 -160 36 -245 87 -119 -173 390 -341 -65 6 129 110 43 -159 -55 -91 -353
2080 -353 -63 -79 -18 25 116 -62 208 52 -138 150 -62 -167 107 272 -105 53 154 -145 56 256 399
2101 399 50 -72 31 -59 153 209 38 -32 123 155 -13 -25 72 28 146 -59 -44 51 -148 157 -56 96 132
2124 132 100 -49 61 -219 -109 -59 142 116 73 -121 61 -2 -96 5 54 5 -172 29 -231 -13 -20 168 85 -197
2148 -197 79 226 -514 166 128 -111 211 -203 -51 -264 -17 -132 -141 -30 -34 -120 -29 -114 107 99 244 125 141 -149
2172 -149 23 228 -99 -55 274 -66 -34 130 -58 -43 -75 373 18 -60 -44 124 -59 150 -281 67 76 -5 149
2195 149 8 519 -94 135 210 219 -118 -212 12 270 -113 -46 21 63 136 133 65 21 -32 196 -38 -63 44 142 -146
2220 -146 -67 -112 67 164 24 11 -190 -232 -140 243 -159 -283 -125 80 -345 4 90 184 8 168 -6 49 -158
2243 -158 12 113 -160 171 -96 -105 -11 -73 -238 128 -46 13 288 -86 56 -251 216 -72 -111 -20 -425 141
2265 141 136 118 152 30 -47 -169 -214 -129 -202 34 45 -179 236 15 130 185 -16 -6 181 398 -172 167 104 129
2289 129 -51 -36 -203 177 350 297 40 14 95 186 48 51 -55 176 33 44 -15 72 -46 9 -39 17 104 90 -219
2314 -219 50 -259 -264 117 -249 -9 -166 -17 115 151 73 -212 -133 -128 -75 -92 14 79 65 78 -39 56 49 -3 -109
2339 -109 124 -191 184 -109 -156 -87 -237 -144 221 189 -117 91 106 112 0 181 -76 -12 -103 -21 -31 -32 -165 -72 86
2364 86 -134 107 84 -116 90 200 -84 61 -32 23 3 -63 209 187 -227 16 -141 169 42 -26 294 -140 32
2387 32 -65 11 4 193 -182 -12 -130 -25 3 -6 -253 -260 60 -150 -298 39 -88 88 38 -210 -10 6 -104 110
2411 110 66 -58 259 131 13 74 -25 -180 46 255 -152 2 234 -258 56 -193 102 91 184 -109 141 36
2433 36 122 87 127 140 9 -317 -65 -255 100 163 133 10 -192 70 -14 -106 12 178 294 171 -198 52 -8
2456 -8 45 14 -199 -156 -123 286 -140 -34 -171 -54 130 101 11 135 -37 72 -65 39 -189 -244 -177 152 -120
2479 -120 65 -164 -37 137 208 -238 5 -98 -83 26 -79 245 -60 -176 -79 -180 103 -52 53 -135 69
2500 69 108 111 -155 33 -114 230 -13 79 -31 19 120 -35 -28 149 184 -80 89 -269 -283 37 -187 16 300
2523 300 -20 130 -239 -218 199 86 69 48 15 -95 49 106 -268 -34 123 180 -56 -180 46 152 -120 -246
2545 -246 -170 46 141 -80 -80 -155 -84 -122 -2 -58 112 -86 37 247 16 44 -94 -131 -140 -97 -205 -156 -128 -120 -238 34
2571 34 81 150 73 15 -414 48 -112 177 -68 -204 148 24 -155 -30 -136 -246 -245 0 -145 48 -175 -56
2593 -56 29 -120 -23 374 86 122 204 142 -22 60 -189 92 33 -113 -202 -35 -64 102 298 -231 -17 31 -175 236
2617 236 158 82 -197 65 -32 -19 -150 169 -54 73 -2 -100 196 -34 -197 218 18 -29 -57 -97 313 190 -107
2640 -107 -133 282 124 292 -61 247 -84 -134 -51 -79 100 -61 127 -212 77 -328 -128 165 136 -118 -101 -157
2662 -157 -144 78 -143 183 203 -87 -122 -138 58 -190 -201 -119 -212 200 209 240 161 146 160 153 -9 -91 -168 84 150 21
2688 21 -112 3 -127 -129 -44 -22 190 -267 -208 -5 74 14 -138 167 -160 34 202 23 -277 -122 -3 202 -206
2711 -206 179 7 229 146 -126 77 -225 -270 -177 85 -93 -27 -237 3 118 235 136 280 95 -172 126 52
2733 52 253 -178 32 7 -7 -1 -27 -107 88 29 -243 208 24 56 -30 153 62 191 -164 32 13 -234 58 89
2757 89 79 56 161 56 -7 -136 -25 101 3 -27 95 123 19 -200 72 -84 41 206 -102 -117 -156 121 -13
2780 -13 122 50 -266 -58 262 69 -13 -133 -37 -201 -41 22 93 28 -165 0 202 -419 -156 118 -126 -118 -102
2803 -102 -44 -85 216 -116 -47 -200 49 68 -173 60 -135 -30 12 17 -249 -82 2 53 1 52 -108 -87 98 16
2827 16 -22 59 59 40 29 143 -136 115 -346 -48 64 -208 -80 16 47 -79 -224 -1 103 134 77 -9 271 -101
2851 -101 261 3 -226 87 193 107 -363 -36 204 236 68 -319 45 -13 47 -274 -244 6 42 -409 -226 17
2873 17 147 -227 -185 51 -295 1 -229 23 -68 -36 -141 3 21 138 -43 -16 -253 -12 -54 209 80 -31
2895 -31 -345 -163 44 -120 60 329 24 -121 -183 -186 134 44 -190 104 92 -147 -206 -66 11 48 40 -69 79 191
2919 191 68 61 148 72 -160 153 72 -139 443 -97 -232 -17 121 -48 -38 143 -67 281 200 4 303 -106
2941 -106 17 -143 367 363 -297 -57 -20 107 -49 4 176 13 31 92 108 203 107 372 -155 150 15 70 -85
2964 -85 -24 -266 -60 -197 -125 -236 77 180 -91 -138 6 147 209 8 -17 -325 132 108 -86 7 -125 -91 -167
2987 -167 -183 -177 75 -32 -366 24 89 -87 -9 -29 -35 -278 -118 -96 35 -37 -25 -14 -167 -107 -215 -22 -62 51 40
3012 40 71 15 -6 -75 -90 115 43 -106 -218 197 -35 -314 -122 -4 29 -402 -95 29 14 36 -2 -101 166 -51
3036 -51 -281 236 -174 114 -93 -54 41 -33 -36 159 -293 -151 99 196 125 137 164 29 40 -336 -175 197 -154 48
3060 48 -119 99 46 -142 377 32 -104 161 -158 -48 -30 -106 121 -30 379 32 -147 -60 80 -158 -227 6
3082 6 12 -135 -156 194 -445 16 -165 -161 25 -94 -76 126 52 -196 55 95 105 167 -95 61 241 -48 25 -67 221
3107 221 -219 -62 -30 88 -15 123 -190 -143 -276 -107 281 -198 16 142 -47 -11 -71 -45 -154 -29 -70 164
3129 164 140 55 -294 134 -58 130 -53 109 226 -104 197 -103 34 -69 -82 -95 33 109 -83 -194 -34 -73
3151 -73 -282 36 82 -125 -171 -28 20 -92 -132 -93 -12 108 -118 -121 82 -289 -61 260 -64 -280 36 15 -38 -47
3175 -47 294 21 -117 79 456 -220 -38 46 105 -66 -210 -99 235 -57 89 130 31 459 248 89 -205 -16
3197 -16 83 -2 9 231 -75 202 232 5 173 246 265 7 132 140 203 -31 -21 230 275 -111 331 92 23 -18 130
3222 130 117 -113 155 -333 -14 -27 -341 42 -24 -2 14 57 75 -205 80 66 -136 6 56 172 101 -12 116
3245 116 -180 -10 77 -66 52 189 46 -66 58 113 -75 58 305 60 92 47 181 355 241 57 -62
3266 -62 -22 141 -97 221 -160 -302 60 -83 -188 217 -173 61 101 43 -9 36 -194 -151 84 302 7 124
3288 124 -93 246 81 -176 -182 22 89 -264 74 -61 -141 -44 295 4 159 -145 -150 90 -322 -74 253 -332
3310 -332 105 212 376 -42 -120 -98 91 31 -19 -287 -220 -120 144 1 47 -104 43 206 -210 373 256 -103
3332 -103 75 125 235 65 -236 -114 53 -16 2 -134 -45 103 -208 65 26 37 213 -253 -24 -1 219 124 26
3355 26 -98 -177 -234 90 74 38 -68 -46 -300 -42 143 196 -160 5 -19 215 215 -136 -37 -36 128 74 -17 57 -133
3380 -133 -51 -147 55 -285 -187 -10 -194 205 97 26 -163 33 -410 -6 -218 53 -109 -5 -29 -64 -353 129
3402 129 -172 -308 23 -15 -148 205 77 -101 222 89 -209 -45 22 -103 267 186 90 179 -150 -394 88 -131
3424 -131 102 -170 131 219 13 0 -4 204 -11 75 93 154 84 -290 -50 266 168 -100 -56 163 251 -76 -37 -48
3448 -48 58 24 -73 -16 -171 199 -213 64 41 117 53 174 -122 -105 -259 268 -23 31 -96 160 99 17 228 366
3472 366 247 -9 88 223 -10 15 120 -15 -136 96 209 303 50 -56 136 14 184 -8 162 -236 -70
3493 -70 83 -240 -115 -57 101 200 115 51 -54 4 -44 110 90 76 80 -194 -135 -155 -64 3 40 -69 131 -136 -190 -111
3519 -111 16 146 -15 136 -119 106 81 -141 168 -97 -206 71 248 -77 -3 113 -77 -159 80 -50 -119
3540 -119 -43 -230 226 56 -25 -49 112 43 -89 223 -8 -139 91 111 25 -1 188 -8 -45 -187 6 -129 63
3563 63 114 -187 131 -60 -10 -225 65 117 196 -60 65 -82 -130 193 35 -142 18 18 -226 93 -297 -30 113
3586 113 -241 122 -66 56 -85 -87 -116 60 -189 1 63 -164 181 154 215 -311 33 -7 -6 -125 -56 107 -227
3609 -227 -30 -184 -92 -115 182 -218 39 -357 68 135 135 44 86 10 6 -18 47 3 -154 206 -207 187 105 -120 -212
3634 -212 121 -19 -149 -93 -360 79 264 128 100 -16 -250 15 -14 12 -151 -146 -215 -20 -163 -28 14 60 189
3657 189 -332 -76 483 -183 -100 -369 -16 -85 -125 188 78 37 410 -32 -311 -258 152 74 91 -131 59 233
3679 233 154 -195 44 103 -86 -46 67 283 -36 139 -304 4 99 114 102 -165 -31 3 18 -42 -337 -23 242
3702 242 -63 -116 -199 119 35 202 -139 -175 -38 119 -144 177 37 -128 -26 -99 46 123 80 57 -6 -378 -42
3725 -42 156 -45 -154 83 163 -118 -325 -53 106 119 -206 57 39 186 47 -15 -210 17 -116 -9 -151 138
3747 138 141 -6 94 43 -120 91 -29 -212 248 60 65 -236 6 65 43 271 114 -13 14 -217 191 -58 33
3770 33 -32 -285 42 -145 62 303 -6 -132 148 -18 -111 -155 -10 -70 225 142 -4 30 -133 -234 85 104 16
3793 16 200 14 41 208 161 41 56 5 -120 -198 -42 83 164 -161 -42 -215 -117 151 8 333 99 -283 -56
3816 -56 127 -44 76 437 78 -20 35 41 218 -64 180 -160 -62 -82 139 -176 46 -204 58 -336 -156 2
3838 2 56 -110 -70 -91 136 196 41 -156 -108 -22 437 27 66 157 13 235 159 6 -146 71 -41 -9 -161 76
3862 76 244 74 -72 -85 -68 21 -1 -273 -206 141 -25 115 99 172 98 18 -52 -97 -25 153 -318 -24 249 -108
3886 -108 37 -35 -57 -69 -29 6 -23 -140 -176 -193 -249 -213 -207 18 2 -80 -103 49 29 95 -20 -53 61 -1 -4 -65 46
3913 46 -68 -91 -13 -232 67 139 347 -176 -330 210 -45 -167 -52 -87 -68 -127 -86 22 138 -210 306 141 -135
3936 -135 106 -344 -78 -149 38 212 115 -196 116 -17 -84 -50 290 264 50 -77 17 -71 89 3 102 10 6 -67
3960 -67 0 -131 -380 -228 -187 156 118 86 144 -20 369 27 108 155 31 -52 56 108 164 91 -394 34 107 -50
3984 -50 104 10 138 -282 -229 129 -151 57 -5 308 94 -137 -291 -133 135 -36 -90 -71 9 182 -165 -169 137
4007 137 -42 -52 -177 -71 135 22 154 12 -11 -49 -98 97 121 -161 -22 107 62 -261 -154 12 -249 98
4029 98 -58 -212 -329 -88 157 241 146 -233 132 -125 135 88 38 -85 -57 72 70 -213 57 127 123 122 0 115
4053 115 201 14 111 -245 194 285 -81 40 9 -105 -137 -101 -283 235 -165 344 69 46 210 -77 154 58 -131
4076 -131 -1 -13 324 253 -58 145 -103 -20 -73 74 -65 -80 -26 0 169 115 116 -134 250 135 159 13 21 -201
4100 -201 9 39 -202 -123 -38 119 74 -51 -182 44 -92 121 280 -28 -27 192 173 270 -41 225 131 -33 31
4123 31 -17 -222 -223 -144 -209 -210 -380 -81 -40 8 51 -84 -109 -37 38 -125 -117 -90 -61 14 -84 257 7 -97 106 70 -68
4150 -68 58 225 76 73 -116 -12 -238 28 29 25 63 187 -64 4 -254 1 56 118 -378 329 -59 -58 318 61
4174 61 36 -144 18 -119 -22 81 -268 -159 26 -172 -169 226 337 -13 -120 -140 -96 3 108 -247 153 6 -128
4197 -128 89 46 19 -243 -423 -192 -58 -294 192 37 -394 -108 -137 22 -171 -193 16 25 119 -37 -98 -106 -103 104
4221 104 122 181 0 -205 -75 241 105 -226 -90 -178 -109 63 -110 78 -11 66 -21 -1 37 -193 -176 5 -61 8
4245 8 -35 -261 -259 172 -251 15 78 -243 -58 26 93 -47 137 -218 31 -143 -170 193 167 -18 -39 -10 139 -190
4269 -190 98 18 -81 156 86 179 26 -54 1 41 106 157 -46 -282 -82 271 -81 124 -29 -169 -71 -137 230 -85
4293 -85 -26 -289 -36 -30 -25 -273 120 148 172 23 -257 161 -117 6 170 -24 -158 -29 252 92 -110 -119 175
4316 175 2 -105 372 -143 170 39 -7 -197 132 21 13 -198 -244 -11 54 118 107 16 34 278 79 -44 -8
4339 -8 -67 16 326 -10 141 115 250 -59 -118 372 -37 -137 87 -63 -108 23 19 -107 2 -37 234 -74 -70 149
4363 149 -288 126 47 102 110 -9 150 1 -46 -271 -61 2 -36 -26 223 74 110 -148 -141 48 -159 63 -78 -169
4387 -169 125 -348 -64 -58 -68 -33 117 64 -27 -64 129 -38 201 52 154 -22 -31 52 -6 -182 29 92 -320 -167
4411 -167 -26 69 -115 2 -71 -132 17 225 2 -347 -6 -44 -84 -29 99 277 81 123 139 267 180 102 141 -111
4435 -111 276 158 -112 -331 -24 -115 -86 22 192 -130 -126 -24 -394 -85 -271 22 31 -91 231 -20 -4 72 106
4458 106 -32 176 77 20 -49 -4 175 -145 -26 72 -48 -2 202 2 -36 -28 214 -19 110 -93 155 95 42 66
4482 66 -32 -32 -245 -84 -384 9 -208 -84 57 -152 -132 25 59 -242 -36 161 147 -9 14 -124 -159 -94 124
4505 124 -159 -52 -217 198 77 74 10 -35 19 88 -121 -366 -200 56 -121 231 -101 176 -130 -139 -64 -91 303
4528 303 -79 -127 228 1 -33 -19 145 79 131 -54 123 123 181 38 133 22 56 259 157 41 -117 -416 39
4551 39 -166 -216 -156 -74 -18 -253 -131 165 68 -250 -21 -261 -18 -115 93 -7 -96 179 120 -154 409 -25 417
4574 417 -232 -74 43 82 82 -151 -70 -35 224 101 -227 -101 -50 -155 -21 20 23 -312 -338 -31 -22 -44 62 35 4
4599 4 47 0 -157 -65 -91 -140 224 5 -10 -39 -20 -17 33 -33 42 -32 -122 -193 -229 41 -155 -90 115 -181 109 -49 249
4626 249 -77 -197 29 258 100 18 -264 137 -93 53 -91 -35 -99 40 -35 -120 260 -4 -142 -91 40 9
4648 9 -333 -112 -5 55 -67 82 289 -109 -122 -155 -12 179 96 -11 25 -112 76 282 240 -118 137 175 69
4671 69 -1 -70 68 -58 -27 19 -137 -46 -68 -308 -113 -139 -249 34 -56 109 -182 -141 -276 -41 70 -73 -118 -203
4695 -203 -46 55 14 9 3 -7 -65 -99 -24 -18 -119 93 9 78 248 -196 176 -115 94 -42 197 54 62 268 98
4720 98 -69 -101 311 90 100 16 -239 -28 -101 100 -8 180 149 42 -279 -175 -57 -38 -100 -50 178 -51 -42 16
4744 16 -199 113 -26 -24 196 -30 -3 318 -4 38 -157 165 -1 84 -68 -216 -17 28 -13 4 168 -210 90
4767 90 182 -23 127 59 182 172 -146 15 -200 -17 102 315 328 -110 -58 18 117 -90 -201 -280 54 -40 -155
4790 -155 143 -20 -15 22 164 165 40 11 81 -110 154 -200 21 26 96 80 19 -57 222 -67 70 109 165 -132 -55
4815 -55 77 149 -65 3 176 -238 -97 -2 15 231 -265 52 -77 -201 -204 81 -123 106 -131 79 -145 129
4837 129 111 88 -45 96 133 -202 57 -128 -26 78 -234 230 14 191 -31 -130 50 -116 171 99 -119 -81
4859 -81 -100 21 18 121 -73 -46 -44 -305 160 332 134 -280 -10 256 -105 248 -106 11 -217 20 66 130 119
4882 119 -177 81 0 162 111 -141 41 -37 72 -16 -108 112 -15 -34 -126 -186 -339 51 8 327 -204 127 -119
4905 -119 23 106 78 145 -147 169 -206 73 -128 85 298 108 191 271 -71 78 -43 120 382 179 169 41
4927 41 65 -249 81 279 -3 -122 22 214 -56 136 -53 -170 212 70 -65 -35 86 -40 214 -101 -216
4948 -216 -38 -155 154 -4 -10 -16 16 -186 214 486 -108 104 181 -108 -68 36 -169 -82 -87 -182 -168 14 287 49
4972 49 -84 32 -59 -85 -31 -212 42 -52 -7 33 -20 -42 -78 -25 153 212 -44 316 -90 183 57 -43 159 234
4996 234 -83 93 -16 326 10 -268 -31 -147 -63 81 219 -9 -74 -133 57 56 91 -149 1 -25 10 20 198
5019 198 262 184 -96 149 -148 -6 138 91 104 -29 -73 66 -140 -52 43 -49 -2 141 268 -114 -39 98 139 82
5043 82 -71 156 123 -75 -249 -73 140 51 -16 -146 125 -65 -246 92 0 14 98 -154 -17 78 137 237 -160
5066 -160 -54 251 -94 395 -9 -140 -65 20 -36 50 3 -99 108 -15 28 -349 259 -99 49 58 11 -159 -320
5089 -320 -194 -183 -370 108 183 51 -154 91 -83 -253 116 -185 68 -15 -96 169 44 37 0 120 -40 -42 35
5112 35 -327 20 46 -171 34 157 -112 -61 -6 -54 99 -94 272 16 229 86 -133 -54 -243 71 -94 -178
5134 -178 36 -149 -161 -5 243 -301 201 49 -139 -126 -42 -36 -135 60 212 -169 -81 -165 90 75 -37 -36 5 149
5158 149 123 91 -34 -66 -137 191 -112 -87 -223 195 -104 -64 30 -11 -24 -106 141 -221 -60 99 -75 16 51 234
5182 234 -54 -287 -65 -178 -38 246 150 -109 2 29 93 138 1 -1 153 -21 265 -85 45 51 -138 -63 -173
5205 -173 -125 395 -4 -65 -39 -189 89 218 148 141 269 37 245 103 -162 -6 130 72 -205 127 62 -246 37
5228 37 -249 50 -168 -288 -39 -294 -111 36 -50 -13 -278 184 163 -11 273 -130 -131 21 53 -357 -277 -109 256
5251 256 -56 -176 -46 240 30 70 78 -219 -77 232 32 -28 173 4 -72 -65 -75 -168 -50 54 58 108 -103 -161
5275 -161 142 16 327 -67 59 -94 -64 187 -54 259 43 -80 -5 -194 -259 -57 42 99 108 157 7 -161 84
5298 84 105 197 139 146 -20 -38 -232 2 -223 143 -90 -27 -206 307 -64 -229 -335 197 66 13 76 -121 3
5321 3 -230 35 204 -104 328 5 54 11 -215 -19 -128 62 90 93 5 -41 -199 248 195 159 -43 167 -115 -155
5345 -155 14 -173 133 33 312 -37 -5 -75 -121 258 -141 -148 -28 155 29 -251 48 53 -53 60 20 186 112
5368 112 -55 -39 -57 141 -173 133 260 -241 -52 -259 124 -120 -28 -7 29 -131 -31 88 -53 2 -78 11 38
5391 38 -84 -129 213 -93 14 -51 -76 30 -109 -32 -147 80 76 -98 -12 -215 -102 -10 -119 -241 -183 -72 212
5414 212 -119 -97 31 -38 200 143 33 -69 -37 -236 -110 123 178 19 238 -33 168 115 159 192 80 134 -70
5437 -70 -32 43 -107 269 -106 44 29 -144 -89 -158 -40 -187 48 79 -21 -72 -16 97 279 143 158 126 319 136
5461 136 302 -121 146 228 -17 41 121 -9 -13 -153 52 146 236 85 -100 -203 -146 -304 85 26 -137 66 -260
5484 -260 -134 -5 167 -38 174 -79 -87 -182 -115 92 -74 38 -35 -71 50 146 22 -251 183 -31 -98 -51 -96
5507 -96 -77 113 81 105 -375 25 -129 -131 -31 79 26 -121 -81 40 140 131 -5 -73 -136 -10 -111 -116 74 15 -111
5532 -111 -97 -21 73 105 40 -23 102 -41 211 -80 28 -35 -68 13 -32 -40 -184 41 37 196 -28 1 -37 14 129 144
5558 144 -221 -55 -125 -193 47 -107 2 -92 197 2 -42 128 -405 -25 -111 -5 12 -30 71 -112 146 -48
5580 -48 -67 -316 58 180 -68 -140 -92 -154 109 -107 -237 -146 -261 144 -52 -25 -111 -252 -257 -11 160 288 183
5603 183 -8 -41 129 124 279 129 -47 41 87 -18 89 240 -107 -189 8 -55 -151 -62 -207 -8 86 30 90 -184
5627 -184 103 -200 -162 -184 84 129 6 422 124 -173 6 -43 -12 -110 26 -56 95 177 65 18 -156 -192 279
5650 279 -236 -102 -221 94 -53 -122 -20 82 -153 -61 199 -51 61 46 234 97 -82 -20 -152 165 145 -289
5672 -289 -7 -16 -98 135 98 257 41 -150 -143 -106 153 -228 105 268 20 45 82 -107 97 -379 187 -93 -42
5695 -42 -131 -7 72 -220 74 410 398 32 -145 -66 -164 -38 -266 60 -131 182 -29 -131 -92 -202 27 63 97
5718 97 -22 -186 -87 -86 -154 87 171 -19 -14 -97 -46 -300 23 42 201 193 124 -236 126 -188 -249 -257 -167 -199 213 -155
5744 -155 -60 74 111 -27 -197 303 -5 -220 226 -87 85 -152 113 61 74 -207 -339 -174 -286 192 1
5765 1 277 27 211 53 -12 115 -43 187 125 -61 -323 -118 143 -123 154 -14 27 -34 -71 -52 244 -208 -74
5788 -74 -151 -319 -7 -49 -42 0 33 -36 -107 -213 -2 -137 108 87 -112 166 12 -144 221 -37 -246 -18 251
5811 251 -13 -10 -196 15 103 165 166 -168 -131 -168 42 -120 92 281 -73 121 207 -76 190 -162 -122 175 232 -113
5835 -113 -28 315 178 210 182 -62 -299 -58 7 -280 72 -19 41 -52 27 129 -35 -36 -159 -126 142 -120 135 90
5859 90 54 76 111 -120 -286 -55 1 158 -7 -103 -124 80 58 -76 -67 -30 224 -83 172 92 84 -72 -134 -149 -58 -40
5885 -40 255 -223 0 -208 -158 -159 -152 -62 195 -8 -71 52 -163 227 4 204 336 99 151 118 -87 -53 65 140
5909 140 -96 -155 236 -114 -139 -264 98 -45 -6 177 -23 67 243 153 231 -96 105 154 -359 219 -16 71 -196
5932 -196 87 -218 7 -209 -228 155 122 -12 108 -144 139 -161 -205 -217 14 -17 4 39 170 -113 282 2
5954 2 98 153 -134 -16 -196 190 -75 71 -19 -74 -12 249 174 76 -23 -117 -236 18 125 -29 69 -80 -271 15
5978 15 -163 -91 -48 305 23 68 133 18 81 131 22 76 -10 -115 -147 -1 -24 -120 -57 -354 -118 60 -238 190
6002 190 -64 -78 -244 -72 180 -202 15 -369 -31 -53 143 -12 117 -62 61 -51 120 -196 52 361 -9
6023 -9 -77 -25 46 -155 -8 -162 -175 39 427 272 -140 72 -123 132 114 -34 87 303 37 35 157 86 207
6046 207 -30 39 221 -22 -133 -53 -30 -161 67 -94 42 299 5 16 30 -130 80 125 -34 31 3 -127 -24
6069 -24 -39 -53 -134 188 91 -195 -127 -62 212 -9 96 -58 -43 1 -56 370 -42 121 -22 -50 -19 76 -29 -5 -38
6094 -38 -191 18 79 -15 -95 -89 -214 -131 164 -163 44 -121 -23 64 -40 -110 -104 36 -1 -7 -282 -96 175 118 276
6119 276 190 47 138 32 81 -206 73 -134 115 107 -253 -121 131 -125 0 113 -52 -14 -201 -206 -58 45 168
6142 168 -53 -61 48 -2 114 26 112 -217 -126 180 209 234 -178 -152 -48 324 28 -42 -155 268 158 197 273 -17
6166 -17 63 95 67 -303 -106 -32 -104 52 31 87 -15 192 -52 -130 32 -94 -292 -99 67 110 -202 -99 -13 -139
6190 -139 44 -51 -48 -164 -162 -316 48 -61 115 63 -46 143 34 66 -166 98 -191 117 25 69 -69 55 73
6213 73 49 36 32 -56 209 28 203 -355 -83 153 33 -58 -139 5 96 -167 -171 119 10 83 13 94 137 -168 -107
6238 -107 -139 -133 97 -158 -150 -28 77 -45 194 126 -10 108 129 -93 -41 216 -75 -67 -68 -274 311 2 -141 46
6262 46 -175 162 126 -114 -95 71 -48 -68 -22 -8 11 -110 -365 -116 -120 54 31 -51 35 -274 187 190 209 276 73
6287 73 -79 136 110 78 -117 226 -114 -415 189 127 62 73 -122 160 -78 -58 71 168 -96 20 140 -1 82
6310 82 229 -37 199 366 -200 -96 -83 403 4 47 14 -321 -112 154 168 -192 -141 27 141 73 144 -154 -113
6333 -113 -1 -134 -281 -58 -6 -175 -173 30 9 -118 11 29 -81 -291 -87 -274 -71 -167 -108 -40 -58 53 208
6356 208 -173 281 -3 -83 -69 108 220 50 89 166 10 11 101 193 -8 -13 -63 132 229 97 27 -8 145 42 140
6381 140 -93 -6 -21 56 22 67 -87 -116 65 -148 -63 147 -32 43 184 27 28 18 280 123 255 -68 -129 -189
6405 -189 120 215 96 -100 -146 24 -314 -22 -22 -75 151 -16 272 -204 -84 107 7 39 289 -126 4 15
6427 15 -82 41 30 -43 -155 179 -93 156 94 -83 -2 -206 7 -121 15 -177 -104 -5 -100 296 265 -123 -150 112
6451 112 235 129 161 115 -183 212 -247 -196 -36 107 -113 -210 -205 67 -109 125 185 56 24 -135 -182 -146 -286
6474 -286 125 -136 216 -141 -195 26 34 -244 110 -193 43 -41 -20 -208 322 184 75 -34 -217 -114 -104 -222
6496 -222 55 -37 -94 -170 -29 -92 -67 97 -135 -26 87 -82 -7 244 -175 74 -177 -321 37 168 -117 359
6518 359 62 106 -76 75 183 -197 136 -40 102 -128 -29 -3 41 -150 92 -300 225 103 68 -45 62 36
6540 36 -210 -11 94 298 91 -25 99 286 -189 -132 -219 272 -103 169 120 -283 45 -213 163 45 10 78
6562 78 -137 210 -204 36 -8 101 345 -25 14 -159 34 -22 57 -139 116 111 94 -84 3 229 -119 148 -41
6585 -41 -137 -212 -194 -58 51 -116 -324 -53 57 23 -120 169 70 -356 177 -260 -180 -106 -27 204 134 -127 -358
6608 -358 -62 -98 -51 25 -333 183 177 -4 228 137 -288 -160 -15 -288 -191 -310 -199 -161 -218 180 20 -212 -326
6631 -326 -164 44 -89 -193 131 144 -285 168 -32 -2 98 -124 157 -46 -133 -22 -50 -115 -28 32 165 26
6653 26 -257 132 -55 -95 28 101 99 -109 204 -47 40 -37 -301 12 45 146 139 -58 -43 17 252 -197 -143 -374
6677 -374 171 -135 121 -234 -208 102 10 -19 -87 101 -184 126 20 7 83 -36 -230 24 177 65 19 -83
6699 -83 -38 151 166 -74 -149 -111 -84 -93 43 -132 -153 -90 -301 122 0 -26 232 290 -136 -56 -135 15 202 141 207
6724 207 29 209 44 -8 225 -189 43 -94 98 7 88 121 82 66 -214 -145 65 204 -57 68 33 -95 -113
6747 -113 -81 -112 7 -14 -10 -159 -71 -179 -26 224 343 -184 92 98 -115 20 116 129 -84 -15 50 -345 -64 -82
6771 -82 175 -126 -169 -89 -36 -73 -52 -119 -67 87 -42 91 59 173 -24 -22 214 -41 35 -59 -52 185 -175 10 -141
6796 -141 -7 179 -181 164 -11 99 74 69 290 62 -69 -23 63 172 5 22 -224 -169 -48 -65 -6 -22 -47 -186
6820 -186 -171 44 -149 -98 192 -93 85 -39 -102 87 416 -47 17 148 7 40 425 -182 -126 -9 11 30 157
6843 157 1 -41 -115 -98 -78 -32 166 -405 -16 -25 4 -130 -46 163 -372 -172 -107 -19 208 -18 -33 32 38 -70 -81
6868 -81 81 174 -55 -24 -174 -61 -81 76 -89 -32 43 77 199 45 -225 116 -37 3 -2 -140 -24 199 -141
6891 -141 -14 148 288 36 43 123 115 118 161 -119 30 -50 100 -86 115 -20 67 -41 -88 -47 55 20 -184 -48
6915 -48 -94 -241 124 -19 -1 39 -36 261 -6 -170 -277 123 -5 -18 14 -69 89 -141 22 91 36 -12 -113 -58
6939 -58 96 -93 71 3 -35 201 19 87 -72 119 123 139 -21 -31 242 -182 -23 -39 -127 -106 141 34 -174 -2
6963 -2 -32 -315 19 2 104 155 207 -106 191 -18 101 80 -264 -182 163 283 -11 -47 -212 -77 -82 278 101 203
6987 203 -11 170 -27 -69 -411 -27 186 140 102 48 -78 -145 -383 49 59 16 124 71 68 -78 -115 -356 113 54
7011 54 188 47 16 3 100 365 119 138 87 -16 -300 33 11 -22 -92 -57 35 61 -97 -113 113 -64 87 -344
7035 -344 210 217 80 -212 157 -50 97 -66 12 0 196 53 323 -30 119 -38 -194 -51 -61 4 -134 142
7057 142 55 -73 -119 -39 171 8 181 -13 72 -106 -123 -3 -65 100 -57 57 234 -142 52 -95 -198 -208
7079 -208 170 -68 6 -139 75 171 122 74 30 -158 -297 -31 121 61 -58 -118 174 27 -51 -154 -39 60 -49
7102 -49 73 -365 -142 76 -293 -137 24 -130 -72 3 98 132 -89 -193 10 -94 -77 17 -83 -42 -149 134 135
7125 135 13 7 148 -132 -57 114 13 -331 -5 -112 -106 204 -8 -68 143 84 -88 9 -51 150 -61 -146 93
7148 93 1 -134 -19 203 52 -112 -71 72 39 136 -71 -99 88 -221 53 100 61 93 55 -231 -134 -60 -92 126
7172 126 110 -14 275 -138 -196 -345 -122 108 -3 195 66 221 103 -192 -33 -103 -53 88 -83 1 94 89 23
7195 23 -124 62 21 -59 -214 153 -215 -28 210 -93 -15 21 116 59 -95 20 -86 300 61 221 -91 -58 0
7218 0 173 -84 -109 -348 -195 221 31 -34 -59 -91 -116 85 -75 10 49 12 -120 87 245 53 -77 230 -31
7241 -31 -159 127 -5 -63 152 254 -192 -87 154 21 181 -25 81 -251 -245 203 25 -187 88 91 218 92
7263 92 -12 277 -255 -30 65 -187 -95 -118 202 -78 14 81 114 -15 -102 95 180 104 -237 -39 -24 -120 -178 180
7287 180 295 108 31 234 217 -229 -7 -79 -15 155 -19 250 -349 -110 100 -103 -153 48 -55 -74 175 73
7309 73 -201 -139 51 -7 35 -6 -2 -148 63 167 -166 -17 261 2 -104 102 38 -70 15 72 -108 71 -269
7332 -269 -30 -136 74 -90 42 54 -8 164 48 -272 -123 -65 -257 133 52 18 230 97 29 26 -117 -141 -183
7355 -183 262 104 -142 50 154 -343 -97 61 238 -144 -151 -36 52 49 46 14 -39 214 75 -59 38 -72 229
7378 229 190 -304 -213 -181 3 226 41 -250 -95 -142 322 18 -3 -219 46 70 -52 41 2 88 -104 207 -34
7401 -34 131 -128 75 132 282 -123 -95 -132 -320 -76 34 -222 -69 -146 55 -28 -305 65 -13 -23 -36 -22 -31 -158
7425 -158 193 25 117 105 -62 -145 -150 -276 -178 -46 -192 225 -101 162 -121 -168 -28 -11 235 -22 -189 110 -62
7448 -62 345 76 135 93 -185 24 -14 -113 -185 -210 -194 149 -51 -307 269 45 28 73 -222 -258 -161 -232 124 -227
7472 -227 128 4 20 -90 -155 325 121 -125 -5 -41 -16 -285 153 82 -62 -232 -152 252 -14 -99 -35 -90 -176
7495 -176 212 -185 -264 -84 -135 -27 -87 61 -31 -32 -64 -52 132 -68 82 104 -140 -423 48 136 -30 49 4 -11
7519 -11 -69 104 -55 -38 139 125 198 22 200 97 -76 -190 103 -162 -119 -55 -275 249 72 206 10 -79 126
7542 126 50 39 157 -54 -11 189 -143 -221 76 -258 -19 16 56 -52 -68 -21 112 -26 -466 -285 -51 133 -99
7565 -99 -74 140 122 88 -159 203 -35 90 71 255 95 168 -56 -87 218 -108 146 -182 -204 165 -116 100 -148
7588 -148 39 -141 35 -53 3 201 -168 175 -9 3 132 29 244 272 -42 14 -88 115 110 -335 -132 -214 49
7611 49 121 -115 -105 -200 -78 -67 -32 -3 -276 -169 176 163 -291 51 150 -163 201 60 87 36 -43 65 -141 254
7635 254 -182 -170 -157 -68 -78 -16 -31 -148 163 -118 -25 211 150 10 -39 307 138 3 -76 159 44 -33 -4 -8 -54
7660 -54 119 -85 -165 217 19 23 60 -74 203 -98 36 16 -184 170 -123 63 118 11 -71 148 -13 110 -327
7683 -327 205 122 -60 -86 170 153 133 -91 221 137 -237 -49 114 -157 -125 4 -73 25 -255 44 221 121 281
7706 281 117 166 -43 -183 275 48 155 -148 -167 159 -30 -67 56 197 19 190 -79 -65 -147 37 -24 86
7728 86 -57 19 137 108 -57 -58 -186 14 -105 -27 153 -157 391 -20 39 211 -45 155 4 -25 177 -27 -137
7751 -137 -41 -25 -210 75 -25 -24 204 -70 -7 -199 72 152 54 -110 -83 26 157 67 -86 -22 124 -264 88
7774 88 -139 -78 168 -125 96 -168 157 23 -75 66 -210 -116 163 121 72 -129 -189 13 -78 -66 -102 234 -141
7797 -141 -339 -30 -354 141 -400 113 -214 234 3 89 -295 -247 -59 187 177 139 -19 8 65 52 -122 263
7819 263 -178 -222 -49 174 44 -49 -92 335 131 18 209 182 -171 -103 44 -73 -123 5 53 -110 182 54
7841 54 27 0 36 -143 230 -92 -52 -35 -9 133 145 -98 58 -16 181 -50 -4 -140 127 1 -85 -25 -1 84 -205
7866 -205 263 -156 -72 64 65 22 101 88 -190 -92 -45 -26 -32 70 237 -16 215 -163 62 -350 -45 -37 108 -10
7890 -10 99 55 -138 -211 251 220 -211 59 170 -217 38 13 -84 37 -47 -130 -59 36 -28 -66 -34 286 15 -83 -18
7915 -18 68 -149 -59 122 28 151 -154 -75 245 -151 -39 256 -207 -85 -207 -50 204 73 177 -13 -198 -47
7937 -47 35 -75 -38 -24 -84 232 -70 203 -16 22 -67 -254 -121 83 301 148 -183 -73 36 66 85 135 -11
7960 -11 -2 119 20 -150 171 86 -125 -359 112 20 32 108 68 -131 194 -233 158 3 70 247 -28 -102 -81 -31
7984 -31 -99 15 47 -104 -218 -104 -137 28 -82 61 197 -40 344 -82 -138 80 -68 -45 228 -78 -102 -42 45
8007 45 139 134 16 -181 -194 275 -76 345 5 132 -45 201 -438 -154 -91 -123 87 -111 198 18 152 -100
8029 -100 110 120 -12 -65 -77 -3 -17 -49 127 -29 -93 293 -100 -273 -80 -246 -144 195 74 106 93 -72 -102
8052 -102 59 47 -49 -153 -200 -42 105 12 12 -122 -8 41 238 -231 73 59 -115 -134 175 -247 36 -199 194
8075 194 60 15 304 220 38 80 66 -159 158 -200 139 -11 -218 -117 226 -202 130 164 -102 -207 -28 -90
8097 -90 -109 -365 184 109 -209 292 173 -56 -106 -453 -198 -42 -276 -13 -342 90 285 12 -205 -287 -116 13
8119 13 -87 -104 13 287 -57 31 261 84 -29 -112 62 -217 -50 58 119 94 153 51 39 207 181 3 43
8142 43 -216 -5 -39 57 223 -133 43 -56 -99 -81 133 -130 -133 -80 4 -174 -90 -30 -22 -356 -116 205 274 18 45
8167 45 -87 -118 -110 -166 202 -221 -3 5 115 100 -86 21 208 -286 -220 91 -42 -132 126 -232 106 20 -320 -2
8191b
##END NTUPLES=NMR FID
##END=
