##TITLE=1H_DE-80H_X3
 200.13MHz, d2o
 8 sc
 
 19ns.26.2.2025
##JCAMPDX= 6.0         $$ Bruker NMR JCAMP-DX V2.0
##DATA TYPE= NMR FID
##DATA CLASS= NTUPLES
##ORIGIN= UXNMR, Bruker Analytische Messtechnik GmbH
##OWNER= pz
$$ XWIN-NMR		Version 3.5
$$ Wed Apr 30 10:44:30 2025 Russian Standard Time (UT+4h)  Yarkov@DPX200
##.OBSERVE FREQUENCY= 200.1313
##.OBSERVE NUCLEUS= ^1H
##.DELAY= (6, 6)
##.ACQUISITION MODE= SIMULTANEOUS
##.ACQUISITION SCHEME= undefined
##.AVERAGES= 8
##.DIGITISER RES= 18
##SPECTROMETER/DATA SYSTEM= spect
##.PULSE SEQUENCE= zg30
##.SOLVENT NAME= CDCl3
##.SHIFT REFERENCE= (INTERNAL, CDCl3, 0, 14.3821)
##AUDIT TRAIL= $$ (NUMBER, WHEN, WHO, WHERE, WHAT)
$$ ##TITLE= Audit trail, XWIN-NMR		Version 3.5
$$ ##JCAMPDX= 5.01
$$ ##ORIGIN= Bruker BioSpin GmbH
$$ ##OWNER= Yarkov
$$ C:/Bruker/XWIN-NMR/data/yarkov2/nmr/H-C/1/audita.txt
$$ ##AUDIT TRAIL=  $$ (NUMBER, WHEN, WHO, WHERE, WHAT)
(   1,<2025-04-30 10:41:47.67 +0400>,<Yarkov>,<DPX200>,
      <created by zg, POWCHK disabled, PULCHK disabled
       configuration hash MD5:
       00 E9 B6 7A A2 85 ED C7 34 08 36 98 17 FE 4E 26
       data hash MD5: 16K
       12 E1 20 94 D6 17 2E 22 DD 5D 2B EA AE F3 AC 5D>)
$$ ##END=
$$ 
$$ hash MD5
$$ A6 47 14 E5 C2 9F F5 3C 15 5A 84 EE 2B 2C 6C B2
##$RELAX= 
##$RELAX= 
##$RELAX= 
##$RELAX= 
##$RELAX= 
##$RELAX= 
$$ Bruker specific parameters
$$ --------------------------
##$DU= <C:/Bruker/XWIN-NMR>
##$EXPNO= 1
##$NAME= <H-C>
##$PROCNO= 1
##$TYPE= <nmr>
##$USER= <yarkov2>
##$AMP= (0..31)
100 100 100 100 100 100 100 100 100 100 100 100 100 100 100 100 100 100 
100 100 100 100 100 100 100 100 100 100 100 100 100 100 
##$AQSEQ= 0
##$AQ_mod= 1
##$AUNM= <au_zg>
##$AUTOPOS= <>
##$BF1= 200.13
##$BF2= 200.13
##$BF3= 200.13
##$BF4= 200.13
##$BF5= 200.13
##$BF6= 200.13
##$BF7= 200.13
##$BF8= 200.13
##$BYTORDA= 1
##$CFDGTYP= 0
##$CFRGTYP= 5
##$CHEMSTR= <none>
##$CNST= (0..31)
1 1 145 1 1 1 1 1 1 1 1 1 1 1 1 1 1 1 1 1 1 1 1 1 1 1 1 1 1 1 1 1 
##$CPDPRG= <>
##$CPDPRG1= <>
##$CPDPRG2= <>
##$CPDPRG3= <>
##$CPDPRG4= <mlev>
##$CPDPRG5= <mlev>
##$CPDPRG6= <mlev>
##$CPDPRG7= <mlev>
##$CPDPRG8= <mlev>
##$CPDPRGB= <>
##$CPDPRGT= <>
##$D= (0..31)
0 0.7 0 0 0 0 0 0 0 0 0 0.03 0 0 0 0 0 0 0 0 0 0 0 0 0 0 0 0 0 0 0 0 
##$DATE= 1745995307
##$DBL= (0..7)
120 120 120 120 120 120 120 120 
##$DBP= (0..7)
150 150 150 150 150 150 150 150 
##$DBP07= 0
##$DBPNAM0= <>
##$DBPNAM1= <>
##$DBPNAM2= <>
##$DBPNAM3= <>
##$DBPNAM4= <>
##$DBPNAM5= <>
##$DBPNAM6= <>
##$DBPNAM7= <>
##$DBPOAL= (0..7)
0.5 0.5 0.5 0.5 0.5 0.5 0.5 0.5 
##$DBPOFFS= (0..7)
0 0 0 0 0 0 0 0 
##$DE= 6
##$DECBNUC= <off>
##$DECIM= 32
##$DECNUC= <off>
##$DECSTAT= 4
##$DIGMOD= 1
##$DIGTYP= 9
##$DL= (0..7)
0 120 120 120 120 120 120 120 
##$DP= (0..7)
150 150 150 150 150 150 150 150 
##$DP07= 0
##$DPNAME0= <>
##$DPNAME1= <>
##$DPNAME2= <>
##$DPNAME3= <>
##$DPNAME4= <>
##$DPNAME5= <>
##$DPNAME6= <>
##$DPNAME7= <>
##$DPOAL= (0..7)
0.5 0.5 0.5 0.5 0.5 0.5 0.5 0.5 
##$DPOFFS= (0..7)
0 0 0 0 0 0 0 0 
##$DQDMODE= 0
##$DR= 18
##$DS= 0
$$ [...]
##$SUBNAM2= <"">
##$SUBNAM3= <"">
##$SUBNAM4= <"">
##$SUBNAM5= <"">
##$SUBNAM6= <"">
##$SUBNAM7= <"">
##$SUBNAM8= <"">
##$SUBNAM9= <"">
##$SW= 18.0517328524113
##$SWIBOX= (0..15)
0 0 2 0 0 0 0 0 0 0 0 0 0 0 0 0 
##$SW_h= 3612.71676300578
##$TD= 16384
##$TD0= 1
##$TE= 0
##$TE2= 300
##$TE3= 300
##$TEG= 300
##$TL= (0..7)
0 120 120 120 120 120 120 120 
##$TP= (0..7)
150 150 150 150 150 150 150 150 
##$TP07= 0
##$TPNAME0= <>
##$TPNAME1= <>
##$TPNAME2= <>
##$TPNAME3= <>
##$TPNAME4= <>
##$TPNAME5= <>
##$TPNAME6= <>
##$TPNAME7= <>
##$TPOAL= (0..7)
0.5 0.5 0.5 0.5 0.5 0.5 0.5 0.5 
##$TPOFFS= (0..7)
0 0 0 0 0 0 0 0 
##$TUNHIN= 0
##$TUNHOUT= 0
##$TUNXOUT= 0
##$USERA1= <user>
##$USERA2= <user>
##$USERA3= <user>
##$USERA4= <user>
##$USERA5= <user>
##$V9= 5
##$VALIST= <valist>
##$VCLIST= <CCCCCCCCCCCCCCC>
##$VD= 0
##$VDLIST= <DDDDDDDDDDDDDDD>
##$VPLIST= <PPPPPPPPPPPPPPP>
##$VTLIST= <TTTTTTTTTTTTTTT>
##$WBST= 1024
##$WBSW= 4
##$XGAIN= (0..3)
0 0 0 0 
##$XL= 0
##$YL= 0
##$YMAX_a= 65765
##$YMIN_a= -86268
##$ZGOPTNS= <>
##$ZL1= 120
##$ZL2= 120
##$ZL3= 120
##$ZL4= 120
##$ABSF1= 10
##$ABSF2= 0
##$ABSG= 5
##$ABSL= 3
##$ALPHA= 0
##$AQORDER= 0
##$ASSFAC= 0
##$ASSFACI= 0
##$ASSFACX= 0
##$ASSWID= 0
##$AUNMP= <proc_1d>
##$AZFE= 0.1
##$AZFW= 0.1
##$BCFW= 1
##$BC_mod= 2
##$BYTORDP= 1
##$COROFFS= 0
##$CY= 83.5205535888672
##$DATMOD= 1
##$DC= 2
##$DFILT= <>
##$DTYPP= 0
##$F1P= 10.8118882576601
##$F2P= -7.23987719738617
##$FCOR= 0.5
##$FTSIZE= 0
##$FT_mod= 4
##$GAMMA= 1
##$GB= 0.15
##$INTBC= 1
##$INTSCL= 1
##$ISEN= 128
##$LB= 0.25
##$LEV0= 0
##$LPBIN= 0
##$MAXI= 10000
##$MC2= 0
##$MEAN= 0
##$ME_mod= 0
##$MI= 1.114404
##$NCOEF= 0
##$NC_proc= 0
##$NLEV= 6
##$NOISF1= 3.799351
##$NOISF2= 2.8
##$NSP= 1
##$NTH_PI= 0
##$NZP= 0
##$OFFSET= 14.38212
##$PC= 1
##$PHC0= -1186.251
##$PHC1= 4.933743
##$PH_mod= 1
##$PKNL= yes
##$PPARMOD= 0
##$PSCAL= 0
##$PSIGN= 0
##$REVERSE= no
##$SF= 200.129724274929
##$SI= 16384
##$SIGF1= 3
##$SIGF2= 2
##$SINO= 400
##$SIOLD= 16384
##$SREGLST= <1H.CDCl3>
##$SSB= 0
##$STSI= 0
##$STSR= 0
##$SW_p= 3205.1282051282
##$SYMM= 0
##$S_DEV= 0
##$TDeff= 0
##$TDoff= 0
##$TI= <>
##$TILT= no
##$TM1= 0
##$TM2= 0
##$TOPLEV= 0
##$USERP1= <user>
##$USERP2= <user>
##$USERP3= <user>
##$USERP4= <user>
##$USERP5= <user>
##$WDW= 1
##$XDIM= 8192
##$YMAX_p= 0
##$YMIN_p= 0
$$ End of Bruker specific parameters
$$ ---------------------------------
##NTUPLES= NMR FID
##VAR_NAME=  TIME,          FID/REAL,        FID/IMAG
##SYMBOL=    X,             R,               I
##VAR_TYPE=  INDEPENDENT,   DEPENDENT,       DEPENDENT
##VAR_FORM=  AFFN,          ASDF,            ASDF
##VAR_DIM=   8192,          8192,            8192
##UNITS=     SECONDS,       ARBITRARY UNITS, ARBITRARY UNITS
##FACTOR=    0.0002768,     1,               1
##FIRST=     0,             0,               0
##LAST=      2.2672688,     0,               0
##MIN=       0,             -86268,          0
##MAX=       2.2672688,     65765,           0
$$ Real data points
##PAGE= N=1
##DATA TABLE= (X++(R..R)), XYDATA
$$ [...]
1345B68n47K62K21l44K71J56l84L28m3n72M05q4k1K93j90j51L18n79L11J35m30
1366c77M94q4m03O18l06j29L59l08L70J46m53K12j30l17M36j61k18K92q3j56M21
1387B23n08J97J79l06L27p7k11N51m94j13M80k68J48J47n25L09J58m49J80o4m40
1408e56O57l20m2M83k06k9L66n64M79P6m26L77j13l66N43k57l04M41k99k1J98
1429A17m02L63p4l29L35N2m14N22j56k26M96l15L9J47j84J77M4m46M00m2l64O24
1451C64m26k83N11k58n4O9j56K73J38k58L33j76j25O10n18n9N48n90J99l5m02
1472b95L22j4n02O49l19O5L16k60JJ55k47J22J89k65K74o9k67M00k79l8M27n68
1494b03p1N62m84J20K65m39K73J43m09L45k94L2M84m19R5K27k07J89l9k24K16
$$ y = [268, -279, -17, 204, -140, 131, 287, -97, 231, 188, -384, 21, -63, -84, 209, 19, -132, 186, -393, -82, 53, -377, 117, 33, -370, 248, -58, -187, 172, -136, 234, 380, -73, 139, 9, -308, 128, -33, -251, 41, -42, -198, 223, -285, -88, 91, -215, 112, 35, -176, 375, -119, -232, 248, -20, 128, 275, -250, 59, 217, -232, -52, -116, -556, 101, -219, -261, 222, 16, -13, 353, -211, 268, 344, -82, 295, 182, -184, 359, 102, -202, 239, -60, -81, 117, -285, 78, 4, -325, 10, 62, -352, 170, 14, -212, 284, -31, 8, 155, -29, 148, 192, -254, 146, 104, -260, 364, -62, -345, 166, -92, -146, -77, -233, 40, 178, -80, 253, 77, -48, 562, 44, -15, 533, -57, 142, 107, -295, 27, 13, -489, 160, -159, -94, 222, -38, -37, 118, -129, -7, 182, -83, 191, 122, -145, 255, -24, -62, 365, -203, -274, 288, -196, -76, 189, -250, 23, 166, -243, 102, -192, -160, 324, -95, 0, 227, 20, 209, 170, -54, 162]
1515A62k9l44K58k12K5K38l77M9M16l14J55rj15M30l06k6L30m48K32K03m86J90
1537B2K84n11L12q2l59M53k86J6J60j73J22K27l81K19K73n08K85J40l26L17j38
1558F6j22R6o5m2P9n21M98R5l20L57l5j20N7l0j56J75n8L09Q1m43K80P0l94K11
1582F8l1j97K14l51M5J49j06J51J28q1J31j97k5J97J2o5L53l77j2L47n26K88j78
1605f3j34J85J68m45M01n1l77M50l48O0M43m76L89j08j38K83j29l31N50k52k50
1626a73L76k54J7l7j35J36M4l03M15o7k69L51m0j78L26k41J31J70l40K93Lk55
1648c0R7q0k85M48l52q2M51m28n4M03l65M24k7j83K56j06j64M10k87r0K08j66
1670bK2J48k71J14M8k16M21l16j34K84j06j80L64j43q2L19k96k2L7q0K29p8j57
$$ y = [162, 133, -211, 47, -165, -140, 98, -279, -230, 186, -128, 27, 18, -97, 333, 27, 1, 331, -117, 115, 318, -168, 22, 306, -205, 107, 25, -334, 119, -167, -151, 9, -164, -42, 185, -196, 23, 296, -212, 73, 213, -113, 204, 66, -56, 40, -25, -67, 12, -509, -11, 84, -236, 121, 86, -34, 23, -7, -163, 12, -46, 263, 344, -99, 181, 251, -143, 68, 37, -160, 54, -297, -252, -103, -209, -58, 70, -11, 120, -77, -102, 95, 107, 42, 395, 18, 6, 353, -173, 115, -63, -197, -12, 156, -289, 112, 61, -316, 134, -214, -154, 289, -187, 202, 94, -44, 239, 110, -221, 329, 77, -173, 203, -51, -34, -71, -206, -70, -26, -329, 86, 19, -250, 101, 61, -117, 209, -32, 99, 269, -71, 222, 225, -30, 67, -13, -298, 150, -202, -284, 167, -261, -315, 88, -277, 147, 120, -63, 193, 87, -77, 333, 46, -44, 164, -2, 20, 168, -103, 11, 59, -157, 264, -52, -186, 98, -8, -188, 176, 33, -49, 270, -26, -48, -11, -91, 138, 60, -97]
1693i7K02k07r8K78l86K23J28j63j14K39p6L41k25j69L07k37K45K8j92R9J11k44
1715gJ32n5k13K07j84k0J43j00k0J69k36J19J50k84L96k51R3R0r2j5K43l16M3
1738hJ67l64K73n5nOm8j9N2l01K22J60k17J94q5n4K89K49m73O6N1j23J25k24J93
1763G1J25m07Q5J96j82J19M8J6r6J05j18R3l1J40Rj76J70j5l00K58j8j99J14j18
1787a11Q3J16k18KJ12l8l3K63m30M01O3m40L22n8P5Q2l51J77R2k61J73k0k00K03
1811Dj52o3K61r3oJ69j27J29J15k10kN9j58K21n4r6K59m55P8J98k25O8R0r2J46
1836F4j92L4K70j71k49M71k77J78nk48K8O2M6J77k27k5P9k76K4K37j22J9K67m83
1860c19L33J3j23J96k42K03J58l9k75J74k12R4J04m7J03K4k90J17m4k20N16l05
$$ y = [-97, 105, -102, -200, 78, -308, -85, 43, -120, -234, 5, -71, 270, 45, -124, 183, -54, 191, 219, 27, 126, 237, -7, 125, 70, -143, 64, -120, -140, 3, -97, -117, 52, -184, -65, 85, -199, 197, -54, 39, 129, 37, 22, 265, -51, -8, 159, -205, 68, 13, 8, 14, -34, -53, -1, -302, -80, 80, -137, 57, -28, -82, 207, 456, -17, 49, 100, -23, 102, -122, 71, 196, -211, -126, 70, -112, 7, 55, 71, -25, 80, -38, 55, 24, 164, 173, -3, 167, 152, -148, 110, 92, -107, 7, -111, -28, 88, -130, -128, -16, -54, -87, 176, -254, 147, 210, -230, 92, 34, 109, 191, -160, 17, 109, -152, 21, 1, -199, 4, -148, -211, 50, -43, -49, 120, -7, 122, 237, 27, 25, 84, -74, 147, 93, -3, 256, -199, -121, 77, -148, -80, 10, -82, 64, -128, -94, 176, 5, -244, 227, -50, 128, 123, -125, -97, -35, 11, 188, -39, -64, 15, -261, -237, 0, -122, -103, 164, -319, 14, 27, -96, 100, -142, 61, 219, 180, -95, 79, -133, -39, 65, 18, 121, 145, -145, -28, -72, -292, 224, -81]
1882h1o3L89l75K75Q4l40K64k53J35J32r9K9N4j14j94L74l61K59q8k25K89j06
1904a5j89J82J32k86L08j21j40K20r1N6P0m3p1M5q2J15n3k9o8j11o6K54k00K23
1928D0O3k47L55j7j54J5J7j50K11j05r6K80k05J3p3j5j0R3k28K95j77O9J61j62
1952b7L6J67k19K26j5r4Q4j2j46J58l4j59L8k8Pk6n6J60j82lQ0M4J23ll41K50
1978B8L2k05J08L7N6Ol1q5J26p4O6r9j05J43k14l9L35J3k60J10K02r3J19k46O1
2003iK35k62L3P7j6J2j22k27J84J56j44j28J55l1J59N9k89J75j69K30j7j31J77
2026A07k19jL42j50j20J47k08J37o4N2J98l57J00K46j18j82J73k02r1M70k95J36
2048A01o3r8J67j28M5k6j55J50J13k36K14j00j2m4Q3q3K9J41j34J32j5k53L00
$$ y = [-81, -144, 245, -130, 145, 229, -111, 153, -100, 35, 167, 68, 97, 151, 37, -157, 217, -144, 115, 27, -198, 91, -15, -204, -22, 110, -176, 132, 11, -129, 91, 0, 56, 126, 83, 12, 57, -25, 90, 37, 8, -60, -171, -237, 17, -183, 40, 103, -144, 211, 194, 40, 55, 72, -78, 133, 28, -68, 212, 7, 20, -53, -68, -78, 15, -213, 82, -95, -26, 135, -27, 9, 176, -43, 183, 168, 74, 158, 146, 0, 158, 124, -35, 3, -25, -18, -44, -100, 60, -122, -125, -45, -1, 122, 119, -222, 28, 60, -145, -37, 0, 56, 62, 31, -54, 72, -2, 64, -35, -140, 3, -211, -250, 85, 98, -162, -52, 150, 57, 176, -70, -9, 226, -36, -3, 74, 58, 70, -52, -279, -95, 61, -83, -211, -56, -87, 72, 131, -158, 17, -152, 78, 61, -70, 107, -112, -113, 229, 79, -41, 106, -102, 35, -29, 23, 221, -136, -36, 210, 92, -90, 83, -119, -210, 260, -35, 101, 38, -60, 107, -21, 24, -2, -157, -7, 106, -130, 84, -16, -28, -72, 11, -72, -43, 98, -36, 96, 81, -172, 128]
2071A28j62J0L26l24J6j8j71L66r5j51J31J7j23O0j71kL22k16J11Kj81J58J56
2094A89k18K6Q0n5N9r2m3Q7k45J48q7J51K04j65k42K33j22N8J68j43K13p5j39
2117a0Q7k09J59m8j14J70K8j44q5K73j87R9j40j0J74j2o1J86j37n5J66k51K27
2140A06q1j30K81k28j00J79q9mJ47j43J67P1j77K1K07l53K41p9j49K67j61K2R
2163B4k5N1J04n08K47J08k81L23K3p4j7J03j08r0J27l0O1n5J2o5M3K9O4q8l4J06
2189E0p0j9Jj60L01j95M8J77k48M7R4k30L54m3k47L00l2p1j2j41J09J00k04L25
2213B34l05m7N1P4p0K74l19K81R0m29L23N5k39J45K1k77K83j67j35J97j24l7J85
2236F4k10R1N7j27J20K6q0L22l07N1J79k43NR8p3J5J89j87Q6o1K9r2L4j29J25
$$ y = [128, -34, -24, 302, -22, -6, -24, -195, 171, 76, -75, 56, 73, -50, 10, -161, -163, 159, -57, 54, 56, -125, 33, 189, -29, -3, 77, 22, 81, -11, -54, 33, -212, -64, -151, 0, 204, 39, -203, 30, -92, -34, 134, -9, 204, 129, -10, 77, -132, 27, -21, -135, 35, 63, -81, -166, 107, -80, 19, -121, -131, 43, 31, -30, 156, 19, -36, 130, -121, 106, 25, -105, 176, -52, -152, 27, -62, -66, 81, -62, 105, 176, -1, 20, 227, -126, 115, 36, -113, 154, -7, 15, 24, -1, 50, 154, -354, -107, 1, -280, 43, 66, -8, -25, 78, -30, -120, 7, -23, 38, -17, -5, -70, -27, 2, 66, -22, -56, 50, -20, -39, -38, -198, 103, -92, -44, 133, -115, -68, 26, -204, 150, 107, -140, 160, 128, 57, 45, -96, 13, 113, -91, 234, -71, -118, -67, 7, -63, 211, -108, 173, 263, -166, 157, 212, -27, 118, 139, -138, 145, -22, -157, 40, -84, -121, 64, -146, -55, 2, -125, -5, 21, -59, 263, -44, 7, 186, -57, -52, 46, -27, -12, 177, -10, 76, 15, 44, -48, -14, -143, -18]
2261a8j31J83Pj57Q3J24k9J11j62o6J1J26M6j31m9K9Oj89K74j96P2J09oo4L5j57
2287a39K39Pj49L3J05l23J74n5L2J83q3K0l0k82L74j07j94J14J9o9J15p2Q9J50
2311A51j16k9P1j30J29o2p4K29J9k34J08q5RO2r7k7J21l7J9n9j15J30O8q0J9N6
2337D6j00N4j8J7p9P6J98k99P8n7J42q2m4J09N4M5k35J8R7m2q5J34N0Kl8j38Q5
2364a2Q0l4o8M9M5R6l33K60K7j91K01j82Q6P5j60Q2P1j42J05L4k62j7L80k63K24
2389A51j78K7m1m2J63N3j10j05J19j89L72l33J29P7j15J9J49r2j38O6j19J16P2
2412E1j11J65k6k81K98j19l6L01k91k6J57k54J56R1j31N3J11p4NN4l11K00r3J52
2436D1r2j28J91o9j79J23J06j05J21J41j94K22j39j59J18k39K41P6m2n9j98J44
$$ y = [-18, -149, 34, 41, -116, -33, 91, 62, 173, 11, -55, -44, 82, 128, -3, -52, -23, -17, -206, 68, -128, -56, 53, 47, -17, 18, -139, 100, 107, -42, -9, 96, -227, -53, -108, -76, 107, 24, 44, 14, -268, 106, -1, -195, -81, -62, -131, -16, -88, 1, 151, 35, 6, 77, -53, 76, 14, -60, 169, 188, -46, 62, -23, -14, 48, -49, -76, 45, 8, 27, -32, -147, -17, 51, -29, -10, 46, -54, 0, -18, -1, -80, -4, 194, -105, -27, -84, 58, -24, -68, 41, 95, 140, -95, -77, 20, -22, -107, 27, 77, 79, 41, -97, -12, 68, 34, -34, 15, 60, 156, -177, 83, 110, -81, 120, -62, 24, 99, -61, 21, 92, -50, 55, 89, -173, -190, 190, -73, 151, -27, 0, -41, -83, 80, 133, 23, -82, 37, -152, 220, -113, 16, 93, -22, -3, 146, 54, -84, -18, -137, -21, 51, -60, 105, 79, -202, 96, -23, -59, 242, -49, -75, 82, -172, -16, 75, -56, -3, 108, 34, 39, 93, -218, -18, -111, 41, -51, -179, 12, -57, -236, -113, -7, -112, 9, 150, -44, 178, 39, -120, -2, -241, 0, 76, 34, -25, -223, -79]
2458g9K41k52J44p3J24nkj36J04j03J63j05j7L3oq2l2K05j49K48j97M0p3r2p1
2483a72K05k31J33J52l9j60J64O2m5J34l66K13n6K0J62n3j57J73j54p5J02m2k
2506c2J16k06J82j37K0o8mJ88m2j38j14K98n7j0K9M4j47M5K2NO0J92k43j35Q7
2531d5K3l7J12nJ6J05r0o6o9J68r2r0O7j5k4n6J75k5l9o7J36oj17k5P1Q4p1k4
2559fJ74k21Q3n1j3K1p5m9K18j71K19j20L7r4J2N7j39J55j24NK5J28j8m6o6om2
2586a07K27j11Q0n1j7J59k12qj00K58q3p2L18k82l4J76j07K67k54j0%j16J80j65
2610f4k3K15K9k90o6K18j06J70k03J06J1j7j6M4o3m7J00K9j8Q4j98J73r6J6oP3
2636E5k6j99L39k72M2j23K82N7j87J1j05J23R3k09P6R8K9k8p5j04O2k4K4J90j
$$ y = [-79, 162, -90, 54, -19, 105, 100, 98, -38, 66, -37, 126, 21, 4, 37, 31, -51, -83, 122, -27, 221, 24, 64, -9, -101, -172, 33, -198, -65, 87, 48, -112, 52, 114, 69, 203, -163, 50, -6, 14, 176, 123, -34, 139, -15, -90, 12, -30, -32, 84, -122, 60, -77, -57, -125, -129, 59, 17, -121, -235, 63, 6, -4, 25, 69, -78, -33, -11, -6, 54, 246, 3, -132, -45, -22, -59, 53, 48, 64, 169, 79, 13, -56, 112, 20, -70, -3, -18, -42, -98, 77, 52, 13, -54, 82, 76, -41, -66, 5, 89, 18, -6, 168, -53, 30, -21, -34, -13, -88, -137, 81, -90, 129, 9, 46, -48, -36, 21, -118, 37, -87, -82, -57, 71, 53, 7, -59, -65, -107, 120, 9, 89, 38, 21, 180, -32, -40, -140, 118, 35, -37, 281, -1, -35, 141, 34, 301, 47, 37, 37, -79, 101, -64, -87, 128, 157, -133, -199, 19, -87, 83, -120, -14, -3, -20, -36, 8, -55, -102, -2, 27, 9, 93, -105, 68, -28, -12, -18, 55, 29, -170, 169, -103, -61, -184, 98, 155, -32, -21, -126, -3, 90, -119, -43, 55, 84, 56, -19, -123, -61, -85, -61, 129, 128]
2661A28J9j09l6j89L01j36J26j20m9K62j41m8J22l7o5Pj46J79J53j88j57K52j65
2684c7%J05k0m4K6j20J21j46J82L5j63K37k54J91j50J61j10m9J41K1N2k10J5K5
2708Iq2J02j27j20K72j7P5k1l21K15k6J3J52o9k04K13j15O1j14J69l9M2o0j9J15
2733A04j46J35j3j13j35K25j28Q0n4L6M4j09Q4K4j80K31Kk15L18j74ll1J55k8
2757A09j6p2k9q3K66q8j00K0j1rJ80N4k55r9j03K68J7L1j43o8O1L2J13k56k1J28
2783g4n8J20k2n9J54j41MJ40j89J07J8q1P4J0N6j04N9n0n3j53J36J92j9Rn8J2
2809C0L9j37Q2K3l8J64k3k84J70J33l70K86%j58J4N3R8j84R5o3N1R7k56J96J20
2834A38j44k5O0j85J9J91k32L15k02j16K76J4K2R3j81m4J51j29m5j20L0O0J65
$$ y = [128, 147, 38, 2, -187, 114, -22, 104, -16, -65, 197, 56, 8, 130, 93, 28, 35, -111, 68, 221, 33, -124, 128, -37, -37, 68, 48, 4, 30, -90, 31, -115, 67, 102, -61, 176, -78, 113, -37, 124, 14, -35, 106, 127, 179, -31, -16, 9, -73, 29, -98, -218, 54, 37, 112, 91, -230, -15, -41, -28, 124, 55, -149, 64, -51, 10, -104, 65, 26, 68, 8, -11, 104, -42, 93, 80, -33, -168, 57, -71, 9, -45, -9, 35, -74, 10, 34, -146, 85, 87, -128, 190, 16, 13, -18, 137, 109, 93, 21, -8, -91, 175, 87, -13, 7, -4, -13, 167, 221, -34, -133, -236, 32, 49, 80, -63, -131, -70, -38, 75, -181, -202, -74, -132, -12, -34, -93, 61, -80, -76, 64, -125, -18, 0, -81, -7, 3, 59, -45, 14, -36, -89, -242, -106, 86, 67, 76, 18, 30, 69, -68, 14, 37, -1, 163, 140, -144, 26, 159, -211, 75, 75, -83, -69, -16, 82, -102, -7, -70, -19, 78, -178, 18, 138, -6, -31, 29, -156, -137, 54, -178, 137, -65, -181, 95, 109, 131, 224, 43, -1, 150, 21, -24, -144, -114, -54, 111]
2857A11j21k0p2PK37l33K04j20j5L00q5k66K06J75k03j91K88%j63pJ24j49K5K5
2881d3j2p3J57kk17K78k19J12n4j48J45l0J40N0j37k9J55k2j24P6N7j23K8k7R5
2906C3J64k24K4P2q9J24j80K16r1j93R3R5m6P1k55K74J21j98J66q1j50J0q5J12
2930a7M3j69K28N6j51N1k59L68p0l10K26oO0r4O9j18J81j52J30j01L1l2o9M8M5
2955a2J12%j13l2L8M7N0j19j21M4J09k8j54K95k05J90K5q7j38P4j00J0J79J20
2979A84j98K3J45k41MK8jJ67j03q1J11j73P1R9n5Q4o1q3q2J50o6k5n2J62P0r3
3005a6J76k55n9J47K1m1R7Q0q5JL2k8J06n2o2k17J23J48l9j18J77k4j35Q7l0j11
3031g7R5j11P8k8K02j21K6N5Rj30l9j43Q6J69j29j49J87J15o4m6M3q4J43j10q1
$$ y = [111, -10, -30, -102, -95, 142, -191, 13, -107, -122, 178, 93, -173, 33, 208, 5, -186, 102, 102, -61, -68, 56, -93, -68, -43, -55, -128, 29, 27, -190, 88, -131, -19, -73, -221, -76, -106, 34, 84, -53, -82, 73, 51, -73, 3, 60, -63, -35, -62, 33, 197, -27, -3, 69, -20, 104, -76, 140, 49, -144, -51, 44, -2, 69, -186, 88, 209, 11, 177, 96, -54, -44, -129, -17, 26, -143, 85, 141, -10, 41, -218, 150, 80, -230, -4, -10, 50, -44, 25, -93, 88, -64, 66, -35, -4, -36, -105, -57, -12, 100, 100, -13, -45, -7, 40, 90, -29, -150, -106, 3, -25, -179, 116, -89, 101, 126, 39, -99, -25, -125, -115, 64, 184, -14, 9, 154, -87, -83, -55, -56, 111, 8, -73, 38, -135, -64, 35, -20, 64, 3, -80, -162, -12, -78, -103, -155, 7, 77, -16, 160, -95, -154, -7, 14, -27, 70, 150, 65, 66, 98, 70, 176, 124, 62, -155, -32, 116, 77, -41, 136, 112, -23, 64, 34, -77, 18, -93, -15, -43, 159, 38, 64, 119, 128, -2, -41, -184, -98, 71, -58, -207, -20, 95, 31, -15, 28, -56, 87, -23, -104]
3056a04K08o6OK8r0j11L23k11J40j72o0J76J0O9k26J34k49J38M1K2m7J64n8l0
3080C5J6Qp2j51J13M9O3J3j87J81j71J39l00K69J69k74M1L1P6j77P3J32q4K9j4
3105GN6L4O0k10N3j7LPj02K25p7m8J36j35mJ1O8j83K63M3j50q3K9l3l1J17J04
3132A43j02Kj13K5N3n2J49n8mM1j97L9QN6nO2j41J45o4j06rJ51J08p5l7J44k14
3159e1O1L7O1j01L8q3j65J93J17j13J11m2k9j5L9n4k1P9r7M7m3on2K64l33J72
3185A4N5j11n6M9J86q8%m4j8O4K6j09R1o1K3jL4l8m1J02Mj44j6P8j90L29%Q6q7
3214A37r2J0n0N2o4p9J12j66J24rr0J61j15J5R1K9o4j13K88l0p3q4p2K44j80p7
3240i5R9M0r1q7K57nk09J98j40O3k8j44L9J82j02N4pK6K7Jq1j65J95j02K2L9R
$$ y = [-104, 104, 38, 44, 72, -18, -129, 194, -17, 123, -49, -109, 67, 77, 146, -80, 54, -195, -57, -16, 6, -41, 123, 65, 35, 51, 59, -13, -164, -51, -2, 61, 74, -113, 68, -103, 36, -264, 5, 174, -100, -59, -28, 48, -129, -56, 76, -8, 21, 7, 63, 97, 157, -53, 0, -17, -14, -7, -109, 116, 39, -9, 127, -8, -12, -1, 67, -116, 147, 190, 40, -43, -14, -47, -78, 39, 143, 41, 43, -70, -45, 8, -44, 105, 47, 43, 84, -113, -74, -66, -10, -15, 47, -94, 51, -13, -119, -128, 23, 131, 56, 19, 163, -51, 10, 47, 108, 7, 45, -38, -203, -10, 107, -6, 105, 63, 34, 19, 58, 4, -17, 62, -35, 12, -31, -37, -89, 175, -158, 14, 69, -42, -98, -49, 137, 49, 49, 5, -13, 51, 77, -32, 59, -2, 21, 20, 54, 16, -25, 77, 81, -63, -79, -1, -191, 138, 138, 224, 137, 45, 55, 5, 57, -7, -86, 26, -140, -16, -25, -115, 46, -69, -54, 37, 66, 2, -111, 177, 147, 74, -10, -82, 162, -18, -95, 4, 44, -47, -134, 123, 118, -91, 107, -33, 30, 2, -142, -103, 79, -23, 31, 24, 50, 77, 78, -3, -168, 27, -75, -53, -14, -5]
3267em2J71o3k1P9k1m0J57k43M3j90K89j62J85o0j90K9J3Q2K9n4M3n1J39J52k59
3293A0o2Q1l4N8l7R0j11j6k0k9R7r1J45j80J11m3Q2J1j0l5OJ3L6r2J50r8j8L7
3321E1q7L9O5o2O6q1J9J4o6J28j53J37j94J68L5l1j56J45O5m8K8n8N9r5p3P5K2
3348A2r3J46J3Mj37K17j20k20J88m0K8K26k16J06j76rn3K6J08K03k98O0Q9j55
3372i1R3J0j09K66j23p1r8R1J57j24M8J5ml1M6j65J64j10K39j66P8l9r8J05j13
3397c0j3Q7j65O1J67p3lj48J22j03J11j22O0K6LJ8O7j04l2R2j61%J05P5n2J25
3423A13k05K01n1j06O9o2q1K12l45J79J80k05M6j26J42j2J95j07n5J84l22J05
3445e1K15j03k88L17p9L4L8O9k30p6J19J16j79N9lJ22L4m8j49K8l9j2J59j04J46
$$ y = [-5, -47, 124, 61, 40, 119, 98, 58, 215, -28, 15, -175, 114, -48, 137, 77, -113, -84, -71, 11, 40, -14, 29, -22, 117, 269, 10, -52, 29, -5, 53, 16, 106, -5, -21, -41, -70, 27, -64, 81, -99, 12, -31, 51, 62, 52, 17, 23, 36, 72, -20, 130, 32, 14, 51, -36, 3, 68, 6, 72, -9, 10, 24, -42, 86, -67, 70, -124, 44, 79, 48, -108, 37, 102, 54, 82, 24, 83, -12, -85, -10, 12, -81, 65, 78, 82, -55, 162, 42, -178, 10, -30, -2, 224, 8, 114, -62, -71, -124, -98, 10, 213, -85, -25, 64, -91, 2, 12, -97, 169, 46, -25, -123, -32, 125, 1, 49, 64, 60, 29, 75, -90, 74, -36, 203, 37, 115, 76, -22, 83, -30, -43, 44, -121, -60, 107, 34, 31, -117, 5, -98, 13, -109, -49, -23, -20, -2, 65, -39, -71, 21, -140, -140, -35, 40, -12, 113, -92, 109, 58, -48, 21, -41, -122, 90, -255, -76, 104, -101, -55, -181, -39, -51, 144, 37, -18, 166, -156, -51, 164, 61, -227, 90, 11, 45, 83, 152, -78, -154, -35, 81, -98, -39, -42, 80, 114, 66, -83, -55, -94, -106, 53, -51, 95]
3470I5k70K30P1k11O6J20N6j44k8l1P4Rk1r5Q0J50j32j52N8K16j16jO5j29J36
3495I6j79J17p9l5P2l1m9L4O6l5O5n8q9J35n1J21r7L4J75l24J53j5j7k3N2m2j12
3522a16j80K67p8K26l0k00J8qK09r4N4j45L9q8K92k28m3K89j84j47M1J15l4l6
3546f1L9j10K75j93K4J72k16O9j20J54j17J13j02J28j99Q7J05op9N3Qj12N5R3
3570F0J6p3N6L6j18P1j1p2n8J36j04o2J32K6j07R6j26K40k95L8K12q6M8j67o5
3595a77K35k3j17J01j12K03m2j2K8J02l67K65K7j07J40L1l20R9L7K7R0j68j49
3618b09J99k05K47r0N5J17k51P0Q7j07R4ql2j64K29r6J37k27J04rm3M4K7J0N4
3643C3k9k0M9j51J3P0Q1N5o2j34R1O4j47J30o6l0J7J11j34J91l4r9J45j61M2M3
$$ y = [95, -175, 55, 126, -85, -19, 101, 157, 13, -15, -46, 28, 37, 16, -79, 1, 151, 19, -133, -75, 141, 25, 24, 89, -40, 96, -83, 34, -45, -80, -8, -39, -88, -54, 12, -23, 42, -16, -105, 30, -21, 100, 3, 37, 212, -112, 41, 26, 9, -14, 38, -4, -116, -296, -29, -107, 119, 89, -111, -93, -101, 108, 14, 68, -77, -38, -126, 166, -62, -105, 184, 0, -147, -106, 9, -25, -61, -22, -132, 143, -50, -26, 146, -70, -1, -121, 33, -84, 29, -73, 55, -144, -57, 48, 42, -37, 16, 24, -88, -33, 60, 76, 3, 59, 95, -23, 48, 37, -35, -93, 43, -61, -123, 9, 35, -72, 24, -102, 138, -157, -119, 93, 7, 55, -112, -177, 58, 35, -82, 19, -93, 110, 68, 56, 84, 186, -181, 84, 111, 4, 144, 175, -145, -46, -9, 18, 108, -60, -209, -10, -215, 32, -58, -3, 114, -137, -67, 20, -87, 7, -1, -33, -197, 32, -64, 73, -154, -50, -59, -102, -58, -31, -21, 33, 4, -16, 33, -118, -105, -35, 46, 101, 39, -95, -4, 60, -87, 43, -23, -53, -36, 75, -59, 132, 98, -1, 144, -17, 25, 68]
3669F8K1l9lr7L13k71J99r5k23j3J23j39K37M1k02M4j3o9Q8P7l1M4j05Jl6Q0o9
3696f9M5J87j37j49P4J01o8L7j22J13Qj66J37r6J10N4j12J92j84J63j23k3L4j90
3720a84J97J8L4p6o4L1J9K8r3K45m53J40J58n4J24l2m9J40r8j43K26l6O2j77J89
3745A52k12L8J09j31J10l6j86K96j23J04K4k21J13L5j38M7R4q9L1o4R5p6j32K05
3769D5j91J51m2J34j67n0p3K53l6j04K51k73J39Q7j04l5O3J15l4m5j59J03n8O8
3793C8j37K16o6j9j47J20m1j0J73m7k55K19p9P9j24J27k38L60k26j43K72L8k81
3816a71J41J01l48L66k24Ol1J48l2NLJ09ko9J90k32Q4J75k57k0R2n7J50j51k6
3841e0J29n3K8N5j69oK31l23J09J33m7r1N7p3l2P2Pj06J07O9R5k10K17q2R4k18
$$ y = [68, 89, 50, 47, -50, 263, -8, 191, 96, -127, -140, -17, -156, 81, 122, -80, -36, -49, -118, -30, 47, 16, 60, -45, -44, -80, 0, -69, -24, 163, 26, -123, -49, 52, -16, 21, -101, 12, 20, -146, -9, -105, 5, 59, -53, 139, -45, 118, -5, -28, 6, -184, 13, 31, 65, -11, -75, -44, -25, 3, -90, 155, -298, -158, 0, -54, 70, 38, -11, 129, 31, -112, 114, 78, 140, -37, 152, -60, -22, 87, -44, 66, 30, -156, 140, 17, 121, 145, -76, 37, 72, -66, -19, 75, -14, 17, -47, 48, -28, -160, 45, -146, 5, -37, 97, -70, -120, -193, 60, 24, -80, 171, -102, 37, 124, 20, -15, 48, 163, 129, 84, -75, 28, -30, 38, -99, 117, 51, 32, -115, 5, -36, -46, 127, 80, -175, 44, -35, 44, -80, 47, -191, 169, -57, -200, 72, 110, -171, -30, 71, -277, 89, -135, -129, -160, -12, -44, -39, -36, 73, 71, 2, 192, -40, 44, 219, -38, -58, 34, -23, 127, -24, -50, 79, 26, 54, 109, -60, -66, 165, -158, -49, 84, 37, -54, 3, -70, -102, -30, -23, -129, -22, 47, 142, -68, 149, 67, 161, -57]
3867e7N1j41J00K35k64J17KJ03j2j91O3J21l46J91k6J79k6J4k51J16q8p7J43L2
3891a2L1J6J02j23j6J29j33kJ14j20q1J96j38mm0k6J14l7J72Mr2j3j8NL2j31K21
3918A50k63KP9O5nM8j17J70j25j25J96j80K20K2k41J54j59J07K0p9J6R7k04nO8
3943h9K5K31p9Q5r8j8j07J22j0q8R9j69J63o0j29J44p9K36n0K2m9Q9j36K4J22
3968B01p7j75R3n3k6j16J38J19o6r2P5m9n7O3P7n9p7J35q7O0P0j02n5L8K55j76
3994E7k5n3j88J10K77j29k9L4j37J26J08k00R2l8N1n0r8j69L94P5k56j0N5O4j17
4019e6J91k54J09J00j37J25M1j64J95p0j30J8Q9j17R2jJ25k18n6r8J23l5N0J8
4043f0O1j13P4k0k8m0L68j96j3j70J89Nj10J99j46n1P3j53K01n3j86N9J22m7J19
$$ y = [-57, -6, -147, -47, 188, -76, 41, 43, 146, 134, -57, 6, 127, -219, -28, -54, 125, 99, 113, -138, -22, -110, -187, -44, -12, 19, 35, 137, 14, -2, 127, -6, -8, 106, -14, -95, 101, -37, -41, -81, -107, 7, -30, 142, 146, 54, 41, 23, 28, 60, -71, 150, -113, -111, -32, 33, 28, 76, -41, 129, 4, -121, 75, -105, 115, 137, -104, 50, -109, -2, 18, -61, -45, 52, -152, -157, -89, -64, 167, 88, 173, 75, 57, -50, 72, 62, -26, 73, -96, 67, 7, -122, 22, -57, 179, 129, 151, 102, 191, 55, 79, 201, 124, -51, 42, -11, -37, -153, -15, 104, 38, -54, 21, -28, -85, -22, 55, -4, -81, 54, -33, 27, 97, -5, -60, -22, 233, 57, 32, -21, -209, -99, 178, 49, 20, 54, -83, 43, 151, -49, 43, 5, 56, 6, -92, -261, 133, 208, -48, -58, -3, 61, -56, 135, -119, -10, 90, -47, 78, 119, -45, 150, 80, -50, -32, 57, -60, 32, 31, 156, -62, -118, -216, -93, -128, -78, -60, 1, -112, -38, -58, -86, -126, 242, 46, 33, -137, 52, 57, -53, 146, 0, -51, 22, -131, 70, 17, -169, -110, 12, -35, 84]
4068H4o1j1K19j46q0Qp5o7J03p4J40N6j96K77j67j5m2O2j23K4o3L1R9k16K49J
4094A7q1J86k49J51r6nJ73q7l9J96j72O2j90N0L0l9J87j69R8l2j9K10k22L3J55
4119A48n3r5j40J47J48j05K3j57P2j27J86k29R6j04J85P5Qj41J70j65p9K91r4
4142F0j27P5j47J24j2J52j91rl0NJ47qN2j3j91lL26k60J41r8%K3j03L4K2P8L6
4169H3QP3j85lJ00J8k77J61oN3%j99J69o9L3J2L1j68J10J00n7l8K7N2ln5P1j08
4197f7J03q0R1N5M7r8j44pN8M4j03O8on0M7J35o8j96J98j14J24Q2l41K87r6j2
4223d3m4N2lj09J43K6j9J20l7j32L0j18L00k49J82n2o9J35rk02L20l69J71J45
4247A69l4l1j20O6J79j52J5j32J8o6R3K99l64K21k58M9k16M27Q5j18l33J7K54
$$ y = [84, 23, 12, 231, 85, 5, 13, -62, -129, -26, -100, 40, 96, -100, 177, 10, -5, -47, 15, -108, -84, -147, -116, -17, -233, 16, 17, -64, 122, -127, 24, -72, -77, 96, 9, -30, 166, -6, 56, -134, -84, -54, -93, 94, -75, 23, -9, -28, 182, -40, -7, 148, 95, 0, -140, 7, 155, 50, 73, -84, -12, -139, 47, -182, -86, -190, -5, 70, 78, -63, 107, -58, -137, 154, 60, -67, 8, -139, -15, -27, 125, -66, -75, -105, -100, 47, 39, 91, 78, -113, -116, 210, -50, 91, -7, -7, 16, -87, -53, -31, 47, 83, 91, 164, -21, -24, 76, 94, -183, -22, -28, 25, 25, -174, -5, -74, -41, -29, 2, -166, -56, 44, -13, -51, -24, 28, 25, -30, 41, -67, 36, -44, 47, 102, 149, 51, -93, -100, -42, 2, -101, -33, -39, -89, -42, 93, 25, -171, 27, -87, 37, 119, -222, 65, -31, -43, -87, -35, -38, -147, -4, 22, 3, 123, 86, -46, -16, -134, 166, -83, 99, 47, -22, 113, 104, -98, 222, -147, 24, 169, 135, 104, -16, 50, 229, 77, 92, -40, -22, -88, 5, 304, -60, 161, -97, -48, -264, 163, 248, 130, -203, -186, 68]
4270F8J10q5q6nQ1j86J11k4M2K35k09j57N3j50L13j27q5j3K4R0r4L0LK52j86K
4296GJK3m7n7K47k10Q1M4r8Q7j99j0L0L4NN8r4J62j75M5m4n6L06l28J10O2J27
4323A11j29K6M8j17O0l6K6j32K10o7l3J8K6m1q9J63P6k8p3J2J07k99q8J15J80
4348D6lJ9M1j96L07n0k24J69J2qk70J78J6O2k14KR2Q1k2n6n3J70o2j00R2m4l0
4375d5J59q8j22J03J4j28jJ67o1l6OJ9k0J35j38K08k28O4j27J16l0K7J51N1j95
4400Ak06K15L3p3J68j39J17k24L6l4p3J53m9M3N3P1j41n0M9L1l6l4j56L25j37
4425e7J2p2J1J28q1m8J19N9r8j29Q9K8R8J0j54J49l7M5k6K9m9j34k6R3R6k20P5
4452i0J67j43N9J22k13n9K00o1k6P5m7O2j8o3o1P1j47K85r3m0J98k12J36Nk37
$$ y = [68, 178, 93, 7, 2, 83, -103, 8, -16, 26, 261, 52, -105, -52, -202, 111, -16, -101, -114, -90, 0, -94, -64, -61, 191, 5, 7, 8, 31, -16, -73, 174, -36, 45, 89, -9, 78, -121, -131, -101, -67, -62, -4, -98, 64, -111, -66, -110, -166, 140, -188, -78, -16, 111, -18, 8, 56, -61, -1, -37, -11, -143, 67, 0, -33, -15, 11, -30, -119, 44, 120, 92, 19, 31, 138, -161, -249, -134, 46, 43, 62, 103, -93, 214, 164, -60, 109, 121, 113, -157, 21, 37, 99, -115, -113, -21, 60, 38, -18, -71, 99, 37, -63, 29, -15, -45, 114, 26, -96, 7, 21, -107, -108, 59, -2, -38, -32, -13, -33, 102, -36, 172, -56, 8, -119, -3, -33, -6, 145, 196, 1, -205, 10, 43, -30, 138, -1, 116, -108, -72, -106, -179, -26, -75, -32, 21, 92, -49, -99, -50, -19, -55, -89, -245, 80, -57, -45, -117, -106, 22, -59, -107, 12, 71, -27, -156, -67, -39, 59, 69, -85, 64, 27, 72, 46, 75, 26, -108, -134, -41, 55, -165, -90, 77, -66, -7, 115, -98, -157, 43, -18, -44, 31, -16, 46, 28, -35, -96, -25, -172, 113, 20, -20, 178, -34, 102, 107, -130]
4477a30J37Kj13J80Lm4j9P2j30o0N0R1p8l3J59mQj18kr1K48j96M3J44k54rK0N9
4505f5K8Jk60K34L0L9l9K0R5k25M4P2J16p9P0j11L2j05m6J88k05K66j33n5L9m7
4531i6K42Ll8j19R3j38P1N8k7n2lM6k20J99k9Q8Ln5J5o6n9Q1J67j56J39j84K84
4558B47k39Om0J50j22L1j17L1N7j09Q1j39K05Q3k38J00k13K52j14N9J38k07J16
4581A8j39J98J14j95j6j35J10j0k1K06j70R9q0mQ1n1l1m6J90n9p7m3o3O5O1Qj19
4608a09J10J36q7l20K75N1q3J20k35J65r4KJ25q1o5J7P7O5k95M24j58j25J32m5
4632BL9J13N1k98J77m3o0r3J54K8q7J9o4R7r4K2M5j2L2k1J0j29K18Q4r1o3p1j7
4660e2n2K3L5K1o3J09p8O8P8o4k16J58O3l9l5PM9J37n0n3R7o4k4n6j75K26j0j8
$$ y = [-130, 7, 9, -104, 76, 79, 35, 16, 88, -42, -102, -52, 39, -39, -72, 87, 83, 91, -27, -29, -120, 128, -68, -25, 119, -135, -144, -124, -65, -37, -36, -296, -62, -32, 7, -32, -12, 83, -142, -98, -26, 90, 11, 81, -30, 2, -103, -149, 39, -166, 100, -33, -88, -49, -96, 146, 149, 111, -8, 85, -53, 18, 76, 49, -3, -6, 40, -180, 19, -10, 78, 81, 26, 41, -25, -84, -3, 164, 8, 147, -37, 247, 8, 14, -26, 124, 2, 33, -84, -53, 4, -105, -24, -163, 42, 125, -113, -13, -226, 26, -88, -29, 109, -98, 18, -121, 77, 191, -4, -20, -155, -45, -55, -76, 130, -40, 59, -21, -25, 56, 5, -26, -72, 118, 59, -18, -61, -124, -59, 2, 10, -109, 1, 137, 50, -270, 5, 56, -27, 93, -142, 23, -71, -69, 56, -25, -90, -73, 4, 69, -226, 198, 40, -85, 47, 2, 41, 154, 205, -93, 84, 41, -19, -112, 42, 70, -17, 2, -62, 35, -59, -37, 8, -4, 28, 7, 17, -112, 106, 190, 99, 36, -35, -52, -104, -81, -46, -25, -88, 21, -57, 11, 89, 25, -191, -33, 30, -9, -44, -37, 12, 149, 99, 46, 143, 79, 55, -1, -176, 50, 40, 22]
4688B2m4j2j8J76q7n9L0m0J76j31M3L0j33R4N2Ml6N7j99J35n6j23O4J84k3j22
4714a6K2l4o6pR6K2J14j30r4M3J04k2o7J23j64Q4J0p6o7Q9K8L4j16K03j34L6p2
4741e7M9j05R6mj68J64o1K59j12o4k6J25k02R6Qo8L16k68O4J6j28J04l4l8J57
4766A19o4n7j88R6L7K27q6j44j11J77M0L4r9j01K38k94K50k21J40J1n1K33j88
4789bP1K4k08Q1O2jKL9j85J99j44J95k07J3L6n2N9K06k01j06Q8k2qm6K4J48j83
4816a18MJ54lM1m0J0j49J69o1k4p8P5o3o7J91P1k72K21j9O6k18J4J66j25K8K8
4842Am1Q8L0p8N7J0J0k18l4J24J22o3n8j4O1n4k6J01J96j76p4J42q7R9j14l1N3
4869B6l6P3j10N2j29J49J58j40l8n3Q3n7J01M4j19M3q0M3J65n4j23k6q7Q0l1J48
$$ y = [22, -22, -34, -52, 124, 37, -22, 8, -32, 144, 13, 56, 86, -47, 47, 99, 103, 67, 124, -75, 60, 4, -119, -55, 129, 106, -16, 6, -28, -94, -101, -5, 17, 131, 1, -93, -50, 54, 32, -35, 88, -76, 8, 18, -58, -125, -36, -8, 26, -90, 113, -21, 15, -57, -8, -113, -17, -21, -189, -25, -86, 173, 61, -3, -29, 96, -106, -10, -2, -70, 246, -22, 42, 58, -70, 34, 0, -38, 119, 55, -2, -190, -94, -57, 170, 84, -60, -171, 6, 46, 80, -19, -120, 118, -176, 74, -147, -7, 4, -47, 186, -2, 69, 93, -115, -34, 28, 27, 29, 68, -117, 82, -62, 133, -74, -61, -25, -77, -18, 188, -13, -119, -31, -53, -61, -107, -83, 65, -118, -114, 40, 37, 78, 38, 48, -101, 68, 7, -17, -95, -20, -83, -150, 41, 112, -160, 61, 42, 108, -110, -96, 70, -55, -27, 1, -40, 48, 78, 0, 57, 67, 77, -141, -175, -51, 71, 8, -50, -64, -3, -57, -83, 18, 214, 38, -36, 106, 19, 118, 4, -27, 26, -10, 63, -47, 5, -124, 25, 183, 43, 5, -48, 35, -22, 79, 123, 4, 47, -33, 10, 175, 121, -2, -28, -115, -35, -66, 82]
4895H2r3j13J08N7j05J50oj37J15Mp4On9k33J73M8P0Kln6K56j86LJ13j44l3J02
4922D7j40o8K61j61K43p3q0j43J55K4r2J46j64Q0J7J12k34K6QRJ68k63R2N4L6
4947F0K9r4J30j58j64K79n3k6k17K79q0J94j76N7q5K1J37j62J93k81Q2o9J52j07
4971e9J38n8p6J25N2p6lJ25j86Q8J6o4l2J5j47L17k34J16k8L9q7K21o6j46n4k4
4997h8J65m9j4p8K9l6J56r7O7j88K39n2p4R9q4k1j22J04n0R5q0J21p5J31k09K09
5023I8k32J61j67R2J08o7O5J06j17L7%M0r9O1r6P7j6n8o6oJ78j45mN8r3J80M9
5050A44m9k04J30PJ10q6l1j19N4J4J97k56J66j23m2J55j3j4n3L6j8%J18j97j4
5075h8Q7NQ3j61l9J05M8j82J14Q0j7q3J33j50R0j5j02k4K52k30J8L0J91k56K1
$$ y = [82, -11, -124, -16, 41, -64, 86, 80, -57, 58, 62, -12, -6, -65, -298, -125, -77, -7, -5, -8, -64, 192, 6, 9, 122, -22, -55, 47, -93, -161, 100, -61, 182, 109, 29, -114, 41, 65, -27, 119, -45, 35, 52, 164, -70, -44, -36, -27, 141, -122, -30, 24, 60, 89, -5, 125, -33, -197, 82, 29, 3, -214, 65, -15, 179, 3, 60, -25, -4, 133, -29, 164, -117, -35, -104, 48, -59, 79, 21, -55, 70, 122, 46, 43, 168, -18, 70, 86, 22, -10, 5, -142, 175, -59, 57, 29, 68, -19, 202, 136, -10, -64, -88, 77, 28, 14, -64, -35, -71, 85, -12, 55, -133, 106, 54, -20, 79, -5, -26, -148, -44, -94, 1, -79, 42, -33, 98, -111, 98, -134, 27, -140, -48, 60, -7, 58, 164, 47, 84, 84, 124, 25, 86, -10, 67, 51, -7, -73, -79, 99, -46, -50, 8, -85, 95, 144, 95, -109, 21, 28, 138, 52, 21, -98, -44, -30, 167, -89, 77, -46, -88, 67, 54, 40, -13, 23, 5, 5, 123, -74, -88, -1, 4, 87, -74, -113, -8, 40, -142, -28, 52, 35, -48, 85, -65, 25, 10, -92, -116, 136, -94, -76, -46, 145, -111, -90]
5100i0l1j01K06J37j64l9RL18l02P7o5NK0M9O1l6L3O4j85J23o5Qm3R0Q7j48j04
5127h6P4J60k11J05M0k04K08k93J03K24M2k04R1p9J94J37l51J42j13Q2l9qo3J05
5151E6k8l1k05K07m1n6N8L3L3k67J82NrLQ8jq5j01J85M6q3oL2oP9k32J58n4K61
5180B21k67p6J62o5J47o0j51J59j19M3l3J2p0K5Q5O9j71L9Q2n4J03p5L5j13P7
5205EL9k5l0O7j19J29n2o7P1L5K4j01J9P8n4l2N2J49j10j29L2J88k49lO0j1l6
5232g0pn6K25o2j11l2O2K56r0j89R6j91K21j12Qm9M2j41K26P7k59K62J09j58j02
5257d5l7J15n4N0K1pj19K21k4j71L9k0P5M4jk45K50k4P5j34p7L5M8k7m5O3J56
5284A62j59p9K31j69m9j18J41P6p5LQ6j85J20O4j60L5J69M4k09J4J85m4o9j2Q2
$$ y = [-90, -121, -222, -16, 121, -43, -82, -73, 245, -57, 20, -45, -40, -20, 29, 90, 54, 87, 151, -34, 89, 24, 32, -11, 79, 166, 18, -86, -12, 148, -63, 42, 82, -122, 86, -207, -104, 120, 162, -42, 49, -30, 164, 301, -50, 92, -21, 61, 22, 14, -49, 56, 28, -3, -208, -1, -42, -98, -40, -7, 26, -241, -59, -54, -63, -60, 28, 27, -58, -159, 26, 72, -11, -17, 15, 9, 88, -144, 14, -40, 221, -46, -122, 40, -25, 122, 62, -89, 70, -49, -6, -39, -27, -97, -72, 13, 82, -89, -50, 32, -22, 81, 6, 41, -72, 5, 44, 19, -11, 56, -63, 66, 14, -53, 18, 53, 77, -24, -5, 73, 19, -13, 39, 188, 78, -51, -19, 169, -80, -83, -23, -34, -70, -77, -133, 92, 30, -81, -113, -51, 205, 115, -74, 22, -169, 52, -60, -52, -101, -59, -200, 26, 103, -156, 106, 215, 57, -45, -82, 33, -21, 29, 50, 43, -76, 145, 121, -50, -11, -31, 44, 88, 87, -158, 92, 68, 143, 9, -68, -33, 15, -12, -57, 6, 162, 3, -76, 155, -14, -63, -181, -40, 36, -39, -36, 50, -135, -15, 49, -111, -76, 93, 137, -72, -58, 127, 83, 14, 2, 84]
5309H4P0k71j24J21L8l8J99j69p8J50J54j3j83oO7r2K01j13rJ02L0o4N5n1J06
5334A66j21j59J64k09J31R3n3j03Q2l7j5O0J0j02J2j0K48p4k01rJ67q1L1J20k68
5359a58P3J9kJ85j57J22o7n8M5q3J01j6J54k88O9P2M0R1k95P9R1%J31k57o8J80
5385Cp2M5j7j2J73N7k48Q8r3M6j8p8Q5j04J59R4o8Pj01j05j2NK28N6N7k93N1J05
5413C8j60J98Pk61J20R1O3k2j60J77K1q6j13J11p5K5J11J62j92P7k30J10p1L8
5437b1l0L2l8K42j61o8R9L2q1r7j23K12J68p9j72m6K19q5J72l37M7J24r2m6L04
5462A75j01n9M2J2j15L0J25j29%J26j32R0j15p2J46%m5p4j13K40p1N5o1J22N7
5487A33j21l8P2k08K45n4J44q2K6l24K63k3j03J4Q9J43k93J92j98O9oL3QM1P2
$$ y = [84, 154, -117, -241, -120, -82, -120, 79, -90, -168, -18, 136, 123, -60, -66, 1, -91, 110, -3, -12, 90, 120, 56, 111, 60, 166, 45, -114, 50, -159, -28, 65, 12, -91, -9, -46, -61, -1, 9, -93, -81, -91, 157, 83, -118, -127, 40, -41, -10, 110, -158, -85, -66, -68, 117, -40, 82, 15, -43, 2, -81, 20, 4, 158, -130, -61, 11, 51, 142, -153, -74, 17, 17, 148, -109, -177, 3, -69, -24, -41, -53, 120, 177, -71, 17, -76, -30, -48, -126, -41, -145, 14, 108, 40, 47, -54, -159, -171, -166, 62, 118, 175, -118, -67, 38, -122, 76, 83, -178, -58, 33, 96, 74, -86, 91, 112, 26, -87, 24, -51, -26, 85, 247, 55, 132, -98, 12, -59, -21, -51, -19, -57, 185, 24, -44, 55, 87, 6, -91, -214, -2, 166, 87, -85, -131, 88, 3, 175, -162, -115, 9, -83, -129, 175, 74, 15, 57, 69, -46, -16, 109, -20, -20, 106, -26, 64, -51, -123, 23, 23, -22, -96, -209, 31, -40, 15, -46, 76, 133, 12, -26, 46, -162, 83, 29, 173, 91, 117, -207, 56, 33, -70, -56, 33, 176, -117, 75, -123, -54, -60, -27, -19, 22, 94]
5512I4j87M0J34r2oM3N7j61O1M7M8k31K74j63j10K27k05R0Pm4n6J65k4n0R7o9
5538a4Nn9nJ55j45J13M3k7m2k7j2O1o4J3j3r2QN2J17q0O0M1q2p2J64l0N6j32r6
5567a04K57r4M9k30J04Rj31J94P9j64N0J5N5K1j2pj39K22j00J9k4j19J32j65q0
5592a63J88k0Qm4J08L4l2n7Q8j8r2M7j4k9j03j3K15j64J55R3q8j45R9l2Mp3N4
5619FJ5M5j80P2n1l3L80m16R0M2NK1J01j22j01J45l1K6O6j27O1m9rO7j42J93p0
5646DJ7k8q7M5J40p9J7J40k03k4J17j81k8K85j41M3kq0n6M9k8J74nj35J06k7J72
5673B05k81J73j11p3j40L28j06j01K46k58K70o8qRQNk25L03j65J3J31p7n0l5k7
5698c4P0L1J0j34l4K12pl63K47L4j57J22O9k30R2J4%rq9J81N9p8J9j00K7m3m7
$$ y = [94, -93, -53, 81, -11, -17, 26, 83, -78, -17, 30, 78, -153, 121, -42, -152, 75, -130, -40, -33, -77, -133, 32, 8, -42, 55, -14, -9, -68, -73, 82, -63, 50, 93, 66, 24, -3, -15, 46, -18, -5, -18, -110, -102, -50, 67, -13, 47, 88, 6, -66, 98, 68, 124, -8, -104, 153, 59, 108, -122, -18, -9, -140, 54, 133, -31, 19, 34, 89, 110, 98, 91, -48, 174, 74, 93, 69, -50, 82, -83, -163, 25, 5, 13, -31, 77, 111, 79, 22, 110, 92, 0, 47, 33, 4, -99, -112, 103, -61, 94, 187, 99, -46, 53, 21, 25, -48, 6, 21, 66, -114, -42, -93, -126, 254, -162, -72, -30, -25, -4, 97, -25, -126, 19, -12, 14, 80, -47, 14, -35, -44, 23, -119, 74, 4, 21, -7, -94, -49, 91, 12, 29, 169, -34, -58, 59, -122, -150, 135, -6, 37, 35, -45, -101, -52, -80, 94, 89, -46, 60, 33, 205, -76, 97, -14, -87, -227, 101, -5, -106, 140, -118, 152, 84, 76, 85, 93, 98, -127, 176, 11, 24, 155, 78, 28, -7, -34, 36, 67, 77, -57, -91, 121, 114, -249, -2, 32, -125, -3, 66, -164, -72, -58, -58, -67, -156, 25, 84, 6, 25, -75, -48, -91, -138]
5725a38K6K51Kj27j30J01k5l3p5J73N2j42P8j35P0J56Mj62j74J19R6Q0pkJ12k08
5751c8LR4J11k22J31k6j1K0n5j71K53j57O6j33J40n7p0rJ78m7P6n5q3n7J57j38
5777a00J98J6j31J21j9j22j41O7J71o1j9J13o9k17J14K6r9P2K06j12J24j07jK1
5801E1J01j79J62n4k45J04MJ43k38M2J03J16j41k4r7N4J28M0j18L6J48l1p3n5
5825b3J28n2j59J97J7j82K8J1m5J0J51k20J41MpJ52j15K0j18q7K55O2k18J2%J98
5851A60j05J76k03L1p2j50K18r1J20mj34J5J31j73K5K29q4Kj00N6j00O1l1NJ08
5876I0R1k51Q1K1j54J55m3J6q2K25j58L0J1j38jJ30L9j83N7k1L6J57Pl7j08J51
5902A21o5k3J32k32q0J29q8J90k05K09O9k35L7K22j23j4Q6j02l5K8l5K9k02K01
$$ y = [-138, -112, 139, 141, 14, -116, -15, -40, -73, -148, 25, 77, -65, 13, -122, -52, 104, 108, -54, -228, -109, -13, 67, 60, 58, 170, -38, -35, 59, 170, -52, 79, 53, 42, 62, 7, -164, 89, -68, -2, -135, 5, -52, -122, -131, 47, 0, 76, 21, -62, -119, 38, -100, 98, 114, -17, 104, 85, -37, -178, -111, 60, -1, -20, 93, 24, -193, -79, -53, -152, -80, 126, 14, 138, 31, 30, 51, 152, -27, 135, 81, -164, -60, -56, 87, -151, -109, -6, 110, -31, -55, -152, -98, 30, 70, -48, -12, 136, 105, 32, -23, 105, 53, -106, 91, 108, -74, -46, -35, -80, -70, 81, -139, 2, 6, -1, 151, 36, 56, -62, -149, 106, 168, -50, -38, -38, 160, 55, 231, 28, 59, -13, -163, 55, -36, 84, 80, -54, -39, 92, -81, -56, 173, 89, 91, -9, 47, -53, 8, -23, -18, 90, 181, -70, 11, 32, -122, 33, -10, 6, -76, 149, -9, 21, 32, -106, -107, 23, 62, -121, -64, -85, -49, 108, 115, 78, -30, 121, 56, 33, 165, -67, -147, -18, -106, 84, -121, 88, 157, -78, -41, 181, 58, 44, 130, 28, -7, 21, -14, 15, -187, 14]
5926A4P6J09j81q6R2j43j6J23J68j0j71J96j99n5K00o5r3N2Ko0O8j01K30k44J84
5951I0o3l03L03mN4r1r9Q6J51j95N6O2j79J71l9N2k8K9p0J67j65J2m6m1Q2J37
5977A29j15MJ23j66M0J14j69PR8j27J52K2L6j31n0J7M2l7K4o4R7J4j12J75p9o0
6003a6J03j17L6N7j3J9Jj97K48j22R7n6j5L0k79K84m3J36k16R0o4J55j79j50K39
6028B8Nq0l9J56n3kN1j27L7L4j4j55M7J26L9j85m7J87j10K82k56r1K29L8j08O
6054bO2k90m4K24L7P7n8n3K11j20j8nJ91j97p2O1n8N9Q3j80K10k0r4J44k56k4
6080a32J29pN1J01K5j48M7o1j24j2Q9J23j28J47k16R6J11j5k11M2k4P8R3O7l3
6105H8q3j89K35q1n2j34K1K41L5P6q1j7lj1j83M0l7lJ98K4L4j64o9L47k71j5M2
$$ y = [14, 90, 199, 18, -68, 24, -119, -135, -12, 156, 146, -25, 171, -28, -83, 117, 52, -41, 11, 13, -47, 21, -80, 150, -94, 90, 27, -276, 27, 23, 77, -14, -113, -27, 124, -71, -15, 47, -132, 39, 0, 52, 24, 53, -17, 150, -15, -3, -49, -90, -8, 129, 14, 18, 141, -25, 15, 129, -40, -33, 65, -62, 90, 112, 148, 17, -33, -16, 26, -11, 13, -51, 46, 60, -52, 123, 44, -16, 87, -30, 6, 63, 50, 69, 70, -127, 121, -1, 96, 40, 25, 55, -224, 60, 17, 153, -63, 27, -37, 118, -61, -211, 28, 33, -47, -86, 70, 17, 15, 66, -61, -24, 10, -4, -159, -112, 14, 53, -132, -179, 8, -102, 180, -76, -167, 62, 100, -8, -2, 60, -230, -274, -50, -13, 64, 6, -47, 164, 44, 26, 21, 212, 15, -57, 4, -54, 5, 88, -92, 118, 98, 4, 148, -108, -132, -3, -10, 41, 142, 167, 19, 66, 5, -119, -131, -42, 81, -47, 100, -116, -20, 91, 76, -135, -93, -117, -39, 54, 121, 88, 5, -184, 51, -30, -82, -216, -195, 46, 81, 157, 76, 59, 56, 45, -138, -98, -135, -138, 60, 84, 118, -46, -115, 232, -39, -54, -12]
6132a2J12R8j48j47P1j08R5J70kp0O9j19J53l09P9j75R4J37P2k6p4p1J84j02j11
6157a40R5J05o5k2K6j21J93k6%M1o8o4j8J70j82J05j82P9J55j33j7J31J13m6j62
6182c3J86o0j73J9o1K36r6j03M9P3O9j67P0j84L18j40j0j6J8O5o7J43j06j67J81
6207D4j68K87m1j15p4J17Q1j22j7j38M6L09k42j17J94J7J76m48K69kj07J11j92
6230a32N6J14o8Q3P7k10Q5J51q8N8j80J40j01J59j45P6n4J9j60J11J42j54O1J08
6254A48k55K02q7J8j43qL1J45n9KO7R2k68J03N6J24j30m3J03o2J43r0P6j98N8
6279B5j82J26j27J8J85P5j41P0l2J55l46K20j31J53K0J3J7k76J32j13K74%j70
6302c5J00j2L9p1n1j66K61j32lJ88p8N3J5o3l5J11M3j7j72J1J04r7K8m6l5Pl1
$$ y = [-12, 100, 198, 50, -97, -26, -134, -39, 131, 129, 59, 128, 9, 162, -147, -68, -243, -149, -12, 60, 34, -40, -111, 73, -29, -140, -45, 60, -5, -27, -1, -122, 71, 45, 45, 86, 18, -46, -64, 106, -76, 29, -153, -74, 81, -52, -69, 62, 175, 129, -33, 153, 93, -80, -61, -122, 114, 18, -85, -36, 37, 106, -61, 9, -175, 143, 3, -7, -23, -5, 60, -7, 136, 30, -137, 44, -124, 163, 122, 7, -67, 50, 131, 9, -8, -146, -100, 209, -33, -150, 44, 61, 237, -211, 58, 56, -51, 60, -132, -76, 38, -30, 53, 130, -80, 5, 156, 68, 126, -54, 86, -15, 144, -1, 75, 21, 40, -120, -9, 133, -21, 40, 148, -107, 95, 8, 26, -117, -125, -94, 51, -8, -6, 61, 153, -115, -12, 44, 168, 38, -5, 98, 36, 179, 89, 165, -33, 25, -157, -31, -158, -140, 45, 120, -21, 49, 17, 172, -174, 46, -85, 68, 88, 101, 118, -158, -26, -139, 135, 135, -35, 65, 53, 92, 21, -30, -196, 65, -67, -70, 118, 40, 93, 108, 45, 10, 121, 164, 147, -25, -14, 90, -7, 21, -25, -60, -53, -84]
6329h4J5o5J13J57k12k8J10j47J13J3j8j01J85j00N4k1R6r7kr5O1J99j94J17m3
6354B6m6K3N4m0k9O1o1j9QQ7m8K6j07M9o6N8j61L01Lj08l5J75L2k31K1J0L1PO5
6383H6j33N4k3L9L0k73J92K0r6R8j3j16l9K68j25Q5l7O2jj37P8J50k48RL2J06
6409F8k4Q6j24J20k6j04J39j22R5j82J97r4r2J34j47J52j89K4R0o5P1j54J83j23
6433h7P9J27m0Pr7j69J94L9k40K63Qj16j44J43J60j41P7j83l1R0L6k4nO0L3q9
6459e0J30r8m6R6K8k13K48j10N9n1Nj5j09K40o4q0RJ16j17kj17Q8NNM9M7n2j05
6487a04J38pj08j02K33n9Q6P7l32L32Qj41j5l0%K37k18K5l3J45k26J59J6l1j01
6512e1m5K3pM7k5J50k92J72k7O6K21j50P0k11K8l0j14J03PR7Nm0N5nl8j7OP0k61
$$ y = [-84, -69, -134, -21, 136, -76, -104, 6, -141, -28, -15, -33, -134, 51, -49, 5, -16, 80, -17, -19, -114, -53, 146, -48, 69, 26, -20, 3, 57, 17, -12, 49, -12, -31, -23, 64, 16, 42, -65, -16, -82, -24, -185, 116, 119, 11, -24, 151, 183, -48, -27, -17, 14, 21, 86, -47, 7, -16, 23, 53, -220, -28, -8, -104, -6, -19, -135, -174, 94, -31, 54, 17, 79, 78, -59, 19, 169, -79, -70, -38, 68, 44, 130, 6, 126, 100, -4, 135, 13, 108, -74, 123, 29, -63, 71, -76, 76, -113, -89, 1, -64, 7, -147, 36, -87, -8, 119, 79, 86, -11, -180, 14, 53, -187, 76, 84, -32, -176, -33, 127, -14, 63, -120, -151, -61, -25, -49, -54, 6, 39, -50, 80, -18, -64, 32, 60, -153, 95, -15, 44, -7, -2, -17, -126, 114, 50, -30, -21, 95, -22, -24, -141, -53, -48, -43, 6, 53, 1, -104, 34, 27, -81, -183, 50, -9, 77, 154, -178, 154, 162, 21, 6, -24, -24, 213, -5, 20, -13, 132, -94, 65, 81, 50, -51, -96, -73, -80, -33, -58, 92, -200, -28, -55, 11, 232, 82, 152, -59, -31, -61, -175, -72, -65, 32, 37, -3, 52, 47, 9, -8, -2, 68, -193]
6541a93K50k0J24k74K65q7k9J1n5%N5r0Q0R3j80k8L1l3O9J87j94J11j77J03n0
6566c1o1O9R6m9L4p1k13K00k2P4p3k4M0J5k1j79K73j97K34n5%j04p0J64K1N7k34
6593a27K86k06L2o5PL7j1J45j54J03J7KL8p9j14K29j71j7P9j44J15q7J06j17Q8
6618hm3q4K27k5m9NO3O9j29n4jR7pj92J25Q3RL2o9j03j19R6J57k00K54j73N9M8
6646F8o3m4J21r4j06J82M2j35P9J1J21q4j94O2M0p5k6J48j53kO2J2n1O3j20J15
6672b1m5J21N6j86P0L3j6J22r1m6k7J58j45J08j06k42R3J86J27j08j18J7L2J40
6696A12k44J01j71J56Q7q4J9R2l5j40J67j40O8k0p8J03L7N4k31K25j81P5Q8l2
6720B8q4J33l8M0q8J29qj56R2J2n7j94R3M0K06o1j61K7K80j60K4k01O3l7Q2K9
$$ y = [-193, 57, 37, 161, -113, 152, 65, 36, 47, -8, -8, 47, -43, 37, 130, -50, -78, -47, -80, -11, 176, -18, 93, -84, 19, -31, -92, -23, 73, 24, 58, -13, -226, -26, -48, 26, -47, -71, -31, -16, -37, -216, 57, -140, 94, 39, 39, -65, -135, 29, 50, 107, -127, 159, -47, -15, -80, -73, -36, -47, 98, -56, 47, 64, 66, 104, 25, -89, 140, -31, -48, 31, -113, 2, -85, 21, -96, -8, -51, -135, 92, 67, 18, 23, 86, 155, 26, -28, -29, 68, 61, -131, -6, 77, 86, 118, 49, -54, -173, -77, 80, -120, 134, -39, 20, 68, 5, -39, 82, -12, -118, 64, 106, -29, 50, 61, 182, 98, -96, -34, 6, -69, -95, 53, -100, -102, -40, -28, -79, -16, -136, -21, -66, 55, 111, -75, -5, 28, 12, 134, 43, -3, -30, 128, -17, 91, -15, -257, -164, 22, 149, 41, -77, -60, -28, 112, -132, -31, -202, -46, 41, -43, -24, 68, 33, -107, 60, -80, -12, -32, -110, -7, 30, 84, -147, 78, -103, -28, 60, 28, -56, 77, 39, 79, -9, 120, 112, -44, 48, 60, 3, -191, -98, -58, 148, 87, -74, -47, 233, 73, 97, -104, -41, -78, 4, 33]
6746C3J75p6j60%j40J73jM8r6J8Qm6q3K28j31k3P2J06j94m0K46j88p3N4J11m1
6772b0k2kn4LK36k20K7J9Q8L2o2Kq0j45J53J09p5M5qP3Lp2M2k20K35o9N9m3j6
6801A8M1L3j27J3J7m2P7j21O8K7l2R4r8J42O6p8k9n6nn7J9J66j25Q0n5PJ26r9
6829G0oQo3j40K67m5k94J11J64l3P7j60j47J43l7J62m0m8q5k3j3K37k0m3j7l5
6855a0Nk18K58P0j13L8K3K9m1Rk06J28P6j97N8J30j25J64n7Q1k06J37o8k19K48
6880fj04J11m0n4R0l6J34j98K7K02k83K45j16L9o5J36j25L8K0o3m5J02j41Q7J98
6905A53k08Q6jk16K84j28N4r4P7O4p6j3J72k92J42J06k03J05j75K16j71K25k65
6928a58K22j43K05j42L2ml7n5J46q4J66q4l3np4Q7m0k58J77N3r8K55j25J85l83
$$ y = [33, 208, 132, -28, -28, -168, 5, 4, 52, -44, -26, -18, -64, -147, 81, -50, -73, -1, 105, -89, -129, 117, -71, -144, -90, 21, -20, -42, -44, -98, -95, 141, -79, -52, -33, 55, 87, 25, 27, -53, -198, -45, 64, -11, 34, 26, 99, 102, 30, 72, -148, 87, 18, 77, 34, 18, 59, 92, -35, -22, -5, -47, 30, -91, -23, 4, -28, 66, -32, 110, 176, 98, 69, 13, 8, -49, -30, 136, 11, 91, 36, 43, 169, 70, 64, 72, 9, -131, 136, 91, -203, -92, 72, 39, 116, -44, -191, -48, -85, 77, 37, -11, -96, -119, -132, 105, 85, 42, 25, -10, -5, -223, 35, 105, -8, 30, 53, 82, 41, 50, -156, -28, 48, -149, -91, 39, -86, 78, 21, 102, -104, 33, -35, -254, -6, -110, 1, -39, -93, -3, -39, 95, -103, -76, 126, -157, 88, -28, 11, -54, 82, -43, -5, 15, -48, -93, 9, -132, -45, 153, -55, 31, 30, -186, 98, -30, 24, -70, 7, 71, -5, -18, 154, -138, 4, 110, -93, 12, -163, 53, -118, 107, -158, 64, -79, 126, -16, 16, 12, -25, -80, 66, -18, 148, 64, 31, 26, -48, 39, -1, -259, -82, -29, -127, 128, 3, 188, -195]
6953a95J68K87k71K5j4K6K06k11K7rk17P3J12m3J8R8j08mm8pK4N5j24K66o6j12
6979d4K6R0j46J80l4k35J91J03j87jJ29j4r5On3J80j83K3R0j8k0R3j11rP9N0n1
7006C9L5Oj43O4r4J25P2j02j7p0J16j27m8J3J21M2o0K8m1Q3j5Mm2K79k08k18J37
7033b1LJ19q2L9j4k5j03N9J04k21K66n4m2j12J26n5P2q0j48K13n6N8nK2l3q5N5
7060@n5N3m0l1J62j26L8m2J85j69ll4J15j2J4r2n0Q5j50L68j41j24QO6k9j34K23
7087H5j05q4M0R1n7j19J97j51J49l0j78J57O4l8j01J82k04J09q1N6l7q0O6L4n3
7112h8J20k06K86j94M7j17J53j48J67j29J93m9r1R3j19J11R8o5p7L3j86J54L1
7135A7q4L4P3l5j0J74m3j48pJ64j65N0MM0j45r1L01l4k0P9n1q0P1K8j93K80l02
$$ y = [-195, -27, 260, -11, 14, 0, 26, 232, 21, 48, 39, -178, -105, 7, -36, -18, 80, -28, -32, -80, -87, -63, -8, -132, 134, 68, -44, -18, 72, -74, 106, 72, -163, 28, 131, -56, -57, 72, 58, -37, -31, -84, 96, -87, -64, 26, 8, -12, 81, -30, -39, 40, 90, 39, 74, 80, -63, 1, -93, 32, 104, 2, -15, -85, 31, -96, -144, -131, -10, 32, -28, 0, -41, 42, 27, 31, -11, 268, 60, -158, -21, -18, 101, 19, 58, 44, 19, -84, -25, 79, -142, 124, 70, 28, -84, 42, -13, 59, -21, -169, 44, -12, 46, 41, 63, 30, -55, 0, -55, -2, -42, -73, 89, -37, 1, -41, 144, -25, -28, -62, 53, 41, 55, -37, -87, -2, -152, 216, 75, -49, -41, 25, -4, -138, 85, -20, -104, -64, 27, -30, -149, 48, -103, 46, 16, -162, -5, 59, 21, -80, 102, -102, 7, -74, -18, -55, -135, -69, -35, -88, 32, -174, 112, -82, -35, -152, 1, -147, 20, -109, 84, 35, -56, 37, -82, 29, 127, 62, -15, 18, -168, -14, 17, -67, -33, 40, 5, -5, 169, 126, -22, -29, 135, -30, 20, 24, 64, -81, -172, 129, 95, 75, 154, 103, 23, 94, 122, -71, 209, -93]
7162i3J26j09N4q8Q3P0l3j21J49Nj94P4l7N6m4J45j72J3Q8J24l0k15J29K4o9P
7188e8K8j9J16M0j74P2O5o4m2q2k3MJ74J03k38K01j15q2Q8k3o1J35p1j9J57j37
7214b5J6m1J42m3k3j96J62j31K87q7j29K16k22J68r7p1M5L2J03m6j27j07K54Q8
7238A68k81K88k23P4j17L64l01l2J25M9j47q8J29n9N1j07R9m4J27k03J37qj88
7261a87K06j70J77q0Q5jj12J35j40K50j13P1j9j92P4L8M3o8j62L13K9M0j39p3
7285EK2J04q7J1N4pp1j16q2O3J13n2R7j95J83m1N7kok17O1J74q3J51j37P1k26
7312a56K88j03k4j6r4p3K9J95J5j78K43p2r5l6K41j13q6J65j62L3Q8p9m1j23M4
7337a10j2L6j8P6p7K96j55R%o7K3K0R2oqj59R1j07J36J5j20J4N8MO7jj32k3n7
$$ y = [-93, 33, -76, -22, -110, -27, 43, 10, -111, 38, 43, -151, -77, -114, -58, -102, 43, -129, -116, -28, 96, 66, -149, -20, 4, -65, -58, -30, -49, 67, 107, -67, 5, 70, 6, -36, -118, -141, -137, 37, 140, -98, 103, -12, -94, -6, -29, -90, 45, -26, -45, 112, -25, -9, -50, 92, 49, 26, -170, -8, -139, 148, 61, -68, 148, -74, 94, -3, -74, -29, 3, 106, 60, -67, -174, 80, 168, -113, 175, -48, 26, -91, 273, -28, -60, 65, 114, -33, -121, 8, -51, 0, -107, -8, -52, 75, -128, 9, 1, -187, 19, -151, 26, -54, 31, 30, -82, 53, -87, 163, 50, 121, 102, -90, -16, 22, 65, -3, -165, 148, 177, 217, 78, 5, 27, 131, 44, 55, 109, 102, 31, -85, -167, -104, 9, -43, 54, -141, 42, 1, 58, 56, 50, -167, -106, 68, -15, 136, -1, 70, -156, 132, 29, 5, -11, -105, -178, -149, 46, 61, -117, 126, 54, -41, -77, 164, 51, -35, 130, -32, 1, 89, 10, -31, -154, -110, -122, -86, -104, -28, -105, 191, 36, 45, 45, -22, 1, 21, 113, 107, 99, -60, 31, -76, 60, 75, -45, -31, 27, 31, 98, 97, -35, -58, -115]
7366a15J23j35MJ62j58J62j76L8J06j5N4J08j61r7J5M8m9J67nk75J98j7l2j21
7390a71J95j56P7Q1J76k35J25n3n2q8J89%K7j49L8J28k85Q1jK9R7q4J08k34J08
7415d9K13M1n17M43O1l21R1L8m9K6J25j34rM5j24R5r6R6q9q2N8J71q2J37r5o3
7441g0j9P9K46k90J51j54J58j08N3k91K56l8Jj81K49o3J9J00J0j29j03qJ17k4
7465c9O4j18R9l1Q5J02k64R5p7j36K34m0J0M2qp2J78j31N5K4m3N6j05j5rlM6j34
7493a35J42O9j22j5o4J33j46J22n1L6O2j31J77j7P2j42l3o7n5P6O3K0J0Nq0M8
7519b3mJ38K3j55J16j83J07m6J65k44J04P5j81LK7L13j42nk27J73J01j63o2Q5
7543eq4J18N1n2k17K70Nn2N6j79J54l6l7J50k97J47o6J91o6Kj46J38L4j96J19
$$ y = [-115, 8, -127, -123, 39, -119, 43, -133, -95, 11, -4, 50, 158, -3, -100, -85, -37, -86, 81, 76, -199, -1, -18, -50, -171, 24, -132, -55, 26, 202, -33, 92, 39, -13, -101, 88, 88, 115, -34, 4, 132, -153, -72, -73, -44, 53, -31, 77, -157, -49, 164, 205, -312, 131, 192, -129, -38, 0, -49, -23, 102, -32, -41, 4, -120, -25, -121, -25, -114, -196, -138, 33, -49, 88, -7, -70, -89, -10, 236, -54, 97, -57, 101, -7, 46, -245, 11, -27, -26, -207, 42, -21, -2, 98, 108, -21, -124, -132, -15, -39, 25, -93, 6, -25, 60, 162, -102, -7, -84, -220, 14, -26, -16, 26, 18, -54, 124, -7, 48, 72, 29, 85, -20, -35, -44, -47, -1, -135, 7, 76, -46, -61, -125, 8, -138, -16, -67, -31, 31, -100, 77, 60, 132, -10, -43, -110, -165, -89, -26, -6, 4, 9, -71, -23, -27, 111, 134, -21, 95, -88, 19, -27, 138, -106, -2, 73, -108, -105, -78, 235, 93, 88, -139, 34, 135, -28, -90, -5, -89, 29, 80, 28, -189, 81, 86, 34, 90, -89, 65, 29, -8, 142, -155, -8, -74, 117, 51, 53, -93, 45, 79, -117, 2]
7568Bp1j48J45O0j59O5J05J7N4J4r3r6J12K13k68J84k87K18r8M5o9J98n5o3rj29
7594a13Pl6mR1l4r9R8K13j74N8J28p3k10O8J48l3j88R5J34p7m1J45j09J09k4j00
7620b1J59k14M1j70K97Q7m0j78J83k00O3no8QJ59l9j8j31Q5J9p9l3J90j51r0K13
7646F7j52K20k00J69n5L6j51J02J6O3j51J00l04K85O3j92l2K69j05N7m9m3R3j51
7670d5Jj13J93Q6l15N7O9O4o4N8o1%J44l9R7j55k8lj6R3j60R6P3Lm1j29%j6K55
7699A04j9j65l8K29j73p1J59R5Kp4j01L12k89K9n1K9K3O8o8j08R2J14r8J05k33
7724a27J06P1Kj42p3K41k03J17J48j28n8j8M0N5q0J53j71Q8K5nL4q7k3R0M3j38
7750d0o7J44j15J27n9J5k0J09j16q1J75k51M6K11k16K68j20L1L4Kn1q6j25J04
$$ y = [2, -69, -217, -72, -12, -171, -106, -1, 16, 70, 84, -9, -105, 7, 220, -48, 136, -151, 67, -31, 14, -55, 143, 88, 25, 16, -113, -106, -142, -146, -55, -89, -188, -90, 123, -51, 7, 135, 62, -148, -80, 68, 35, -153, -58, 76, -1, -42, 103, -6, 103, 79, -21, 138, -76, -35, -205, 92, 179, 139, -39, 144, -56, 7, 2, -66, -58, 101, 62, 44, -87, -2, 17, -62, -95, 95, -56, -146, 67, -85, 135, -65, 104, 49, 85, -66, 36, 52, 115, -36, 64, -240, 45, 108, -84, -116, 153, 48, 105, 56, 13, 106, -45, -44, -157, 36, 122, -193, -136, -67, -3, -67, -9, -70, -70, 74, 35, 132, -23, -51, -54, -70, 23, -137, -41, 32, 35, -6, -135, -135, -151, 104, 85, -80, -118, 111, -62, -133, 26, 121, 123, 49, -52, 260, -29, 0, -51, -22, 1, 69, 1, -107, -15, 99, 1, 106, -127, -21, 50, 52, -90, -163, 78, -125, -8, 140, 12, -46, -64, -24, 31, -49, 104, -67, 21, 46, 41, 75, -12, -35, 55, 98, -40, -107, 37, -78, 49, -10, 5, -15, 94, -22, -103, 72, -179, -133, 78, -138, 130, 10, 41, 75, 77, 26, -60, -185, -81]
7774h1P7R4n0JNj41J71j01O1J19M9j08j97K64j55J60l49P8OJ22j50K01rl7O8n2
7800D6q5K2P5k1m5M0l13J02J45R2j2j62MJ54J3j63J38k3M0j31R1m2N7M4mr5n6
7827h9p8K98l6k2n4j83R4J70L8j13l7k08K92M4j63l5Q1jj00J3J29J44j45o2J15
7852I2J9k33k0K25pj2m1J32j08n3K7l1p9L5K04j4Kj71L0J28l7q6N1PQ2l24n3J48
7880h7J30N6N4j22M0j34L8Q8O9j11R1r7j61J84q6J15J26k69J02J24k03j3J47m7
7904C4N8j32j28J12J7J49j69J10l5J05j33k7J18Q2p2k31J91l4l7kQ6k4K0k0k01
7929a63J39J55m5j2n1Q9J4j74n7M7J14Q4j77k1J82m6j39QJ13j49nJ29Q5j03n5
7954c8R8k40K10j44J1J16K1J01n5m3j34k3J12J0m9M6m4o8J05j6j20R6J46k29J44
$$ y = [-81, -4, 90, 40, 41, 46, -95, 76, -25, 36, 155, 204, 96, -101, 163, 8, 168, -181, -103, -97, 25, -125, 76, 67, 30, 98, 46, -39, -17, 58, 37, -8, 32, -281, -179, -34, 58, 46, -116, -112, 42, 55, -108, 30, 7, 47, -84, 7, -35, 22, 66, 62, -33, -89, -167, 131, 95, 73, 19, -164, -70, 100, 138, 25, -12, -220, 72, 116, -47, -82, -1, -2, -102, -89, 40, 184, 39, -23, 92, 111, -122, -142, 83, 76, 64, 23, 155, 47, -6, 21, -10, -89, -54, 150, 136, 138, -33, -3, 125, 88, 2, 53, 60, 142, -182, -235, -87, 43, 99, 153, 31, 71, -63, -25, 63, 132, 21, 112, 15, -146, 38, -48, 67, 193, -76, 26, 150, -53, -66, 81, 34, 92, -40, -168, -56, -39, 110, -59, 51, 16, 121, -12, -39, 79, 161, 89, -142, 49, 15, -22, -24, 62, 38, 58, 38, -163, -24, 131, 86, 74, 23, 112, 126, -48, -105, -58, 56, 140, -37, -58, 124, 78, -61, -53, 60, -89, -94, 35, 120, 17, -38, 60, -180, 30, -114, -103, 13, 34, 135, 80, 37, -97, -120, -8, 2, -47, -1, -45, -113, -8, -24, -144, -48, 98, -131, 13]
7979A3m3K2R7k31K25J2j38K7j19J79N7j06j4K21q5p8j49K04k83J51p8K15j53J3
8003d1J38m1j01Q6k08L23k34J56k92J04K83l31K62j23l1j4K4n5k1K30j7R3j64
8026B6O6j57J57k59N4J91j91K00l3J4J01j49l8n0l1K29K7k71J31o1N3P7j07R4
8050G3j75J75k21K06o2k57K03j4K54p2n8R5j41r2K7J6N8O2o0j14P7r7R1j40J09
8075e7q6J29Q7J4l4j89o1K80q0N7k13K76q5q6K8jJ45k50J24l4k5jj28J77O6j11
8101e8OK0n1Q8j16J17k4k7M7k58L45j40LJ12k6j44R4j03rj5R2J40m6j02J34n0
8127B9j29J48o6Mp1J06k6OJ67j93r3J42j23K81k55J77p2L4n4q4L1J52j88J99q0
8152D2j68ML05p2J2j35k5K49k49O7m7j06P6oJR1M1j03J93l2r9p7pJ93k56J78j35
$$ y = [13, -30, -8, 89, -142, 83, 95, -43, -16, -135, 44, 101, -5, -19, 202, 117, 39, -110, 94, -189, -38, -116, 99, -54, -41, 97, 56, -45, 41, -167, 156, -78, 78, -214, -110, 173, -158, 104, -19, -50, -64, -40, -95, -116, 114, 97, 190, 26, 92, -65, 92, -167, -113, 78, -113, 87, 54, 68, 169, 20, -18, -68, -99, 130, 157, -114, 17, -44, 9, 86, -21, 73, -102, 73, -148, 58, -4, -261, -58, -72, 182, 110, 52, 147, 6, -86, -59, -43, 15, 77, 17, -97, -20, -117, -26, -166, -57, -143, -14, 73, 87, 53, -136, -197, 83, 3, 60, -153, 123, 38, -48, -20, -21, 124, -126, -2, -36, -61, -62, -190, -13, 53, -58, -52, -32, -83, 5, -111, 6, -18, -45, 2, -256, 89, -51, -48, 64, 38, -106, -12, -115, -124, -139, -47, 93, 47, -55, 79, 29, -100, 48, -18, -14, -85, 21, -5, 1, 168, -25, -118, 24, -99, 182, -73, 104, 32, 66, 12, -72, -41, 111, -77, 122, 42, -126, -122, 183, 111, 123, -12, -37, 212, -37, 30, -17, -123, -47, -53, -52, 39, 80, -23, 170, 138, 39, -38, -45, 148, -108, 70, -65]
8179f5j5K70r3j72J4O8j08J00q5Q2M3M5
$$ y = [-65, -80, 190, 97, -75, -61, 7, -101, -1, -86, -4, 39, 84]
8191H4
$$ Imaginary data points
##PAGE= N=2
##DATA TABLE= (X++(I..I)), XYDATA
0@%%%%%%%%%%%%%%Qj6J6j6J6k4L2l2M0m8N6o5P3q8J04j20J36j53J74j98K25k53
36a33K82l18L58l98M42m95N48o04O69p41Q21r06R99j102J214j336J472j623J791
55I40j982K198k443K727l060L457l940M541n313O348p817J0083j4072K3192q6545
70g1686r097J14445r084o146l0534j3107O511L3638K0229M563j6015j1033l1425
83a8741n139K9379J0011j4453q72j3952m693R749P180P894K037q821J827r490
97h084m761J9224M351j0705K097l336j685M154J087L140l497k957P223j0818n594
112a0161J7730m215j0935R050k566m082O085j109p00R37J034M122q348o17J1853
127H078p410m254Q755n721j540M133n999J951L204j240L382o492l091R647m565
$$ y = [0, 0, 0, 0, 0, 0, 0, 0, 0, 0, 0, 0, 0, 0, 0, 8, -8, 8, -8, 8, -16, 16, -16, 24, -24, 32, -33, 40, -48, 56, -64, 72, -81, 93, -105, 120, -133, 149, -169, 189, -209, 233, -262, 286, -318, 351, -390, 431, -475, 524, -578, 636, -700, 772, -851, 940, -1042, 1156, -1287, 1440, -1620, 1837, -2103, 2438, -2875, 3473, -4344, 5739, -8333, 14859, -71686, -80783, 33662, 24578, 18432, -12102, -25209, -18698, 14940, 35169, 39732, 23717, 12684, -18741, -23880, 5499, 15510, 1057, 185, -13767, -18460, -8711, -1531, 6363, 8400, -421, 1406, -8084, -12845, 6379, 10730, 25, 2122, -1214, -2899, 1255, 2342, 5482, 1985, -972, 6251, -4567, -10161, 7569, 3354, -7581, 1469, -1097, -5179, 906, -203, -903, 34, 1068, 5190, -3158, -3775, 8078, 668, -3586, 5169, -552, -2092, 2041, -3958, -2007, 1197, -43, 3339, -3153, -6244, 3403, -1162]
142a162j961Q708m004j755K223l771K319R15j53L859q685q75R471p305j986R062
158D900o767k650M486l506K036L600q6Q02o264J978P204p367J357P261p466Q5
174c97L177n766K358K508k592Q80m354J309N962o285Q17N124o062J785M167l603
190i72K927O72j615J743m510K123N018p879J230M870p256J889L035n411K607J627
206I8j492J480k355L224L341p199K466M176n262L718J710n903K879P84k755J398
222C08k496K389K087o313K441L067m911L716Q84m615M317Q51j559J797k385K117
238A695J450n827L213K646n151L700L7n866L871J14k315J735j472K139J334m788
254c485L749J923m143M381p35l959N036k88l008J673j883J684L54m837L430J084
$$ y = [-1162, -3123, 5585, 1581, -174, 2049, -1722, 597, 1512, 1359, 5218, -3467, -4342, 5129, -2176, -4162, 4900, -1867, -4517, -31, -3537, -1501, 2099, 2013, 2815, -3449, -1471, 5733, -1634, -277, 6984, -482, -397, 2780, -2986, -628, 1880, -712, 168, -4186, -2877, 3085, -3200, -2383, 2741, -3321, -1536, 2631, -972, 1955, 2627, 1012, 2755, -1755, 368, 5386, -2493, -1263, 3607, -3649, -1760, 1275, -4136, -1529, 98, -1394, 86, -2269, 955, 4296, -2903, -437, 3739, -1523, 2195, 3905, -1998, 881, 1665, -1090, 308, -2188, 201, 2288, -4025, -1584, 1483, -3428, 288, 1172, -3443, 874, 1725, 166, 1963, -422, 1695, 3145, -2682, 531, 3177, -1974, 1726, 1763, -4103, -232, -118, -2433, -698, -2170, -31, 1303, -3485, 264, 2187, -1956, 2425, 1690, -2269, 2767, 2479, -529, 1144, -739, 945, 1299, -3538, -108, 976]
270I76l760L635j693l203N550r77k190K290q96K100M36m042L445M22l330L817
286B580k010l209M863j691k514J701j305J420L14l186L409L5k423L918k089j926
302b113N388j952j939K237j365J539n23l637L478n98k495L358k797j611M982k669
318g17j966K582p94J843j37k580L529n18j723L297l158q05M527l157j687K387
334I23j736J212n59k682K949p22j019L051l016Q1M207l146p70K618j113J459o04
351A133k102K731j123j340K339l090M65L423m264m24K714j430J197p84j593L292
367A144j026n41K406l045J284K990m296K84K610j966Q96p61j797K426j186l91
383i69J665k785J346K547l874J270K325j826J541o52j469K637j289k61J320l022
$$ y = [976, -2784, 851, -842, -4045, 1505, 528, -1662, 628, -268, 1832, 2268, -1774, 1671, 2093, -1237, 2580, 570, -2639, 2224, 533, -1981, -280, -1585, -165, 149, -3037, 372, 407, -2016, 1902, -187, -2113, 3275, 1323, -616, 1621, 256, 1795, 1272, -2365, 1113, 515, -1980, 1378, -1419, -3030, 1952, -717, -2683, -101, -895, 948, 811, -1769, 1760, 1242, -481, 2816, -342, -1147, 3380, 223, -1464, 923, -813, 399, -160, -2842, 107, -615, -1634, 1417, -1599, -1518, 2689, -457, -1227, 1391, 278, 1737, 1133, -969, 1762, 639, -701, 1638, -1452, -987, 2436, -1828, -2252, 462, -968, 229, -555, -2148, 1144, 118, -423, 1983, -1062, 222, 3212, -1084, -800, 1810, -156, 740, -21, -1818, 608, -578, -969, 696, -2089, -743, 1804, -2070, -800, 1525, -301, 1240, 588, -881, 1756, 467, 206, 1526, -1496]
399a496J632J956m138J239J762k199J209n57j134K419j260j24J522k097K301J444
415B479l984K126J723k377J156o88j148K025j718k29N06k394K620P17l704K253
431f37J688k232J835o30o38K342j307K72N35k104K647M4l650K253N07k153J550
448C22j016j008K299j642K57N86j360K634l35k952L300M50k248K123q87m56J528
465A595j541J14L92j441J932p56l134L223j75k182K191j036m43J955j259M56O14
482E05r86K515q46k501L235o36j966J929j566m59J609j801K81L2q09K155r24j869
500b102L404r67j584K303j312J91J835j977L74L73q41J646j677j058L220j694
516A34j503K218j942L71J486j807M34R60p90J356j423n34K944j712p19K003j798
$$ y = [-1496, 136, 2092, -2046, -807, 955, -1244, -35, -592, -1726, 693, -567, -691, 831, -1266, 1035, 2479, -1505, 621, 2344, -33, 1123, 435, -713, 1312, -406, -635, -129, -2523, 97, 814, -2890, -637, 1051, -1181, 654, 24, -614, 1728, 421, 693, 1228, -876, 1771, 1815, -1835, 418, 925, -1228, 322, -694, -1702, 597, -1045, -788, -202, -1562, 1072, 737, -2215, 1085, 1535, -713, 1410, 523, 67, 1595, 54, 168, 560, -881, 1051, 295, -2839, 384, 209, -1973, 218, -818, -1261, 694, -565, -109, 505, -481, 2034, 1188, -1313, 1922, 1286, -680, 1249, -317, -776, 833, -968, -687, -655, -1464, 691, -233, -2102, 1302, 335, -1249, 1054, -258, -67, 1768, -209, 165, 538, -303, 1343, -334, -1392, 1828, 134, -1369, 849, -1093, -722, 764, -1043, -609, 351, -439, 917, -506, -1040, 1904, 192, -527, 1476, -322]
533c22L88J194k092L11O08o29J168j704n33K780j788n02K200j571P91J229j905
550c77O09P63n53R61k182O6K249k605j12J942j970R33R83k408Q90J137p65J216
568G77j211L35J925k529M71J793j805R58P41k395R58N27j056Q48j508M12J721
585I62k170J57J309j602J260Q66j857J235P35n66P37j377P24J541k432N99J139
602A260k342J269M97k358J472N33j197N98p89P94J339k131J157J257k018J492
618H33N9j902J993K89j131L72j255O00J022k070N72Q98j487J722l32j735J960
635D08J0o27N44q55R13J066k085J139L38j535J714m55j854J736j80j210P52p85
653i66Q35N08j707J131M86j031J878o81j492K468p23r21J049q02O38L34k145J094
$$ y = [-322, 66, 1260, -832, -521, 87, -542, 626, -1078, -1611, 1169, -619, -1121, 1079, -492, 299, 1528, -377, 232, 995, 442, 1403, -779, -713, 1536, -1069, -1181, 761, -1209, -276, 707, -1701, -811, 326, -439, 777, -434, -99, 1826, -703, -232, 1561, -244, 714, 1455, -940, 18, 545, -511, 337, -1171, -759, 962, -1208, -1051, 258, -1344, -84, 782, -1075, 160, 895, 329, 1066, -311, 413, 1954, -478, 121, 1260, -1082, 187, 684, -1674, -202, 331, -866, -268, -1057, -263, 1076, -1055, 102, 1359, -659, 833, 892, -1010, 983, 1272, 141, 513, -742, -142, 880, -1190, -618, 280, -1207, 515, 183, -1552, 408, 418, -209, 335, -520, 393, 1459, -626, 513, 851, -684, 1030, 575, -1279, 457, 277, -933, -181, -966, -131, 377, -1330, -199, 287, -744, 1134, 453, -1039, 1429, 706, -215, 834, 32, 670, 1004, -1141, -47]
671d7K16j180J537r22j251K090o55p40J100p32J163K60j597J311J58r88J636j296
689F3j210K442r42q77P64p71O64j00j339J217m7n18J449j381m22K191r62m11R85
708G95p46M65K09j246J182j90r11R26j013l73J701j331m06R01q00J094K7j159
726h75J326r8n98J212j183q0J808j469m68P69o66P01j66j290J065l20o38J202
744B32j214L87J710j718K53R09p38J006q9j108J166j78o45Q31j243K60Q31j545
762h93L45Q36r81P71k73o32J057l50k36J019q64L62J083j470L68P47r70O82l90
781B11r90J302p15l40Q57j474Q44Q46j639Q21R91j032R28m11p66J428n72j41O35
800G83j242P68M24j531R86J19r72Q22m14o22J258o84j44P27r52R32O44j404R28
$$ y = [-47, 169, -1011, 526, -396, -1647, 443, -212, -952, 148, -584, 579, 839, -758, 553, 711, -277, 1359, 63, -1147, 1295, 353, -524, 240, -531, 133, 33, -1306, -89, -136, -654, 795, -586, -1008, 1183, 221, -190, 795, 49, 514, 723, -523, 659, 469, -442, 484, -529, -902, 799, -532, -938, -37, -837, 257, 284, -875, 451, 353, -245, 967, -216, -296, 1512, 43, -425, 344, -322, 379, 213, -1077, -12, -332, -970, 232, -982, -595, 1115, -603, -350, 559, -179, 827, 738, -370, 796, 618, -27, 804, -439, -179, 652, -893, -548, 288, -693, 78, -195, -827, 230, -120, -356, 663, -201, 161, 1244, -226, 142, 889, -81, 601, 211, -779, 523, -192, -532, 325, -1149, -305, 541, -1098, -277, 714, -318, 610, 199, -567, 861, 289, 148, 783, -459, 309, 733, -798, 188, 307, -665, 157, -257, -879, 379, -305, -449, 278, -674, 258, 902, -502, 426]
819D26L27j002J002m80o40J238q50k43N01q61Q04K00j702J035K76m75O85l47m06
838e12J305p31j27O26q44J080j4j413J125M1j038R16m37o62J191r89j19O72o89
857f19Q31n1j178J432k2p18Q58l87k46Q62q90R6N42r24Q77m06r76J177k38p20
877g00O74o02K31Q78q51O8M62n76R85j90q99J336m93n33P73j033L63Q26j247K74
897b54L74p65Q66k57q55J395n39m74J027p35J56J003j177L89L91o33O41n94o25
916f66J290o74o08R80j000M54P48j328N78N59o06O33m51l41J286p25l29O99o07
935a08N24L87j322M21K58m22N40p22l14J069p68p3O97p37M51Q83j213M47M83l16
955A65N72o71k47J085r17k19O01q17N10L71j366M51M66m75O10o36R4J215j104
$$ y = [426, 753, -249, 753, 273, -367, 871, 21, -222, 279, -582, 222, 422, -1280, -245, 31, -444, 241, -106, -512, 793, 62, -65, 561, -283, 797, 783, -630, 495, 536, -502, 414, -23, -685, 506, -483, -602, 70, -619, 212, 161, -1017, 415, 393, -325, 533, 146, -100, 762, -128, -32, 510, -414, 463, 57, -919, 258, 20, -700, -26, -628, -397, 481, -370, -302, 160, -416, 569, 379, -520, 816, 323, -210, 563, -470, -107, 719, -528, -254, 120, -645, 221, -36, -891, 504, -35, -509, 518, -217, -61, 942, -235, 154, 545, -88, 553, -41, -666, 624, -50, -658, 322, -678, -224, 524, -804, -226, 333, -273, 360, -91, -432, 854, 129, -200, 499, -108, 416, 803, -519, -98, 160, -262, 278, -444, -758, 311, -457, -530, 167, -570, -119, 764, -449, -2, 481, 165, 737, 66, -181, 904, -13, -232, 369, -448, 62, 433, -933, -482, -16, -491, 119, -517, -423, 792, -312]
974c12J19O82o97Q28J70j114N49l7k94L63p09m1R02r24m8O06q53P84K89q61O37
995C9K75m61O56p19K67P26r71M49L28r58R12l31r90O66J4m04N70o82K32P80r74
1016e76O54L75p73P80J9r33R25m1m97N01q68K92N46r00K99K64o26O73j71q60J141
1037B24j08o05P17n26K76P37r81N60J08q12J205m94p98J064n03o33P50o24K81
1056a62L68q82O94k3p26J035j49n98J191m64n69O76n49L72K52p47N65j65n53P48
1076C14n05m99J025n23l45O61l66K55L34o76O83n3n21Q00n63l00J019m98m24K35
1096E3l13J69l8m59O06j01n16R48n13k45O82m48lN85m90L68Nn80P20j86l14M23
1118C53n32k77Q70p78j35O58o27M72J23n72N63P4m94Q02q09J24J045q57l6M52
$$ y = [-312, -193, 489, -208, 620, 790, -324, 225, 188, -106, 257, -452, -493, 409, -515, -563, 43, -810, -26, 263, -598, 39, 314, -147, 509, -210, 57, 783, -188, 261, 589, -369, 543, 212, -778, -112, -98, -502, 68, -614, -382, 398, -576, 78, 453, -320, 460, 479, -454, 471, 430, -67, 434, -434, -142, 404, -496, -197, 67, -559, 114, -57, -917, 224, 116, -489, 228, -298, -22, 715, -266, 294, 402, -410, 795, 301, -497, 567, 64, -569, 181, -443, -162, 206, -676, 18, -5, -731, 304, 155, -443, 748, 284, -285, 391, -158, 214, 466, -281, 284, 119, -434, 314, -191, -690, 335, -188, -533, 128, -238, 17, 351, -325, 358, 305, -216, 584, 21, -279, 740, 242, -182, 53, -260, -91, -129, -588, 18, -83, -599, 349, -164, -409, 273, -175, -178, 407, -83, 285, 290, -290, 430, 244, -70, 353, -179, -456, 414, -364, -499, 159, -468, 4, 127, -445, 118, 192, -302, 500, -309, -185, 860, 3, -33, 419]
1138D19o67M37j3q70O36k2m46N45n61K27Q22q69k2O56l56L27K09o18O05j73l28
1159f2M36n44K83N62r92n8N54o09M44j31l65Q56k03l63N17p99N94N15q75K92L64
1180D16m99N22k95o34P93k19k43J63m96K02O75j039N03M06o82R35m35m21Q04k34
1200B22j22K48n95M68M02j114M97K83o80N01l96l17N27k05n4N65p07Q61N0p16
1220b82K20M36n96O24j69o03P29m12j51L30n23N20M5o79M34O9o21P83k72j74Q02
1241E10n41J06K09n00O37J19q86O71j16l30L75l36k28O19m10j68L80n05M86O2
1261A54o68P53J47n20N17m73j12P14n01lL97o22N68j06o70M47j58l06M02k25P2
1282a93N50n53l5L28j62L85o5m52O90l28l66O09n14j4K76m31J63J58l33M87j6
$$ y = [419, -248, 189, 176, -694, -58, -80, -526, 19, -542, -315, 507, -362, -384, 272, -84, 243, 452, -166, 439, 266, -62, 374, -170, 113, 675, -317, -375, 179, -430, 14, -117, -482, 374, 171, -192, 325, -474, 120, 635, -240, 52, 416, -83, 439, 144, -490, 303, 84, -159, 4, -492, -290, 385, -654, -151, 255, -427, 508, 73, -348, 456, 222, 100, 348, -247, 221, 623, -491, 6, 289, -391, 110, -286, -603, -76, -281, -335, 230, -477, 384, 434, -282, -62, 374, -222, 402, 233, -370, 359, -53, -204, 126, -397, 123, 168, -511, -77, -8, -629, 154, -118, -292, 510, -31, 75, 284, -216, 421, 540, -346, 325, 209, -121, 254, -82, -310, 309, -101, -269, 111, -394, 92, 154, -514, 239, 386, -134, 383, -90, -202, 512, 11, 8, 405, -217, 351, 245, -425, 22, -136, -442, -40, -265, -193, 357, -196, -231, 97, -65, 320, 255, -197, 493, 165, -201, 408, -106, -120, 156, -275, -112, 46, -287, 200, 184]
1303A84n47L73J2l52O47m47K9M14m67L29K25l86K29Om86O11k74l94M44m82q1O13
1325B00n53L6M28m76N69j49l38O82n06o1O14o29L65J60o94N57L7m90K81k79k30
1346d76M91r7j19N16o34K41O45p35K86O0l40M91k24k02O46n08p0J46m28K72K58
1367B19o46K58R3k18K53k50l7N89k46r7K96k09J87K79o18M19j01j46L3o8j37L83
1389B36o58J69K83l85L04K99o66M65K28m62M63k66L3K99l14J04L22m96K20Q1n91
1410c32K11K08l54L77m92L31L18m78K4M85l94K24N4m02N63Nl67K41l97K61J24
1431B10m57K31J60l54K86q8m50N34n9k78L63k53J31L99n07K32J34k92M97m18l07
1452b86M51j34j33K76n10L63k9m74K97K37l57L55j9k95P15j90k71L03k29l5K89
$$ y = [184, -363, 10, 22, -330, 317, -130, -101, 313, -154, 175, 400, 14, 243, 249, -237, 374, 100, -294, 150, -332, -413, 200, -353, -317, 111, -365, 204, 55, -283, 399, -107, -168, 446, -183, 182, 342, -352, 205, 242, -248, 33, -246, -476, 15, -82, -201, 315, -319, -78, 567, -168, 118, 178, -162, 329, 105, -97, 549, 41, -29, 117, -311, -39, 219, -427, -169, -76, -294, -41, -291, -328, 261, 15, -82, 214, 5, 192, 471, -147, 272, 171, 25, 58, -10, -147, 236, -422, -253, 30, -355, -51, 248, -418, 47, 275, -187, 276, 10, 43, 342, 28, 132, 454, -42, 178, 259, -332, -121, 87, -267, 110, -382, -51, 267, -211, -187, 298, -96, 128, 182, -220, 343, 348, -19, 222, -175, 86, 210, -247, -16, 144, -210, 76, -12, -462, 72, 13, -265, 98, -155, -24, 375, -132, 100, 234, -58, 439, 21, -286, 165, 31, -102, 174, -336, 27, -2, -476, -179, 58, -299, 56, 37, -258, 457, 267, -4, 299, 70, 35, 324]
1473C24m76K69j5l86L39l9m86N83o9l01L29l35J38L59l19Q9K84l18J83j33k18
1494a98N86l56r1L63o32K05K06l93K79Pj89K49l2l15M75j76KK23l99L09K27k97
1516E3k9L6j28M52o13n2K82j31j2R4k98K45J48l04J78n5j7M61k62k11M73l06q8
1539h4K38l15K12J44n63L49j74J61K39n11J22M28n51J30L86k89PJ13j66J60K40
1560B76m26J82j03J14J25m53J78K37n14M21j07k85L92j33j11K89o2k00M83m61
1580a58K37R8l11L61o1k11J87r3k03J65j09kK02l65L3K61k19K67j47j03M37j45
1602A21k54L02k51J33K84m47K34R0l28K06L2m20M14j49k07K73j48Q9K63l29J95
1623A03N5j73J94m8k73M04k8k65K04k01j6J28l21K65Ok73J97%r4P3J96j48L40
$$ y = [324, -152, 117, 102, -284, 55, 16, -470, 113, 44, -257, 72, -263, -125, 234, -85, 4, 288, -30, 153, 20, -198, 388, 32, -59, 304, -328, -123, 83, -310, -31, -24, -213, 36, 4, -311, 164, -12, -10, 213, -186, 123, 350, 53, 24, 60, -68, 384, -229, -281, 1, -130, -142, -48, -346, -101, 47, -257, -79, -134, -151, 310, 48, -163, 310, 4, -84, 154, -161, 51, 195, -368, -19, -193, -32, 207, -304, -182, 246, -305, -175, 211, -78, -71, 42, -124, 36, 276, -150, 32, -71, 43, 168, -285, -107, 130, -384, 37, -70, -355, 37, -96, -207, 82, 20, -180, 303, -158, 79, 177, -134, 227, 166, -45, 142, 49, -154, 11, -98, -100, 102, -263, -230, 31, -188, 79, -68, -171, 266, 121, -133, 169, -82, 51, 335, -112, 122, 212, -116, 90, 122, -298, 116, -33, -240, 33, -115, -26, 237, -92, 103, 158, -15, 179, 131, -142, 262, 234, -31, 173, -28, -44, 84, -237, 28, 34, -239, -42, -42, -136, -63, 133, -15, 325]
1646C25m41K74p6l04M04Pj48J82j90qJ17j45j39Q6j34J25J26m01L55Q3k15L52
1668B35k20p0L67k80R4K50l18M9Ml48L04r6k62L63l11j46N96m11M9K68l29K22
1690A0K15m44K82J38l53K40n4P4K06n16K16Mj64Q1J12l45K11J08j11L85l76K06
1712A25K6o6p1L14l66L01k35l31M69j44j09J74q4k12K81j52o0K09k74J38L6j34
1734a65M61k21j71L65l36Q1L02l40M3K28l81J70J27l60K57m6j96J58r2p9L50l90
1756b35L2M38k21J27j25n0J81n1M3M6l76K44Q6l85J8N36l60J00j70n3K49n9k70
1779b55K83j68L11O8m44O07q3l33P2q3j76L15p3q0Nj47K09M2k46N7L4k6K10k4
1803G5j53L74l54m2L8n9K15N7l34L67j44j84l1J16r6L06j47k12L54l44L19K42
$$ y = [325, -116, 158, 82, -222, 182, 189, 41, 223, 33, 25, 142, -3, -142, -56, -190, -65, 61, -340, 15, 98, -117, 235, 15, -55, 312, 32, 126, 376, 58, 107, 111, -237, 67, -29, -291, 72, -239, -385, 211, -200, -151, 117, -212, 10, 225, -219, 63, 201, -152, 88, 34, 108, 314, -202, 14, 18, -146, -65, 47, -298, -87, 21, -90, 295, -81, 125, 151, 85, 14, 328, -38, 263, 28, -303, 166, 22, -87, 87, 3, -209, 72, -80, -140, 69, -205, -67, -31, -165, 296, 75, -96, 269, -67, 14, 316, -24, 19, 247, -134, 36, 163, -197, 60, 14, -182, -24, -116, -195, 155, -235, -203, 235, 14, 141, 16, -34, 147, 96, 139, 185, -191, 53, 139, -246, -228, 308, -52, 48, -122, -175, 74, 15, -255, 28, -140, 171, 239, -205, 402, 319, -14, 58, -25, -201, 114, 41, -39, -34, -181, 28, 70, -176, -119, -85, -111, 99, 75, -78, 296, -58, -100, -62, -121, 94, 151, -183, 184, 40, -144, -175, -59, -155, 151, 4, -208, 146, -198, 121, 363]
1825C63l52J48R7j79J17j91j08K43j91m7M24m49Q1o9n2J94j54L1J05p4M9J49o0
1848G5o9J07j80L03l6r6J13j84l7o5k7k1J86l15R1M17k09Op4j77K10J01m9J75
1872B45k23J20J44j84k1M7k47K48r2k91M22k50l7J99l14J78J68k25o5K07o0K60
1894B29j80k9J15j19k14L45k87J78mk16M22l40MJ49m0k93O49m09QJ10j16J73n6
1917G9L2j34N2k33L50j44j38K88k62l0L22k50KQ8j80J80k9ll5Mr6K54j58M9J75
1942A83l01L3L12m48K87J9k44J30p5J22J71j45j70L65k86J38k3k12K34r3l6J65
1964A26N1k17L18l38J00n0j24O3J89l69K37P9k26L12k39mK80k06J94r0j78J53
1986F1O7k15R3K8k08K66j60o1J55j48j58K66j90K00p0m1K77j44q7K19k63K72L7
$$ y = [363, 11, 159, 256, 77, 194, 3, -105, 138, -53, -100, 324, -125, -44, -113, -165, 29, -125, -94, 11, -63, -14, 135, 75, 6, 113, -67, 236, 200, 104, 217, 33, -4, -69, -96, -117, 69, -246, -155, 262, 53, 59, -15, -192, 18, 119, 70, 245, 22, 142, 286, 102, 81, 128, -119, 129, 37, -254, 168, -82, -119, 80, -234, -56, 112, -113, -178, 29, -31, 229, 49, 20, 135, 16, -198, 147, -140, 38, 34, -182, 240, -100, -96, 53, 13, -280, 369, -40, -32, 78, -38, 135, 79, 111, -23, 29, -204, 146, 2, -136, 152, -110, -140, 182, -68, -66, 22, -158, 22, -7, -10, -45, -41, -137, 117, -41, 8, 183, -118, -85, 227, -221, 66, 85, -159, -29, -104, 18, 189, 44, -126, 239, -47, 91, 68, -144, 90, -3, -39, 126, 177, -40, 278, -60, 40, -10, -134, -71, 118, -251, -14, 65, -161, 151, -88, -92, 188, -18, 176, 86, -92, 61, 128, -87, 6, 34, -174, 92, -68, -129, 26, -122, -280, -14, -204, -4, -74, -115, 162, 18, -69, 150, -113, 159, 196]
2009A96k86Q5j0j24R4O7j43K11M2k72N4j63K25Q0j9J5P2k57K71k33O3K0L5O8j41
2034e0l5J22J07l86J97J37k21J12k43J61J62j47n4L29j53J11J9k56J90L1j22K00
2056B11p0l07L19q7K0l4j18O5L3j00J23M8j62jN2M4J6J04j46J41k03K08k35l5
2080a14P9j05Q8J16o5k5K14k80L6K6j28J01J36j53L20r3k14J10P9k21K88j49k4
2103B2J08k50J44l0l8j75J51l8K89k25j3J98k34J38n9o2K49mj85pPL4Nl3J9Or7
2130h0j3K9L8Q8p5j53Q4J36J4l2j12J63Rj59k8J62j15J52j23q5K34k74j23M27
2154A64k22m7J84k08J83j08r2M7J02o3J48Pp4K06l84J17K66j62j39P5o5J63k18
2177a20o4K71j02l8oqJ56N4j62j1rj00J16L0k28L57k95K05L1k52J45l8j4M0j34
$$ y = [196, -90, -5, -15, -139, -45, 22, -121, 90, 132, -140, -86, -249, -24, 56, 37, 52, 124, -133, 138, -95, -32, -12, 23, 91, -50, -85, 37, 144, -242, -45, 92, -129, -17, -260, -99, 63, -84, -138, 191, 38, 149, 168, -88, 102, 133, 11, 211, 141, -166, 153, 66, 86, 52, -66, -1, 32, -68, 55, 103, -59, -60, -8, 36, 52, 156, 10, 151, -52, 156, -79, -114, -35, -140, -52, 64, -1, -26, 188, -92, -56, -30, -158, -57, 79, -74, 246, 153, -61, 49, 128, -93, 195, 46, 22, 130, -120, 24, -6, -44, -219, -68, -106, 183, -42, -55, 143, -91, 47, -12, -74, 175, 171, -14, -21, -14, 20, 25, -8, 11, 17, -80, -93, -64, -26, 62, -13, -166, -82, 54, 68, 36, -76, 87, 96, -63, -91, 71, -44, 108, -15, -100, 134, -140, -263, 164, -58, -105, 79, -129, 54, -54, -146, -99, 3, -60, 88, 95, 21, 227, -157, -40, 226, 64, -75, 0, -65, 98, -120, -184, 87, -15, -53, -59, -67, 89, 143, -19, -30, -39, -139, -23, 7, -221, 136, -159, 46, 77, -175, -30, -68, -82, -42, -176]
2202a76N1J07J28K02k35k99J66J77k54J59L9p3j3J65j79j0J96k44M3l0Q1j26N2
2225g3L7Ok51L59k4j17K91k91J07P7j85O3o5o1j83K94j33K03K00m15K32K3k15
2248a21m6K64p7n2j14L07j45q6J43n6n2J73j59J6L8n2j11J25K0k2k4O6J13k01
2272e3J2m6j43L61J10l67K05K1j45mRq4O0N7j68J27j21J71JJ53r1nKK02j63r7
2298Dm6J44N8l1p1r3L0k47K21k5p0J88j62j54L83j29k8L7q7L1m5N0K99j38j61
2323d2J9J25j92K28m6j83L7Pk3J83j4rJ30l51J56k9j5o6J27r4O3p3P2O6k59J87
2349D%O0m5J8j24J51j86J73p5o0J41J36l89L29m2j90K10j53p8P7L00k74nr1J54
2374D1j34l2J33L1o0O8q3k7J02L4j26K58j90J18j40pJ92k05J03q3J76k13o0q5
$$ y = [-176, -125, -18, 110, 312, 77, -222, -56, 121, -133, 26, 65, -8, -21, 144, -35, -45, 151, -93, -50, -80, 1, -125, -73, -36, -30, -281, 78, 54, -63, 228, -63, 44, 121, -64, -1, -66, -127, -310, -16, -149, 54, 254, -161, 71, 94, -121, -167, 97, 20, -32, -146, 161, 16, -70, 73, 17, -35, 138, -21, -5, 33, -19, -130, -5, 15, -7, -31, 35, 148, -53, -41, -87, -230, 131, 241, -126, 79, 100, -45, -49, -40, -124, -64, -7, -175, -48, -169, 2, 3, 156, 65, 60, 62, 264, 101, 4, -42, 102, 160, 129, 58, -35, -5, -252, -31, -56, -126, 62, -100, -254, 129, 0, -28, 9, -78, -47, -92, -42, 257, 119, -42, -23, 102, -90, 138, 92, -91, -54, -47, -70, 113, 99, 90, 220, -131, 25, -4, -19, -85, 42, -52, 11, -62, 10, 76, -183, 4, 4, 64, 19, 37, -87, 64, -122, 51, -24, -84, 57, 193, -196, 133, 91, -99, 111, -42, -120, -43, 257, -17, -22, -113, 41, -93, -125, 8, 39, -21, 47, -36, -63, 39, 73, -53, 205, 15, 133, -7, -14, 178, -27, 76, -7, 169, -44, -104, -189]
2398a89J35kN0J04k51Q6J14j13NJ86j75KK65l99K37N4q5k3O6j12K42k25M8P6k26
2423a30O8K18k12O0ln0K1J82k22J05J14j78P3%n1J19j71N9q2o2K34n0l6J07l3
2448H0N4j83J14P1j15N8nq6M6L7q5p6J76l8j79K92j26p1L5o5L62l95M2k9K15j65
2474c6o3P0Q3N0k41J85O2j59n7J08O1Lj06o4p2MJ98j38qJ22N5n4K19k49k6q6R0
2501d9J14J01l01J07J76q5J71j87J16J9j78n7K53k19m5J04p8K8L7j38J47O6j16
2524a4M4Q3n9k0k9o6J45p8jl9J28J07k3k93J75R9j38J34j54KR3k34J60j1j59J84
2550C6m3n6l5J35j64Q2J31j32m0l0k1J62Op9O8m1O5r8K5j24J05J38j77p5K20p4
2576a6n0j7J9r1K68r3q2q2J50O2n8L3lq8l0N7K6q3J31j50K20j06j02L3Rk9n9Q5
$$ y = [-189, -54, -56, -6, 98, -153, -67, 47, -66, -61, 125, -50, -48, 217, -182, 55, 109, 24, 1, 67, -45, 197, -28, 20, 96, -130, -62, 156, -56, 4, 1, -49, -28, 154, -68, 37, 151, -27, 46, 46, -5, 114, -57, 2, -80, -142, 92, 42, 6, 113, 80, 134, -49, 65, 136, 21, 79, 74, -12, 34, 71, -14, -90, 86, 48, -131, 161, 35, -36, -1, -66, 296, -99, -57, -86, 129, -36, -99, -29, 54, 104, -137, 48, 110, -49, -106, 2, 63, 66, -40, -104, -176, -172, 26, -112, -120, 2, 57, 3, 222, -27, -53, -139, -49, 65, 166, -135, -28, 148, 63, 234, 47, 163, 182, 4, -53, 200, -19, -64, 40, -38, -10, 27, -111, 36, 102, -14, 30, 113, 54, 34, 5, -61, 84, 6, 5, -34, 94, 201, 178, -115, 60, 159, 21, 155, 1, 3, 96, -138, 22, 11, -148, 36, -7, -63, -98, 37, -127, -45, 86, -46, -86, -116, -137, 25, 31, -48, 20, -21, 44, -54, -29, -153, -48, 90, -87, -162, 58, -16, -66, -83, -64, -155, 113, 20, -62, -144, 6, 68, 10, 43, 40, -48, -78, -21, 5, -78, 53, -97, 123, 17, -85, -52, -43, -72, -131, -46]
2604d6J35q6J4k26K06N2K3M2j55J00j47P8j30J04P2J47l26R5J03p0l2qM5O9p7
2629a8m4O3j49L49j08m6KL9m1l0o9J13R5k90J09j10J18J17j51j69K11Kj44m6L24
2654A27j21q5J06J05j04k28J95RP6j9j52j17L18o0On5Q7j85QJ22j50K25k10J04
2678Bj6J6J59p7l3q9mJ9J11l4j32J29l0J02o6j67J55j43P3Nkj26J05J62j50N8
2704B7k54J44K54r9p7p3N6K8Ko3q3K11j68J79p3l9M5M9j14J77l3m1n0r9J6l7J46
2731C1j36J32q8J5J88K0k76J34j6J14N7j85Q5k92K75q8o9R1n6J35j83r5J73j44
2755a78K48k13J53j55M1R6MR3r0q0K58k36K58j24j50L2Q3j39J60j88R4J42j11
2778bj32K29r8k9R0k85J22J33O4j65J95k41J43j61J63M3N1j23n3J55j40P0j4%
$$ y = [-46, 89, 3, 17, -209, -3, 49, 72, 114, -41, 59, -88, -10, -140, -36, 36, 183, -143, -48, 55, -15, -47, -55, -10, 59, -18, -62, 1, -148, 201, 93, 47, 49, 88, 47, 17, -52, 61, 156, -134, -25, -135, -17, 100, -51, -220, -9, -7, -151, -197, 127, 6, -79, 27, 132, 28, -200, -5, 4, 80, 61, -91, -208, 110, 50, 56, 1, 88, -97, -89, 33, -117, 108, -102, 2, -14, 2, 161, 84, 51, -38, -42, -23, 88, 54, -78, 51, 21, 123, 57, -110, 45, -98, -25, -20, -22, -148, -43, 119, -31, 27, -227, -83, 171, 72, -5, -78, -22, 6, 8, -55, -138, 73, -95, 84, 11, -28, 17, 66, -48, 129, 96, 55, 5, -94, -78, -115, 31, -105, 27, -61, -46, 142, 162, -114, 20, 4, 118, 175, -10, 75, -217, 58, -30, -99, -8, -64, 71, -112, -207, -34, -178, 70, -143, 10, -145, -104, -8, -4, 89, -1, -81, 177, -59, 199, 75, -75, -43, 40, -99, 61, -127, -33, 109, -2, -134, 95, -3, -32, 58, -227, -105, 28, 92, -73, 122, -119, 24, -137, 26, 69, 120, -3, -56, 99, -41, 29, 15, 15]
2802A5P7j25JJ34j11k04K70o5P3P4r9j19K14k17J1J22j36pJ26r0j54K02Mm3L2
2827a5K1q6J39k51P7P2m8K62j77o4J90k42J39K16m40J83R1j35L04j58P0j88o2
2850a02J35J8JQ4N7j78J09o3j97J16N6j36m9O2kQ9O3j96P5M5O0j37N1LK09j19
2876E4Rj89K33j33p3R3k9J92k21R0j28J44r3P5j3l4K3o9J82J6J5j60J3N8k02L42
2902A95j93p2Q5N2j1p3p8J39j46j3k1N5L2L4J4O3o2j28Q8J04j3j98K62k67J42
2927a0k8J4J59j39k9J9M4R3m2r6O8j17J72L8j18K5j06O9j26J16N3K7r2q6l0K34
2953A12l7r7j32J49J34j62j03J74p3mO9mO0p8k06L30k4Kq5K4p7M6R5j03oO3k08
2980a41J19L8K7N8j30m4J50q4o1o1K5mJ24j16K39k65K42L7j13j39O2O9L8j10j30
$$ y = [15, 92, -33, -32, 102, -9, -213, 57, -8, 65, 139, 40, -79, 135, -82, -71, 51, -85, -92, 34, -56, -210, -8, -4, -47, -15, 6, -80, 59, -192, -115, -43, -91, 171, -6, -70, 120, -122, 17, 233, -207, -24, 67, -68, 236, 78, 148, -40, -102, 33, 51, 52, 136, 193, 15, 124, 61, -136, -20, 36, -100, -149, -87, -89, 0, 63, -133, -58, -13, 47, -90, -39, -36, 173, 54, 63, -126, 107, -26, -99, -6, -35, 157, -64, 26, -102, 42, -51, 24, 11, -23, 0, -69, 113, 129, 144, -16, -3, 55, -147, 195, 2, -70, 15, 67, 56, -17, -95, 44, -102, -115, -136, -81, -49, -15, -1, 62, 0, -128, -40, 64, 51, -147, 115, -152, -10, -38, -24, 135, -4, -33, -14, 30, 123, 81, -15, 53, -64, 108, 146, 28, 53, -53, 16, -110, 6, 59, 86, -6, -92, -122, 112, 75, -22, -154, -5, 129, -33, -136, 38, -35, -39, 30, 26, 86, 8, -198, 132, 108, 110, 25, 49, -28, 18, 113, 10, 4, 67, -141, -22, 16, 43, 101, -29, -73, 77, -7, -68, -129, -104, -108, 16, -100, 139, -126, 116, 153, 40, -99, -37, 32, 70, -40, -170]
3005a70J51L4j8J6o8PM1J8m5n9N9o8J08m0M1J25J18l09K2J06q0j02Q8K07q1Pk5
3032H3m68L18L40k62k16M9J49J00j02O7p5n0m2K00k4j43M0Mn2P7k7mn0J61k0j30
3058g7M0J05j8lj26kJ48j2K26m17J34K2j33J8M3L0J70k70K4j2J09Q1l7m8J11q1
3084B5K52l00N4k4M6Nq1r1J31P5n8K9K0j07Q6Q5l47K66l03J82J81j69O1j0l8J22
3110I2O8k93K10L3J1k32J94L9j11K21k65o9J37k76R0K45j35P3k32J69R2j36O5
3133a0M0j02R6k08J76J6l8J01J27k35m4K43j44M9o2l1n3J13m2n2j37K10Q6N7j22
3158C4kP0q8M1j36J7r9L03j33J18j7j47K00k40L1o7J36J18q8j63J50j13QO6o7
3183f8K02m7q2j49N0P2J17k11O3r2L01k59J70K7j96K18R3k64L2R0o5P4j21J42
$$ y = [-170, -19, 15, -3, 13, -55, -48, -7, 11, -34, -93, -34, -102, 6, -34, 7, 132, 250, -59, -37, 69, -11, -113, -25, 182, 101, 108, 83, -385, -67, 273, 11, -205, -156, -7, 93, -9, 58, -17, -67, -109, 91, 67, -76, -36, -32, -84, -7, -34, -38, -88, 73, 53, -77, -37, 68, 50, 47, -79, -81, 67, 55, 281, -136, -2, 20, -113, -95, -52, -22, 148, -122, -98, -110, -1, 80, 43, -5, 106, 25, 277, -23, 31, 7, 53, 58, -23, -114, 17, 92, 34, 63, 83, -24, 62, 147, -200, 66, -237, -55, 126, -43, 18, 8, -30, 92, 160, -133, 77, 110, 121, -111, 83, 122, 11, 232, -33, -102, 35, -241, -151, 94, -41, 32, -200, -31, 61, -75, -10, 30, -72, 24, -184, -8, 8, -30, 71, 198, -37, -81, 162, 18, 67, 5, -26, -79, 34, -8, -60, -197, 13, 99, 156, 34, 32, 102, 14, 55, -81, -64, -163, 140, 7, 125, 108, -39, 161, -79, -48, -115, 21, 139, 51, -112, 38, -75, -67, -1, -68, 134, 87, 5, -144, -94, -22, 95, -116, -53, -145, 156, -103, 67, 94, -102, 116, 209, -55, -23, 67, 2, 76, -45, 97]
3207I7m4q0j28K39j86K54j30L3l4KM1j24O9L4n8m4K3k9J68j77j08K01l5O9%m8
3233ER1l7j96J64R0n3k9m6k87K88M0o2p1M3mK15j34j48j43K91j00N9Pj60J72r7
3259a02K25o2j65K50j02J9M3q7k7l5N8o3J47n1j62K12j72J52p5q0K54j40M3j29
3283d9N2k24K18O8L6l2k24J03n7pK68n5R8k01m9J31j59J15p4R4r5kP2J0j10n1
3309a24J30Rj66J72J0M6j34RJ07r7L1l0P6j35N3M3K00j16Nq3J1n8j7J35k08J98
3335F7k03Q0N4R2m1j8L1j69R0OK5O4k05Q7J28j48Q6j93O3j17L35k09Q3r7J05J37
3361A33k36Q8N9J17r3m5np2J99j81j8q7J64k0J25j18p1K1L0q7PON4J87q8k18J42
3388gN8j06k15J73J31q1K42l11J95m3p4q3N5L31j09l88J94q0j39L86j39l7P9N8
$$ y = [97, 53, -27, -155, 84, -102, 152, 22, 55, 21, 23, 64, -60, 9, 43, -15, -59, -36, -65, 103, -74, -182, 19, -16, 53, 53, 5, 96, 59, -137, 27, 117, 64, 35, -11, -298, -10, 30, -32, -103, -60, -64, 151, 17, -131, -274, 17, -83, -24, -17, -177, -5, -102, 123, 61, -104, 146, 44, 63, 106, 19, -8, -43, 15, -48, 99, 48, -114, 98, -74, 78, 3, -77, 177, 37, 80, -49, 3, -221, -3, 65, 101, 69, -155, -52, -109, -116, 152, 97, 195, -6, -55, 76, -83, 32, -42, 52, -43, -45, 27, 37, -73, -124, 6, 15, -151, 21, 31, 77, -57, -48, 59, -38, -7, -37, 39, -96, -43, 0, 200, 84, 89, 6, 17, -41, -58, 77, -131, 67, -136, -56, -2, 90, 49, 31, 62, -107, -17, -11, 14, 78, -127, -40, 88, -60, 26, -167, -104, -221, 114, -95, -12, -109, -4, 133, -103, -15, 44, 161, 68, 23, 18, -54, 145, -36, -54, -141, 23, 3, 128, 10, -61, -40, -10, -97, -90, -84, -30, 157, 69, -149, -7, 51, -55, -270, -97, 34, -47, 195, -116, 79, 36, -38, -121, -66, 265, 156, -232, -38, -118, -257, 129, -10, -47, 32, 90]
3412I0j88J25j07J5J04k40O7P6J36j23J58k04l2J59p6J35l9j29J3J83Pr6K6j95
3436a35J75q1km7j0Q7pj2p2J6Q4o7m8J24k1k6j28K95j04j4m5o8J32j03l1P2K32
3463A96l11K87k20n5J45j58m7J60l6J09j31J15O0r1kJ84k41P0Q0k02n5O4j6L2
3487f3k5L4Oj8mkN7oL8j13L0L3J42Q0L7j17j94K2J17q5o5J53M6j30Q4k19K53j9
3515G2P1M6j14J3j86J68j41j7J46n3p0K9J29j50R2p4K19k12L2n2J04J16k41MR7
3540B8J0j77K3J10L8N6pOj39J04R1j46J49k26kJ18p6O1L1n4J49J05k42M4k4j35
3566a05jO1l4Q1K9p1j1N4Nj4J89j87k8p1k5L9P6J33Nj8p4j44K59J22m01K68l1
3593A06k6j38J53L5j98l4O8j07J18o2j9J72k60K96m9j58j3O0O6j49J97j54K44
$$ y = [90, -98, 27, -80, -65, 39, -201, -134, -58, 78, -45, 113, -91, -123, 36, -40, 95, 56, -73, -60, 123, 130, 34, 60, -135, 40, -41, -43, -90, -100, -13, -20, -32, -104, -88, -4, -71, -119, 5, -16, -42, -170, 125, 21, 7, -38, -106, 26, -77, -108, -36, 196, -115, 172, -48, -103, 42, -116, -163, -3, -39, 70, -61, 54, 114, 23, 21, 205, -36, 34, 114, -88, -143, -79, -95, -63, -88, -54, -48, -66, -70, -72, -15, -21, 17, -96, -66, -33, 109, 189, 226, 109, -85, -63, 54, -31, -96, 57, 103, -27, 57, -162, 91, 72, 143, 189, 75, 88, -98, 70, -71, -88, 58, 5, -65, -36, 93, -57, 35, -39, 180, -32, 0, -52, 52, 168, -73, -69, 28, 38, -139, -116, -6, 32, 88, 81, 87, -52, 52, 143, -3, 146, -80, -82, 36, -40, 21, 52, -2, 147, 252, 10, 54, 30, -105, -106, -45, -79, 2, 31, -40, -51, 3, 8, -6, 183, -4, -32, -103, -128, -89, -13, 120, 125, 107, 33, -111, 148, 270, -131, 137, 106, 80, -58, 95, 130, -68, -102, -34, -141, -23, -85, -104, 68, -192, 104, 55, -103, -116, -56, 10, -139, 58, -96, 148]
3616A48m7j44J24q7j4o5N8L0q3J41j53P9j26J55l14L02J13j42j4J4L2P1j60K48
3640A66q6k16L03l30J53j24OL00j22q8PK30k19J44p8j27Q7j11J93j94K53q9k7
3663C1j01J08k9j8k4p1K6J61n8r7K47j36o2M3J33j33J58j14o9J00r2r9J40j4j9
3688A1l1J13k62O8K21j05O5n4N7p6P1q6m1nmJ7l3q1k5J53N5j63Q5l9J18n4lm6
3716g4P8r9J73m3N3n9O3k8r0l5M8k7o4J04j81K37j38J56n8j75K03j37Ok4K60j97
3742d8n3K09j17rJ88k88L3K26j58O6j17Q2j5l3K08l38Q3N0k4K1Q8r7P1j4L16m16
3768h6K03k4k5r2q3K87m41K87l3m4R2k54K18j27J92k37K06N2j45O2m9j1J08j79
3792a23MK96m75L08N5j65M5R3j31O0J27J02o1j39K8R0p4lNM7j01Q0q6j10K08J18
$$ y = [148, 101, -43, 81, -6, -20, -85, -27, 3, -80, 61, -92, -13, -139, 16, -298, 4, 117, -25, -39, -25, 7, 78, -82, 166, 80, -136, 167, -163, -10, -134, -128, 172, 50, -38, -31, 199, -20, 124, 46, -81, 6, -105, 88, -106, 147, 58, 31, -70, 38, 9, -9, -33, -104, -78, 83, 25, -72, 175, 39, -23, 20, 153, 20, 178, 64, -5, 95, 3, -96, 44, 30, 11, -20, 93, -169, -101, 120, 15, 80, 26, 83, 7, 78, -8, -49, -54, -58, -41, -74, -155, -180, -27, 28, -135, -50, -89, 29, -25, -28, -74, 4, -95, 78, 35, 88, 29, 92, 64, -26, -61, -13, -40, -104, 0, -181, 56, -82, 74, 16, -159, 44, -93, -87, -111, 149, -48, -101, 108, -9, -18, 170, -118, -85, 141, -17, 49, -68, 14, -1, -34, 174, -164, -81, -31, -55, -34, 54, -43, 28, 14, 330, -86, 117, 93, 68, -24, -107, 180, -261, 26, -7, -51, 41, -213, 5, -122, 70, -167, 39, 91, -54, 8, -41, -52, 56, -123, -119, 177, -298, 10, 65, -100, -55, 38, -93, -33, 94, 196, 135, -4, 24, 114, 40, 37, 42, 89, -12, 68, -18, -128, 80, 198]
3818A98k37lJ39Nn1p3j65J84oP3K0m5j71J70l9L2o6l5m8rJ4J02O7m7j41J44J13
3845A25p2L2J1p0o3M8L9r5J09J2n4p8p0J50K9q9J7l8J43N9j44j36K18O4j47j61
3871a61J68R5k11K58k00K30j85O3o7K34j17k34L00k85J42r1N8J31o1j9j48J81
3893H1J3j60J28j35J65j57L7K09j32Q7p0R4j17J8l9q0K03k61N4pR8k2O1m2O9j16
3919b1rQ6ok2L0j65L11j14j9k05K44p2o8q2J2O9J05K2j48N9M3p0j52J74L5J41
3945A78j54J0M3k00K10Ok80J25K5L6oJ19j99J77j32M5RO5j50J87j05J14l8M3q7
3970D1Q1q3m0p2J25J14k24J00n5J28k24K2P0P6r9J7j19K07j80J98k13L07l09J45
3994A3K3P9j14N4J17j60L8r5J6Q0J03j46j07J20n1R1J95j91p2o6m6K51j79Qk2
$$ y = [198, -39, -42, 97, 102, 51, -22, -187, -3, -9, 64, 84, 39, -132, 38, -1, 31, -35, -70, -118, -127, -113, -11, 56, 9, -132, 12, 125, 53, 85, 96, 26, -37, 11, 50, -45, 64, 76, 22, -56, -126, 24, 53, -36, -19, -57, 86, 145, 1, -135, 83, 147, 0, -161, 7, 102, -109, 149, -51, 179, -6, 57, -10, 224, 107, -127, 173, -112, 30, -61, -3, 128, 67, 48, -100, 81, 94, -66, 62, -73, 92, -65, -28, 181, 49, 136, 66, 160, 43, 61, 22, -58, 145, -116, -62, -69, 29, 7, 68, 26, 95, -21, -30, 56, 50, 28, 58, -107, 204, 90, 71, -134, 110, 38, -30, -112, -100, -31, 74, 96, -52, 7, 50, -20, -172, 2, 37, 178, 24, 34, 77, -123, 87, 93, -187, -62, -37, -1, -7, 112, -87, 90, -42, 3, 12, 77, -73, 114, 9, 123, 85, 128, 41, 122, 39, -1, -73, 52, 166, -58, 42, -13, 115, -109, -87, -17, 59, -40, -23, -142, 65, -115, 83, -130, 177, -132, 13, 36, 115, 1, 55, 172, 12, 50, -45, -29, 51, 154, 8, -99, 21, -30, 61, 256, 65, -7, -73, -119, 132, -47, -39, -61]
4019f1J53k92J39J91m1j78J12R3j84J38q1J15N1k79R7k5N5L5k7K3O0J1k96Q9P
4044i5J90j85Q4j06K8n0K23k20K01J36l68J84J06j13j35Q5N4L0j32K03j15RR3
4067A07p1q9K27P1m44J84j38J00M5k6K75q5l38K59j42o9J54J7K3P2j12J1J09j93
4091e3q5J80l8J70k55N7l1O4p7N5P6j07M8R5K0K00l51q5MJ69Mj20M1J12q4J95
4117B04k55o5LJ98j77J24m8J7rL9Q3j80R3K2o9j97K11j1m2j8J39p0n6N0j18K3
4143a09J76n2J9j84J60J56m1j94J39r4M8J28n5l1j09nJ8k4L1K11k05QL9L6O7p8
4169E5R4k47N1J04m2J18j53j6J04o0K4n5j05J58j68K00o8J5J20k92J79Q8q1J22
4193A45j83L5o2k5J93j18k6J6q9j08K17O7j31K20j10j16K02j87qL1J37j42J51
$$ y = [-61, 92, -200, -61, 130, 89, -89, 23, 116, -68, 70, -11, 104, 155, -124, -27, -52, 3, 38, 11, 34, 94, 105, -191, -102, -95, 95, -90, -6, -112, -84, -134, 89, -131, 70, 206, -162, 22, 128, 15, -120, -35, 19, 49, -83, 120, 5, 14, 107, 36, -53, 174, 245, -199, -15, -153, -53, -8, -34, 241, 156, -182, 77, -65, -134, 20, 37, 60, 132, 20, 31, 140, -53, -138, 42, 4, 174, -81, -24, -55, 9, -68, -13, 63, -44, 4, 99, 119, 319, -32, -117, -113, 56, 60, -60, -19, 93, 9, 204, -51, -116, -113, 85, -92, 32, -16, 1, -8, 31, 114, -66, 27, 49, -20, -217, -6, -17, -59, -77, 62, -8, -64, -14, -132, -109, 67, 15, 34, -150, 10, 166, 125, -69, 70, -24, 24, 152, 97, 66, -43, -48, -30, -54, -23, 188, -17, -9, 30, 66, 133, 55, 149, -98, -47, 57, 15, 133, -20, -36, 68, 8, 32, -23, -128, 30, -138, 62, -6, 9, 129, -163, 16, 104, 23, 145, -38, -3, -65, -90, 103, -15, -41, -25, -114, -222, -5, 62, -69, 151, 41, -75, 127, -60, -68, -37, 100, -42, 109]
4216A09j53N1j73Q6K52q7k3r5Q3j2j3j45J58q9Q8np0Q6P1j7j15l9j3j0J05l0O7
4243F7p2LN2J1j57K14j67K7J8pl1L0j61J52j35K93j10r9L34l47P5Jj5J01L3l1
4269G9k2P1k20J08o7J60r2k0J0O5q2jl6Q2k17O8K98j81M5Oq5N5J26j44jK8j24
4296i1K06j96J3Nl5J01k5J66k58N2R4Nq0K29L3q4k09J46j53O0k28K47n0L7j8n4
4322h7K5J13j01R0L3j06P4J7J08j85J14j87lK71l04J88r5L4J33k63m3K78j44j13
4346a53J96p2L4J7K2m9r6K6J79j06m4m6J11j35K54n2n6%j52J22o5K2J9N2j19J58
4372F7kN7j01j45K23k09m2j7J60Q5j59J46p3j6J18r3q3K7P4J05j50J23j50K34
4396A79j44l8J04l2n8O0L7j13l6j5L3k23L56J14l70K05o9J40k1M9jq5k03n6K17
$$ y = [109, -44, 7, -166, -80, 172, 85, 62, -33, 50, 38, 25, -120, 38, -51, 37, 32, -38, 48, 119, 102, -13, -52, -65, -75, 30, 0, 67, -5, -2, 50, 61, -96, 118, -49, -22, -4, -11, -42, -12, -173, -21, -156, 137, 27, -72, 262, -85, -10, -9, -24, 77, 110, 79, 57, 128, -92, 16, -51, 109, 17, -3, 7, 72, -10, -11, -47, 35, -182, -114, 184, 3, 48, 54, -31, 24, 150, 6, 5, 33, -91, 115, -81, -68, -63, -98, 3, -22, 144, -114, -62, 32, 37, -43, 186, 219, 135, -74, 72, -81, -21, -249, -2, -52, -15, -33, -87, -62, 51, -50, 40, 73, -33, 41, 58, 166, -19, 95, -92, -95, 176, -128, 60, -35, -1, 132, -131, -174, 104, -40, -153, 43, -29, 5, 22, 44, -5, -101, -75, 104, -2, -46, -92, 19, -116, 138, 86, 30, 30, -122, 0, -65, -43, -24, 28, -91, 67, 65, 122, 21, -124, 99, -110, -152, -169, -9, 76, -83, 63, -10, -26, 92, -1, -84, -57, 17, 122, -28, 95, -55, 179, 35, -3, 101, 69, 11, 71, 108, -5, -41, -56, -23, -246, 110, 224, -146, 59, -10, 130, 109, 158, 157, 72, -131, -187, 30]
4421C0j71J50j04J15O4p2j1k30J29J61j35J78mj40J40j00J20o8k37K49K17l19
4443c8K66k72R3R0j15r2L0n3J11J81j89J2L3j14J33l19K21N9J35q4J84j93m2P7
4467A14j48J67k20o3J57L4K3j27M0q8K18o5M4j07MJ96k35J07J33k4j36L0j79j0
4491a35J55j4Kq9N5Q5r8l3j6M7R1j75J08M6j22K93l94J63K9J61k48j7P4Qj4m8
4517h6K08j76M6Qk2O1K3q6k6O9L0q6o7J66Q4j09K7J52j74k01K22M0m4j00J70p2
4543E7j49J31O6q7J02k59p5J43q3L17j16j85r3J91K6J24o6j14J38j79L5J35k34
4566a75P7M6J43q7q9K39j39Q3m1N5k58K77p8r3J07o1J9o8j0Nj8J18k17K11q8O8
4592B6j41J61q8J2Q8k96J56K05j03k76K18M2%M4J26k30Q3O8L8p0lk7j7o1J18n8
$$ y = [30, -141, 9, -95, 20, 84, 12, 1, -229, -100, 61, -74, 104, 100, -40, 100, 0, 120, 52, -185, 64, 281, -38, 228, -44, 49, 139, 24, -68, -38, -91, 20, 201, 12, 24, 57, -57, 76, -243, -22, 37, 172, 88, 272, 79, 37, 114, -34, 133, -87, -150, 7, 41, 64, -63, -23, -111, 107, 42, 86, -21, -17, 179, -56, 51, 184, 160, 24, 54, -125, -135, 20, 6, 8, -81, -26, 59, -39, -72, -88, -41, 50, -125, -17, 29, -93, 200, -194, -31, -2, 159, -89, -106, -32, -24, -38, -86, 122, -54, -8, 0, -22, 39, 62, -24, -50, 19, 49, -37, -104, 62, 146, 37, 64, 216, 42, -159, 63, 103, 59, -41, 129, 57, -92, 39, 105, 18, 120, -139, -214, -71, -154, 163, 47, -138, -231, -40, -14, 110, 44, -70, 68, -111, -76, 59, -175, -98, -52, 91, 4, -85, 154, 15, 98, 57, 112, -146, 131, 53, -40, 67, 6, 25, -43, -53, -48, -66, 52, -165, 46, -42, 26, -115, 46, -42, -30, 58, -238, -82, 123, 20, -256, -38, 4, 4, 48, 174, -56, 27, 95, 133, 63, 60, 33, 16, -45, 73, 15]
4618A5m8J24j08Rm7J07j91K82k33J3J32r1J30o4P3j91J06p0l5J70Pp4j24J06J11
4643A09q5P1m0j36J63J8k2M1l27K91j26P4p1j37M4J24M3j36J87m8j1Q4k5QP8j09
4669F2k78J71qR6k4j83J94j00L7L7j04J26k34K01j1Nj41J87N5l81K24J72J29j63
4693F9k05J92j73K66j70mo5J29O1j13J08j31J45K1j49J26j05n0RJ06q8o1N4n5
4717h3l7K14j34k2O6J1L10l33o3j4J46Lr4QK8j53M4J98k18J63j62R4R6r0J21j40
4743d1M6j18J85J4r6j2m8J10o3R2j57J21L8J39j79Q3r3k2j8j17K27k08J73m4M7
4768E9o1rm1K00q1j48K16o8Q5j51K6L9l3Q3o3Oq4o8J52k4L1j98J24n1n6J95p1
4795IJ00k6j91J01M1J0pN4r0j6O8j63J55k3o2L4j30J76J07j42L3J0j49J14L4j15
$$ y = [15, -33, 91, -17, -8, -55, 52, -139, 143, -90, -77, 55, -36, 94, 30, 103, -88, 18, -52, -87, 83, 90, 16, -108, -2, 109, 24, 95, 55, -81, 82, 100, 78, 119, -208, 83, -43, 31, -40, -177, -133, -9, 34, -102, 85, 37, 26, 110, 85, 93, 171, 62, -216, -45, -53, 43, 19, -164, 30, -70, -33, 4, -100, 26, -208, -7, -18, -13, -154, 33, 88, -293, -69, 103, 232, 69, -136, 56, -117, 149, -21, -25, -90, 39, 100, -13, 95, -36, 109, 130, -19, 107, 2, -48, -39, 67, -21, -82, -28, -83, -120, 94, -40, -62, 4, 15, 325, -8, -71, -85, 61, 64, -30, -22, 6, -147, -103, 95, -123, 40, -122, -28, 68, -22, 99, -41, 5, -113, 72, 86, -10, -22, -70, 40, -23, 69, -88, 33, 71, 210, 31, 114, 21, -1, -19, -136, 91, -117, 56, 12, 59, -2, -11, -52, 148, 67, -81, 135, 67, 152, 1, 27, 66, 33, 116, 53, 59, -25, -93, 59, 35, 66, -132, -8, -59, -115, 80, 9, 109, 83, -108, -7, 34, 44, 37, 91, 1, -15, 53, -110, 45, 22, -40, -6, -136, 40, 147, 5, 38, 48, -101, 13, 47, -68]
4821f8m7K18k33R9M9J17M3l89K58j76J05Q3j81K25j52N1l5J3o1n8K26l8M9j32
4845c4q8K28r9J9l6r9J36N9l9l0l3j27J11O4M0j47J75r1Q8J3o2K1j95J13J55j08
4871C4L1R6k07J78l22J22J59j04k6r1J96r6J89j38Q2j30k6R9q9L5M8J5K2N3j00
4896C0Pj30J27L5q7N4o5j2P2K3k1j07P2P6l3o6N4J70l33K26Q0k28j8K84l63K03
4922E0j5L8l22J53j0Q1J09j11J00K6j62k2J9O7j15N2Pn3J45O0j9j83O7J89k31
4947h0j4J3K64o7j36q0nk0k1J16J96m4j16P0q0p6K6J9M0O5j56K12j2j23p0K64
4973A85j95l8l1J73p8L0O3K0rj66k3J74n5N6j83j14J6R9J56q7K6oo1m6R5q6J58
5000G3o3Q4K5k49q9J59k9J89n8R1p0o0J66j53o6R9l0r0N8q5L52k21m2p1Q0o7L7
$$ y = [-68, -115, 103, -130, -31, 18, 135, 178, -211, 47, -129, -24, 59, -122, 103, -49, 2, -33, -20, -81, -139, 87, 49, 98, -34, -122, 106, 7, 26, -10, -109, 27, 86, 47, 17, -16, -143, -32, 32, 72, -75, 100, 9, 97, 110, 48, 69, -126, -13, 142, 34, 65, 161, -46, 132, -190, -68, 91, -13, -39, -130, 66, -30, 159, 21, 103, -27, -53, 46, -43, -8, 40, 55, 77, 130, 30, 37, -93, 34, 69, -18, 36, -29, -41, 31, 54, 33, -74, -2, 74, 41, -25, 29, 199, -134, 92, 172, -56, -74, 210, -153, 50, 35, 73, -249, -96, -106, -25, 84, -27, 73, 99, -63, -85, -66, 1, -114, -62, -55, -108, 37, 97, 78, -105, -38, 151, -80, -94, -81, 183, 116, -20, -100, -105, -125, -146, -30, 166, 122, 6, 76, -4, -80, -54, -35, 5, 70, -86, 126, 114, -9, -79, 185, -10, -48, -79, 94, 16, 46, 109, 129, 120, -46, -69, 105, 50, 106, -77, -191, -175, -76, 80, -7, 19, 13, -48, -94, 1, -85, 73, 10, 94, 119, -130, -219, -60, -89, 100, 42, 133, 63, 3, 169, 16, -50, 49, 19, -71, -13, -98, 254, 33, -9, -80, 0, -67, -30]
5027c0J41p2J83p3j75J59l0l3j7O1k39J13J33k55K4K28n0j51J19j24M8M5o2n8
5051a15K2J22p8l5J84k11J45J4o7p3J77J23j02L1o6r5M1q8L2K00k37J6J14j82
5075a28N9K63J0j08k83K29Q7p4j27J73Q3k61j5J07K26l42K04r7j8Q1K1j18L2j3
5099ip9J59m8R2m8j91J66j8p3R2j75K24j06k06J94QR2j4kJ06n9j24l0j9J8J85
5125A35j25k7K6n7J94j16o4K25k54K28m8L9jl7k21J82j68J11N0k63K40j74J24
5148arL9O7j16K9k0j2L3L3j55J84p6m0J70j22J5k0K1j64Q8q9J38p4P9j53K27j4
5175E8n2j7J69k3k0j33KpJ24k22J14J18l4j57n1P2j45J72n2j8P8M1P6J1j42k2
5201f0J7JRj81K37o7K19l34K27j56J80N9j15P4j92J25j06P0K6k5K8n5r3J35Rm8
$$ y = [-30, 111, 39, 222, 149, -26, 133, 103, 70, 53, 114, -125, -12, 121, -134, -110, 118, 68, -83, 36, -88, -40, 5, -57, -115, -93, 29, -49, -84, 100, -111, 34, 48, -19, -92, 85, 208, 106, 137, 71, -24, 17, -71, -39, 161, -76, -60, 54, -128, -69, 194, 204, 96, -187, 42, 129, 55, -72, 101, 184, -77, -92, 15, 241, -101, 103, 6, -12, 69, 90, -28, 4, -9, -88, 71, 23, 115, 67, -124, 42, 24, -49, 43, -132, 92, -14, -220, -26, -18, 74, 60, 58, 164, 105, -19, -49, -68, -50, 135, 10, -17, 9, -48, 146, 30, -34, 191, -63, 165, 117, 156, 155, 118, -103, 79, -89, 22, 72, -191, 49, -125, -1, -10, 29, 96, -20, 9, -11, -23, 10, 43, -112, 72, -4, -44, 126, 4, 19, -1, 20, -144, -56, -145, -7, -81, -2, -155, 72, 58, 6, -11, 158, 135, 115, -18, -16, -23, 101, -121, -7, 111, 77, -80, -131, -59, -204, -32, -84, -102, -24, 17, 93, 104, -38, -60, -43, -42, -33, -214, 23, -44, 175, -159, 68, -88, 92, 151, 36, 110, -82, 43, -63, 7, 33, 8, 36, -19, -112, 23, 32, -16]
5227a6L5j18J43j31M8l1P4N1o9p3L9K2j20J27Pj5M1q9L0P1K4j65J71p3L9j48R6
5254c0j00N6l7L6J31m6p8J14l7n6p5N9P5o7Q8j53J03p9N9N5l7j3k4N7j52J19J77
5281A45m6l2j38j2N1j38N9Q0J9j8R4j61J8K80j77l2L4N9p1j27J87j07j11J50J5
5306B1k1j43L5q3K12j85O4K11k94K72p4Kl9Q1k01J01J2o3l7R4m0J48k8r8K59j90
5332A6l9r1j6K00P8j43O8j16r6K58j77j06J76J62k05J95k14PJ68k1O9l04J73j03
5356f1J80L4J0r9p9M0q3J8J01J51l31J61j62K54k66K25J00k65Q1j03R4l7j4K12
5380A61r7j0j03Q0J3r1O5j41K43j52J5m2k9J88p4n7J29j17N1L1m3k8J26k2j37
5405d1J57r5M3j71J67j71M6K40%j73M6p0J32j48kR5k0p5NJ53j05P8j60J64k5%
$$ y = [-16, 19, -99, 44, -87, -39, -70, 4, 55, -14, -87, -48, -26, -146, -19, -12, -27, 14, -75, -45, 26, 50, -115, 56, -17, 22, -126, -30, -130, -74, -111, -75, 56, 10, -68, 46, 9, -47, -122, -63, 12, -55, 33, -120, -17, -96, -37, 18, -19, -32, -56, 1, -151, -32, 145, 99, 67, -71, -83, -32, -170, -111, -31, -12, -30, 64, -97, -79, 201, 24, -8, 26, 85, 14, -113, 74, -33, -144, 6, 21, 0, -143, -108, -191, 21, -164, -100, 111, -183, 89, 15, 17, -22, 59, -142, -41, -29, -92, -129, -35, -75, 73, 45, -53, 206, 16, -23, -114, -130, 70, 148, 5, 73, -43, -139, 119, -58, -164, 12, 174, -31, 164, -50, -43, 125, 104, 173, -131, 42, -61, 119, 153, 163, 64, -15, 25, -58, -40, 61, 212, -119, 42, -120, 134, -132, 93, 193, -72, 9, -94, 0, -37, -51, 161, 64, 54, -49, 31, 44, -47, 18, -123, 120, -32, -17, -59, -88, 100, 26, -31, 98, -19, 32, 63, 20, -8, 118, 96, -41, 116, 21, 64, -107, 60, -111, -65, 175, 175, 2, 48, -22, 110, -38, -40, 55, 35, -40, -35, 118, 13, 91, -69, 95, 70, 70]
5431G0j12J69r5l9n0nP2Q7j87P7q2J26M9j18L5O9n3n2J26j38MJ05j94J23L2k8
5457iK4j8L6j4k54K07j0j7J7mK38j73N0k16J74j05Q2j38J73rr2J53j39O5Q0q5
5483A6p0L8r2K08j68J15O4j92J45k8k33J51p8L54j93Q5k22M6R2l1q4Q4n8R3j10
5508f8J00K5Qj39K33o8k08K33j17p4Q1O3j64%P2n5L1j13J66J52j82n4R8j1J3L2
5534E4k95J37J85Nn4Oj60P7qPO4N7n2Q3j32N3O1j30L3J9r6R0K7J25k50J97j97
5561i4J45k10K05J48r9j4j13n2J1N5p5J46j22J70l6j75pK9J47j45J2J32P9r0j3
5586C4K4N0j20J92k26J11k17J45j9n9M7j6l4Rl7K00k20J61q7j0n0J59P0l02L47
5611A52k07l1N1J18L1l7O6r8q8J46j85M8J03%L8j8j58L2k9J75m8j13k0NK4J7n1
$$ y = [70, -42, 127, 32, -7, -57, -62, 10, 97, -90, -13, -95, 31, 80, -38, -3, 66, 13, -39, 87, -51, -47, 58, -136, -13, 19, -9, 15, -3, 33, 19, -235, -28, -38, -55, -38, -42, 196, 23, 73, -143, 31, -74, 8, -130, 43, 34, -58, 95, -44, 21, 101, 16, -54, -16, -108, 100, -68, 47, 111, -81, 64, 36, -197, -46, -124, 230, 37, 122, -100, -54, 38, 7, -77, 7, -51, 42, -68, 32, 57, 65, -74, 159, 91, -117, 116, -1, -75, 6, 69, -95, -95, -23, -78, -47, -160, 6, 158, -24, -78, 20, 9, 22, 54, -241, -104, 81, 86, 32, 38, -122, -45, -53, -46, 18, 75, 23, 106, -26, 27, 88, -42, -9, 10, -86, 4, 31, 156, -94, 103, -94, 51, -159, 46, 194, 95, 81, -32, -84, -73, -18, -93, 53, -69, 101, 65, -110, -117, -88, 59, -86, -74, 58, 137, 47, 34, 58, 108, -12, 180, -46, 65, -152, -7, -26, -85, -38, -54, -88, -79, -116, 84, -136, 25, -62, -72, -122, 37, 107, -195, 152, -55, -86, -35, 83, 114, 77, 143, 45, -43, 103, -82, -34, 69, 69, 107, 89, -69, -37, -66, 109, 61, -52, -72, -67, -43, -26, -77]
5638g7n5N8m2J97j08J66k08k3J56L5j02N2l2m9J84m1K3m8k98J72j4J52k31Q4K6
5663b3j5J7N9n3J5J46j51J88k68K9O7J3j48m1K42j03J83k56K63j65L3j59K78k02
5687e1l7j13k1J88R9k28j46K81M6J6MR4k38J9L8P9J9q4nR6j6O7p8j92J33K53l18
5714i5J70Q4Nk04%L1J48k58J36J14m3p2r9K42k42J53j66kK98q4k46J68J09K4k78
5739a07K10k57L1J11J11m3l1m7pR1p4K4N3N7j83N9nN7r6k3N3m1M7q3J13r7J90
5766A13J4kk4k45P3J5p7J74j48J51R3j13N8j42K19j03k00J10k5J4K35j53J69j89
5790A7N0J61k98J04j55Q1k0K0j3J18j6j35J20p2m3K30k00k1J37m7j17K28k13K0
5814f4J16l4n6r9J86j99J12L2J65j01m5j8Q6j17q7l7K51p1k22K86L5l6n5m3q9
$$ y = [-77, -132, -74, -116, 81, -27, 139, -69, -92, 64, 99, -3, 49, 17, -32, 152, 111, 134, 86, -212, -40, -54, 98, -133, -49, -23, -38, -21, 38, -15, 0, 146, -5, 183, -85, -56, 11, 24, -124, -165, 77, -26, 157, -99, 164, -1, 32, -127, 151, -51, -88, -201, -222, -34, 65, -163, -309, -28, 18, 34, 38, 132, -106, -87, -49, 30, 49, -35, -40, 56, 40, 107, 29, -163, -30, 223, -95, 75, 159, 164, -40, -40, -9, 139, -119, 17, 131, 88, 16, -83, 159, -83, 70, -96, -98, 200, 116, -130, 38, 147, 171, -107, 103, -154, -123, -12, 99, 56, 25, -22, -29, 62, -12, 12, 65, 122, -61, -2, -7, 50, -46, -69, -16, -57, -10, -93, 20, -77, 113, 127, 125, 101, -144, -71, -56, -133, 41, -107, 44, 137, 24, 82, -60, 159, 56, -144, -34, -59, -45, 190, 37, 206, 17, 67, 228, -70, 34, -121, -40, -60, -40, -53, 65, 49, -86, 34, -38, -81, 149, -51, -72, 65, 18, -99, 129, -84, -64, 52, 18, -38, -137, 49, -150, -38, -6, 159, 58, 13, -5, 81, -36, -123, -160, 91, 20, -202, 84, 119, 83, 28, -15, -104]
5839a04K1p1K8N4j2m3J90j87J37J4k19K13kL0R7l0l9q1N6j01jQ1j15J89o9P2j26
5866a8J18k12J74j47P8l5L5n2K4K1M8p2P1J57k30N8k2j1N2o1J33j02q9J73j51
5891f0q2K04j55rJ24m3j20J60k4Jq4Q9P1k49J93p2J49k84J08N5KO3M9j01J4M0
5917C9J8l6LN1qj28J00Q2j63j43K06r2k1K37l02J40P3M5j20n7J85k77J50m1J3
5942d6j10J73J27k05J03p2K3p9j18L15j43l4J53m9o3k34K13l4M2L1P9r1J8J4M3
5967E6p2R3j23O7o1j62O0J90K0j68J39J13j04p8L2r7K51q6j94K12j1j0j32Lm5
5992a07P3l5kN6Q3J2j47J01j07L46l60J57K1O2k05J13l0l2M0rr8p6M9Q6jK7K8
6019D5j44J17k6r1O4J20o9O0j37j78L38j67q2M4LJ74j02P2M5k32K42n5%k7j36
$$ y = [-104, -83, -154, -126, -72, -84, -127, 63, -124, 13, 27, -192, 21, 19, 49, 146, 116, 77, -4, 52, -49, -50, 31, -84, 105, 36, 108, -18, 100, -112, 62, -85, -7, -42, -7, -59, -35, -14, 34, -38, 33, 190, -40, 18, -4, -15, 37, -24, 109, 7, -82, 91, -60, -142, 62, -93, -102, 22, -21, -141, 19, -5, -4, -88, 1, 72, -177, 16, -56, 93, -191, -83, -28, -26, 37, 86, -15, -1, 39, 57, 21, 24, 75, 67, -61, 39, 121, -42, -185, 21, -71, -92, 145, -157, -17, 56, 101, -19, -76, 109, -168, -18, -59, -46, -156, 17, 144, -61, 42, -30, -7, -86, -204, 111, -32, -66, 87, 38, -25, -259, -46, -80, -38, -7, 72, -19, -1, 13, 56, -16, 77, -46, 21, -40, -202, -142, 48, 68, -100, 39, 152, 48, -30, 2, -95, 156, 70, -124, 88, 77, 67, -65, -62, -107, -34, -69, -71, -15, 68, 80, -67, 34, -73, 273, -87, 70, 91, 153, -52, 61, 31, -1, 39, 30, -68, -144, -95, -9, -10, 17, 45, -99, 18, -8, -99, -35, 85, 16, 76, -61, -239, 99, -68, -150, -106, -103, 71, -31, 41, 86, -146, 96, 41, 41, 14, -122]
6044a22J27N2J7r4LN0j06j22J26M1J76j76p1J0J24N4ll6O5j60r2J71j52K18L6
6069A36j4k13J67l4R2k08k0L3J37j91J96k4j88K59p9m2R5r5o4J29n3N0K0j2J32
6094B09k34K05k70m9K51q3j76J8J77l5q6J13j42J38l4R0k90J97q5M9lL1Lr0R1
6119eJ12P1k94J13O9L5k75K65j49J8K29k89L3j28K02p5O0M1rj4n9J70j02n4r7
6144a32J56L9J20j80Q5j21N4J77k06j4o5J08k4m8J59k4j6j04m9r0J75n9J98o7
6168G2j06K31k18m4P5R1j90N6L2J19j15j28J18q4J54j86Q3j55K34r6J79j95pJ01
6192B1j05J44j39p3J49k7J6j44J67J05J15r1k06K38j52lq0J43m9j37R9J38m3l31
6216b45K19pJ26o9Qk5pRM3j57p5J68N3k0KRq1P9p4o9J88p6j1o9j4L3N0L1K1M5
$$ y = [-122, 5, 57, 74, -20, -17, 33, -73, -195, -69, -28, 148, -28, -99, -89, 35, 89, 86, 50, 115, -45, -137, 34, -118, 100, 136, 122, -91, 76, 42, 134, -74, -94, -61, 76, -115, 81, 57, -131, 128, 49, 7, 102, 7, -57, 72, 19, 69, 89, 77, 209, -25, 180, -90, -139, 112, 29, -147, -129, 48, 13, -73, 40, -102, 36, 2, 92, -198, -1, -86, -37, -40, -9, -6, -96, -5, 107, 178, -116, -3, 66, 101, -174, 91, -58, -40, 189, -100, -67, -195, 7, -68, -8, 33, 24, 10, -49, 121, 19, -35, -132, 24, 63, 183, 3, 88, -33, 21, 198, -8, -22, -87, 21, -3, -51, 108, 84, 68, -36, -85, -175, 0, -59, 139, 72, -34, 197, -21, -65, 10, 101, -89, -33, -1, 118, 3, -125, -7, -91, 63, -123, -40, -195, 39, -57, 122, -73, -80, 21, -84, 60, -79, -152, -3, -30, -14, -158, 9, 114, 229, 138, -68, 170, 18, 15, -65, 78, 29, -108, -9, 129, 86, -245, -26, -33, 93, 24, 32, 7, 0, 9, 52, -105, -180, -12, 41, 21, 23, 32, -49, 30, -44, -113, 75, -1, -12, -81, -95, -62, -12, 19, 40, 85]
6246H5j55R9j9Mj9Q1l4j62J03J83j68j77J99j84J77L9j04j6J10Ll2j45rJ26J73
6271A58j30j9mP0j92K15j82Q5j53J86J32j90j00J64k5p6n4J89O3p9p9j7J32mq1
6296IqJ84k02K85m76J48J89K2n6J03j34m5pM1j34K09j51N6j70N8P5k5o8P5l0r7
6322a49J01q1m0J16J14n4o6r8J56O8q0J10p8J06k28J30J5N6l5m3J23o3O0%l9k28
6348a27J66N6J99j36L9j73r0J94j79K5q7O0J68r6k8j63L21k31J35r7J16j29m2
6371i9J07mP0K8p0oQ0q5K6j11J57j20K07j98j09K52k58J47M3j10K14r1j4m3j25
6396a12J80j31j6J96j83l4P6J41l55K68q3o7k0J35m3k0Q6j9N9J21k51l7R5J87
6420A73Ll5l3j59pJ77j62R6J93k70PQ2j30J59j96J20j44J52J00q1j93K13j72R7
$$ y = [85, -70, 29, 10, 14, -5, 76, 42, -120, -17, 166, -2, -179, 20, -164, 13, 52, -52, -68, 42, 45, 13, -132, -141, -15, 158, 28, 9, 5, 75, -117, 98, -84, 1, -152, 34, 166, -24, -124, 40, 15, -61, -115, 74, 137, 58, -21, -38, 94, 90, 9, 1, 185, -17, 268, -208, -60, 129, 151, 95, 198, 64, 19, 12, 53, -81, 128, -23, 33, -137, -79, -4, -29, -97, -22, -52, -149, -48, -129, -169, -53, 61, 7, -59, -157, -1, 67, -13, 97, 19, 125, -103, 27, 42, 98, 63, 20, 143, 80, 140, 140, 101, -127, 39, 95, 294, 158, 197, 24, -66, 128, -51, -26, -113, -53, 115, 19, -9, -172, 149, -82, 53, -44, 72, -57, -99, 8, 4, 74, 102, 32, 26, 106, 21, 47, -64, 93, -27, 180, -18, -127, 125, -133, 14, 57, -53, 161, 70, 56, 13, -112, 68, -63, -79, 117, -66, -100, -24, 117, -238, 30, -53, -120, -140, -5, -48, -68, 18, -1, 58, 179, -72, -109, -14, 173, 176, 141, 108, -51, -58, 119, -43, 53, 246, -24, -17, 65, -65, 94, -102, 18, -126, 26, 126, 45, -148, 65, -107, -10]
6444a0J61j17p8m4K69k01J48m4n7k3N1j96J15P8n4j85L11r3r2J16j58J34m6M8
6468C3j21L7LO1j55JR7M4j9J51k41J91k7kk9N8r7MJ3q2J77q5k4k52K57L9RK4K8
6497I3q3p8J52p7j93K62j18J70m7p6j0P4o9M5p3J01P0k58j9o1K39k5q4J2K0J08
6523G5q7n9O3L4j83J80j67P4K22j67M2K2j71J48k5lM9j74J86O5k4k69K92p8KJ16
6549A63j04N5k5o5J98k22J34k9j04J45j94pM7l3J12K9o6JQ6j99j0nJ62j2o5Q5
$$ y = [-10, 151, 34, -44, -88, 181, -20, 128, 84, 27, 4, 55, -141, -26, 52, -2, -187, 124, 31, -61, 55, -103, 31, -15, 33, -88, -51, -48, 13, -142, -141, -44, 0, -19, 132, -109, 82, 55, 53, 24, 82, -15, -11, 2, -80, 97, 12, -12, -264, -7, 32, 41, 65, 93, 10, -68, 84, 7, -186, 76, -42, 128, 81, 5, -5, 69, 0, 45, -28, 73, 143, -115, -134, -195, 44, 19, -65, -53, -33, 75, -12, -71, -8, 26, -157, 23, -144, -70, 152, -15, 27, 49, -122, 26, 1, -2, 47, -127, 59, 124, 100, -169, 123, 45, 47, 163, 59, 114, 89, 24, 222, 0, 134, 105, 1, 146, -48, -55, -8, -41, 71, 100, 34, 35, 121, -78, -88, -93, 69, 57, -8, 77]
$$ [...]
8191a1
##END NTUPLES=NMR FID
##END=
