##TITLE=1H_DE-80H_X3
 200.13MHz, d2o
 8 sc
 
 19ns.26.2.2025
##JCAMPDX= 6.0         $$ Bruker NMR JCAMP-DX V2.0
##DATA TYPE= NMR FID
##DATA CLASS= NTUPLES
##ORIGIN= UXNMR, Bruker Analytische Messtechnik GmbH
##OWNER= pz
$$ XWIN-NMR		Version 3.5
$$ Tue Apr  8 15:23:00 2025 Russian Standard Time (UT+4h)  Yarkov@DPX200
##.OBSERVE FREQUENCY= 200.1313
##.OBSERVE NUCLEUS= ^1H
##.DELAY= (6, 6)
##.ACQUISITION MODE= SIMULTANEOUS
##.ACQUISITION SCHEME= undefined
##.AVERAGES= 100
##.DIGITISER RES= 18
##SPECTROMETER/DATA SYSTEM= spect
##.PULSE SEQUENCE= zg30
##.SOLVENT NAME= CDCl3
##.SHIFT REFERENCE= (INTERNAL, CDCl3, 0, 14.3821)
##AUDIT TRAIL= $$ (NUMBER, WHEN, WHO, WHERE, WHAT)
$$ ##TITLE= Audit trail, XWIN-NMR		Version 3.5
$$ ##JCAMPDX= 5.01
$$ ##ORIGIN= Bruker BioSpin GmbH
$$ ##OWNER= Yarkov
$$ C:/Bruker/XWIN-NMR/data/yarkov2/nmr/H-C/1/audita.txt
$$ ##AUDIT TRAIL=  $$ (NUMBER, WHEN, WHO, WHERE, WHAT)
(   1,<2025-04-08 15:18:07.60 +0400>,<Yarkov>,<DPX200>,
      <created by zg, POWCHK disabled, PULCHK disabled
       configuration hash MD5:
       00 E9 B6 7A A2 85 ED C7 34 08 36 98 17 FE 4E 26
       data hash MD5: 16K
       19 9F A7 AF B9 2D AB 47 CA 25 1E 70 B9 BA AC F6>)
$$ ##END=
$$ 
$$ hash MD5
$$ CB 5B A9 2B 55 4F F2 60 E2 B2 A6 F1 85 9C 1E 71
##$RELAX= 
##$RELAX= 
##$RELAX= 
##$RELAX= 
##$RELAX= 
##$RELAX= 
$$ Bruker specific parameters
$$ --------------------------
##$DU= <C:/Bruker/XWIN-NMR>
##$EXPNO= 1
##$NAME= <H-C>
##$PROCNO= 1
##$TYPE= <nmr>
##$USER= <yarkov2>
##$AMP= (0..31)
100 100 100 100 100 100 100 100 100 100 100 100 100 100 100 100 100 100 
100 100 100 100 100 100 100 100 100 100 100 100 100 100 
##$AQSEQ= 0
##$AQ_mod= 1
##$AUNM= <au_zg>
##$AUTOPOS= <>
##$BF1= 200.13
##$BF2= 200.13
##$BF3= 200.13
##$BF4= 200.13
##$BF5= 200.13
##$BF6= 200.13
##$BF7= 200.13
##$BF8= 200.13
##$BYTORDA= 1
##$CFDGTYP= 0
##$CFRGTYP= 5
##$CHEMSTR= <none>
##$CNST= (0..31)
1 1 145 1 1 1 1 1 1 1 1 1 1 1 1 1 1 1 1 1 1 1 1 1 1 1 1 1 1 1 1 1 
##$CPDPRG= <>
##$CPDPRG1= <>
##$CPDPRG2= <>
##$CPDPRG3= <>
##$CPDPRG4= <mlev>
##$CPDPRG5= <mlev>
##$CPDPRG6= <mlev>
##$CPDPRG7= <mlev>
##$CPDPRG8= <mlev>
##$CPDPRGB= <>
##$CPDPRGT= <>
##$D= (0..31)
0 0.7 0 0 0 0 0 0 0 0 0 0.03 0 0 0 0 0 0 0 0 0 0 0 0 0 0 0 0 0 0 0 0 
##$DATE= 1744111087
##$DBL= (0..7)
120 120 120 120 120 120 120 120 
##$DBP= (0..7)
150 150 150 150 150 150 150 150 
##$DBP07= 0
##$DBPNAM0= <>
##$DBPNAM1= <>
##$DBPNAM2= <>
##$DBPNAM3= <>
##$DBPNAM4= <>
##$DBPNAM5= <>
##$DBPNAM6= <>
##$DBPNAM7= <>
##$DBPOAL= (0..7)
0.5 0.5 0.5 0.5 0.5 0.5 0.5 0.5 
##$DBPOFFS= (0..7)
0 0 0 0 0 0 0 0 
##$DE= 6
##$DECBNUC= <off>
##$DECIM= 32
##$DECNUC= <off>
##$DECSTAT= 4
##$DIGMOD= 1
##$DIGTYP= 9
##$DL= (0..7)
0 120 120 120 120 120 120 120 
##$DP= (0..7)
150 150 150 150 150 150 150 150 
##$DP07= 0
##$DPNAME0= <>
##$DPNAME1= <>
##$DPNAME2= <>
##$DPNAME3= <>
##$DPNAME4= <>
##$DPNAME5= <>
##$DPNAME6= <>
##$DPNAME7= <>
##$DPOAL= (0..7)
0.5 0.5 0.5 0.5 0.5 0.5 0.5 0.5 
##$DPOFFS= (0..7)
0 0 0 0 0 0 0 0 
##$DQDMODE= 0
##$DR= 18
##$DS= 0
$$ [...]
##$SUBNAM2= <"">
##$SUBNAM3= <"">
##$SUBNAM4= <"">
##$SUBNAM5= <"">
##$SUBNAM6= <"">
##$SUBNAM7= <"">
##$SUBNAM8= <"">
##$SUBNAM9= <"">
##$SW= 18.0517328524113
##$SWIBOX= (0..15)
0 0 2 0 0 0 0 0 0 0 0 0 0 0 0 0 
##$SW_h= 3612.71676300578
##$TD= 16384
##$TD0= 1
##$TE= 0
##$TE2= 300
##$TE3= 300
##$TEG= 300
##$TL= (0..7)
0 120 120 120 120 120 120 120 
##$TP= (0..7)
150 150 150 150 150 150 150 150 
##$TP07= 0
##$TPNAME0= <>
##$TPNAME1= <>
##$TPNAME2= <>
##$TPNAME3= <>
##$TPNAME4= <>
##$TPNAME5= <>
##$TPNAME6= <>
##$TPNAME7= <>
##$TPOAL= (0..7)
0.5 0.5 0.5 0.5 0.5 0.5 0.5 0.5 
##$TPOFFS= (0..7)
0 0 0 0 0 0 0 0 
##$TUNHIN= 0
##$TUNHOUT= 0
##$TUNXOUT= 0
##$USERA1= <user>
##$USERA2= <user>
##$USERA3= <user>
##$USERA4= <user>
##$USERA5= <user>
##$V9= 5
##$VALIST= <valist>
##$VCLIST= <CCCCCCCCCCCCCCC>
##$VD= 0
##$VDLIST= <DDDDDDDDDDDDDDD>
##$VPLIST= <PPPPPPPPPPPPPPP>
##$VTLIST= <TTTTTTTTTTTTTTT>
##$WBST= 1024
##$WBSW= 4
##$XGAIN= (0..3)
0 0 0 0 
##$XL= 0
##$YL= 0
##$YMAX_a= 574101
##$YMIN_a= -545228
##$ZGOPTNS= <>
##$ZL1= 120
##$ZL2= 120
##$ZL3= 120
##$ZL4= 120
##$ABSF1= 10
##$ABSF2= 0
##$ABSG= 5
##$ABSL= 3
##$ALPHA= 0
##$AQORDER= 0
##$ASSFAC= 0
##$ASSFACI= 0
##$ASSFACX= 0
##$ASSWID= 0
##$AUNMP= <proc_1d>
##$AZFE= 0.1
##$AZFW= 0.1
##$BCFW= 1
##$BC_mod= 2
##$BYTORDP= 1
##$COROFFS= 0
##$CY= 83.5205535888672
##$DATMOD= 1
##$DC= 2
##$DFILT= <>
##$DTYPP= 0
##$F1P= 10.8118882576601
##$F2P= -7.23987719738617
##$FCOR= 0.5
##$FTSIZE= 0
##$FT_mod= 4
##$GAMMA= 1
##$GB= 0.15
##$INTBC= 1
##$INTSCL= 1
##$ISEN= 128
##$LB= 0.25
##$LEV0= 0
##$LPBIN= 0
##$MAXI= 10000
##$MC2= 0
##$MEAN= 0
##$ME_mod= 0
##$MI= 1.114404
##$NCOEF= 0
##$NC_proc= 0
##$NLEV= 6
##$NOISF1= 3.799351
##$NOISF2= 2.8
##$NSP= 1
##$NTH_PI= 0
##$NZP= 0
##$OFFSET= 14.38212
##$PC= 1
##$PHC0= -1186.708
##$PHC1= 7.392292
##$PH_mod= 1
##$PKNL= yes
##$PPARMOD= 0
##$PSCAL= 0
##$PSIGN= 0
##$REVERSE= no
##$SF= 200.129724274929
##$SI= 16384
##$SIGF1= 3
##$SIGF2= 2
##$SINO= 400
##$SIOLD= 16384
##$SREGLST= <1H.CDCl3>
##$SSB= 0
##$STSI= 0
##$STSR= 0
##$SW_p= 3205.1282051282
##$SYMM= 0
##$S_DEV= 0
##$TDeff= 0
##$TDoff= 0
##$TI= <>
##$TILT= no
##$TM1= 0
##$TM2= 0
##$TOPLEV= 0
##$USERP1= <user>
##$USERP2= <user>
##$USERP3= <user>
##$USERP4= <user>
##$USERP5= <user>
##$WDW= 1
##$XDIM= 8192
##$YMAX_p= 0
##$YMIN_p= 0
$$ End of Bruker specific parameters
$$ ---------------------------------
##NTUPLES= NMR FID
##VAR_NAME=  TIME,          FID/REAL,        FID/IMAG
##SYMBOL=    X,             R,               I
##VAR_TYPE=  INDEPENDENT,   DEPENDENT,       DEPENDENT
##VAR_FORM=  AFFN,          ASDF,            ASDF
##VAR_DIM=   8192,          8192,            8192
##UNITS=     SECONDS,       ARBITRARY UNITS, ARBITRARY UNITS
##FACTOR=    0.0002768,     1,               1
##FIRST=     0,             0,               0
##LAST=      2.2672688,     0,               0
##MIN=       0,             -545228,         0
##MAX=       2.2672688,     574101,          0
$$ Real data points
##PAGE= N=1
##DATA TABLE= (X++(R..R)), XYDATA
0 0 0 0 0 0 0 0 0 0 0 0 0 0 0 0 0 0 0 0 -17 92 -100 100 -100 100 -100 100 -100 100 -106 133 -147 159 -171 176
34 176 -182 185 -187 189 -192 189 -187 183 -171 166 -158 146 -128 112 -97 80 -65 60 -53 52 -70
55 -70 107 -170 273 -427 659 -1005 1503 -2241 3340 -5009 7637 -11979 19784 -36004 66151
70 66151 -106559 -239879 574101 -430036 371589 -333807 384842 -245008 228410 -44464
80 -44464 -147063 235558 -200031 282674 -503295 444240 -386117 314732 -344329 185059
90 185059 -165732 19954 159463 -208387 192913 -270921 478143 -346545 295680 -260528
100 -260528 294268 -120194 58216 -12291 -166433 246346 -215913 185440 -422387 375486
110 375486 -221507 155224 -250065 128796 16876 -45213 123153 -210959 244026 -191241
120 -191241 304709 -299333 214469 -117017 183521 -74492 -48590 62280 -98095 190324
130 190324 -249459 155728 -252666 227515 -183413 72493 -136473 63147 83399 -79172
140 -79172 90812 -131954 257267 -128163 181622 -188178 157142 -46164 61426 -65858
150 -65858 -88887 80638 -90016 105368 -223746 121560 -106225 152169 -141050 33701
160 33701 -2652 47438 62321 -95217 77424 -69276 197781 -127589 54449 -83268 137652
171 137652 -39432 -29899 -4091 -38132 64757 -94465 53658 -150490 99773 -53819 44408
182 44408 -103605 36962 48120 5271 43914 -48488 86061 -32522 131191 -84046 14454
193 14454 -28571 90937 -52899 -91166 5809 -7809 29538 -103726 27647 -62228 90251
204 90251 -19616 485 -44269 78853 67987 -50201 5256 6727 78779 -55783 39608
215 39608 -45274 20496 -11557 25958 -46437 -45920 36581 -9326 -6508 -69077 31036 -28936
227 -28936 42082 -16457 -7889 -14143 63112 53748 -42264 5216 41063 74103 -51741 -9584
239 -9584 -18823 30079 -17795 -32765 -56717 -18821 35066 -29207 -36987 -20740 67707 1460 3983
252 3983 -5491 37667 21858 24732 6941 -20809 15277 13840 10865 -47692 -3828 -2526 14871
265 14871 -25661 -23510 -21930 7819 19757 -25887 -25330 -2646 48561 -3882 -13179 -6829 49637
278 49637 31878 4227 -14183 9923 37987 3955 -21265 -37537 10036 -7027 -17120 -47136
290 -47136 -14452 1571 8289 -13963 -18633 19663 28048 29822 -4619 16625 12164 33639 3785
303 3785 -8621 -17195 11426 12873 -27091 -29237 -14995 18710 -17859 -12783 -25091 6338 7715
316 7715 8072 -18435 -10494 32127 21271 621 -17471 31647 17716 18249 -7974 1461 -2726 15091
330 15091 924 -40003 -19943 1306 7243 -46417 -16488 -2706 15043 -3119 6181 3158 12869
343 12869 40821 11125 105 -1456 42363 -2078 -11165 -16254 4635 -11997 -9464 -6999 -31823
356 -31823 -6773 2527 9425 -34270 5387 14042 14773 -10383 4146 11285 10407 27566 -5220 -3372
370 -3372 1807 40860 -12051 -19352 -4477 18633 -10848 -28152 -9634 -16173 2568 -15129 -4494
383 -4494 -22863 19177 12143 3619 -2079 23075 26861 2559 16189 -195 7917 -7002 16803
396 16803 -20066 -19457 -11227 2105 -14565 -25863 -989 -4443 10796 -11095 1836 -5278 28486
409 28486 11912 -3591 -1733 20288 21543 -9848 3038 181 16945 -11233 -4028 -16811 -196
422 -196 -2833 -11758 -15594 -13980 5165 -11325 2817 -10174 10803 3530 19773 6884 6313 13176
436 13176 15552 16481 -7992 2568 -7224 7837 -15940 -15162 -18514 808 -5338 -21136 -9404 162
450 162 14735 -6209 7538 800 17689 10056 10188 -417 7621 15444 -2794 -2409 -6318 8500
464 8500 -11107 797 -10329 -9586 -11427 726 -5724 -17421 332 2678 5060 -8688 11608
477 11608 5745 14024 10556 10816 2870 9999 16597 -7662 -7210 -3550 5346 -21101 -11878 -10603 -8537
492 -8537 -10581 -925 -2192 -10141 10185 9432 6534 -759 20369 9418 5724 4363 5845 498 1308
507 1308 7234 -12888 -10044 -3529 2712 -19056 -9236 -1994 -2666 -9562 -3864 2608 -2671 9051 5688
522 5688 5801 1356 18694 7876 2455 6335 8645 -584 -5130 2187 -10402 -10384 -6736 -2530 -19266
537 -19266 -10357 -2337 -1608 -4651 1190 8640 4965 12992 7019 6765 7267 16034 1999 -4017 1007
552 1007 2814 -7133 -11904 -1535 -8102 -6564 -9901 -3893 -7329 -740 -275 519 1497 4043 7213 3483
568 3483 12603 7300 6101 4099 9912 1409 -2573 753 214 -5602 -11283 -7979 -8982 -5335 -10949
583 -10949 -6512 -3832 3279 -558 683 9085 11784 8018 5890 10545 6123 5067 1002 1208 -4941
598 -4941 -2914 -5878 -8814 -6553 -7350 -7926 -7176 1297 -3856 -4351 642 7299 1729 2164 9210 8003
614 8003 4355 3775 7819 2523 4833 962 -3681 -5667 -1135 -6379 -11921 -6806 -4611 -8577 -9770
629 -9770 1472 436 -1638 3042 11012 4887 5418 10879 8169 4834 4947 4237 -4380 -32 -2577 -7259
645 -7259 -9980 -1334 -4986 -12664 -5031 104 -3777 -6022 5791 4592 1489 4308 9000 4696 6209
660 6209 7911 4240 1587 2347 1946 -6795 -1709 -1453 -6889 -12286 -3779 -4330 -9394 -3816 1234 -732
676 -732 -2626 5997 5775 5365 7033 9335 4691 5331 7552 230 -2314 151 -1173 -10391 -6818 -3705
692 -3705 -6914 -10209 -3763 -859 -4512 -985 2541 3970 3282 7897 5287 6653 6342 5639 1558 3357
708 3357 4179 -2873 -4482 -3080 -2941 -9287 -7343 -3737 -3938 -6750 -4111 -856 -976 2352 3482 5492
724 5492 6387 7810 4273 5752 7694 3619 -1237 -125 -336 -5504 -5850 -5448 -4525 -7094 -5518 -5453 -2552
741 -2552 -681 132 570 4317 6734 3523 4344 7117 7195 2564 3986 4577 1427 -2781 -2799 -2939 -5813
758 -5813 -4936 -7413 -5770 -5296 -2310 -5456 -1536 3869 3375 706 4632 9429 3974 3527 7566 6318
774 6318 532 -187 839 -1389 -3964 -3660 -6917 -6473 -3248 -5834 -6040 -2120 1501 -2410 -1329 6157
790 6157 6112 2593 5482 8871 4216 3136 4056 2778 -355 8 -1928 -5659 -4642 -4315 -7273 -7211 -2034
807 -2034 -2289 -4665 -1402 3633 403 1945 7661 6659 4134 4244 6698 3679 2563 1400 -710 -3260
823 -3260 -1494 -4902 -8127 -3867 -2617 -5910 -6463 -914 -632 -1711 860 5985 3501 2859 5741 5752
839 5752 4244 3927 3865 669 811 -1389 -3943 -3940 -1620 -4339 -8633 -4507 -2512 -4597 -4420 891 2101
856 2101 1213 2479 5712 5883 4563 5456 4253 4388 2442 -22 -2512 -1796 -1998 -4656 -5619 -3769 -3939
873 -3939 -5823 -3385 -298 -524 -212 2006 4002 4181 3874 3922 5695 5828 2270 343 2160 2831 -2591
890 -2591 -4860 -2674 -3051 -5213 -6054 -4364 -3489 -3205 -1981 -627 988 3219 3374 3902 6208 6142 3120
907 3120 2452 4015 2124 -1377 -799 -679 -4966 -6214 -3994 -3705 -5410 -3362 -3192 -1616 -248 1595
923 1595 70 3337 7127 4560 1621 4776 6354 2271 108 3045 10 -3263 -2717 -3239 -5183 -4342
939 -4342 -4235 -4685 -3573 -1223 -1774 -1073 2304 4035 2255 2728 6164 4729 2173 4142 5397 937
955 937 -1939 -1092 -1487 -3796 -3214 -5322 -6167 -3222 -3220 -4263 -2032 2167 1401 54 2941 4945 3155
972 3155 3578 5254 4155 1131 1195 1523 -1696 -2149 -1705 -3344 -5081 -3784 -3600 -4935 -1719 -658 -2549
989 -2549 -680 3686 2816 1319 3027 5283 4792 3175 2748 2130 1007 2046 -464 -4069 -3347 -3277 -5778
1006 -5778 -4857 -2903 -2150 -4160 -1218 1198 -957 1228 4389 4787 2903 3550 4304 2534 1536 1235 274
1023 274 71 -837 -3697 -4117 -2386 -2585 -3537 -3921 -1133 -1311 -1951 -21 2802 2635 3077 3612 4049 2740
1041 2740 3008 3207 1936 1219 -1040 -1841 -2110 -2045 -3915 -4689 -3202 -3200 -4202 -3500 -752 962 1108 1485
1059 1485 2529 4580 4377 3931 2839 3660 3384 -809 -1013 -783 -1089 -3315 -2743 -3154 -3263 -3815 -3181 -1520
1077 -1520 -1193 -49 1723 1660 3347 3257 2295 4120 4496 1610 660 2354 1625 -1407 -2228 -972 -2029
1094 -2029 -3781 -4415 -3198 -2539 -1982 -2099 -1629 -37 1421 1328 1705 4787 5364 2566 1963 3312 2204
1111 2204 -157 493 23 -3345 -3585 -2435 -3003 -3682 -2471 -2108 -1553 -1222 719 -1105 1922 3773 2933
1128 2933 1306 4180 4592 1405 1378 2157 1694 -1012 -1883 -1410 -2970 -3137 -2612 -3142 -2586 -1237 -2551 -1888
1146 -1888 323 1756 622 1941 4260 3267 1326 3320 4431 1099 218 -557 -848 -2279 -2752 -3401
1162 -3401 -2641 -2362 -2603 -3300 -2361 -83 -16 -819 1470 3933 2571 2184 3010 3271 1399 1392 1072 -318 -353
1181 -353 -1293 -1498 -2317 -2696 -3037 -3790 -2650 -1306 -1956 -1070 1356 1160 404 2887 4090 3158 2459 2931
1199 2931 2295 1249 -70 -1086 448 -1507 -2837 -4007 -2447 -3085 -3161 -2582 -1238 -339 -801 890 2337
1216 2337 2853 2928 2354 2358 2902 2007 1144 944 1110 -502 -1968 -1915 -1288 -3646 -3124 -2031 -1121 -2029 -1488 24
1236 24 -209 1177 1765 2498 2681 4169 2278 1633 2106 2257 138 -1100 -668 -1592 -3057 -3389 -2082 -2682
1254 -2682 -3052 -2202 -815 -597 873 1619 1976 2515 2916 2284 1296 3889 2957 -297 -206 818 -1278 -3859
1272 -3859 -1702 -1192 -3051 -2842 -2497 -2248 -1122 -917 181 487 1896 2091 1312 3156 3953 2432 511
1289 511 1680 1680 -1218 -1160 -387 -1140 -3228 -2363 -2091 -2547 -2213 -2239 -954 346 1469 865 587 3249 3604
1308 3604 1543 1603 2246 1642 -515 16 1061 -600 -1830 -1843 -2283 -2790 -2557 -2501 -2161 -1145 -1017 -552 740
1327 740 2536 2472 1427 4098 3143 1654 1313 2065 2141 -470 -919 -1100 -1974 -2424 -2052 -2319 -1721 -2771 -2125
1346 -2125 -618 226 194 1014 1899 3374 2477 1642 3195 2718 1658 -147 -459 -255 -371 -2735 -3088 -1771
1364 -1771 -1963 -2447 -2749 -122 -505 -1470 -284 1745 1772 1671 1251 2556 2809 2603 898 529 783 -350
1382 -350 -1485 -1201 -1086 -2828 -2846 -2169 -1462 -1932 -2285 -1066 572 -267 986 2445 2723 2090 2019 2086 1815
1401 1815 1831 -53 -801 -354 -410 -1527 -2932 -1033 -1923 -3152 -2365 -530 -1027 -803 1201 824 1313 2471
1419 2471 1778 2569 2191 2406 219 -207 583 -75 -1541 -1856 -453 -2766 -4069 -2172 -1272 -1995 -2019 -236
1437 -236 1266 952 2511 1349 2097 2517 2771 2066 630 2547 629 -1089 -996 -780 -3097 -3111 -1787 -1638
1455 -1638 -3228 -1271 -1202 -730 -594 655 1976 2015 2272 2393 1902 2565 3068 637 345 1192 219 -2947
1473 -2947 -1501 -594 -3102 -2653 -2108 -1928 -1428 -765 -438 -438 1057 1597 1849 2183 1692 1851 1105 2129 830
1492 830 108 -712 -329 -1045 -1868 -2612 -1554 -1373 -3032 -1823 -79 352 -76 913 731 2054 2043 2246 2329
1511 2329 1700 2142 548 436 -342 -531 -945 -2177 -1641 -2501 -2491 -2175 -1604 -1357 -1261 569 1530 1026 800
1530 800 2535 2758 1259 2106 1851 1778 326 473 -718 -1635 -1996 -2240 -3327 -2821 -1167 -1158 -2079 -1255 105
1549 105 440 205 2357 1990 1979 2496 2546 985 1397 1316 591 -1333 -823 -1442 -2087 -1870 -1597 -2596 -3342 -543
1569 -543 -259 -1790 192 1616 1034 986 1588 2346 2439 2032 1430 157 182 801 -481 -2231 -1460 -1566 -2430
1588 -2430 -2695 -2045 -1021 -1546 -126 334 -559 1331 2314 1399 1040 1669 2229 1817 885 -5 240 -82 112
1607 112 -2079 -2412 -1191 -654 -2557 -2738 -1539 -589 -716 -647 871 1476 2007 2843 2450 1135 1795 1682
1625 1682 637 34 -651 -507 -1290 -734 -2824 -3426 -1660 -996 -1108 -2123 -86 1394 1115 467 936 3008
1643 3008 2640 1648 892 1684 1047 1556 -293 -796 -1093 -878 -2006 -2154 -1390 -1397 -1956 -1765 -1217 -399 994
1662 994 1800 939 1247 1868 2972 3164 553 429 1559 892 -873 -1102 -2169 -815 -1885 -2904 -2790
1679 -2790 -1557 -60 -1697 -1546 498 2775 1591 550 1657 2054 1796 2058 590 -110 1294 1020
1695 1020 -813 -2514 -1234 -583 -895 -1967 -1686 -813 -419 -503 -532 -763 1628 1491 1103 549 2105 2555
1713 2555 1772 675 15 -472 437 -46 -1511 -1987 -1538 -982 -1656 -2619 -1101 350 -95 -38 -77 757 2134
1732 2134 3236 1112 511 2240 2104 -154 -808 122 633 -1176 -2527 -2733 -2227 -342 -1306 -1710 -1405
1749 -1405 769 462 -440 -431 1864 901 1460 1918 727 726 2386 1131 -1268 -709 -459 46 -1101 -2569
1767 -2569 -1428 -1105 243 -1273 -2082 -48 2000 1426 204 1202 3013 3120 873 825 1266 1682 144
1784 144 -2138 -1578 -1034 -174 -1743 -3238 -1315 -865 -629 -1039 -322 506 2112 2190 1398 971 991 2114 1971
1803 1971 715 317 911 1795 -269 -1726 -1305 -181 -729 -2305 -2772 -1581 350 -156 -1187 -26 2410
1820 2410 3129 -118 599 2366 3003 1592 150 -57 1304 306 -1032 -1762 -1409 -618 -883 -2139 -1737
1837 -1737 -896 455 193 915 -507 987 2188 2494 1151 -358 2400 2505 404 -1052 885 738
1853 738 -252 -2753 -2940 -993 -200 -1146 -2363 -709 1013 740 -796 204 1411 2341 1667 275 461
1870 461 565 1974 -297 -678 -806 199 -795 -2239 -2081 -2141 -1237 5 -1275 -1857 182 1636 318
1887 318 -32 924 2587 2267 143 291 665 1107 974 -1640 -2880 -88 662 -901 -2972 -1252 16
1904 16 156 -983 -1467 -79 2285 1016 114 353 2712 3392 228 192 1083 1521 406 -1340 -1059 -1295
1922 -1295 -976 -1666 -2068 -2335 -1049 -310 -1246 -769 763 1522 1709 1291 566 450 2586 1805 100 -834
1940 -834 810 1230 -1465 -2444 -1764 -361 -968 -2598 -2125 -623 1369 216 -1386 -645 2366 2573 89
1957 89 139 2241 2841 576 -311 477 247 -349 -792 -1549 -1979 -1218 -248 -735 -1770 -1198 482 1140 1240
1976 1240 -206 666 2606 2985 834 -1293 1955 2239 -294 -2235 -1251 494 -635 -2051 -1727 -918
1992 -918 -341 -1392 -1210 -829 1295 566 -946 209 1572 2351 933 772 1386 1996 1206 1170 -311 -1031
2010 -1031 -297 70 -2085 -3017 -2123 -74 -339 -1690 -1149 137 1646 1876 -479 -802 1867 2405 636
2027 636 621 317 2243 -749 -1476 -1904 -411 -440 -1332 -3021 -2194 387 240 -1271 -607 658 543 1380
2045 1380 662 -256 1539 2468 1465 -100 -178 964 726 -1303 -1427 -899 -996 -646 -1766 -1518 -949 1006
2063 1006 100 -982 -356 2260 2222 1587 518 1388 1186 1900 115 -29 -163 528 -671 -2181 -1816 -96
2081 -96 -533 -1700 -2103 -977 344 -104 -434 561 1527 2157 1285 393 992 1911 1095 -335 219 -194 -359
2100 -359 -871 -1256 -2122 -1385 -524 -624 -978 -1349 1133 1696 63 184 308 2489 1948 1130 -6 1625
2118 1625 1818 180 -1589 -778 567 -605 -2348 -2087 -496 -803 -1253 -699 -186 609 895 481 480 1641
2136 1641 2212 2312 603 151 360 -201 292 -503 -2055 -983 -397 -749 -1563 -1466 -388 -244 -347 -1071 156
2155 156 1898 1372 248 602 2173 1571 602 7 946 924 -690 -960 -836 -758 -832 -1134 -1540 -1849 -592
2174 -592 -313 323 -833 720 787 1689 1210 868 586 1043 1862 988 -444 -305 584 -676 -2294 -1225
2192 -1225 -209 -685 -1596 -1676 -302 222 -485 -617 -124 1681 1909 103 -157 1595 2275 217 33 -239
2210 -239 589 1 -940 -1530 -1062 -632 -846 -1189 -1349 -431 195 559 1055 443 844 908 1732 1080 173 1180
2230 1180 2326 -117 -1234 -644 -249 -826 -1090 -1817 -1192 -518 -754 -686 -949 576 445 723 294 566 1754
2249 1754 729 285 77 413 989 889 -796 -661 -934 -738 -1601 -1565 -969 -455 -672 -884 500 157 1319
2268 1319 779 764 1208 1919 1116 1722 52 -297 992 -457 -1180 -873 -1615 -681 -1320 -1660 -961 218 -278
2287 -278 82 58 1163 1281 981 873 503 785 1294 5 303 759 387 -557 -1331 -546 -932 -1107 -716 -1695
2307 -1695 -470 -437 -320 434 -682 435 894 1361 353 1034 779 1221 1199 221 -113 -247 -58 -52 -1436
2326 -1436 -1821 -561 -312 -1673 -796 -200 322 -375 -151 1198 1015 1136 407 289 1061 1485 37 278
2344 278 60 -776 -191 -1520 -1400 -1235 -1073 -259 -657 344 -837 -39 1428 565 609 847 1777 1414 1382
2363 1382 25 146 896 -613 -1323 -543 -173 -1411 -1844 -1669 -696 -1016 -419 270 -163 73 786 850 616
2382 616 326 827 1078 86 292 478 770 -263 -1013 -950 -1361 436 -362 -840 -1886 748 -524 -765 -333
2401 -333 320 267 855 1199 224 667 749 504 1244 354 -231 701 -378 -662 -954 -1223 -561 -1435 -1297 -396
2421 -396 -242 164 734 213 153 767 390 963 503 695 -268 39 -248 -153 -141 -1213 -1597 -868 -196 -703 -36
2442 -36 -407 -395 -238 763 188 56 406 526 1557 1234 -122 400 853 420 261 -532 -747 -1155 -399 -1091
2462 -1091 -1048 -172 -218 -587 -725 -36 189 646 827 818 236 2014 1176 420 174 -74 178 -490 -31 -805 -227
2483 -227 -376 -470 -1029 -959 -193 82 -832 -170 732 -371 123 542 338 755 395 165 612 4 530 -903
2503 -903 -1164 -199 -1309 -1078 -69 -951 -415 -1273 -453 112 65 1362 1061 747 964 665 1704 409 439
2522 439 85 476 -501 -696 -1079 -739 -362 -576 -880 -543 -62 -438 -236 -336 -273 649 1159 779 105 401
2542 401 1070 618 -249 454 245 -186 -1001 -1139 -855 -884 -775 -1045 -445 -348 266 268 24 370 349 1027 1073 449
2564 449 1017 1020 157 104 479 -200 -208 -1043 -1038 -1092 -237 -1032 -1779 -621 417 276 -138 586 411 890 95 819
2586 819 1048 128 542 118 -580 -577 -160 -610 -589 -1052 -1836 -485 -642 -1051 -523 -83 680 -345 852 849 987
2607 987 354 349 555 -125 521 591 -12 -340 114 -36 -1232 -1252 -270 -1251 -371 -328 256 551 -281 -337 1550
2628 1550 173 46 613 521 243 927 221 -158 111 -51 -711 -1020 59 -967 -1096 -88 -17 -647 397
2647 397 736 56 163 1069 726 1046 604 391 360 256 1131 57 -286 -716 -812 -801 -824 13 -111 -551 -469
2668 -469 -377 -595 188 -206 648 -65 751 461 538 133 433 341 127 -303 -274 -1394 -1030 -582 -1474 -798 -16
2689 -16 -205 -714 104 711 426 606 803 502 512 577 688 550 -101 -449 1 -594 -599 -369 -682 -876 -310 -542
2711 -542 -425 -189 -338 94 -64 139 474 361 369 702 528 48 -152 604 -735 536 171 -185 -544 260
2731 260 -1010 -860 -1187 221 307 -37 141 529 -164 314 992 172 955 1071 1045 419 -487 454 -749 15
2751 15 -1268 -757 -551 -1204 -531 -608 -419 540 715 -734 50 58 719 112 206 879 863 189 358 220 147 -153
2773 -153 -281 -759 -503 -943 -78 -828 -1007 65 -485 411 -125 -349 507 389 970 810 668 -128 316 -216
2793 -216 -482 35 -697 -1140 -192 -1728 -532 -55 -906 -51 175 232 560 274 490 43 319 1270 771 619
2813 619 369 -183 98 -617 -771 -933 -884 -775 -621 -87 -748 -419 636 -325 575 45 -63 393 372 557
2833 557 468 697 -377 948 -705 -223 309 -133 -584 -482 -577 -1047 -621 394 -795 352 251 -275 122
2852 122 -345 878 298 204 675 525 -192 504 -407 -827 91 -662 -843 74 -1017 -211 -433 -797 -560 -635
2872 -635 -227 436 900 226 877 1131 836 827 695 653 155 -312 -199 -456 -879 -359 -850 -932 -691 -567 -376
2893 -376 -134 690 -360 1328 1339 736 887 575 -190 555 537 -315 126 -358 -156 36 -733 -112 -626 -855
2913 -855 -321 -528 -274 176 -513 43 959 -193 715 251 -322 422 -35 190 -331 -112 -493 -361 -465 -880
2933 -880 -660 -430 -855 -1011 -179 -90 -59 195 -83 -139 303 386 -140 -80 494 -289 -154 -403 265 -691 -661 -617
2955 -617 -1585 -193 -13 -381 -923 -140 489 17 589 1030 262 390 897 -155 172 1095 403 619 -379
2974 -379 -627 -140 -936 -802 -438 -183 -322 -984 -1041 422 767 551 787 892 1138 -6 -377 -207 484 -191
2994 -191 -110 -721 185 -387 -822 -282 678 -526 -242 -623 -315 -556 384 123 289 916 889 565 691 1225
3014 1225 243 174 28 -60 -289 -1175 -681 216 -241 -413 -451 -572 -637 -449 855 975 698 395 768 -194 287
3035 287 794 1194 268 355 436 -508 -247 -147 -333 -952 -519 -693 196 -669 -28 -840 348 -89 591 55
3055 55 857 1187 1010 -310 746 -604 -174 734 269 -386 -514 -16 -609 -51 -557 -905 -1060 -276 -143
3074 -143 94 11 670 1101 816 -27 500 1023 821 -317 -296 -230 -341 -340 -323 -597 26 -691 313 -385 -214
3095 -214 -637 -260 947 162 616 496 286 -67 -75 924 -545 355 -5 -258 34 28 -1592 -314 -459 46
3115 46 25 -219 -842 244 454 240 79 -741 482 213 632 374 967 -377 429 -135 -864 -746 -86 -611
3135 -611 -558 -460 -591 407 145 92 123 659 191 193 421 539 -217 687 -203 -408 -270 -259 124 -492 665 -158
3157 -158 -424 -369 -326 110 -575 -146 457 219 169 178 535 -20 534 854 569 73 629 -21 -260 223 -350 -129
3179 -129 -736 -959 -660 -224 -469 -149 518 40 45 66 12 448 754 291 450 619 197 373 -101 646 -717
3200 -717 -885 -360 -74 -872 333 -42 -442 -183 664 -440 -195 -48 574 -249 777 474 635 84 662
3219 662 -226 -297 -605 -636 -362 -531 -194 -479 97 391 214 -654 494 571 -71 247 544 317 245 -188 159
3240 159 367 309 -161 208 -845 75 -718 -847 351 -133 282 -243 30 273 -271 655 354 -17 -641 584
3260 584 -440 17 -115 275 -58 -105 378 -310 -650 -370 -897 152 -408 -508 -363 67 -381 -180 -245 228
3280 228 894 17 863 393 184 398 313 -475 239 -827 -367 -778 -929 -462 -252 -179 -28 307 394 -442 429
3301 429 406 270 208 165 330 281 -59 -462 -1079 -527 -835 -510 -995 -744 323 -48 -270 -521 -149 676 -222
3322 -222 -302 343 240 34 185 -732 -118 1263 -487 -317 -54 -870 -474 -436 -829 -1154 -319 -142 50 -411
3342 -411 -27 158 94 -386 593 148 -62 435 642 -71 -122 208 -577 -175 -325 16 -324 -817 547 -158
3362 -158 551 242 -544 667 -333 -378 112 478 69 1098 -679 946 -116 -19 742 -367 -166 -651
3380 -651 -560 -860 -384 -263 -397 -707 602 -310 59 177 -120 444 418 272 220 -95 382 56 -394 540 -359
3401 -359 -102 -620 -511 -592 -524 53 -336 -172 -134 521 92 -266 -115 413 456 747 -147 229 527 593 577 603
3423 603 -52 87 -227 495 662 -358 -328 -505 335 631 -103 254 116 -185 265 627 68 18 531 686
3443 686 272 -101 -402 -277 13 -567 -206 -821 264 -1000 -665 -63 413 -71 499 -140 381 -275 384
3462 384 -103 838 638 -80 -931 -599 -854 -626 -470 -95 313 202 -188 -408 234 600 494 -684 433
3481 433 -231 898 9 84 -118 30 395 187 -89 233 -848 -387 -465 -856 -604 -248 -899 -90 350 46
3501 46 154 -434 -572 97 129 305 286 516 -102 101 146 -242 -362 236 -638 -218 -1036 216 458 -296 512
3522 512 -94 -447 490 197 238 411 -616 108 -46 744 -305 -422 -304 60 -632 225 -565 -411 -471 132
3542 132 85 203 -103 259 589 -86 929 -21 -242 274 -342 621 -5 -545 -175 -392 -753 288 -292 -581
3562 -581 -110 -413 122 -704 141 191 318 133 313 -273 -140 984 581 307 -83 -414 182 -220 -58 -217
3582 -217 25 -687 -31 196 -653 -130 623 621 81 595 -96 973 649 294 385 497 28 -38 469 357 -92
3603 -92 -155 98 308 -914 -158 -367 489 -184 -202 -328 113 1337 438 -238 326 630 -301 -260 198 -159 -397
3624 -397 336 -229 244 17 -823 63 -279 54 -585 189 530 -118 545 72 422 490 19 43 580 -241 625
3645 625 266 -188 89 258 -253 -172 43 255 88 -451 -196 -844 38 32 577 340 336 -388 654 77 496
3666 496 -290 -187 104 -1022 -899 114 -512 -521 91 -209 271 83 312 272 1031 678 -225 -448 438 746
3686 746 -730 116 288 -225 68 -45 -222 264 -156 -545 28 -666 -657 -545 -21 204 -309 77 82 567 21
3707 21 -504 32 -214 -284 -316 -657 317 -685 15 444 -446 105 46 -141 84 281 -706 -886 602 450 -245
3728 -245 415 263 200 976 -544 -257 725 -471 -625 -294 -466 -374 -891 109 -112 -121 495 -77 55 122 813
3749 813 31 -264 652 -549 -835 644 -5 390 117 35 -313 91 -420 -261 -26 -499 -374 -611 352 -69
3769 -69 325 136 115 1010 -450 235 366 -142 88 488 -646 104 -14 -767 294 -343 329 16 -562 246
3789 246 -162 647 -122 -506 273 957 211 571 212 -529 -379 -213 189 -349 65 104 -120 396 -622 -125
3809 -125 190 -604 353 -202 9 957 581 -219 597 -611 -594 43 -420 -264 577 322 -718 -523 -570 -148
3829 -148 116 98 -333 -195 210 -167 92 -360 1049 -264 -26 228 134 -195 453 -452 -177 99 66 -163
3849 -163 19 32 -5 -230 -171 -201 -299 129 8 201 -324 309 621 -249 287 -703 548 -296 -157 625 539 564
3871 564 -410 -265 -239 199 -562 -581 621 -474 429 -333 112 534 272 -482 147 677 63 -287 42 -165
3891 -165 -122 -233 353 837 -307 -80 -364 414 -16 133 33 -768 101 705 647 -336 217 362 -346 -325 -32
3912 -32 -70 -824 83 -629 -21 -1068 125 -240 -65 -71 -413 -583 472 -400 -531 -95 -2 -90 515 256 -20
3933 -20 -224 -548 -37 225 -823 396 523 -428 151 89 -724 76 -196 -188 -466 153 -259 328 75 390 17
3954 17 -765 382 -309 -736 268 470 -480 -1131 -328 255 -509 -635 -431 22 458 119 -95 236 148 354
3974 354 408 -227 -216 1021 733 411 -477 -19 743 -3 551 -171 -433 -161 640 -371 2 1246 245
3993 245 -127 24 173 482 -124 181 534 404 1037 -174 665 -256 -74 -547 310 -95 147 -60 77 -458
4013 -458 -66 474 -492 199 1052 276 506 -149 -314 552 223 -318 -364 141 34 -178 -60 -251 160 -674
4033 -674 -136 -809 45 113 472 -228 565 5 -145 150 131 -279 357 -1 20 595 475 317 451 51 -215
4054 -215 621 -729 -189 24 259 51 -679 418 -175 168 229 30 474 300 -754 90 -97 72 -226
4073 -226 -336 18 -7 652 -265 -73 -453 500 -161 524 112 -98 465 -1051 -148 -258 -389 24 -640 -35
4093 -35 -604 -860 388 377 53 485 343 -290 -114 249 -41 308 415 323 128 57 307 30 -95 441 -14
4114 -14 318 -4 -1027 402 -150 349 85 179 -396 -357 53 -543 33 1187 475 -155 -292 -88 -631 -16
4134 -16 -30 -394 -172 -47 474 -231 617 201 24 -534 -3 -246 -360 -639 167 383 558 529 -596 650
4154 650 365 -317 -275 -802 344 254 -27 103 -67 -932 228 -312 -166 -154 -122 313 87 -484 -28 296 -20
4175 -20 -17 -159 250 -705 401 -417 101 151 197 -460 125 509 -123 275 -65 134 564 471 124 -63 -539 852
4197 852 1058 711 179 608 210 282 123 -17 -536 435 119 64 -97 195 326 172 316 164 737 -641
4217 -641 -272 -34 -482 461 66 503 -391 274 1282 320 -662 -491 -81 410 -186 -371 -237 -244 307 176
4237 176 411 -255 -549 308 -424 333 15 -411 158 669 -193 768 334 80 -386 250 377 227 237 -451
4257 -451 57 271 4 -632 -155 -203 261 386 -28 477 199 -70 -265 309 -283 -110 -207 -466 -431 -119 -791
4278 -791 35 -168 5 428 -225 -156 -105 -68 -36 36 -105 211 27 55 -490 102 -52 -791 -273 -70 -79 -112 114
4301 114 10 -248 -829 430 -492 443 0 -415 676 637 -75 -1100 93 865 227 -102 142 -689 -141
4320 -141 -795 -138 -504 -646 552 -369 60 174 181 231 -416 -896 747 244 -292 285 306 -840 358 -622
4340 -622 -263 -146 40 -289 -224 -139 -851 -100 -158 -838 -322 84 -267 -280 3 444 361 -681 -676 369 -56 -70
4362 -70 311 878 -106 -142 843 -117 -116 187 244 253 -140 -709 460 -349 655 206 -616 103 -103 322 -208 554
4384 554 246 532 382 318 -338 186 262 -402 -605 -201 227 569 192 124 35 -569 717 135 512 -291 340
4405 340 521 -682 -517 200 482 -40 39 -356 -339 -516 33 22 188 -251 -358 -690 267 -170 -745 464
4425 464 136 -136 -86 -297 339 -794 -51 -321 -491 -485 26 -627 1016 -6 903 177 -372 -597 411 -48
4445 -48 -192 373 -190 207 -445 692 -804 -296 -431 677 -135 -723 -519 -404 144 -304 281 352 -190 -215
4465 -215 407 -695 -74 86 -555 -68 358 -402 476 473 277 -47 68 98 172 279 -543 465 217 66 774
4486 774 -278 44 387 -448 -472 -85 750 -4 -150 224 271 -334 507 330 448 -65 457 -6 388 335 366
4507 366 718 -28 -675 692 -380 -647 957 -682 -67 -352 327 -271 97 -280 -416 -719 -170 -398 681
4526 681 -249 -359 -269 -413 -131 233 -206 -266 -101 -514 -73 198 -514 -348 -331 646 131 31 372 -206 242
4547 242 -724 356 145 306 -593 -629 -160 -561 209 -39 518 490 174 686 -382 425 508 655 -53 502
4567 502 154 -137 -539 283 -315 252 -505 78 -433 289 -393 -324 -167 -568 199 -37 -525 364 212 -488
4587 -488 -342 207 -99 -808 -129 -425 131 -136 -56 214 409 -494 67 160 335 -500 -593 409 351 -291 566
4608 566 1210 395 -291 -724 287 -425 627 204 -150 -335 183 583 689 -293 -333 -221 -186 563 240 221
4628 221 3 795 -392 34 -448 -86 -388 -773 390 -762 -235 314 -88 563 14 -345 658 -249 -473
4647 -473 793 435 256 -503 -440 333 -233 -507 -253 424 -280 -251 -152 107 146 -62 -206 151 188 252 -151 -248
4669 -248 -532 677 -127 89 869 640 -226 -810 -445 -457 -172 -33 -99 -848 -674 -466 -8 279 -311 300
4689 300 -358 18 480 -67 24 760 -611 -940 -1 -6 -267 -591 -724 -152 -320 47 -272 149 -195 -518 601
4710 601 325 240 -7 -142 -342 -350 -103 -405 112 -16 -783 144 382 -210 -495 42 -70 661 222 18 -734
4731 -734 -187 383 -331 -206 -921 204 211 -346 -569 -669 -173 -724 -4 -404 -114 -326 99 330 -290 -134
4751 -134 400 -965 104 -432 664 318 -478 -241 -102 259 -423 -211 -866 -589 464 0 -279 654 228
4770 228 433 1270 116 946 220 370 -286 180 503 171 227 460 -288 174 -320 680 540 -87 679 -375
4790 -375 414 -179 17 317 82 275 456 179 44 461 -756 114 -340 -89 -301 106 -100 -34 -289 189
4810 189 636 23 -167 -294 -234 -89 -308 495 329 -76 351 260 -606 748 296 -563 -175 79 -686 -516
4830 -516 323 -878 263 -178 -59 115 83 -225 -217 -20 311 191 822 -65 281 -206 456 699 34 498
4850 498 634 6 -282 270 163 511 480 473 455 1 -716 -454 -156 -229 128 509 -92 428 -222 -631 285 783
4872 783 -107 -671 -732 -117 112 -382 266 -308 240 -425 741 -925 -38 434 49 113 -79 34 -813 48
4892 48 -404 420 -264 -512 -468 -112 77 146 709 165 140 433 -1002 -534 623 -246 -474 396 -30 -69 -183
4913 -183 207 191 -109 -659 79 -338 -12 -419 -433 -594 742 410 296 79 563 -141 -70 479 222 -807
4933 -807 -336 25 116 -195 -83 -31 -471 -123 -53 -885 -445 357 79 329 -471 759 -302 -98 -276 -66
4953 -66 -767 78 7 253 27 -754 -758 360 210 -699 -130 -784 -6 350 87 645 195 -340 -570 242 -139
4974 -139 -26 140 -112 111 206 -110 343 -101 155 189 240 -153 229 -154 136 164 295 553 -470 576 -282
4995 -282 -9 -306 -65 -325 404 -85 407 81 -366 -152 83 -276 232 -187 81 -56 409 -346 215 -178
5015 -178 267 237 -512 82 -311 50 70 528 540 -116 -4 -183 261 2 -66 -550 -69 461 -771 252 -100
5036 -100 -600 303 822 -333 706 100 -461 -156 717 -39 -216 655 409 649 368 -90 319 -576 -624 -398
5056 -398 -332 33 87 -489 -565 -113 345 -18 928 -235 555 430 580 -504 796 -140 412 -164 -275 -486
5076 -486 -545 -234 -58 123 -572 -143 -292 119 -620 104 394 159 620 118 -326 274 424 258 -115 286
5096 286 -92 265 -109 155 158 -646 -683 -135 -389 814 -427 -104 480 5 434 480 453 -2 171 -486 -423
5117 -423 -45 -563 -66 426 482 -111 -390 189 771 224 384 -599 34 -145 -633 185 702 -319 61 366
5137 366 -235 322 -215 -543 482 -342 369 156 -1083 -675 464 -307 -326 -4 -295 241 -430 -9 808
5156 808 831 315 179 -36 484 117 27 184 -61 -591 -505 -84 -483 463 1064 -20 -254 -318 28 468 1144
5177 1144 -1035 -312 442 554 -69 -330 -165 -634 -209 -358 656 -292 270 569 -418 -104 -85 -11 913 291
5197 291 173 94 346 -150 -578 268 -194 215 271 308 -276 578 -88 323 136 -107 838 5 -182 -297 -643
5218 -643 -182 -435 -100 -683 -367 15 -77 -339 331 -251 -143 -221 816 -252 -229 62 -365 437 592 193
5238 193 323 -89 680 304 27 -378 146 -163 -155 257 232 -72 -160 -368 -204 15 -658 20 -242 258 -91
5259 -91 31 -439 -375 -450 -148 -78 606 -376 363 515 79 -348 -114 795 -160 -880 -75 770 -94 -804 -581
5280 -581 263 -811 -442 22 204 -605 839 -92 -629 54 -433 -21 -476 427 -224 -469 88 478 151
5299 151 -253 -576 403 355 -209 269 324 51 444 -156 187 -192 -43 237 820 -32 -217 501 637 -264 -45
5320 -45 260 -150 67 -173 29 546 278 519 -669 -701 -213 -468 572 336 172 -478 -136 8 -287 17
5340 17 326 445 116 -450 536 843 -710 -57 -699 -822 57 -367 -182 353 -115 -470 -209 427 111 -184
5360 -184 253 -136 216 155 -486 -536 -442 437 167 -14 -164 143 -889 37 -343 695 391 317 -99 -412 27
5381 27 -58 71 181 819 22 398 366 262 86 41 -111 -534 -45 -537 285 460 367 435 -184 71 404 -142
5403 -142 346 545 620 -120 714 85 -485 217 -116 -349 -222 -150 33 -7 -248 -281 -1300 60 -134 -242 627
5424 627 456 -38 -449 -357 183 218 367 799 184 -190 289 81 284 -278 -779 -300 -337 -311 -121 363 266 -477
5446 -477 -107 -306 196 -218 -780 -128 190 -225 541 -552 558 -228 -435 -292 -912 -637 225 16 -716
5465 -716 385 114 169 107 183 -860 29 -117 -178 -635 -459 -785 -463 284 172 296 -39 -833 -360 15 -1002
5486 -1002 440 720 24 -408 192 162 245 -369 539 -254 264 153 98 -91 196 1097 -262 183 97 -422
5506 -422 -36 831 325 -31 539 77 -163 -486 486 449 422 -474 -245 250 120 521 -128 122 198 -125 -224
5527 -224 195 168 267 17 233 -160 111 283 159 473 404 490 269 405 449 42 -71 -272 -422 549 -31 -528
5549 -528 315 -674 217 -385 797 479 -174 -124 -395 -548 278 -212 33 457 -67 147 -3 -43 -136 306 -115
5570 -115 629 -134 272 -35 110 259 290 -122 -284 -260 -235 660 -206 138 -88 329 -73 -963 802 -266
5590 -266 445 346 -322 73 -256 397 -458 -28 -164 -382 638 -92 -220 645 78 0 -320 -355 -473 390 -201
5611 -201 137 199 21 -15 386 357 81 329 588 1091 -29 -420 -817 -349 26 -554 -228 763 -325 -471
5631 -471 -154 -589 80 -86 -129 -312 -437 592 -563 -389 412 -90 -486 69 -376 49 -503 604 389
5650 389 141 -269 1052 156 -421 -656 -138 -352 -88 259 238 -488 -257 239 -455 -350 115 323 32 800
5670 800 -122 -418 616 291 294 -1 -221 -47 -76 -501 -136 -250 -794 -657 -749 185 -569 -80 -104 411 -291
5691 -291 202 -337 111 436 218 331 87 305 -337 -305 -69 263 -465 205 -427 -128 776 970 -24 419
5711 419 343 492 145 -195 20 440 -891 170 -132 -23 123 -250 196 -1040 -532 -455 -273 183 -607 5
5731 5 -311 531 -209 -419 22 -366 -771 135 600 -61 -206 -386 -19 -383 295 -421 -581 126 -516 6 -245
5752 -245 161 391 419 461 67 -86 220 193 458 198 509 -96 -118 263 3 -487 -7 530 -208 -590 -413
5773 -413 39 30 -161 -413 165 -341 -139 -539 -496 94 564 491 95 498 -303 -421 409 65 -585 -459 28
5794 28 -230 -35 -297 -253 -62 -487 -196 114 540 -334 440 156 382 173 491 470 -260 106 -105 795 756
5815 756 -56 -92 71 717 513 -712 442 274 87 464 -335 328 44 -40 -80 175 -311 687 204 -64
5835 -64 313 -798 -854 174 724 746 -289 267 495 -347 -153 398 364 317 431 -493 -1388 216 436 -788
5855 -788 -333 -191 -211 -145 -458 -416 22 65 -549 -200 -325 -277 763 2 214 69 223 -531 184 -373 -10
5876 -10 98 858 36 43 -177 -609 -324 -178 29 143 -463 -453 -37 525 796 508 254 -106 318 164 -198
5897 -198 -27 -152 -263 -63 -20 -246 -210 -379 674 -62 273 302 422 -84 18 -142 -550 -133 21 51 -220
5918 -220 14 69 562 -203 935 518 -189 -679 678 -69 125 -152 -268 -461 254 170 -469 6 -370 108
5938 108 172 130 110 -334 -470 87 254 -259 -301 419 312 -310 -288 387 -80 -392 45 -369 10 402 106 -288
5960 -288 -392 -122 -4 -32 235 440 -388 -26 -296 732 274 215 234 291 966 380 177 286 680 245 726
5981 726 695 294 126 -81 71 80 -386 35 -40 -739 -881 314 -557 188 193 901 138 302 239 -119 -37 -54 -3
6004 -3 336 -199 150 -90 -9 309 -37 475 -881 -605 -199 485 -294 339 -299 -716 -49 94 552 -97 108
6025 108 233 -45 244 -38 -464 -902 -16 111 269 85 198 300 -363 -203 -378 -95 -604 -256 57 882
6045 882 531 -190 481 -508 -115 -336 55 -401 -624 -57 -396 503 627 -93 623 33 -357 494 83 -280
6065 -280 -545 -483 -195 728 -38 112 291 188 -493 32 -988 -8 -363 -833 357 -237 -552 -225 206 -476
6085 -476 70 5 -105 -99 528 -469 -55 36 237 23 -564 276 -211 485 -202 -122 -763 -235 -458 427 -225 -588
6107 -588 295 497 -71 -301 208 483 63 -511 601 734 -578 817 150 24 -368 11 -133 -299 99
6126 99 187 -404 100 -159 15 -29 -222 -616 -307 -16 764 1139 -396 -141 -171 149 750 315 -421 -216 294
6147 294 -196 -487 -328 -108 595 115 330 -114 -688 648 -381 380 785 -692 331 60 -195 567 226
6166 226 171 -220 68 139 297 -673 352 -522 -48 -217 -637 462 -19 123 -491 475 370 819 -317 -42
6186 -42 151 1070 238 -539 525 117 -91 -298 -265 543 369 135 -60 -1054 -138 178 12 -52 -650 236 97
6207 97 -312 466 72 545 475 -318 -365 -109 -140 184 -425 -40 -49 -281 -200 505 744 211 260 -74 310 67 -12
6230 -12 -828 232 -827 265 100 -247 113 -80 -207 325 -96 89 775 -401 -98 41 530 213 -215
6249 -215 -512 -137 -215 -237 361 124 -23 -1135 76 -28 -113 -492 -280 16 -304 -335 286 688 -767 224
6269 224 -332 -72 404 -190 357 54 134 385 66 -123 56 129 480 -276 -16 -407 379 286 396 310 133
6290 133 15 306 93 305 230 152 541 476 542 -309 117 -394 -604 187 44 -449 5 219 -1156 -268 198
6311 198 126 439 131 28 -192 217 58 -270 -334 -228 -315 -267 486 224 103 172 -34 565 789 711 210 -386
6333 -386 211 -160 -284 756 653 -516 -99 95 -262 311 193 118 35 42 -219 -307 613 -552 -307 -429 68
6354 68 573 -75 -665 -106 -51 264 553 171 304 -223 -706 410 -389 -295 197 -349 -306 -36 100 319 -575
6375 -575 -156 -330 -329 -467 -711 -15 -315 801 70 481 -218 -316 53 -176 -866 -31 -413 105 51 -124 130
6396 130 -268 -52 -265 -568 -316 355 287 722 459 106 142 -144 -384 -369 -549 638 -364 -77 -471 -14
6416 -14 -727 -450 -562 -771 -903 287 836 -462 -605 15 518 -818 -14 526 695 410 -180 -264 148 -436
6436 -436 689 -256 221 23 112 747 -388 73 99 -40 -127 397 245 556 184 -12 -16 172 -110 -767 -452
6457 -452 -759 -248 153 -519 -251 -469 -572 -468 -30 177 -367 -545 -271 506 414 -41 300 -659 -418 214
6477 214 1043 -130 -379 6 170 164 -36 -737 -460 -914 -102 -451 49 832 -143 48 339 -105 318 285 -566
6498 -566 -23 -138 113 637 19 496 -727 -158 -268 125 308 -293 -148 -60 83 371 465 -75 -185 358
6518 358 178 656 522 -89 537 -420 -148 -70 275 473 -88 -472 -982 96 -125 140 553 -156 520 600
6538 600 193 483 -196 233 170 566 -379 -355 95 343 318 391 431 220 -223 -788 -69 -316 120 -447 239 -60
6560 -60 -129 -257 -33 299 1025 -150 -464 -365 -349 -425 -819 373 2 -8 -242 185 -381 -260 227 -441 227
6581 227 229 281 -738 -396 130 -72 -289 -134 13 -166 -582 -23 40 228 326 -397 -642 76 -558 -182 -556
6602 -556 -201 380 141 -245 553 313 481 -89 -905 151 -1043 -535 -193 188 136 324 111 542 508 -22
6622 -22 212 476 -170 -281 225 -301 185 -11 118 984 -32 10 825 -203 -141 556 501 -434 -1012 -13 414
6643 414 -104 -297 800 341 -124 134 443 233 11 168 -472 -345 -78 291 -295 -533 -259 -513 -782 -241
6663 -241 1147 200 61 536 -193 439 -791 -556 -404 194 -133 -930 78 -684 26 -248 -1049 31 -594
6682 -594 -225 488 1013 556 399 719 219 602 -358 -308 41 73 -53 1229 243 1037 597 57 -259 -42
6702 -42 -703 129 944 286 -450 388 216 -93 -295 -366 -94 -420 -297 673 -448 731 -511 651 -449
6721 -449 -35 237 133 -229 -419 101 277 -1 -198 -669 -162 -50 1060 178 -621 -104 50 -5 -697 993
6741 993 -287 -125 711 148 -239 567 -371 591 394 244 58 268 -355 214 217 -321 549 -724 95 189
6761 189 395 -100 -345 398 263 43 -409 -266 -84 601 219 -7 -100 27 -252 83 -593 402 -557 376
6781 376 745 261 -539 -10 144 -687 471 160 17 -114 484 -141 -509 -216 58 -104 -99 144 406 -477
6801 -477 -795 -10 40 -436 -62 -682 -521 -771 545 -228 773 -578 77 -79 -28 320 -135 747 -255
6820 -255 -20 -609 -604 196 -195 -23 228 151 443 -1 240 -388 -138 -59 -522 -332 183 139 25 -637 -110 42
6842 42 -539 125 35 20 -204 501 138 339 45 136 -336 -737 -51 -221 85 -65 -364 -327 -657 414 264
6863 264 -137 949 122 -483 -226 282 -142 563 -379 181 -448 -7 -280 -738 -310 -346 -349 1 -366 104 -118
6884 -118 1 472 -381 91 330 -35 121 -142 -31 -441 394 402 -26 649 229 637 45 461 678 -633
6904 -633 262 -600 166 101 -46 -34 -489 -359 -111 -547 -64 604 -389 117 85 452 971 789 -432 -87 750
6925 750 187 226 193 -54 -545 -658 -120 -717 367 -231 116 1 -363 -2 251 68 103 -350 -348 453 -190
6946 -190 -38 -427 -38 -673 -430 -624 -306 265 312 -506 72 187 -299 -345 -338 -569 -1 490 -168 42 238
6967 238 -126 -122 -354 354 -198 -242 298 461 -94 -474 -621 255 100 693 323 287 312 -143 -23 -3 31 130 -129
6990 -129 -125 396 -324 340 124 -642 -126 -249 -659 274 146 -527 138 166 -839 634 -96 -321 962 -183
7010 -183 322 -186 -633 -239 -63 792 244 198 -628 -34 -14 -175 -417 -63 -26 -296 378 598 345 160 35
7031 35 677 17 187 -955 644 727 150 5 -256 -261 -255 -215 -23 638 -110 -103 -58 -19 -222 -19 -511 -434 861
7054 861 304 87 280 -493 -424 -753 -104 -120 -342 439 -11 -63 120 10 370 -252 328 -211 -55 -108 -18 -267
7076 -267 292 -33 181 -338 -1064 -112 -118 53 -344 1414 268 182 -786 -293 -652 371 -634 -588 439 52
7096 52 182 -122 309 225 -799 301 -298 -127 28 344 -74 208 70 -59 293 109 244 -108 -291 41
7116 41 186 479 644 -491 -846 -340 -70 384 45 448 -116 -94 257 -151 380 -235 235 0 -248 -111
7136 -111 -57 349 -191 471 -353 -191 -79 -131 -361 -66 -159 -1025 504 381 -71 602 -466 -164 -344 -177
7156 -177 -74 -870 705 -166 706 441 -80 478 -284 -40 -476 187 -424 -739 -502 -312 -231 -228 -42 -360 602
7177 602 346 -225 -426 -173 -380 -55 100 -598 -243 504 75 -677 -87 685 220 -140 -412 -150 106 607
7197 607 145 335 -492 796 246 -691 -212 -171 -194 747 -260 375 108 108 -235 -336 61 226 301 -426 -225
7218 -225 -190 -275 -477 112 -611 269 -452 -401 862 -4 311 -10 -15 -35 -701 271 379 -7 726 363 -254 -286
7240 -286 482 127 930 330 -221 -127 -348 -528 -441 -1050 -220 -397 -286 -473 398 189 -392 -83 446 547 198
7261 198 150 -234 199 -576 -613 -585 397 1 -247 -363 -171 495 65 -67 67 20 -155 -3 -34 -336 598 737
7283 737 -737 -41 418 -39 -121 319 -288 608 -327 55 513 127 348 -20 256 -985 -800 -362 63 -105
7303 -105 -412 585 518 -129 -376 395 167 -535 -271 -671 119 87 313 307 508 542 309 135 -1015 358 105
7324 105 -188 -220 -676 -99 89 548 463 286 -19 178 647 -134 309 -387 -190 57 -56 -612 431 -239
7344 -239 -276 -198 -905 -135 -429 -1184 -127 914 169 -293 -470 522 -283 -470 -109 226 -204 624 461 377
7364 377 267 275 747 -20 55 -198 -54 -123 -1094 -36 170 268 -226 -406 -228 -335 1140 -67 863 170 190
7385 190 -86 191 80 885 -145 473 -123 2 315 688 -273 -138 -5 71 449 -280 164 720 414 -217
7405 -217 -147 -406 132 8 305 -418 261 -102 586 762 -472 816 47 -412 -65 -541 -21 622 363 -550
7425 -550 -818 370 -84 239 -494 -316 243 -131 278 -115 391 4 28 343 -188 272 -405 -270 125 82
7445 82 277 -332 -127 211 -315 412 444 150 -677 -877 789 393 99 194 239 -210 7 -1168 -61 449
7465 449 -46 137 -345 -55 -347 -167 49 -680 245 -546 61 -112 -236 -179 265 419 144 377 -514 -203
7485 -203 -20 479 2 -324 1149 -231 161 -52 200 -31 -638 368 135 -94 -589 653 416 745 -148
7504 -148 -104 -175 -454 492 -195 93 15 536 -478 299 250 -458 868 -67 -105 37 164 95 -98 60 -29 -393
7526 -393 105 -303 295 -575 -160 -239 173 -280 -495 -209 -30 -609 344 157 -64 -35 307 661 653 -311 256
7547 256 398 -113 390 31 -340 -169 -168 134 787 -416 -303 419 567 -178 -73 351 191 -416 -155 -143 525
7568 525 -358 -120 326 382 688 311 212 -214 -131 357 407 -79 728 45 315 -556 700 668 -57 -418 -209
7589 -209 -31 -113 258 -262 -272 439 -28 270 92 409 -331 -28 -77 227 -336 765 309 -435 -33 -58 -77
7610 -77 -370 495 79 -7 -414 62 298 153 -91 -318 273 473 -710 835 -42 556 142 465 235 315
7630 315 345 317 -92 -149 541 316 -384 1 244 -841 548 -95 -510 698 876 877 193 -851 -463 -252
7650 -252 292 -30 344 -120 -67 -501 177 54 540 528 -252 -515 341 -522 196 -340 -238 -208 43 414 120
7671 120 -124 -260 -669 81 173 25 568 -539 -759 1015 -571 426 -37 744 -111 302 -10 226 205 334
7691 334 -303 -712 6 -10 143 273 470 235 505 -421 471 165 213 81 728 294 60 248 224 -323 -451
7712 -451 -596 -422 424 -555 -321 373 -281 -431 210 231 -206 714 -209 -73 -13 290 -390 -388 -264 416 18
7733 18 -27 -38 -84 66 -152 575 251 695 -310 212 -954 339 -75 -160 -116 650 749 130 59 -121 546 -524
7755 -524 277 -602 -486 -921 -267 113 311 -807 381 -110 -82 679 94 139 -73 288 435 695 -233 -229 -52
7776 -52 -258 -43 229 -335 -796 -417 426 1063 361 83 -127 41 318 -180 -100 -383 1005 -121 -71 -153 554
7797 554 -1002 -266 661 -721 375 634 -228 -143 -414 -444 256 -395 -11 -387 217 508 23 -440 67 115
7817 115 219 -15 -136 -175 422 -547 190 526 -78 166 -225 -111 -280 809 -531 207 321 -55 124 701
7837 701 171 475 104 -137 -204 -171 -224 -434 141 44 -243 510 -43 -62 452 57 -522 186 -874 -639 146
7858 146 632 -91 6 46 -941 -689 832 -39 650 -445 -449 -449 165 178 31 -194 -261 226 417 -192 452 138
7880 138 1009 647 -2 -288 -444 34 622 -424 -45 -604 537 -4 -506 -423 -512 609 -669 -82 171
7899 171 391 516 -414 481 87 290 159 -184 1232 593 -26 351 -164 -324 -367 91 225 164 -635 -191
7919 -191 134 179 485 591 -238 -1 -336 -272 -194 139 -244 -466 795 -267 -39 423 74 -482 -199 60
7939 60 101 -80 -123 270 -48 -88 866 562 -210 188 638 184 27 485 577 204 -262 -135 197 -326 -25 74
7961 74 -220 -524 -617 289 305 -44 -142 -118 -17 375 -621 25 -216 -55 -146 -129 43 -898 8 325 -167 572
7983 572 650 477 -395 99 394 561 353 -416 -35 -455 366 878 -377 160 520 -174 -228 195 315 -374
8003 -374 -175 84 -369 266 -814 -374 114 -59 400 303 10 -331 149 -217 -412 267 527 415 22 -51
8023 -51 30 -108 -229 -875 -20 -437 65 -186 53 766 197 461 222 239 -450 -276 71 -460 391 522 782
8044 782 221 -341 151 -61 -20 -464 -33 987 316 406 -134 11 306 -405 368 136 4 -121 564 107
8064 107 874 343 -530 -897 84 -150 -465 427 -21 542 64 97 -248 241 -261 -13 -476 72 -309 875
8084 875 326 62 -90 247 287 -431 660 86 186 244 72 108 225 592 141 -411 658 -585 405 469
8104 469 147 -288 -474 587 475 -104 880 -68 29 -391 242 -173 297 -45 308 107 408 -309 -166 438
8124 438 -763 -298 -526 572 144 35 645 297 -279 -227 -113 335 708 233 -300 -559 -223 528 -133 -690
8144 -690 42 -55 470 -544 -131 307 -102 192 456 712 315 -172 592 457 -263 -298 -469 -161 -95 695 217
8165 217 -213 172 351 98 -405 652 205 -1109 174 -860 368 -91 -598 92 -110 380 136 268
8183 268 39 -365 164 -540 451 323 -99 202
8191B02
$$ Imaginary data points
##PAGE= N=2
##DATA TABLE= (X++(I..I)), XYDATA
0 0 0 0 0 0 0 0 0 0 0 0 0 0 0 0 100 -100 100 -100 200 -200 296 -300 400 -400 500 -600 700 -805 1000 -1100
30 -1100 1300 -1500 1700 -1902 2191 -2463 2774 -3111 3492 -3903 4348 -4844 5376 -5963 6597
45 6597 -7291 8055 -8874 9781 -10765 11839 -13031 14332 -15772 17366 -19147 21148
57 21148 -23407 25990 -28963 32442 -36575 41584 -47814 55818 -66607 82216 -107450
68 -107450 159816 -545228 234564 -59429 74299 -175839 -40693 263499 -302892 439832
78 439832 -405432 429349 -389707 525735 -392172 182083 -97301 109567 27901 -215582
88 -215582 259942 -348620 371370 -343175 325452 -417424 270500 -94636 40477 -82148
98 -82148 -110614 255448 -259816 302332 -346781 351239 -226656 351847 -250837 76134
108 76134 64555 45000 38964 -284676 268833 -260051 242152 -344104 201861 -228993 179500
119 179500 -71954 -45829 55247 -48846 249342 -229790 224655 -213870 296849 -170359
129 -170359 134233 -143306 47558 49557 -79392 62116 -213306 216671 -176694 160496
139 160496 -252127 155207 -70295 82240 -57700 -65341 104304 -57908 163713 -194658
149 -194658 168397 -105689 205936 -118310 43915 -42738 50797 52799 -138915 46406 -122851
160 -122851 148415 -172863 65492 -149052 112740 -6699 9059 -36367 -5478 165082
170 165082 -59732 80634 -96274 153062 -78670 76799 -87890 240 -5440 2062 148
181 148 -130154 73106 -49550 81298 -117970 61339 -53506 64015 8348 -13536 -14024
192 -14024 -971 127713 -71444 12717 -39644 135642 -50503 4168 -40002 21535 19432
203 19432 -28945 -31778 -96671 78249 -29819 -15648 -98559 80296 10318 8536 -241 23900
215 23900 42525 9134 68865 -50485 23177 -4251 56879 -70872 -24307 -16135 -488 -7255
227 -7255 -34513 -14617 -46289 65248 -5358 -15323 -47330 79696 32849 -20588 -23886 28419
239 28419 52606 -4473 6315 -40325 36587 17317 10460 -69532 -1167 26385 -9794 -49089
251 -49089 -33735 16703 -15171 9643 -26186 3717 1233 52333 8962 -2422 13856 40504
263 40504 31177 -12380 -4129 -17473 20524 -10414 -22586 -58283 -1166 11690 -15032 -43240
275 -43240 -12062 37359 15100 -2275 -21899 32593 33321 28097 -22317 1587 23055 24931 -9603
288 -9603 -25277 3257 6494 9920 -35225 -18836 -13507 17890 -16014 -23248 -17229 6201 14778
301 14778 -1947 -1431 -4285 40119 23535 10681 -15214 28862 26306 4816 -20583 -15609 599
314 599 -8648 -8687 -44785 -17366 -1879 16000 -32708 -13790 16790 28744 8738 -2375 16418
327 16418 9904 34632 2282 -5543 -14921 33141 4046 -28020 -23648 6227 7923 -24381 -8863
340 -8863 -23190 4621 -1629 6079 -29590 3947 26561 9738 -10356 1788 34821 6780 19879
353 19879 452 8270 -9190 22614 -4990 -28296 -15899 3236 -6302 -39791 -7640 -12178 9987
366 9987 -4950 7118 -14428 19541 36590 7119 -8090 10232 42716 -6831 -6257 -11261 14587
379 14587 -9368 -3294 -19053 -19142 1818 -2090 -10962 -28336 15871 428 2122 -11825 13718
392 13718 1256 11794 19705 2396 1606 6233 30485 -8109 -903 -5912 13390 -11793 -12482 -20209
406 -20209 -14543 4604 -12127 -16446 -22669 22267 4817 2431 -6134 25237 20057 8748 6901
419 6901 2958 18520 1971 4778 -20896 1476 -8295 -4183 -18439 -10850 -6462 -7271 2674 -11764
433 -11764 511 -6189 19092 473 5664 -158 15101 14674 4628 2619 -1073 20458 -2588
446 -2588 -6111 -17029 8057 -5597 -12267 -17969 -9751 -3942 -8014 -1738 -12997 10289 6144 12590
460 12590 -3396 16642 15644 11037 8474 4183 4059 -5684 10027 -11039 -11831 -15759 3717 -13729
474 -13729 -15328 -7157 -2115 526 -3903 6172 -5652 13779 11826 8686 -4822 16631 15302 -881
488 -881 -519 4410 5846 -8835 3349 -10668 -10044 -10231 1715 -14212 -13063 634 -1618 -4602 -3814
503 -3814 11183 1107 14261 11245 8436 2 16931 14053 -5064 -3171 2655 673 -18002 -6787
517 -6787 -10066 -7938 -10735 -2170 -10442 -5777 7474 2805 522 3654 16918 2416 7220 8888
531 8888 8085 -839 7502 6241 -6995 -6677 -385 -886 -15340 -5418 -7379 -5966 -8363 -4525 -7310
546 -7310 -324 9343 1505 1588 6201 18480 3912 6085 9364 10232 -425 -152 -268 -6826 -4534 -8725
562 -8725 -7237 -12685 -5795 -8082 -3394 -2460 2282 -993 3079 9962 5374 5007 7821 13454 3509 2412
578 2412 2482 4671 -428 -4117 -6345 -6467 -3206 -10517 -10506 -6598 480 -7495 -3674 1277 4022 2804
594 2804 5603 8353 6793 9573 6681 6375 2543 4835 -1694 -2417 -1296 -6144 -11328 -7861 -3112 -10007
610 -10007 -8581 -3364 1360 -4670 1837 5675 7457 7435 8528 5811 5873 10636 4490 8 -266 3841
626 3841 -6466 -8875 -4162 -3762 -11208 -8699 -1347 -6955 -5732 69 3495 -549 5713 6157 4938
641 4938 6627 10014 5258 2179 8919 3651 -4328 -4434 2603 -6262 -10554 -5258 -4417 -9890 -8304 -1356
657 -1356 -3360 -547 2873 4993 2254 9020 8336 4386 6918 10101 3412 -2941 3221 2108 -6252
672 -6252 -7573 -634 -6946 -10770 -6441 -3406 -5411 -3536 1130 -198 2587 5491 5449 3709 9923 8517
688 8517 2155 3467 7548 2182 -5061 222 -1929 -7204 -9308 -3793 -6847 -7265 -5582 -2739 -2120 100
704 100 2807 908 5549 8012 7151 2852 7975 6849 1619 589 3020 -128 -6411 -5404 -5189 -6328
720 -6328 -7681 -5484 -6288 -3500 -2150 -1828 665 4311 5895 2984 6789 8310 5531 2652 5003 3874
736 3874 349 -1716 -3182 -3483 -4671 -5623 -7485 -4900 -4203 -4827 -5151 1522 1926 -29 2794 5510 6137
753 6137 3807 6646 6380 5166 2740 2154 -560 -893 -1784 -5785 -6355 -4231 -6150 -9569 -5583 -471
769 -471 -2135 -2879 2993 5267 2449 4730 6861 6740 5096 5695 2721 979 1092 -757 -5160 -3176
785 -3176 -2354 -8355 -8945 -3379 -2893 -6764 -3054 918 -55 -382 4580 5406 4754 6466 5894 4481 3544
802 3544 4038 462 -1504 1219 -2123 -7371 -5125 -2021 -7020 -8113 -2601 27 -4126 -1777 3528
817 3528 3789 3239 5897 6181 5122 6465 4258 1718 2551 3040 -3363 -4714 -1388 -3243 -7470 -6150
833 -6150 -2590 -4877 -5342 -1807 235 612 1815 3568 4929 5247 5835 4005 3929 6020 2552 -1661 -289
850 -289 854 -4196 -6395 -3626 -3389 -5938 -6299 -2806 -2053 -1196 -599 1958 2429 5251 4965 3932 5318
867 5318 5609 2897 1334 2920 697 -2978 -3385 -1855 -4430 -6337 -4893 -3968 -3915 -3351 -2202 99 2498
884 2498 2615 2111 5259 7874 4627 3105 4596 5269 816 -257 780 -1333 -3500 -4652 -5243 -5253 -4302
901 -4302 -4955 -3917 -2189 -618 -621 711 3738 4063 2089 5101 5863 3125 1561 3217 2657 -684 -1585
918 -1585 -2821 -3664 -3592 -4815 -6092 -4810 -1338 -2423 -4255 322 3217 1768 1499 5398 6117 3825
934 3825 3319 4558 2480 1649 829 -1871 -2793 -2751 -4152 -5509 -3884 -2732 -4956 -3260 207 424 -2267
951 -2267 2022 4906 3304 2544 4664 5249 3976 3779 2086 937 -153 -608 -4144 -4220 -861 -3586 -6380
968 -6380 -4672 -1589 -2499 -2579 1038 841 340 2911 4835 4040 3575 4928 3557 2178 1383 6 -2238
985 -2238 -1274 -2024 -5032 -5127 -2526 -3107 -4931 -2317 110 0 -157 2001 3819 3397 4517 3928 2966 2733
1003 2733 3861 1916 -554 -56 -1048 -3808 -3942 -3174 -4765 -4671 -1581 -1933 -3376 -1448 1009 1387 1951
1020 1951 2658 3771 3410 4494 3502 2564 3229 2153 -849 -1770 -976 -2115 -5178 -4845 -3162 -3125 -2895 -2124
1038 -2124 -753 -259 1282 2583 3423 3160 4073 2648 3384 4405 1823 454 1322 -90 -2691 -2491 -1940
1055 -1940 -2901 -4160 -4307 -2926 -1291 -1456 -1408 -486 1990 2946 1322 2135 5089 5523 2407 2715 2284 917
1073 917 -1307 -525 -1861 -2935 -3116 -3744 -3843 -3307 -2386 -2383 -632 1525 459 85 3568 4511 1924 2378
1091 2378 4333 3267 634 -561 1314 -329 -2006 -2747 -3276 -3713 -2322 -3372 -3834 -1030 -540 -1056
1107 -1056 -521 2977 2487 1552 2690 5628 2684 1853 3207 2136 -787 141 -723 -2713 -3050 -2743 -3491
1124 -3491 -3599 -2022 -2780 -3792 -82 2143 446 948 4091 4487 2455 2308 3359 2161 1724 841 -291
1141 -291 -1385 -1393 -2407 -4770 -2528 -2190 -4686 -3481 -811 -143 -2067 659 2373 2102 1405 3580 4066
1158 4066 2512 2631 2842 1334 132 -891 -1952 -2440 -1351 -2535 -4946 -3528 -2138 -2140 -2642 131 1462
1175 1462 696 1474 2999 4039 3075 3171 2875 2318 1601 793 -195 -1664 -1668 -2704 -3534 -2685 -1642 -4305 -2120
1194 -2120 -513 -41 -657 267 1868 2477 2535 2322 3334 4170 1442 855 1617 297 -1192 -1347 -1634 -2113
1212 -2113 -3469 -4572 -3244 -2222 -1384 -1621 -1162 255 666 733 2503 3450 3403 1817 2447 2965 1593 -211
1230 -211 -276 -108 -1558 -3333 -2732 -3370 -2806 -2528 -2642 -1085 -162 87 424 1576 3768 2836 1403 3375
1248 3375 3627 992 1136 2536 706 -1595 -1391 -1933 -3245 -2709 -2120 -2902 -2133 -713 -619 -372 1212 2374
1266 2374 359 2034 3482 2772 1656 2795 2833 748 -333 306 -592 -2928 -2555 -2485 -3560 -2779 -1379
1283 -1379 -2036 -1587 1848 240 -579 1884 3596 1984 1628 3910 3357 545 670 1279 -124 -1492 -2023
1300 -2023 -1912 -3381 -2338 -3317 -2767 -682 222 -1455 -708 1620 2699 118 2774 3821 2652 1174
1316 1174 1316 1074 722 -228 28 -986 -1609 -2421 -3326 -2788 -1401 -1826 -2171 -524 425 -263 261 2125
1334 2125 3557 2765 1430 3082 2040 1000 1186 795 236 -803 -2079 -2592 -2401 -2460 -2840 -1942 -1919 -635
1352 -635 -972 492 1476 1686 1493 2256 3152 3061 1427 1315 1520 996 -477 -1198 -919 -1059 -2605 -2770 -1490
1371 -1490 -1570 -2224 -2105 549 4 783 1234 1441 3003 2375 2629 2306 2044 1839 707 624 271 -1380 -2930
1390 -2930 -1929 -1741 -3306 -2565 -1717 -1655 -1001 -785 280 257 2016 2711 1018 2786 3310 1548 1467 1991
1408 1991 784 -711 -1210 -601 -2186 -2509 -1769 -1469 -2028 -1559 -1553 -1725 -285 885 1168 1748 2499 3619
1426 3619 1369 2220 4222 1372 -1453 42 443 -1260 -2696 -1846 -2136 -3202 -1966 -1703 -1962 -157
1442 -157 511 -148 613 2196 1625 1002 2747 2617 1413 1094 1916 855 -1417 -2258 -1039 -2676 -3183 -2893
1460 -2893 -2064 -2093 -2068 -1672 -106 598 1464 766 1788 3046 2577 2036 2212 2788 1403 178 74 -536 -1097
1479 -1097 -2182 -1751 -2171 -2560 -1876 -1913 -1444 -36 136 60 1729 2118 2515 2413 1876 2573 2300 233 889
1498 889 539 -1181 -1652 -2068 -1412 -2514 -3311 -2182 -737 -1530 -1088 -238 731 983 1170 1474 2271 2184 2421
1517 2421 1367 967 992 402 -539 -1291 -1403 -1993 -1835 -1483 -2520 -2415 -838 -449 -145 -781 1511 1351 2140
1536 2140 1693 1762 2587 1891 2508 574 195 1213 -380 -2540 -2281 -1421 -2367 -2352 -1872 -1874 -1472 -642 497
1555 497 -199 431 2117 2278 1306 1750 1923 1318 1029 1159 -325 -911 -740 -748 -3211 -2140 -967 -1751 -2953
1574 -2953 -1764 -143 -19 273 879 770 2157 2996 1091 944 1600 2934 429 -13 487 -802 -1721
1591 -1721 -837 -1507 -3098 -2240 -598 -1611 -1600 -448 1325 1508 -273 1295 1312 1945 3036 1675 741
1608 741 1352 1408 -499 -2186 -129 -656 -1756 -2948 -1640 -2101 -1636 -1328 -120 -348 1123 2185 1160
1625 1160 1217 1384 1374 1635 1725 852 -209 1005 247 -1415 -2255 -738 -930 -2806 -3393 -1743 -55 -718
1643 -718 -1010 -570 521 1643 1728 482 1643 2014 2722 878 309 1226 529 -398 -848 -1744 -1694 -1898 -756
1662 -756 -1338 -1914 -1081 305 294 -315 365 1698 2271 962 1229 1625 1952 1066 -358 -357 296 430 -1528
1681 -1528 -3674 -1324 -52 -1973 -2683 -1545 -444 -104 688 1011 831 1339 2611 1496 248 1673
1697 1673 2114 828 -408 -1262 -705 -627 -1004 -2175 -2753 -316 513 -2021 -2316 317 853 1352 -124 2131
1715 2131 1001 2854 2610 832 775 1796 2533 -1834 -1239 -1057 -810 -1421 -1557 -2521 -1827 -269 -129 -1448
1733 -1448 -944 1693 2449 369 553 1760 2219 1441 -76 556 844 1714 1053 -2393 -1446 -887 -1715 -2724
1751 -2724 -3587 -1417 -391 -1506 -223 317 774 2143 1689 1551 967 2108 2786 1119 59 -611 -188
1768 -188 -17 -1518 -3275 -1928 -107 -1606 -2765 -2312 495 1196 -1202 -689 1558 2117 1630 849 715
1785 715 2220 2845 896 -694 649 680 -583 -1689 -1320 -1362 -345 -1890 -1713 -1489 -960 594 721 581
1803 581 -281 2396 3200 1513 369 1473 2133 1700 -260 -2206 -749 166 -1174 -2437 -2393 418 66
1820 66 -2637 -1938 654 1569 554 -191 1110 1410 2651 1120 742 1313 1710 745 -146 -1424 -130 -225
1838 -225 -777 -1998 -2415 -2089 82 -745 -1371 -1211 1350 2345 475 800 1632 2533 2019 455 -166 650
1856 650 1115 399 -3215 -1885 415 -903 -3225 -1724 -242 415 -1380 -599 641 1327 2052 1270 277
1873 277 1175 3349 1629 134 116 515 949 -484 -677 -2278 -1324 -495 -1648 -3232 -1106 -282 -24 -714
1891 -714 -251 551 2153 1652 1012 664 1521 2917 578 -1030 77 620 -421 -1603 -2623 -1307 -384
1908 -384 -1434 -3220 -1583 916 896 75 -709 1893 2024 1443 183 1042 1889 1467 614 -1521 -865 691
1926 691 453 -1948 -1571 -1983 -750 -1185 -1126 -2500 -536 691 1291 -78 111 1906 3198 1525 -795
1943 -795 1307 1585 965 -791 -1528 -80 47 -1288 -4162 -2635 -1127 144 -1841 -1854 1436 2021 627
1960 627 272 1679 2012 2861 1535 -21 587 890 984 -448 -1692 -1046 -972 -553 -1400 -1565 -1394 -164 -419
1979 -419 -533 -1012 921 2635 516 358 1608 3049 1905 -549 112 1052 1609 -1087 -2407 -1815 230
1996 230 -803 -2761 -1547 -216 52 -876 -927 1378 1395 1160 1560 819 340 2235 1678 265 -1060 -19
2014 -19 320 -164 -2146 -2151 -1532 -147 -556 -2404 -1516 295 959 -646 -584 1236 2824 1120 656 749 2145
2033 2145 1948 66 -1181 -1072 -174 -487 -1628 -2311 -704 -1025 -869 -1362 -1390 -161 518 479 -270 1351
2051 1351 2413 2175 1186 883 952 1121 511 -740 -1702 -261 574 -1805 -2289 -1583 -706 -114 -1414 -682
2069 -682 -558 923 924 -197 872 1954 2224 1333 -8 347 2214 512 -555 -1279 -765 -699 -1204 -1519
2087 -1519 -1627 -826 -468 -1072 -1480 560 1286 1357 -116 1417 1765 1906 1760 1077 190 329 293 -948 -2075
2106 -2075 -1835 -648 -587 -1402 -1749 -1044 497 283 -686 -685 1393 2597 69 -620 1110 2123 867 208
2124 208 48 603 434 -1090 -811 -959 -483 -969 -1938 -1587 -1309 125 -873 -900 -44 407 702 1688 920 105
2144 105 2002 1000 716 -342 -1240 -89 425 -1620 -2752 -926 -145 -1093 -2549 -308 195 1433 -18
2161 -18 63 803 2372 628 284 725 1115 427 -116 -833 327 -54 -1060 -666 -1581 -833 -390 -412 -1025 -424
2181 -424 -493 111 788 96 -231 1082 2485 847 806 335 1571 -317 -1960 -768 -818 -1001 -1122 -1952 -922
2200 -922 -929 -565 -1807 -672 923 1933 1316 645 977 1164 1311 855 150 -135 969 -287 -1139 -743 -775
2219 -775 -687 -894 -1444 -838 -783 295 7 -566 -915 854 1526 866 784 376 1685 1468 292 -229 103 -38
2239 -38 -69 -1560 -1268 -566 -1035 -730 -1903 -373 165 50 129 -453 1855 1144 1602 1293 642 1344 451 147
2259 147 -626 -217 -220 -1267 -1420 -75 -1769 -816 -1496 -782 -1246 -589 399 450 -82 863 1895 1300 1171 926
2279 926 1481 431 -8 -583 -481 -331 -619 -1460 -1413 -1051 2 -1147 -1018 -990 63 32 327 1007 138 1086
2299 1086 872 564 1094 1895 89 -161 -754 -824 -1066 -1780 -1083 -1517 -1190 -842 -509 -653 -945 167 874
2318 874 833 1162 904 1371 1679 1283 913 -100 756 567 -1070 -387 -1052 -543 -1392 -1417 -1257 -912 -613 -896
2338 -896 -661 -345 1386 1212 317 1094 1532 154 721 996 565 -1124 729 -508 -1070 -1910 -985 -1337
2356 -1337 -2084 -1520 -563 99 961 -252 280 614 2424 515 537 1354 1972 674 -58 -204 51 307 -552
2375 -552 -551 -1149 -599 -1277 -950 -801 -158 -422 417 -44 634 536 1526 1635 2235 995 1605 170 -132 -424
2395 -424 46 -531 -876 -2161 -1626 -1677 -819 -181 -713 -1012 47 276 542 804 22 554 422 421 485 744 1021
2416 1021 1029 -647 -267 -1046 -448 -1007 -1336 -662 -1010 -258 -796 -86 343 229 727 1149 622 638 1024 1413
2436 1413 177 499 509 117 217 -592 -1432 -685 -71 -882 -1249 -1839 -336 -38 -443 530 376 52 1376
2455 1376 245 783 1279 1593 812 205 -55 -79 -93 -495 -69 -890 -1320 -986 151 -134 -1309 -320 -425
2474 -425 59 758 413 707 1168 886 172 -425 506 416 -119 -235 -898 -382 -1189 -1069 -507 -833 -1085 -920
2494 -920 191 34 893 496 772 785 424 632 290 632 213 269 -183 370 -280 -1867 -199 -1157 -1191 -1426
2514 -1426 -611 -578 -646 29 30 953 508 967 879 -145 1124 619 -8 346 579 -206 -1291 43 -607 -833
2534 -833 -798 -958 -847 -1091 -62 417 -419 660 721 623 659 1160 795 -30 335 740 90 840 -196 58
2554 58 -728 -680 -852 -913 -487 -167 214 -473 -894 308 30 516 644 904 665 661 1436 163 307 -1008 139
2575 139 -570 -558 92 -1299 -983 -471 -242 247 -683 -373 149 784 586 902 1306 703 897 425 740 928
2595 928 -180 83 -203 -748 -134 -1256 -731 -467 -550 -539 -239 597 -277 514 527 553 123 548 364 760 512
2616 512 69 267 871 -117 -40 -490 -132 -771 -380 -688 -715 -682 -655 878 277 -302 360 849 970 633 795
2637 795 1115 589 716 -299 -681 -48 -575 -428 -463 -457 -477 -885 -527 -610 -461 -943 435 596 275 770 518
2658 518 585 779 704 701 646 36 -308 -670 -895 -910 -842 -1250 -629 -493 -418 98 -260 -151 -304 123 1122 168 723
2681 723 226 655 -347 702 -83 163 -177 -60 -223 -613 -709 -1049 -589 -938 -238 266 228 -112 947 455
2701 455 1071 457 480 25 179 664 -183 -451 -176 -727 42 -789 -761 -504 -205 -459 -286 -886 408 54
2721 54 -387 173 605 393 1051 -420 270 507 -29 714 -447 -34 -458 -342 -931 -118 322 -771 -585
2740 -585 -895 82 -249 591 124 348 294 216 1056 60 16 264 531 -127 252 -812 -1058 -851 -543 -1381 -558
2761 -558 -282 -526 -394 -373 348 -160 -89 265 765 368 191 136 388 4 141 -255 -102 -281 -407 -712 -1787
2782 -1787 -198 174 -791 643 -638 578 1355 282 1047 1060 1484 623 -55 454 302 -895 412 -493
2800 -493 -206 -739 -545 -966 -772 -474 -292 -150 -637 -319 -57 1229 290 411 870 444 945 584 993 395
2820 395 -407 -612 -661 -33 -955 -332 -998 228 -529 -913 -116 106 572 -8 325 990 478 787 885 825 109
2841 109 51 170 -86 -302 -108 -724 -578 -31 -227 -487 -51 181 -699 137 486 402 578 974 695 507 581
2862 581 353 76 -621 -71 258 184 -537 -712 -729 -886 126 -442 -888 615 -232 468 499 858 1080 1008 666
2883 666 1035 625 334 219 90 340 -459 91 -121 -877 -1061 -298 -243 -513 -366 -228 -104 -300 -200 1070
2903 1070 253 504 16 -302 660 1349 184 608 139 -800 -216 -587 -1074 -348 -794 148 -982 317 -316
2922 -316 -245 439 880 1289 1125 122 1224 626 843 981 -50 -171 357 -430 -405 -1170 -346 -1075 36
2941 36 -2 -233 -101 -466 -240 760 384 625 1412 855 49 -106 -58 103 509 -87 -321 -786 -370 -825 -1298
2962 -1298 -194 -906 -1002 -312 404 135 231 166 711 753 386 980 1016 18 21 -536 -404 349 60 -425 -886 -282
2984 -282 -437 -723 189 31 401 -161 675 408 997 392 399 219 -212 339 1356 301 341 173 -565 117
3004 117 -61 -367 -654 -248 -279 -277 -374 119 -272 -580 -7 534 646 -105 -55 1086 495 8 -579 187 678
3025 678 22 -579 -1489 -593 -1017 -488 70 800 310 282 169 605 393 865 689 751 524 -372 790 71
3045 71 -701 -84 395 201 -67 204 -431 -736 -700 -488 -68 -188 112 -367 39 252 1076 504 407 -187 314
3066 314 -219 13 347 -28 -512 -633 -521 -601 -61 -85 -592 229 564 98 215 -750 436 579 60 1128
3086 1128 254 -236 434 604 -275 -323 219 369 71 -878 -207 -1027 -494 -219 -602 768 -600 352 79
3105 79 -197 1130 110 64 421 345 18 522 973 62 -232 -187 -391 -315 -687 -494 -189 -343 652 118 123 760
3127 760 57 -442 -433 976 674 267 791 -30 329 -328 -491 -523 -947 -578 -1170 -612 -289 -471 -295 101 -195
3148 -195 326 -987 942 89 345 306 705 -42 146 -25 -43 -175 -847 -650 -752 -134 -402 -81 -324 552
3168 552 1024 -241 -201 935 565 1086 416 679 433 -180 314 -150 845 -73 -686 -86 -356 108 -401 -935
3188 -935 384 201 243 -93 709 427 238 282 589 776 -253 383 232 -111 180 218 310 -578 -202 -267 -134
3209 -134 -143 -36 -332 -878 407 -153 391 199 327 972 492 268 8 41 -40 1643 -87 -300 -82 -298
3229 -298 -694 -631 79 -474 -228 44 -286 436 591 -21 567 578 -26 429 -296 -80 1111 -552 -363 81
3249 81 126 -815 180 -445 74 -1195 190 -49 -983 -370 -488 449 1231 -280 126 -224 337 717 249 173
3269 173 -10 762 9 -217 -391 -879 -790 70 -595 -852 -112 5 675 666 709 -139 -455 -748 842 1082 -202
3290 -202 -176 407 -80 -203 -311 -755 -352 -275 -217 324 338 143 51 -96 -47 201 351 515 389 481 871 48
3312 48 -237 -815 -213 675 -127 -985 54 -592 99 -80 -412 400 -579 253 -312 549 432 -81 292 197
3332 197 811 -133 322 395 251 -703 5 -731 -67 -215 -434 -381 -216 -421 388 -137 -41 209 471 782 -1
3353 -1 780 858 366 336 222 -921 183 -399 348 -354 50 -79 9 -142 -280 -652 -39 378 1054 37 862
3374 862 418 750 -35 136 360 -731 -70 -650 -89 64 -164 184 286 40 -18 -232 -471 -314 57 539
3394 539 -219 71 575 807 278 438 -82 -134 222 -350 -1051 -355 -151 -594 89 -725 -715 -198 -121 340 -880
3415 -880 -414 1068 -615 70 633 151 1344 1000 461 -241 138 -43 -925 70 16 1 -711 -14 -163 306
3435 306 -191 -419 160 730 643 435 846 660 -18 854 339 207 228 -244 84 233 -594 31 -157 -484 -572
3456 -572 -640 -543 -239 411 -1270 1446 -724 294 773 472 -101 220 755 89 209 -24 -207 -92 -168 -501
3476 -501 346 -563 -173 422 -590 -1 -146 -324 -383 1150 232 -199 6 51 158 -271 368 -632 289 -577
3496 -577 -52 -79 -969 -762 180 -497 -133 154 -734 153 858 695 205 -220 496 -499 -79 -4 609 57 -184
3517 -184 124 -291 -3 -134 -459 -782 438 -740 307 -691 -432 318 -993 461 664 269 -154 363
3535 363 -214 404 635 640 -136 29 -158 -350 22 -325 -49 137 -44 -200 227 523 196 305 204 1045 141
3556 141 535 693 424 -361 278 307 -712 837 -330 -144 -295 18 -568 -307 -694 -210 -257 522 460 -623
3576 -623 219 -211 510 -188 101 -47 -202 28 -295 62 -345 -952 -477 -627 -532 124 -306 -169 536 202
3596 202 1152 636 670 153 219 194 334 368 198 153 -33 482 487 67 -163 81 -134 -168 142 -453 157 49 312
3619 312 -1045 208 721 475 -121 56 109 293 374 -900 252 -509 -634 87 -60 -987 7 118 290
3638 290 102 67 -467 142 298 558 344 196 -78 287 250 -108 354 -128 -85 -526 79 -100 -253 -504 -872
3659 -872 250 -608 786 217 694 -170 567 392 389 -537 39 290 1182 264 450 -125 -142 -182 -448 161 -481
3680 -481 -602 253 449 110 20 -44 767 431 442 667 -1092 318 535 99 -683 -179 214 -666 -623 -450 461
3701 461 520 -151 -410 456 -125 -735 -61 207 21 726 444 206 -237 93 4 71 -38 -620 129 -366 -1260
3722 -1260 12 -574 440 -23 -586 77 -577 -194 163 -788 78 950 898 -309 302 -515 221 131 -731
3741 -731 -510 -199 266 -338 -243 102 -191 279 142 -313 -470 -99 -377 755 -139 109 729 -166 176 -537
3761 -537 -486 -623 -152 -47 594 -222 99 -50 -22 387 -147 -965 117 718 406 559 -277 -274 419 -282 -687
3782 -687 -178 -90 549 562 -207 -246 -231 -205 -595 7 -161 -378 127 673 -122 -324 11 810 -240 -290 811
3803 811 508 414 262 -220 -797 -128 -16 -146 -998 31 -427 -804 -461 331 -403 142 147 999 -32 353
3823 353 67 -248 -191 -99 469 85 -536 324 -135 -580 210 60 -446 -49 314 455 4 503 463 -526 288
3844 288 1447 191 -138 112 445 206 332 225 -425 -68 -77 691 306 36 373 -109 333 426 -294 -355 650
3865 650 330 -192 1023 740 -92 -118 -123 -430 320 -301 -391 53 -71 301 455 -135 551 599 -716 401 168
3886 168 422 186 -67 666 142 350 -556 -30 -218 281 592 -398 241 -663 -50 -269 -12 -375 -211 691
3906 691 -172 -503 -307 -116 373 -282 280 187 874 -292 -183 -378 -582 -243 -45 -108 -4 -164 183 -385
3926 -385 134 41 105 804 685 150 -736 84 -272 387 129 -533 -1 -233 -676 -777 133 574 -410 -437 297
3947 297 62 -629 -602 207 1014 711 -379 -208 533 626 -268 -285 -130 -540 95 909 -98 -526 235 630
3967 630 247 -632 -63 324 -311 -80 76 39 -371 227 716 -491 379 266 225 77 -21 838 3 997 -377
3988 -377 -653 -868 -63 127 -326 -79 27 4 325 198 -438 576 -253 55 128 -47 -366 61 133 -515 440
4009 440 -372 -104 855 -18 502 -7 -204 535 -333 -102 359 561 -10 100 -316 295 276 -476 391 -1
4029 -1 313 633 168 -97 -453 119 40 -67 -697 -541 44 420 716 52 -541 549 733 -472 465 -186
4049 -186 325 524 96 501 -454 136 -676 -51 -123 134 38 672 338 17 268 -80 -399 36 130 1176 313
4070 313 25 481 494 67 -279 -465 -303 51 386 -447 -161 390 -952 236 -570 -276 340 370 -40 -175
4090 -175 247 110 -12 -462 493 -204 299 313 -515 559 -272 -454 129 316 449 119 -544 -501 153 -535
4110 -535 449 303 1097 -801 603 383 -49 -115 -229 -371 -446 37 368 -132 -48 -491 -94 -8 246 -462 349
4131 349 -251 -289 886 -45 706 34 0 -310 88 283 -399 379 -103 -787 -29 -405 674 204 -177 -368
4151 -368 -366 -421 -674 311 805 -253 223 -321 -879 174 101 419 -399 -401 283 421 -316 -249 -207 529 436 34
4173 34 -479 -354 -21 696 -358 -214 151 -38 180 201 155 -265 674 15 -180 108 -205 228 -623 -49 -706
4194 -706 -61 565 415 3 -299 -485 -118 -24 -29 305 324 -26 377 -84 -222 -463 -122 474 462 236 218 -410
4216 -410 -235 -197 431 -334 -39 419 293 -150 74 264 209 137 -358 384 56 352 -463 -707 -106 -487 -122
4237 -122 -566 -453 717 325 440 322 -313 79 -199 74 451 549 -103 -151 112 354 210 191 153 -79 -127
4258 -127 -220 -520 357 159 1150 -741 -4 -335 -300 463 -100 131 585 -252 250 -273 528 -382 213 47
4278 47 57 -168 -49 414 353 -48 -54 -84 90 -275 386 -334 852 -466 201 282 88 137 -425 -266 -322 84
4300 84 173 -339 649 -736 569 -389 -70 466 -684 371 439 268 -348 109 281 -571 534 -82 149
4319 149 300 -253 60 -551 -1025 434 594 -442 -283 212 307 -273 33 -820 -335 -240 173 92 352 -571
4339 -571 38 -450 -321 328 26 -62 -309 140 -752 -1015 189 167 -253 446 -51 212 286 -392 505 -442 182
4360 182 -34 83 93 206 101 -314 -67 -17 -256 -507 -462 25 -675 -476 1193 -694 617 582 -529 352
4380 352 -454 -523 -145 -826 -374 50 2 -533 -236 146 351 -109 -595 -636 422 -194 -248 288 -1006 1077
4400 1077 550 -372 -232 134 439 124 615 399 567 45 -613 -732 183 -731 156 1019 -311 585 190
4419 190 -555 209 -72 293 -565 -28 279 233 226 73 -133 -25 622 399 -659 -440 -3 -481 -446 -233 346
4440 346 -125 -153 -516 -180 399 237 -1130 35 101 -372 478 328 -69 118 146 322 1051 -438 418 -256
4460 -256 -233 -110 -478 222 44 -638 102 518 164 -192 -436 -202 383 46 130 231 -346 -554 -345 -224 -633
4481 -633 -794 -626 -144 -108 -201 206 627 611 -246 171 -8 340 -149 413 219 520 286 168 -271 -697 -818
4502 -818 -146 -407 164 69 -122 326 -444 108 96 -126 149 -28 -114 446 814 64 -549 195 792 -326 -80
4523 -80 -623 -537 -349 -317 41 -467 402 -404 686 955 709 -118 -26 0 1216 242 457 -464 808 758 -612
4544 -612 -183 342 625 -62 -2 -713 -294 -176 729 637 88 -482 -308 933 344 -145 474 254 -35 -723
4564 -723 181 -240 21 -77 -99 -578 -649 -192 -8 -196 -35 945 -65 -357 -340 -243 -19 250 818 42 768
4585 768 -43 -455 15 26 -13 -478 73 348 83 -375 38 -153 1082 23 -61 -534 -125 -632 -259 -234 185
4606 185 90 1 -601 486 -45 -25 446 335 -297 -760 808 178 -70 -254 369 -392 -115 185 89 67 -694
4627 -694 144 31 -339 -928 -658 640 145 -283 822 270 -164 -86 108 -324 -25 518 -509 -478 55 -66
4647 -66 -71 73 -431 -108 347 -351 -37 57 -77 619 269 -702 39 232 544 251 287 -185 647 142 -731 192
4669 192 -67 128 94 534 21 245 -99 -349 -256 12 109 374 379 608 396 245 -192 419 -99 -309 -568 423
4691 423 -829 -179 529 110 -296 146 -546 256 -391 -110 357 -501 -174 34 -57 -176 -146 274 267 -680 -348
4712 -348 214 -474 -107 843 -683 365 515 42 652 153 -145 124 -253 156 -198 418 339 127 -93 202
4732 202 751 10 223 78 -212 -648 -322 20 482 -280 430 406 -41 352 -160 694 442 61 -952 -137
4752 -137 506 371 -141 133 866 483 -649 102 -757 100 15 40 154 269 -3 366 228 776 735 464 55
4773 55 17 -477 -99 256 217 -29 343 456 -42 571 -34 725 107 -443 154 -99 -180 245 361 -94 -834
4794 -834 67 304 117 247 -565 379 -80 646 3 218 -741 530 132 273 206 64 118 442 172 135 -564
4815 -564 -391 -478 697 -558 600 306 -277 -39 410 834 29 193 -563 530 -539 -525 -264 203 -247
4834 -247 576 761 -264 -1143 -99 -259 155 -252 184 342 83 -4 313 43 -955 717 185 402 149
4853 149 -302 -476 -177 -653 60 -260 -907 26 -227 233 -417 64 147 95 414 302 601 -19 146 -162 730
4874 730 -216 -65 447 -124 153 -1256 503 344 399 -490 46 61 333 -74 231 32 791 -500 288 556
4894 556 451 242 -443 -502 -213 183 68 240 -66 -433 -562 -1013 -126 41 145 -434 232 -594 271 -121
4914 -121 -1119 285 320 49 -242 -65 170 -60 374 -40 -395 171 -85 -120 63 -833 130 790 -238 -697
4934 -697 -302 628 -1089 648 432 465 506 -749 -72 491 -117 -457 890 -1012 -59 97 -1150 164
4952 164 282 657 -390 244 -399 688 -79 243 -30 242 87 268 125 -157 -381 -665 226 -119 -5
4971 -5 75 -394 -391 34 -293 242 565 64 200 -120 -651 494 -72 -990 -39 80 392 397 -581 -285 259 -665
4993 -665 -480 614 -315 490 -326 91 -311 413 343 656 233 357 490 -355 402 113 4 241 -193 136
5013 136 483 -628 -86 -177 -285 -24 342 -318 -185 -103 465 299 155 -1080 -303 963 -732 -53 -75 -348
5033 -348 466 71 -232 161 581 -121 -690 124 1073 27 -185 36 124 508 341 226 741 -98 101 -185
5053 -185 -60 -589 -213 -325 18 46 -17 -137 385 -444 -155 -512 -384 50 226 461 269 61 367 -85 169
5074 169 -314 211 418 -442 295 389 17 -278 48 -210 -64 418 -318 6 375 -186 -382 345 -256 -237 234
5095 234 310 430 273 -149 461 658 485 369 159 209 -406 -724 -981 177 -142 -344 394 272 622 301
5115 301 206 58 549 -339 -39 28 78 142 -524 170 396 370 184 -662 68 545 -259 674 247 -1792 -428
5136 -428 355 -197 -145 -275 12 316 162 412 495 -97 -204 -352 274 -284 373 -329 -62 -259 79 -242 679
5157 679 142 771 -342 -1 128 -732 513 -10 333 -40 -147 -17 893 -651 -243 -468 -21 -212 148
5176 148 201 -73 409 -160 158 -470 219 -141 -515 36 -438 -195 82 330 373 -2 -499 536 475 -489 -58
5197 -58 -61 -244 -479 -453 -465 582 -356 -234 -1079 -213 333 -571 -219 139 -81 -158 -56 769 -163 -103 372 278
5219 278 363 -334 239 348 -138 -237 239 -184 364 456 -72 272 -100 -270 -112 151 -78 -175 -651 910 80
5240 80 -176 -675 891 -180 -710 -80 -775 -176 -248 929 -458 -427 545 103 29 399 354 -191 -424 221
5260 221 -314 -118 -821 122 -299 -412 280 -384 -508 -36 -39 -274 736 88 -468 222 -349 364 175 -92
5280 -92 -284 -499 -226 -197 -491 -353 289 -356 -237 -360 539 103 43 667 127 -135 -211 140 -318 -12 113
5301 113 -582 -1122 -68 147 96 -835 201 142 -197 -145 549 -27 -116 -450 196 520 91 -455 -48 327 -86
5322 -86 -206 169 -389 -267 -58 -817 548 -257 -155 70 -1022 -651 -25 48 -285 545 543 -115 590 146 -397
5343 -397 -19 400 -27 -42 89 -624 -66 -316 -567 -176 985 516 -616 -594 761 -194 54 -280 -112 -122
5363 -122 -35 279 -997 -111 512 264 -659 -206 -367 -580 -474 478 668 -333 -1018 570 138 -163 -40
5382 -40 129 315 -104 558 580 -213 -428 -175 113 -46 12 -30 -72 -324 -71 -28 -75 -268 -550 675 -498 -360
5404 -360 -177 145 168 -80 637 52 -221 -362 -573 -570 48 -10 298 -221 -90 682 -213 -93 -1194 -305 119
5425 119 215 373 116 -413 -333 650 -246 586 -917 -749 317 195 599 694 222 -396 -481 -473 -213 233 -510
5446 -510 -592 -931 -488 275 286 -356 -279 -203 273 282 -197 -150 -532 397 63 -269 -648 -486 -1157 363 236 86
5468 86 -80 118 298 -113 285 59 171 -454 143 439 810 -502 636 526 -528 -149 250 -283 -189 536
5488 536 -1232 -59 110 618 -43 126 495 361 383 -272 -361 105 -510 -91 -331 401 -435 -82 88 -249
5508 -249 -499 356 111 14 336 487 46 144 -472 -266 -211 308 109 -561 541 345 -189 178 239 -396 228
5529 228 -448 455 30 -412 -55 -446 766 -508 289 302 -556 280 216 179 -444 -350 -293 334 26 45 471
5550 471 306 -45 -369 335 -37 525 16 161 -213 -185 462 403 880 -6 -475 370 502 312 458 61 -90
5571 -90 147 -268 -178 -225 89 -904 292 -491 -375 -131 188 -436 -84 880 367 363 -222 702 92 28 -275 -360
5593 -360 -278 -457 197 707 -47 347 -174 -156 -18 252 -358 -153 75 164 -10 -230 368 893 -642 -1040 -316
5614 -316 93 -83 241 -58 -370 -233 69 -808 180 773 567 54 -378 41 317 -207 -296 -118 -144 625 -378
5635 -378 -235 63 62 -1068 -269 326 -254 399 218 227 -263 242 18 190 306 589 -2 -243 -331 -6 -333
5656 -333 547 16 527 -579 -469 152 -559 -687 136 -427 -575 548 422 -355 591 -140 -272 -193 -124 334
5676 334 -581 160 520 -813 46 199 -78 -251 -530 -314 -33 980 -295 -684 125 -909 -178 22 -144
5695 -144 176 -473 149 -127 419 -148 19 816 177 524 383 -635 -488 689 140 142 204 140 211 237 -268
5716 -268 -39 589 334 -109 8 -91 376 370 287 979 -433 87 60 -203 34 893 186 239 818 416 463 687
5738 687 -131 -438 327 -497 157 -272 231 -774 407 -211 860 130 96 501 41 -598 216 144 346 459
5758 459 -112 -645 -166 -130 201 635 38 684 717 219 223 203 -281 418 370 37 -345 -384 179 -214 243 15
5780 15 -159 -243 97 47 -538 29 704 308 -67 571 -131 96 -136 -215 -102 63 535 536 114 163 -499 -97
5802 -97 59 -510 -191 -596 -568 626 522 -649 624 194 670 347 185 195 -452 291 -47 -241 471 -16
5822 -16 -158 187 1 436 -320 -105 367 -411 586 231 214 330 102 -363 497 -337 -552 49 212 -640 400
5843 400 68 -217 -601 62 614 966 95 240 33 -519 -86 -23 372 -24 630 424 -403 -137 -641 -836
5863 -836 448 -513 111 66 -230 -437 -421 33 286 -59 8 168 574 252 -98 -622 50 143 373 -267 62
5884 62 -482 -479 607 190 121 -424 16 -113 183 -30 -36 366 -102 -593 -58 -464 112 -353 127 93 -11 334
5906 334 470 -341 720 122 522 428 -406 -544 -277 23 -559 -191 -162 547 891 -94 -334 -207 -687 416
5926 416 272 193 -188 54 -258 -360 362 -142 330 -360 -169 -109 319 115 474 264 166 213 292 337 10 -437
5948 -437 -45 -153 -536 -90 44 -592 332 146 -371 239 353 -565 -217 267 -187 -309 -83 645 -523 56
5968 56 676 233 -214 596 -201 -427 -463 -41 56 -48 -150 -313 689 -338 238 -575 241 10 -162 -34
5988 -34 230 -209 0 457 362 -123 -156 -783 -10 -312 445 18 131 -661 -88 -330 -539 390 -34 -129 484
6009 484 -232 376 -450 233 202 -344 59 88 96 -138 -565 -333 -478 -10 463 -11 182 -296 308 -282 89
6030 89 171 26 313 -319 148 -92 -463 205 90 -373 538 -641 -775 -384 254 -227 -129 -812 460 -413
6050 -413 312 480 152 217 186 552 -44 -453 -106 338 429 -6 -646 -40 282 56 64 -334 -792 133 280 847
6072 847 -415 376 -75 224 -154 12 48 599 60 6 -157 3 448 -507 542 197 640 214 108 599
6092 599 280 -393 365 235 43 289 -373 64 42 599 779 572 -812 -434 379 286 291 -561 -175 193 1
6113 1 332 149 683 329 -329 -354 -660 118 1048 719 -136 -185 -136 631 280 -191 30 400 -431 108 181 -748
6135 -748 -717 51 -352 -141 -224 40 31 -470 366 -7 228 64 -587 -71 330 -224 -391 649 294 -379 -489
6156 -489 -281 203 -100 -278 -424 -439 -720 -50 -29 310 247 -955 850 118 143 -77 237 159 201 -131 292
6177 292 -562 -293 102 -415 321 -209 655 171 -312 300 178 149 245 -502 -372 -114 -66 403 77 -1119 -723
6198 -723 357 209 -1249 180 290 -244 126 9 79 704 333 15 -295 -5 187 -258 -41 -580 227
6217 227 378 -125 -250 -106 -606 59 639 -735 119 662 705 42 666 538 -395 207 -164 -273 -527 376
6237 376 -22 -263 -341 -476 -247 296 -161 -102 -578 43 96 -288 10 321 282 319 670 69 49 153 -303 -38
6259 -38 -411 -356 -217 -277 279 15 670 37 403 -329 -921 661 -169 -257 770 110 759 381 127 -97 -840
6280 -840 99 501 18 -1 336 118 403 -821 666 -250 -734 215 -39 106 130 -122 -645 -500 -198 57
6300 57 460 428 -326 -397 137 -287 -229 140 541 450 25 294 211 327 244 -258 249 169 141 -313 -465 85 141
6323 141 66 -140 899 -228 543 632 -59 67 412 -208 -501 6 -107 -209 -190 872 55 -186 -260 110
6343 110 189 780 -69 270 -64 -492 155 -9 154 166 194 -458 -702 -547 137 -66 -1023 -44 -408 -238 -402
6364 -402 -306 254 -516 -554 -40 -1046 -306 -185 124 -127 375 288 -380 -196 -320 357 422 -554 -369 719 18
6385 18 179 151 624 223 -692 121 54 55 -609 -421 -353 70 70 -49 64 96 -654 -199 -348 488 416 -621 128
6408 128 564 -346 -317 87 -192 5 815 -85 72 167 400 -531 -405 -995 261 43 -69 -336 -40 -357
6428 -357 -432 -368 700 765 -545 -758 -503 540 169 517 -194 518 -324 103 -149 471 441 -942 -167 274
6448 274 359 -801 172 -83 563 -166 -897 423 -560 667 -516 381 -559 302 45 -243 -287 -199 165 290
6468 290 -367 215 -92 -139 485 362 383 107 594 -143 -230 364 -438 -183 -264 866 -64 197 262 -318 -447
6489 -447 37 900 -213 229 -267 365 743 957 -696 -614 266 -646 595 251 -306 557 935 665 -884
6508 -884 511 623 173 -331 503 -606 63 925 -68 -384 -232 122 -4 -290 248 566 -361 340 -647
6527 -647 469 -463 544 -41 -128 -433 62 41 -440 -232 -690 682 116 -276 236 -121 579 -304 201 130
6547 130 -411 -248 462 -125 -218 -498 351 -275 -273 -108 -239 442 394 418 314 -503 -46 341 653 1046 429 850
6569 850 -266 -36 -311 182 -423 -501 164 31 -397 -748 -168 -926 -303 78 -638 99 56 122 -213 273 -662
6590 -662 -984 -16 1 223 54 392 -103 -15 340 132 35 230 18 213 -403 491 -483 -210 219 342 415
6611 415 -458 144 -25 -391 283 -868 156 30 -450 697 132 -53 -811 -740 -807 4 104 -400 -278 375
6631 375 -22 -63 724 -749 508 143 -324 81 -716 372 64 -254 -164 160 -433 676 75 -91 -436
6650 -436 88 269 139 -139 -325 83 157 582 645 -216 324 -269 -160 -174 483 -51 291 -256 78 -9 -180
6671 -180 -64 -446 -343 -595 700 370 410 149 420 -273 -210 -33 -361 500 394 257 -290 -10 -466 930
6691 930 -90 -549 509 -13 51 -453 313 374 -244 959 944 140 525 458 328 -45 -98 370 534 -22 -395
6712 -395 -287 -490 -60 -563 361 -82 -157 -58 -206 -80 388 -45 -362 -464 -39 302 -256 -524 441 37 525
6733 525 -356 114 103 -165 244 333 188 -719 397 142 38 -428 -218 -107 -107 -111 611 595 88 124 -338 -126
6755 -126 -355 779 -1162 101 -264 495 -59 413 -457 -149 2 199 892 164 787 -501 -579 -117 -466
6774 -466 -3 269 162 -239 -137 -500 -30 286 0 461 -198 80 92 252 -612 724 274 116 -382 218
6794 218 270 -449 180 247 -546 173 -448 381 178 -424 691 -117 -228 406 195 -449 86 1132 425 285
6814 285 -19 -186 -160 155 -501 389 -8 521 -387 316 -345 -356 -150 534 43 -1197 30 589 335 138
6834 138 -194 -230 -419 -677 -282 167 408 -502 -156 277 -429 186 -264 -547 84 98 -445 188 -693 -145 -574
6855 -574 -415 -559 -437 919 -410 -835 398 830 -522 -229 163 -196 -183 -297 404 216 108 -755 85
6874 85 -301 220 225 -376 421 117 40 -529 -513 254 339 -337 80 -174 326 462 103 213 -674 -112 -129 -43 -586
6897 -586 -308 239 402 168 -425 -459 852 -82 213 110 -605 738 313 -286 -437 -526 -237 -63 -1030 -203
6917 -203 62 -305 35 1071 288 -600 -77 478 229 233 373 -251 -114 244 501 -235 -152 530 73 -21 73
6938 73 717 -50 -4 81 -874 -291 236 -311 337 -302 -25 366 -747 -133 -553 -311 -431 -697 376 -498
6958 -498 324 832 -280 140 262 708 -1060 2 952 -129 -293 534 4 670 -226 -44 -347 737
6976 737 278 971 -453 300 26 -227 -370 -566 -273 -6 -326 126 201 -394 1096 900 469 337 -565 -85
6996 -85 24 315 479 -14 419 439 -847 -804 82 -419 313 75 -177 -696 202 305 -521 -53 92 168 -277
7017 -277 -444 370 74 448 -347 -430 22 -291 -281 -67 369 -154 -904 198 1243 -142 -339 433 435 267
7037 267 -284 35 -191 414 -793 741 -577 226 527 -231 -579 -316 -299 693 -573 428 -916 -798
7055 -798 652 242 -447 -682 250 309 173 -274 165 130 553 -162 -402 20 -114 -246 342 777 -177 320
7075 320 410 319 -659 152 -795 -55 533 -104 335 -330 -378 -268 -8 -664 82 103 53 354 -459 685 167
7096 167 639 16 -463 395 -66 -395 845 742 798 791 -254 -33 446 150 -216 727 61 608 167 131 -35
7117 -35 535 -125 -209 -45 7 630 -701 -165 264 299 -149 -43 501 219 -183 48 -275 29 -103 -442 292
7138 292 311 -330 -277 -114 -605 1244 -276 -173 -114 70 -355 148 55 -712 -422 140 635 -289 -452 -226 113
7159 113 -137 142 182 -389 -606 334 -531 89 -434 -301 -101 -251 362 216 -466 589 -128 -283 11 274
7179 274 4 -282 -1005 -401 508 -916 167 -217 340 -239 565 25 -131 -284 -453 -446 -51 112 -205 68
7199 68 -9 -106 -104 80 793 147 -16 -467 -227 -176 -77 -301 74 76 843 37 -428 -371 -603 406 171 179 -393 170
7223 170 -628 -79 125 630 -116 100 -159 667 -485 -156 12 -151 391 -220 416 -107 273 -444 -364 844
7243 844 -545 -156 17 -19 -47 341 -5 267 -640 -568 310 114 841 141 -253 -843 -543 -12 307 655 22
7264 22 101 830 205 -261 551 -512 638 190 30 25 61 230 -214 281 -188 89 205 853 399 -567 -691
7285 -691 -391 -341 -2 -400 344 -515 -503 -16 -496 -394 -684 -108 187 -271 -97 598 -635 543 508 -123
7305 -123 449 -45 -26 -225 313 508 197 318 589 -249 -405 -167 -290 -401 -447 533 -547 -854 473 -55
7325 -55 469 346 247 51 147 -101 187 -60 299 -806 -1126 -115 97 220 -582 -446 -289 -304 -7 393 172
7346 172 123 9 -120 -32 305 -65 -116 -238 -365 -445 668 -316 -138 -603 -51 -138 104 -698 -497 -191 -290 81
7368 81 -452 -10 143 494 750 105 -377 272 100 175 -387 519 -499 383 124 246 -679 307 -408 274
7388 274 418 12 199 -496 147 115 -312 -123 -6 -266 -378 -170 130 471 -269 -501 -198 -374 755 168
7408 168 -256 -28 -44 -457 -649 -175 119 -326 628 -287 118 -135 -662 -607 -314 369 -203 -207 214 -170 82
7429 82 -802 -572 333 -897 113 161 -699 366 -190 -210 -385 409 -137 -442 -547 -296 -411 -243 493 470
7449 470 287 -105 400 312 392 -1158 575 -324 -76 -311 730 349 -735 264 331 -407 110 -127 -164 -398
7469 -398 -595 254 -60 683 -17 -422 186 -100 -417 -605 -388 -18 264 -82 344 -439 -327 251 296 14
7489 14 -112 -424 229 339 35 -177 -429 -172 192 -224 -1124 534 211 62 360 77 -137 -424 161 709
7509 709 246 -385 196 422 532 -498 -550 -169 142 -231 -748 -126 20 217 116 287 112 -347 234 -270
7529 -270 -45 -199 -143 261 -488 458 -17 -147 -372 -789 83 88 -308 -44 632 -88 -156 -248 -177 -272 -832 -256
7551 -256 -145 -742 -326 -319 -287 435 590 3 176 -304 -76 241 421 463 608 631 467 49 287 160 403 -42
7573 -42 -1251 669 -45 -458 593 -175 -432 -17 150 -477 -596 130 -243 -596 -415 328 -94 106 182 723
7593 723 -137 -599 -449 -22 68 329 360 1096 -258 -213 656 716 -784 -809 108 125 -690 -118 71 -241 -397
7614 -397 59 -171 383 598 212 224 399 -194 -6 247 22 272 -277 -197 -662 -719 -53 -225 -337 -95 -588
7635 -588 92 -2 -284 261 208 -4 -30 -164 -176 788 -524 -328 106 -796 50 -585 -339 -299 53 -267 -235 3
7657 3 -633 57 335 608 -161 -856 -378 -156 315 -28 147 -301 518 -341 -5 8 -986 111 -429 -740 453
7678 453 -26 -761 56 2 -91 103 -16 -403 104 216 623 -432 -148 311 -1112 943 -236 510 -147
7697 -147 1 -170 91 482 190 142 -121 -223 -510 -314 -181 240 408 721 253 -62 238 -399 -220 134
7717 134 -874 66 564 122 -559 220 -782 326 302 26 8 616 123 -310 -148 54 402 28 5 66
7737 66 -63 -537 -311 42 -404 -482 67 439 -68 -318 219 -44 488 189 226 147 -279 249 540 533 7 -157
7759 -157 -492 -90 524 646 228 79 242 759 13 158 196 -62 -97 -87 171 33 321 556 -324 1034 -756
7780 -756 -284 -89 50 -501 -227 -927 23 -538 381 296 617 -13 -173 70 594 -20 -101 -127 113 185 -375
7801 -375 360 113 -594 -61 104 -650 -673 -343 -211 -95 -336 -948 78 -154 -299 174 682 -220 721 901
7821 901 -466 -56 502 46 -193 131 280 -297 -468 374 29 -265 -797 99 -594 323 -163 516 1026 276
7841 276 54 196 673 -331 -691 -366 -229 -54 308 -278 209 50 -504 -85 -293 -108 187 -224 317 339
7861 339 967 393 282 -283 -314 157 285 319 450 322 -35 -400 -165 227 -194 708 -153 79 744 268 253
7882 253 -846 -90 12 -9 647 236 25 47 416 537 -327 -220 -273 592 -82 -122 -13 284 -434 128 -86
7903 -86 -558 710 791 236 362 -519 -368 745 -326 31 349 425 -665 2 -293 -147 -247 -32 -116 -298
7923 -298 380 236 35 213 -317 -114 -716 -541 -405 -84 157 527 156 145 -94 -116 292 38 1004 -440
7943 -440 -406 416 99 -694 -38 -215 278 -279 69 -618 -274 115 -631 541 -658 424 386 -667 -320
7962 -320 -761 -923 -531 -331 18 -232 -610 -322 -157 -543 -671 132 420 533 246 -265 -952 318 -524 -203
7982 -203 271 385 -265 363 116 -536 193 235 230 -527 27 -126 -197 465 503 -714 -210 -158 173 1015 -357
8003 -357 -603 5 -41 245 -239 213 -299 22 -474 -20 -61 -461 143 115 263 549 -201 -457 -630 196 384
8024 384 89 143 217 -264 -130 465 -608 17 -45 341 -122 -187 -111 666 -457 708 65 122 77 80 -219 -496
8046 -496 75 691 -176 293 404 562 -804 -535 -196 -621 232 -206 276 171 557 124 -33 -936 312
8065 312 378 138 -119 797 -252 -75 206 143 431 25 -146 -120 -471 -446 170 -311 166 132 380 -188 198
8086 198 362 16 96 -103 382 199 -529 -545 26 -353 292 -280 -588 35 -760 175 -247 -607 18 -110 55
8107 55 136 284 -91 598 649 21 604 -531 -193 527 306 -80 -57 456 -142 49 -955 83 -514 319
8127 319 -498 397 -114 67 97 -437 412 -328 -128 -54 -335 -239 -122 -343 -681 -431 533 -657 -396 -138 -508
8148 -508 324 429 -17 -17 975 233 -103 529 -273 75 2 -15 31 -100 248 -780 -241 -716 -151 -134 -127 -278
8170 -278 -136 112 624 236 130 -121 57 -376 -397 439 569 93 334 -298 -285 -562 482 -91 -160 107 306
8191C06
##END NTUPLES=NMR FID
##END=
