##TITLE=1H_DE-80H_X3
 200.13MHz, d2o
 8 sc
 
 19ns.26.2.2025
##JCAMPDX= 6.0         $$ Bruker NMR JCAMP-DX V2.0
##DATA TYPE= NMR FID
##DATA CLASS= NTUPLES
##ORIGIN= UXNMR, Bruker Analytische Messtechnik GmbH
##OWNER= pz
$$ XWIN-NMR		Version 3.5
$$ Wed Sep 17 15:16:22 2025 Russian Standard Time (UT+4h)  Yarkov@DPX200
##.OBSERVE FREQUENCY= 200.1313
##.OBSERVE NUCLEUS= ^1H
##.DELAY= (6, 6)
##.ACQUISITION MODE= SIMULTANEOUS
##.ACQUISITION SCHEME= undefined
##.AVERAGES= 8
##.DIGITISER RES= 18
##SPECTROMETER/DATA SYSTEM= spect
##.PULSE SEQUENCE= zg30
##.SOLVENT NAME= CDCl3
##.SHIFT REFERENCE= (INTERNAL, CDCl3, 0, 14.3821)
##AUDIT TRAIL= $$ (NUMBER, WHEN, WHO, WHERE, WHAT)
$$ ##TITLE= Audit trail, XWIN-NMR		Version 3.5
$$ ##JCAMPDX= 5.01
$$ ##ORIGIN= Bruker BioSpin GmbH
$$ ##OWNER= Yarkov
$$ C:/Bruker/XWIN-NMR/data/yarkov2/nmr/H-C/1/audita.txt
$$ ##AUDIT TRAIL=  $$ (NUMBER, WHEN, WHO, WHERE, WHAT)
(   1,<2025-09-17 15:14:49.17 +0400>,<Yarkov>,<DPX200>,
      <created by zg, POWCHK disabled, PULCHK disabled
       configuration hash MD5:
       00 E9 B6 7A A2 85 ED C7 34 08 36 98 17 FE 4E 26
       data hash MD5: 16K
       DD 6A D8 B6 A0 6F 24 38 3C F0 23 C8 5B 4E CA 51>)
$$ ##END=
$$ 
$$ hash MD5
$$ 4D DC 23 1E 41 48 3D FC 3B 56 A6 15 6A 0B 34 6E
##$RELAX= 
##$RELAX= 
##$RELAX= 
##$RELAX= 
##$RELAX= 
##$RELAX= 
$$ Bruker specific parameters
$$ --------------------------
##$DU= <C:/Bruker/XWIN-NMR>
##$EXPNO= 1
##$NAME= <H-C>
##$PROCNO= 1
##$TYPE= <nmr>
##$USER= <yarkov2>
##$AMP= (0..31)
100 100 100 100 100 100 100 100 100 100 100 100 100 100 100 100 100 100 
100 100 100 100 100 100 100 100 100 100 100 100 100 100 
##$AQSEQ= 0
##$AQ_mod= 1
##$AUNM= <au_zg>
##$AUTOPOS= <>
##$BF1= 200.13
##$BF2= 200.13
##$BF3= 200.13
##$BF4= 200.13
##$BF5= 200.13
##$BF6= 200.13
##$BF7= 200.13
##$BF8= 200.13
##$BYTORDA= 1
##$CFDGTYP= 0
##$CFRGTYP= 5
##$CHEMSTR= <none>
##$CNST= (0..31)
1 1 145 1 1 1 1 1 1 1 1 1 1 1 1 1 1 1 1 1 1 1 1 1 1 1 1 1 1 1 1 1 
##$CPDPRG= <>
##$CPDPRG1= <>
##$CPDPRG2= <>
##$CPDPRG3= <>
##$CPDPRG4= <mlev>
##$CPDPRG5= <mlev>
##$CPDPRG6= <mlev>
##$CPDPRG7= <mlev>
##$CPDPRG8= <mlev>
##$CPDPRGB= <>
##$CPDPRGT= <>
##$D= (0..31)
0 0.7 0 0 0 0 0 0 0 0 0 0.03 0 0 0 0 0 0 0 0 0 0 0 0 0 0 0 0 0 0 0 0 
##$DATE= 1758107688
##$DBL= (0..7)
120 120 120 120 120 120 120 120 
##$DBP= (0..7)
150 150 150 150 150 150 150 150 
##$DBP07= 0
##$DBPNAM0= <>
##$DBPNAM1= <>
##$DBPNAM2= <>
##$DBPNAM3= <>
##$DBPNAM4= <>
##$DBPNAM5= <>
##$DBPNAM6= <>
##$DBPNAM7= <>
##$DBPOAL= (0..7)
0.5 0.5 0.5 0.5 0.5 0.5 0.5 0.5 
##$DBPOFFS= (0..7)
0 0 0 0 0 0 0 0 
##$DE= 6
##$DECBNUC= <off>
##$DECIM= 32
##$DECNUC= <off>
##$DECSTAT= 4
##$DIGMOD= 1
##$DIGTYP= 9
##$DL= (0..7)
0 120 120 120 120 120 120 120 
##$DP= (0..7)
150 150 150 150 150 150 150 150 
##$DP07= 0
##$DPNAME0= <>
##$DPNAME1= <>
##$DPNAME2= <>
##$DPNAME3= <>
##$DPNAME4= <>
##$DPNAME5= <>
##$DPNAME6= <>
##$DPNAME7= <>
##$DPOAL= (0..7)
0.5 0.5 0.5 0.5 0.5 0.5 0.5 0.5 
##$DPOFFS= (0..7)
0 0 0 0 0 0 0 0 
##$DQDMODE= 0
##$DR= 18
##$DS= 0
$$ [...]
##$SUBNAM2= <"">
##$SUBNAM3= <"">
##$SUBNAM4= <"">
##$SUBNAM5= <"">
##$SUBNAM6= <"">
##$SUBNAM7= <"">
##$SUBNAM8= <"">
##$SUBNAM9= <"">
##$SW= 18.0517328524113
##$SWIBOX= (0..15)
0 0 2 0 0 0 0 0 0 0 0 0 0 0 0 0 
##$SW_h= 3612.71676300578
##$TD= 16384
##$TD0= 1
##$TE= 0
##$TE2= 300
##$TE3= 300
##$TEG= 300
##$TL= (0..7)
0 120 120 120 120 120 120 120 
##$TP= (0..7)
150 150 150 150 150 150 150 150 
##$TP07= 0
##$TPNAME0= <>
##$TPNAME1= <>
##$TPNAME2= <>
##$TPNAME3= <>
##$TPNAME4= <>
##$TPNAME5= <>
##$TPNAME6= <>
##$TPNAME7= <>
##$TPOAL= (0..7)
0.5 0.5 0.5 0.5 0.5 0.5 0.5 0.5 
##$TPOFFS= (0..7)
0 0 0 0 0 0 0 0 
##$TUNHIN= 0
##$TUNHOUT= 0
##$TUNXOUT= 0
##$USERA1= <user>
##$USERA2= <user>
##$USERA3= <user>
##$USERA4= <user>
##$USERA5= <user>
##$V9= 5
##$VALIST= <valist>
##$VCLIST= <CCCCCCCCCCCCCCC>
##$VD= 0
##$VDLIST= <DDDDDDDDDDDDDDD>
##$VPLIST= <PPPPPPPPPPPPPPP>
##$VTLIST= <TTTTTTTTTTTTTTT>
##$WBST= 1024
##$WBSW= 4
##$XGAIN= (0..3)
0 0 0 0 
##$XL= 0
##$YL= 0
##$YMAX_a= 16500
##$YMIN_a= -15253
##$ZGOPTNS= <>
##$ZL1= 120
##$ZL2= 120
##$ZL3= 120
##$ZL4= 120
##$ABSF1= 10
##$ABSF2= 0
##$ABSG= 5
##$ABSL= 3
##$ALPHA= 0
##$AQORDER= 0
##$ASSFAC= 0
##$ASSFACI= 0
##$ASSFACX= 0
##$ASSWID= 0
##$AUNMP= <proc_1d>
##$AZFE= 0.1
##$AZFW= 0.1
##$BCFW= 1
##$BC_mod= 2
##$BYTORDP= 1
##$COROFFS= 0
##$CY= 83.5205535888672
##$DATMOD= 1
##$DC= 2
##$DFILT= <>
##$DTYPP= 0
##$F1P= 10.8118882576601
##$F2P= -7.23987719738617
##$FCOR= 0.5
##$FTSIZE= 0
##$FT_mod= 4
##$GAMMA= 1
##$GB= 0.15
##$INTBC= 1
##$INTSCL= 1
##$ISEN= 128
##$LB= 0.25
##$LEV0= 0
##$LPBIN= 0
##$MAXI= 10000
##$MC2= 0
##$MEAN= 0
##$ME_mod= 0
##$MI= 1.114404
##$NCOEF= 0
##$NC_proc= 0
##$NLEV= 6
##$NOISF1= 3.799351
##$NOISF2= 2.8
##$NSP= 1
##$NTH_PI= 0
##$NZP= 0
##$OFFSET= 14.38212
##$PC= 1
##$PHC0= -1348.02
##$PHC1= -1.209074
##$PH_mod= 1
##$PKNL= yes
##$PPARMOD= 0
##$PSCAL= 0
##$PSIGN= 0
##$REVERSE= no
##$SF= 200.129724274929
##$SI= 16384
##$SIGF1= 3
##$SIGF2= 2
##$SINO= 400
##$SIOLD= 16384
##$SREGLST= <1H.CDCl3>
##$SSB= 0
##$STSI= 0
##$STSR= 0
##$SW_p= 3205.1282051282
##$SYMM= 0
##$S_DEV= 0
##$TDeff= 0
##$TDoff= 0
##$TI= <>
##$TILT= no
##$TM1= 0
##$TM2= 0
##$TOPLEV= 0
##$USERP1= <user>
##$USERP2= <user>
##$USERP3= <user>
##$USERP4= <user>
##$USERP5= <user>
##$WDW= 1
##$XDIM= 8192
##$YMAX_p= 0
##$YMIN_p= 0
$$ End of Bruker specific parameters
$$ ---------------------------------
##NTUPLES= NMR FID
##VAR_NAME=  TIME,          FID/REAL,        FID/IMAG
##SYMBOL=    X,             R,               I
##VAR_TYPE=  INDEPENDENT,   DEPENDENT,       DEPENDENT
##VAR_FORM=  AFFN,          ASDF,            ASDF
##VAR_DIM=   8192,          8192,            8192
##UNITS=     SECONDS,       ARBITRARY UNITS, ARBITRARY UNITS
##FACTOR=    0.0002768,     1,               1
##FIRST=     0,             0,               0
##LAST=      2.2672688,     0,               0
##MIN=       0,             -15253,          0
##MAX=       2.2672688,     16500,           0
$$ Real data points
##PAGE= N=1
##DATA TABLE= (X++(R..R)), XYDATA
$$ [...]
$$ plain form
408 -180 -559 -29 -52 -684 -487 -42 -352 -548 236 441 -177 -12 489 364 382 679 433 -111 202 335 -286
429 -286 -430 -82 -255 -713 -428 -153 -459 -509 -76 -17 -10 449 378 -102 189 780 643 163 236 281 -28 -76 89
452 89 -198 -385 -192 -252 -431 -263 -221 -426 -311 -3 176 -66 -3 33 135 413 515 193 8 166 211 40
474 40 20 -61 -178 -239 -202 -276 -372 -140 -35 -106 -27 270 215 92 219 365 329 318 167 -159 -162 -18 -83 -347 -267 -137
500 -137 -261 -323 -192 -46 -77 204 238 102 242 350 228 152 322 444 51 -173 91 65 -198 -149 -96 -405 -340
523 -340 -64 -190 -450 -150 232 61 -76 260 224 -3 291 580 274 62 176 79 -242 -157 -55 -332 -543
544 -543 -263 -198 -396 -159 11 -204 59 439 313 102 428 606 250 239 453 144 -232 -36 -101 -414 -299
565 -299 -154 -538 -657 -130 -118 -450 -198 242 6 -96 483 423 35 366 614 210 72 413 196 -290 -77
$$ packed form
408a80l79N30k3o32J97M45l10j96P84K05o18J65N01j25J8K97k46n44L13J33o21
429b86j44L48j73m58K85K75l06n0M33N9PM59p1m80K91N91j37m80P3M5l09m8J65
452H9k87j87J93o0j79J68M2k05J15L08J79k42O3L6J02K78J02l22j85J58M5j71
474D0k0q1j17o1L7p4r6K32J05p1P9K97n5j23J27J46l6j1j51l26lJ44o5k64Q0J30
500a37j24o2J31J46l1K81L4j36J40J08j22p6J70J22l93k24K64k6k63M9N3l09O5
523c40K76j26k60L00L82j71j37L36l6k27K94K89l06k12J14r7l21Q5J02k77k11
544e43K80O5j98K37J70k15K63L80j26k11L26J78l56j1K14l09l76J96o5l13J15
565b99J45l84j19N27J2l32K52M40k36j02N79o0l88L31K48m04j38L41k17m86K13
$$ plain form
586 -77 161 -303 -548 -162 -236 -530 -152 55 -357 -233 324 196 -13 351 520 170 180 460 135 -146 48
607 48 96 -325 -303 -78 -293 -443 -109 -95 -240 -80 247 133 -49 260 374 121 319 404 72 -48 160 120
629 120 -215 -205 -128 -190 -330 -159 -109 -282 -284 -49 -9 -51 70 195 177 248 339 281 124 174 243 102 -83 -54 -82 -202
655 -202 -243 -216 -269 -264 -122 -102 -153 -20 225 180 138 203 266 156 119 171 141 -2 -79 -15 -179 -158 -133 -177 -270 -171 -84 -155
683 -155 -143 -77 74 116 227 245 113 168 298 238 111 100 102 35 -125 -184 -148 -170 -350 -279 -189 -161 -82 -128 -16 86
709 86 120 214 198 195 185 230 106 110 208 48 -105 -136 -131 -182 -146 -203 -257 -260 -48 -39 18 -17 171 182 177 279 173 50 172
738 172 264 35 -51 -4 31 -241 -264 -181 -146 -260 -98 -47 -137 -53 206 116 119 228 298 99 157 342 232 24 72 82
764 82 -115 -168 -162 -280 -331 -65 -38 -279 -227 58 121 12 168 289 142 191 260 86 92 174 61 -168 -144 -10 -241
$$ packed form
586g7K38m64k45L86p4k94L78K07m12J24N57j28k09L64J69l50J0K80l25k81J94
607D8M8m21K2K25k15j50L34J4j45J60L27j14j82L09J14k53J98Q5l32j20K08m0
629A20l35J0P7o2j40J71N0j73kK35M0m2J21J25j8P1R1n8j57N0O9j41j85K9k8j20
655b02m1K7n3NJ42K0n1J33K45m5m2O5O3j10l7N2l0j43p7O4j64K1K5m4r3R9Q7p1
683a55J2O6J51M2J11J8j32N5J30o0j27j1Ko7j60n9L6k2j80P1R0K8P9m6J12J02
709H6L4R4j6lj0M5j24MR8j60j53l1Nn1L6n7n4lK12RN7l5J88J1nJ02j06j23J22
738A72R2k29q6M7L5k72k3Q3L5j14J62N1r0Q4K59r0LJ09P0j99N8J85j10k08M8J0
764H2j97n3Oj18n1K66K7k41N2K85O3j09J56J21j47M9O9j74OQ2j13k29K4J34k31
$$ plain form
789 -241 -233 -93 -106 -279 -75 13 -133 -32 152 259 92 210 262 144 29 184 151 14 6 -71 -212 -198 4 -187
813 -187 -344 -131 47 -75 -124 38 125 72 135 206 51 96 92 55 65 96 94 -60 -109 -134 -159 -127 -25 -34 -225 -113 67
840 67 27 11 142 170 62 111 129 58 106 87 39 -36 49 35 -195 -168 -119 -90 -176 -70 -22 -191 -56 76 143 71 142
867 142 149 131 125 191 16 94 167 32 -61 -77 -25 -149 -200 -35 -98 -199 -132 -49 -126 -44 208 78 13 166 149 68 111
894 111 169 132 -43 -12 1 -159 -156 -118 -205 -250 -131 -103 -220 -53 69 16 95 188 267 108 332 486 215 -46 172
919 172 33 -94 -67 -48 -248 -211 -196 -128 -295 -51 -106 -145 60 -99 359 198 319 104 -219 379 264 15 -407
942 -407 -257 -38 -238 -84 -164 -181 -431 91 0 -161 60 16 35 113 190 192 162 151 179 87 79 34 2 -111 -92 -157 -162
969 -162 -180 -90 -188 -84 -23 -5 31 71 102 104 86 124 107 151 116 12 -25 27 -70 -88 -107 -162 -176 -94 -59 -58 -99 54 65 20
$$ packed form
789b41QJ40j3j73K04Q8j46J01J84J07j67J18N2j18j15J55l3j37qp7j41J4K02j91
813a87j57K13J78j22m9J62Q7n3O3P1j55M5ml7J0L1kj54m9k5k5L2J02rj91J12J80
840F7m0j6J31K8j08M9J8p1M8j9m8p5Q5j4k30K7M9K9q6J06M8j69J35J32O7p2P1
867A42Pj8oO6j75P8P3j35r3j6N2j24n1J65o3j01O7Q3p7Q2K52j30o5J53j7q1M3
894A11N8l7j75L1J3j60LL8q7m5J19K8j17J67J22n3P9R3P9j59K24J54k71k61K18
919A72j39j27K7J9k00L7J5O8j67K44n5l9K05j59M58j61J21k15l23N98j15k49m22
942d07J50K19k00J54q0j7k50N22r1j61K21m4J9P8P7Kl0j1K8r2qm5l2j13J9o5n
969a62j8R0r8J04O1J8L6M0L1Kj8L8j7M4l5j04l7N2r7j8j9n5j4Q2L5Jm1J53J1m5
$$ plain form
999 20 107 86 62 64 139 109 105 30 11 18 -106 -53 -57 -155 -126 -80 -92 -64 37 23 38 -26 99 87 90 106 140 25 27 33 68 -57
1031 -57 -48 -67 -113 -91 -69 -90 -135 -61 -10 -66 -59 112 21 25 43 130 100 103 82 132 21 2 53 -48 -67 -23 -30 -142 -107 -55 -132
1062 -132 -134 -42 30 -23 -56 80 109 21 163 145 -5 85 120 87 -15 28 -8 -105 -98 -96 -113 -66 -3 -29 -81 13 71 85 72
1091 72 141 192 93 95 118 92 -13 52 -46 -99 -85 -139 -79 -172 -106 -93 -51 -67 15 5 65 119 150 82 145 102 152 21 44 11
1121 11 -33 -94 -114 -131 -156 -155 -55 -76 -65 24 33 29 86 155 113 128 167 157 108 44 81 -40 -13 -92 -149 -191 -81 -97 -149 -74
1151 -74 32 0 -28 36 37 37 124 181 155 143 132 107 37 3 -19 -66 -57 -33 -105 -125 -83 -71 -121 -19 45 40 4 87 100 97 107 88
1183 88 56 79 59 42 -39 -98 -32 -71 -90 -58 -77 -50 -98 -32 -4 38 -3 41 53 37 54 85 96 72 -22 -10 6 -21 34 -71
1213 -71 -93 -131 -102 -111 -104 -73 -78 -8 -4 73 58 51 62 117 120 111 84 58 14 -47 -62 -32 -21 -90 -112 -118 -112 -34 -20 -56 -43 -42 -34 96 99 47
$$ packed form
999B0Q7k1k4KP5l0mp5j9Pj24N3mr8K9M6j2K8J01j4J5o4J25j2LJ6L4j15KOL5j25
1031e7Rj9m6K2K2k1m5P4N1n6PJ71r1MJ8Q7l0Lk1N0j11j9N1j01j9M4pj12L5N2p7
1062a32kR2P2n3l3J36K9q8J42j8j50R0L5l3j02M3l6r7PKj7M7O3k6n2R4N8J4j3
1091G2O9N1r9KK3k6j05O5r8n3J4n4O0r3O6J3M2j6Q2j0O0N4L1o8O3m3N0j31K3l3
1121A1m4o1k0j7k5JJ00k1J1Q9RmN7O9m2J5L9j0m9o4L7j21K7p9n7m2J10j6n2P5
1151g4J06l2k8O4J%Q7N7k6j2j1k5p0l4k2m7RK4p2k0M2J2n0J02O4nl6Q3J3lJ0j9
1183H8l2K3k0j7q1n9O6l9j9L2j9K7m8O6K8M2m1M4J2j6J7L1J1k4r4J2J6k7N5j05
1213g1k2l8K9rPL1nP0MP7j5pJ1N5Lrk7k6m4o1j5L0J1o9k2oOP8J4l6J3JQJ30Ln2
$$ plain form
1249 47 77 99 119 128 52 25 -61 -55 -50 -67 -106 -121 -76 -52 -113 -9 -5 -18 45 125 97 94 86 109 61 28 114 -16 -9 -72 -116 -183 -121
1282 -121 -47 -126 -112 -24 -61 -9 7 91 55 66 130 178 94 55 110 45 -2 32 -15 -130 -93 -75 -141 -118 -43 -74 -105 -58 25
1311 25 19 40 33 97 80 111 75 25 57 5 5 -73 -53 -97 -126 -30 -36 -81 -91 13 20 -6 23 23 52 45 82 88 75 77 71 -26 18 20 -22
1346 -22 -82 -61 -41 -71 -49 -52 -33 -39 7 52 28 48 111 62 28 85 23 61 76 -3 37 -4 -2 -75 -121 -102 -45 -44 -60 -38 -44 -28 19
1379 19 67 38 48 67 15 21 101 56 41 -16 -20 -38 1 -84 -75 -94 -62 -52 -56 -38 -16 -13 1 5 76 58 91 86 16 2 37 52 -16 -34
1413 -34 -46 -40 -71 -67 -62 -89 -70 -52 5 -51 -4 12 33 56 124 92 94 78 66 85 43 -23 9 -44 -50 -36 -90 -68 -71 -76 -34 11 -21 74
1447 74 27 55 41 47 104 76 2 44 -4 -94 -49 -87 -78 -65 -64 -70 -79 -64 -18 45 35 55 44 63 118 119 54 59 70 36 10 29 -21 -23
1481 -23 -79 -73 -87 -198 -122 -112 -28 -15 -18 -22 38 70 35 78 35 66 94 29 -6 -13 -44 -35 -66 -82 -72 -106 -61 -87 -50 -16 63 67 4
$$ packed form
1249D7L0K2K0Rp6k7q6ONj7l9j5M5K4o1J04Mj3O3Q0k8lqK3m8l3Q6j30Po3m4o7O2
1282a21P4p9J4Q8l7N2J6Q4l6J1O4M8q4l9N5o5m7L4m7j15L7J8o6K3P5l1l1M7Q3
1311B5oK1pO4j7L1l6n0L2n2%p8K0m4k9R6om5j0J04Pk6K9%K9pL7Oj3Kor7M4Km2
1346b2o0K1K0l0K2lJ9oM6M5k4K0O3m9l4N7o2L8J5p9M0m1Kp3m6J9N7Jj6K2oJ6M7
1379A9M8k9J0J9n2OQ0m5j5n7mj8L9q5Rj9L2J0mJ8K2LJ4MP1j8L3np0j4L5J5o8j8
1413c4j2Ol1MNk7J9J8N7n6M7J6K1K3O8l2Kj6j2J9m2o6L2n3oJ4n4K2lnM2M5l2R5
1447G4m7K8j4ON7k8p4M2m8r0M5l8RJ3JorJ5M6O3j0K0j1J9N5Jo5NJ1l4k6J9n0k
1481b3n6Oj4j11P6J0Q4J3lmO0L2l5M3m3L1K8o5l5pl1Rl1j6J0l4M5k6L7L4P9Mo3
$$ plain form
1514 4 40 99 97 107 54 62 -5 31 59 -14 -131 -56 -59 -42 -18 -23 -20 -17 -3 13 14 39 69 13 93 41 46 108 25 -26 -26 -49 -38 -64 -17
1549 -17 -35 -77 -53 8 -50 -55 9 90 -5 79 -16 65 62 39 84 28 11 19 10 -15 -52 -97 -36 -25 -73 -110 2 36 -93 -44 -25
1580 -25 -22 -144 -48 143 -47 284 -125 -245 -237 -129 75 -228 -8 283 285 140 -256 -178 -9 -82 -260 51 11 131
1604 131 61 87 53 85 116 36 62 7 -8 28 -4 -71 -67 -85 -63 -129 -98 -77 -56 -9 28 26 83 81 1 118 44 41 36 76 -24
1635 -24 65 -6 -58 -63 -33 -105 -67 -63 -27 -14 4 48 17 69 56 77 84 65 65 13 -64 50 -41 -56 -29 -27 -66 -47 -53 -101 -44 -16 -8
1668 -8 -24 34 8 23 63 44 39 73 63 52 23 -41 -10 -11 -23 -2 -46 -77 -44 -52 -13 -4 -2 17 45 19 34 48 -25 32 -12 19 -18
1701 -18 5 32 -50 -64 -37 -44 -3 -19 -66 -50 -22 3 15 -26 17 17 43 59 34 21 61 13 32 -28 10 -56 5 5 -116 -53 -84
1732 -84 -34 -12 -12 -2 -20 -36 8 74 23 37 15 36 57 -14 -7 23 -8 5 1 -63 -20 3 -39 -117 -26 -61 -25 3 -4 19 56 123
$$ packed form
1514DL6N9kJ0n3Qo7L6K8p3j17P5lJ7K4nLLJ4J6JK5L0n6Q0n2NO2q3n1%k3J1k6M7
1549a7j8m2K4O1n8nO4Q1r5Q4r5Q1lk3M5n6j7Qrk5l7m5O1J1m8l7J12L4j29M9J9
1580b5Lj22R6J91j90L31m09j20QJ08K04l03K20K91Kj45l96P8J69p3j78L11m0J20
1604A31p0K6l4L2L1q0K6n5j5L6l2o7Mj8K2o6L1K1K1M7L7kN7kq0J17p4lnM0j00
1635b4Q9p1n2nL0p2L8ML6J3J8M4l1N2j3K1Pj9%n2p7J14r1j5K7Kl9J9om8N7K8Q
1668hj6N8k6J5M0j9nL4j0j1k9o4L1jj2K1m4l1L3qL9RKJ9K8k6J5J4p3N7m4L1l7
1701a8K3K7q2j4K7pM1j6m7J6K8K5J2m1M3%K6J6k5j3M0m8J9o0L8o6O1%j21O3l1
1732h4N0K2%J0j8j6M4O6n1J4k2K1K1p1PL0l1J3mo4M3K3m2p8R1l5L6K8pK3L7O7
$$ plain form
1764 123 14 16 39 90 10 -16 60 -100 -21 2 -21 -83 -25 5 -27 -84 -43 10 19 -5 32 50 42 55 84 50 28 -5 20 -47
1794 -47 -33 -63 -98 7 -36 -42 -34 -48 10 0 40 32 67 56 60 64 -36 3 44 -37 68 -47 -32 -159 -75 14 -58 -28 -14 -12 -8
1825 -8 -4 61 0 4 -13 25 53 30 3 15 -33 -87 -22 -5 -18 -54 -86 -49 -28 -6 -6 -34 19 9 78 43 24 -15 -1 1 -9 62 20
1858 20 20 -48 -22 -63 -30 -14 18 -15 -45 13 -28 -11 -23 34 1 -33 12 21 61 61 21 94 14 7 -29 -36 28 -32 -71 -45 -5 -60 -17
1891 -17 -38 15 27 13 8 9 66 47 47 16 -21 41 44 -99 -19 -25 -9 -28 -81 34 -39 -42 -33 11 16 -3 -24 46 -17 58 48 38 80
1924 80 73 -6 -55 8 -22 -1 -66 -45 -29 -29 -115 61 -98 190 11 -5 -140 -20 -51 -115 142 110 13 40 -6 -68 5 66
1952 66 21 55 -27 -28 4 -38 -45 10 -42 15 34 23 66 17 5 38 33 37 21 -36 -14 -44 -41 -7 -30 -33 -9 -29 29 -26 14 -2 21
1985 21 39 20 8 7 79 -7 30 10 -55 -18 -77 -23 -72 12 -15 -44 -20 -4 25 8 6 21 40 29 7 16 47 -15 23 18 14 12 -46
$$ packed form
1764A23j09KK3N1q0k6P6j60P9K3k3o2N8L0l2n7M1N3Rk4L7J8qJ3K9l4k2l3K5o7
1794d7J4l0l5J05m3oQj4N8j0M0qL5j1MMj00L9M1q1J05j15J5j27Q4Q9p2L0J4KM
1825hMO5o1Mj7L8K8k3k7J2m8n4O5J7j3l6l2L7K1K2%k8N3j0O9l5j9l9J4Kj0P1m2
1858B0%o8K6m1L3J6L2l3l0N8m1J7j2N7l3l4M5RM0%m0P3q0pl6pO4o0l9K6M0n5M3
1891a7k1N3J2j4nJN7j9%l1l7O2Lj43Q0oJ6j9n3J15p3lRM4Nj9k1P0o3P5j0j0M2
1924H0pp9m9O3l0K1o5K1J6%q6J76j59K88j79j6j35J20l1o4K57l2r7K7m6o2P3O1
1952F6m5L4q2jL2m2pN5n2N7J9j1M3m9j2L3nMj6n7K2l0LL4k3lK4k0N8n5M0j6K3
1985B1J8j9j2jP2q6L7k0o5L7n9N4m9Q4k7k9K4J6K9j7kJ5J9j1k2RL1o2L8nmkn8
$$ plain form
2018 -46 -62 49 -32 -17 -13 -30 11 -21 25 46 11 9 -10 15 30 -14 -73 5 -12 -18 -52 -28 58 21 -27 -28 -36 -53 -8 -53 8 76
2050 76 30 -21 -3 -14 21 -26 10 8 52 33 5 20 -15 -41 -1 7 -62 -6 -5 -69 -11 41 -40 6 28 63 46 72 -5 35 0 -22
2082 -22 -16 17 -11 -72 -26 45 -15 -47 -36 -26 -26 6 25 24 6 52 52 86 -17 -20 68 7 8 -8 1 31 19 8 -27 -51 -73 -24 28
2115 28 -7 14 22 33 38 23 35 -6 -11 -9 -19 20 -41 18 -39 38 20 -49 22 -37 -2 -11 -22 29 -5 35 2 32 56 -8 72 -4 13
2148 13 13 25 48 14 -39 1 41 -15 -29 -30 -51 -29 -36 -52 80 8 59 50 56 22 5 23 -13 15 -40 -22 -41 -20 16 -7 -66 -11
2180 -11 -24 1 -8 -20 25 7 25 36 44 24 2 36 37 44 54 -16 -39 -38 48 -23 -46 -38 40 16 -5 -24 -37 35 42 -14 -5 -55 28 39
2214 39 -41 -16 -12 20 -3 11 -48 10 -65 -20 10 -27 -52 -2 -31 -40 -10 19 53 53 58 34 43 7 10 13 -44 -49 -48 28 16 18 -53 -43 47
2249 47 -11 -5 26 -34 -30 -67 -23 5 7 62 36 -6 -43 -46 21 -26 -53 -8 -8 -25 -39 -17 -61 42 6 3 48 -14 -15 -19 3 39 20 52
$$ packed form
2018d6j6J11q1J5Mj7M1l2M6K1l5kj9K5J5m4n9P8j7ol4K4Q6l7m8jqj7M5m5O1O8
2050G6m6n1J8j1L5m7L6kM4j9k8J5l5k6M0Qo9N6Jo4N8N2q1M6K2L5j7K6p7M0l5k2
2082b2OL3k8o1M6P1o0l2J1J0%L2J9jj8M6%L4j03lQ8o1Jj6RL0j2j1l5k4k2M9N2
2115B8l5K1QJ1Nj5J2m1nKj0L9o1N9n7P7j8o9P1n9L5rj1N1l4M0l3L0K4o4Q0p6J7
2148A3%J2K3l4n3M0M0n6j4jk1K2pj6J32p2N1rOl4j7J8l6K8n5J8j9K1L6k3n9N5
2180a1j3K5rj2M5j8J8J1Qk0k2L4JPJ0p0k3JQ6p1k3QP8k4k1j9j3P2Pn6Rn0Q3J1
2214C9q0K5ML2k3J4n9N8p5M5L0l7k5N0k9rL0K9L4%Nk4Rl6LLn7nJP6j2Kp1J0R0
2249D7n8OL1o0Ml7M4K8KN5k6m2l7lO7m7k7M5%j7j4K2m4J03l6lM5o2jmK2L6j9L2
$$ plain form
2283 52 -5 21 -52 -21 9 20 -53 20 -78 -30 16 -5 13 4 -22 -36 15 22 -21 29 44 27 15 -42 26 -44 24 9 -67 -58 -9 -35
2315 -35 -25 -2 20 27 34 0 26 23 115 34 -32 34 -6 37 45 63 -15 -42 -27 11 -10 -15 12 -21 -1 35 -5 34 45 14 78 63 -24
2348 -24 -8 26 26 4 -34 -11 -20 15 17 -47 21 -31 -46 -10 4 17 -2 54 52 27 57 20 26 21 37 34 38 -21 35 -3 10 8 -63 -19 -21
2383 -21 -12 18 -1 0 39 0 31 29 4 59 24 2 29 -43 -15 28 -10 6 -13 -11 24 17 -60 1 20 15 3 -5 90 1 1 18 26 13 10
2418 10 -19 12 25 17 -8 -16 -45 6 -38 -25 -32 -42 0 -61 49 0 18 56 81 31 5 11 23 33 24 3 -16 -7 2 -29 -2 -39 -7
2451 -7 -33 -24 100 48 21 46 43 -3 6 34 40 2 -19 -10 -66 -33 -34 42 -22 -63 -45 -13 3 -31 -53 -26 53 44 23 36 30 42 -39 -30 29
2486 29 -45 22 1 -50 -84 -20 -41 3 -26 -79 0 -22 -18 28 -17 0 5 11 44 40 49 3 5 -6 -53 -5 -14 -26 -41 -57 18 -20 -5 50
2520 50 5 -43 43 -23 -19 44 3 10 22 38 -13 19 -1 31 -44 -18 2 -39 22 11 -46 -26 -15 -8 -24 -22 22 2 -19 22 28 -16 35
$$ packed form
2283E2n7K6p3L1L0J1p3P3r8M8M6k1J8rk6j4N1Pm3N0J5j7j2n7O8p0O8j5p6RM9k6
2315c5J0K3K2PPl4K6lR2q1o6O6m0M3QJ8p8k7J5L8k1nK7l3K0L6m0L9J1l1O4j5q7
2348b4J6L4%k2l8K3rL5Ko4O8n2j5L6J4J3j9N6kk5L0l7OnJ6lMn9N6l8J3kp1M4k
2383b1RL0j9JL9l9L1kk5N5l5k2K7p2K8M3l8J6j9KL5pp7O1J9nj2qR5q9%J7Qj3l
2418A0k9L1J3qk5qk9N1m4J3pj0M2o1J10m9J8L8K5n0k6OJ2J0rk1j9RRl1K7l7L2
2451gk6RJ24n2k7K5lm6RK8Ol8k1Rn6L3jP6o4m1J8L2J6l4k2K7P9rk1J3oJ2q1RN9
2486B9p4O7k1n1l4O4k1M4k9n3P9k2MM6m5J7NOL3mRm6Kj1m7M8rj2j5j6P5l8J5N5
2520E0m5m8Q6o6MO3m1PJ2J6n1L2k0L2p5K6K0m1O1j1n7K0J1Pj6KM4k0k1M1Om4N1
$$ plain form
2553 35 -51 36 34 -85 -6 -13 -41 -30 30 11 -1 31 25 -14 30 64 30 15 16 36 0 -21 3 52 72 -28 21 -26 43 -29 17
2584 17 -55 -30 -4 10 -8 -80 57 121 128 -77 -158 95 -70 48 -8 46 -33 26 13 8 -51 9 -30 32 -13 4 -9 46 12
2613 12 57 -25 50 8 -22 71 46 3 -20 -1 42 2 9 -67 -15 28 37 -88 -47 -16 -9 31 -18 -21 32 -43 31 -19 21 26 -17 35
2645 35 -16 2 0 -23 -5 -22 -47 -30 -7 -1 -32 -2 15 15 50 37 3 -110 -78 25 27 9 -32 -104 -16 -41 -20 16 -11 51 39
2676 39 36 -10 35 -23 6 22 -6 42 27 -12 9 2 -20 -17 -28 -44 -43 -50 16 -23 66 0 -47 42 -20 -17 -1 122 25 46 57 34 9
2709 9 8 -5 -18 13 -75 39 -35 -11 -19 -66 40 -51 -18 -33 -42 22 77 49 81 -61 35 11 57 42 -48 -8 -9 -12 64 17 -316
2740 -316 -38 -174 -14 66 -145 -15 96 61 29 28 62 -9 57 1 40 -2 -32 -14 -32 -5 -60 -24 2 -29 -58 11 36
2767 36 -30 -25 27 14 87 40 29 -14 52 -60 -9 19 36 -8 12 -25 -32 3 19 -18 27 27 11 7 -18 19 3 7 23 35 6 3 -53
$$ packed form
2553C5q6Q7kj19P9pk8J1O0j9j2L2ol9M4L4l4j5JK0l6k1K4M9K0j00M9m7O9p2M6
2584A7p2K5K6J4j8p2J37O4Pk05q1K53j65J18n6N4p9N9j3nn9O0l9O2m5J7j3N5l4
2613A2M5q2P5m2l0R3k5m3k3J9M3m0Pp6N2M3Rj25M1L1PM0m9lN3p5P4n0M0Nm3N2
2645C5n1J8kk3J8j7k5J7K3Ol1L0J7%L5j3l4j13L2J03Kj8m1p2Q8k5K1L6k7O2j2
2676C9lm6M5n8K9J6k8M8j5l9K1pk2Lj1j6JpO6l9Q9o6m7Q9o2LJ6J23r7K1J1k3k5
2709Ijj3j3L1q8J14p4K4qm7J06r1L3j5rO4N5k8L2j42R6k4M6j5r0M0jlP6m7l33
2740c16K78j36J60Q0k11J30J11l5l2jL4p1O6n6L9m2l0J8j8K7n5L6K6l1k9O9K5
2767C6o6NN2j3P3m7j1m3O6j12N1K8J7m4K0l7pL5J6l7M5%j6mk5L7j6MJ6J2k9ln6
$$ plain form
2800 -53 -54 -11 -16 -33 -27 -46 -7 1 -50 6 -107 -45 170 -79 -228 144 145 30 104 190 174 -160 192 44 104 -104 -36 -280
2828 -280 -108 -35 66 -4 -5 243 -100 -124 -117 -107 63 -191 -491 108 77 -45 59 56 7 -226 -7 133 -100 -31
2852 -31 -50 -120 103 164 -92 -47 4 25 37 -36 41 -16 20 31 42 -36 0 4 -36 -13 -22 -27 11 -18 -48 -5 5 21 -53 19 27
2883 27 63 12 33 26 65 6 -89 -44 -31 2 -53 -36 -8 -57 -36 13 -32 -6 46 9 3 12 50 60 52 20 -22 -19 40 -30 49 0 -10
2916 -10 36 15 15 -45 -23 6 -67 -39 8 -4 51 20 61 -55 -13 42 89 -44 -39 65 56 20 -68 -34 -6 -6 -34 23 -32 12 62
2947 62 22 4 -7 52 -29 59 11 21 -49 18 -30 -49 -59 346 92 210 108 37 330 -136 118 -11 -65 41 106 198
2973 198 232 11 -199 -133 -116 -108 264 -78 82 23 98 -16 -229 163 -21 46 71 38 109 142 166 211 -20 -10 144
2998 144 77 163 206 -289 -55 -66 -219 -223 215 31 -42 -16 -333 -141 167 245 -29 -51 -189 -48 -256 -11 -141
$$ packed form
2800e3jM3nj7Oj9L9Qn1N6j13O2K15k49j49L72Jj15P4Q6j6l34L52j48O0k08O8k44
2828b80J72P3J01p0jK48l43k4PJ0J70k54l00N99l1j22J04lm9k33K19J40k33O9
2852c1j9p0K23O1k56M5N1K1J2p3P7n7L6J1J1p8L6Mm0K3rnL8k9l0M3J0J6p4P2Q
2883B7L6n1K1pL9n9r5M5J3L3n5J7K8m9K1M9m5K6N2l7oRL8J0ql2m2LN9p0P9m9j0
2916a0M6k1%o0K2K9p3K8M7j2N5l1M1j16M2N5M7j33NJ04rl6q8L4K8%k8N7n5M4N0
2947F2m0j8j1N9q1Q8m8J0p0O7m8j9j0M05k54J18j02p1K93m66K54j29n4J06O5R2
2973A98L4k21k10O6J7QL72l42J60n9P5j14k13L92j84O7K5l3P1L3K4M5k31J0J54
2998A44o7Q6M3m95K34j1j53mM38j84p3K6l17J92L08P8k74k2j38J41k08K45j30
$$ plain form
3021 -141 -88 63 -67 -272 -133 -369 -22 -101 -302 -256 -53 -11 -179 -271 346 -77 221 83 107 -197 -135 -58 -2
3044 -2 -36 34 -18 3 -60 -46 -28 -5 -18 -12 6 -11 -21 -93 55 17 18 -11 27 -47 125 206 121 98 177 49 121 -84 -77 125
3074 125 -10 -102 297 44 -102 195 45 160 71 305 -146 -31 -29 20 19 72 -6 19 52 36 -44 -102 28 -57 -104
3099 -104 -51 120 49 2 366 51 -247 110 54 -3 -40 142 -162 -23 300 -138 -52 160 37 167 77 50 -83
3122 -83 -13 -21 69 86 28 16 -38 9 -16 -61 103 145 87 -14 -29 -21 -22 -36 9 -41 -18 -96 -1 -12 15 -50 38 -37 169 123
3152 123 -24 -17 -142 91 14 248 295 465 257 108 -42 10 10 -44 52 -12 -11 38 10 32 -20 36 37 0 42 25 36 13
3180 13 3 -3 18 -51 11 -29 -27 -28 3 -43 10 19 30 -10 -33 39 -12 -123 -15 -38 -39 26 -76 44 14 22 -4 -9 42 -51 -9 2
3212 2 12 42 28 -9 46 8 1 -15 132 -144 -247 48 -138 -149 -35 10 75 14 73 22 -336 339 64 -59 182 -203
$$ packed form
3021a41N3J51j30k05J39k36L47p9k01M6K03M2j68r2O17m23K98j38K4l04O2P7N6
3044bl4P0n2K1o3J4J8K3j3OJ8j7j0p2J48l8Jk9L8p4J72Q1q5k3P9j28P2k05PK02
3074A25j35r2L99k53j46K97j50J15q9K34m51J15KM9jN3p8K5L3j6q0n8J30q5m7
3099a04N3J71p1m7L64l15k98L57n6n7l7J82l04J39L23m38Q6K12j23J30r0k7j33
3122h3P0qR0J7n8j2n4M7k5m5J64M2n8j01j5Qjj4M5n0K3p8R5j1K7o5Q8p5K06m6
3152A23j47Pj25K33p7K34M7J70k08j49j50N2%n4R6o4JM9k8K2n2N6Jl7M2j7J1k3
3180A3j0oK1o9O2m0KjL1m6N3RJ1m0k3P2n1j11J08k3jO5j02J20l0Qk6nN1r3M2J1
3212BJ0L0j4l7N5l8pj6J47k76j03K95j86j1J14M5O5o1N9n1l58O75k75j23K41l85
$$ plain form
3238 -203 -135 -108 57 191 -59 -85 -205 -44 -22 59 -8 -355 -133 133 0 90 -101 158 246 -64 194 -49 -419
3261 -419 -146 90 -154 -224 -106 73 93 -210 -249 187 -328 -74 20 -22 128 71 33 -151 28 -18 -26 -4 -19 -2
3285 -2 -3 -101 7 52 83 42 -1 11 51 -20 -57 -22 -12 -16 51 -152 264 80 209 -67 -190 48 16 53 11 -3 -34 50
3313 50 -13 5 9 37 -35 10 -37 6 -24 -74 -35 -22 46 -21 33 38 29 4 -21 33 4 -27 5 -51 27 23 -22 69 -59 -1 -77 -17
3345 -17 40 -70 19 0 72 2 3 -21 -24 -56 10 78 -26 -7 25 2 35 25 -56 -10 -65 20 -27 33 -11 12 57 38 -5 17
3375 17 38 15 36 62 19 62 -44 27 12 -10 -37 -26 39 9 3 -10 14 20 25 43 44 -21 -8 18 5 25 -5 27 8 -38 14 -17
3407 -17 -3 -45 -24 -5 -15 -16 -7 -16 50 10 -11 -18 -23 -4 51 16 -8 30 17 56 -25 31 9 23 -16 29 11 7 52 0 -24 2 -13
3440 -13 36 20 55 -7 18 -16 10 26 -25 -2 -24 -55 8 -26 -20 33 -33 -17 19 1 10 5 11 61 0 20 -21 -24 23 -32 7 -6 22
$$ packed form
3238b03O8K7J65J34k50k6j20J61K2Q1o7l47K22K66j33R0j91K59Q8l10K58k43l70
3261d19K73K36k44p0J18J79K0l03l9M36n15K54R4m2J50n7l8j84J79m6qK2j5J7
3285bjr8J08M5L1m1m3J2M0p1l7L5J0mO7k03M16j84J29k76j23K38l2L7m2j4l1Q4
3313E0o3J8MK8p2M5m7M3l0n0L9J3O8o7N4Nrk5k5N4k9l1L2n6P8mm5R1j28N8p6O0
3345a7N7j10Q9j9P2p0Jk4ll2O6O8j04J9L2k3L3j0q1M6n5Q5m7O0m4K3M5j9m3K2
3375A7K1k3K1K6m3M3j06P1j5k2k7J1O5l0oj3K4ONJ8Jo5J3K6j3K0l0L2j9m6N2l1
3407a7J4m2K1J9j0jRrO6m0k1pnJ9N5l5k4L8j3L9q1N6k2J4l9M5j8mM5n2k4K6j5
3440a3M9j6L5o2K5l4K6J6n1K3k2l1O3l4ON3o6J6L6j8RnON0o1K0m1lM7n5L9j3K8
$$ plain form
3473 22 37 34 26 -34 24 -16 31 -39 -32 -39 9 51 -25 -16 29 16 4 17 49 4 14 -35 15 -96 -6 48 13 2 30 61 31 7
3505 7 51 56 25 0 6 39 1 -41 -15 -28 10 -19 75 24 -22 0 -14 17 -33 -22 10 -24 -20 -6 -6 14 33 27 86 -14 -19 -7 20
3538 20 9 -11 34 12 -34 22 -43 12 -9 9 56 -13 -11 50 18 -71 -43 26 49 43 17 4 9 15 13 -55 -24 29 21 -14 5 -5 34
3571 34 -21 39 47 -48 9 38 5 64 -8 1 8 92 -18 44 67 20 -13 -40 4 -45 -18 10 51 -11 12 27 -44 31 81 2 25
3602 25 -55 15 42 0 22 -33 29 27 28 -28 -26 -10 40 2 -2 -20 4 34 14 40 14 9 17 3 -34 -38 -13 -4 26 43 -20 -17 5 -30 9
3637 9 -14 -22 31 32 59 75 24 26 15 3 -28 -8 -7 21 10 2 -12 -33 -27 -26 -57 -17 -36 6 -29 -21 -39 44 17 24 0 26 88 40 -10
3672 -10 -34 30 -33 49 -21 -23 4 -39 10 1 7 32 -7 -27 -17 24 -35 -16 3 25 34 -26 -10 13 10 40 59 5 35 43 67 16 27
3705 27 11 38 2 12 5 2 38 7 -1 23 9 -32 17 -38 16 -15 17 12 7 -65 -29 -48 10 7 15 -64 11 36 10 17 -38 -41 26 -10 -36
$$ packed form
3473B2J5lqo0N8m0M7p0PpM8M2p6RM5j3j2J3L2m5J0m9N0j11R0N4l5j1K8L1l0k4
3505GM4Nl1k5OL3l8m2K6j3L8k9R4n1m6K2j4L1n0J1L2l4MJ4%K0J9oN9j00nJ2K7
3538B0j1k0M5k2m6N6o5N5k1J8M7o9KO1l2q9K8O9K3ok6j3NOko8L1N3ql5J9j0L9
3571C4n5O0Qr5N7K9l3N9p2RPQ4j10O2K3m7l3k7M4m9K7K8M1o2K3J5p1P5N0p9K3
3602B5q0P0K7m2K2n5O2kJn6KJ6N0l8mj8K4L0k0K6k6nQj4l7mK5RL0J7o3LK2l5L9
3637Ik3qN3JK7J6n1Kj1j2l1K0JK8j1qj4k1OJl1M0j9M2l5Qj8Q3k7Pk4K6O2m8n0
3672a0k4O4o3Q2p0kK7m3M9rOK5l9k0J0M1n9J9J9K2Ro0J6K3lL0J9n4L0QK4n1J1
3705B7j6K7l6J0plL6l1qK4j4m1M9n5N4l1L2nnp2L6j9N8lQp9P5K5k6Pn5lO7l6k6
$$ plain form
3740 -36 -70 -60 -24 -25 -4 1 -15 -84 -11 10 -39 50 12 85 21 -29 -2 -48 21 15 20 -8 -29 17 24 -20 -27 16 -6 16 -28 43 -5
3773 -5 -11 -19 -34 25 -21 12 26 -31 -10 13 7 53 63 -19 -25 6 18 29 -42 50 41 -27 5 -9 -3 30 6 45 4 27 12 78 -13 -37
3807 -37 -16 -61 61 5 9 -1 66 32 5 -16 60 7 18 -28 42 5 -57 22 13 12 15 22 -5 9 49 17 -8 -19 -14 11 -13 24 0
3840 0 42 -3 2 4 -16 -8 42 -11 3 22 -42 -12 -2 17 -15 15 -18 -19 -18 -32 -36 -28 -10 61 19 24 -26 11 58 -57 45 1 28 9
3874 9 0 -38 -77 -37 34 -28 -25 -27 20 17 19 16 -22 31 29 11 8 34 9 8 57 -14 44 -6 25 30 6 32 -64 16 -6 -3 12 17 -14 -46 16
3911 16 31 -12 33 -6 -1 12 16 35 -30 -1 -23 5 1 28 66 -31 17 -25 -13 12 22 -18 27 31 35 9 35 -17 -47 5 26 -5 41
3944 41 -6 1 17 -18 11 25 -8 28 -54 49 5 21 8 30 41 56 32 13 23 4 33 -5 -35 5 13 19 54 -35 26 14 45
3975 45 11 -41 -55 31 14 5 50 6 26 -40 -3 15 20 27 -33 -40 42 -2 8 33 38 32 7 -7 -3 46 80 0 24 -16 75 40 -18 17
$$ packed form
3740c6l4J0L6jK1Nj6o9P3K1m9Q9l8P3o4n0K7m6O9oNk8k1M6Pm4pM3k2K2m4P1m8
3773eoqj5N9m6L3J4n7K1K3oM6J0q2oL1J2J1p1R2ro8L2j4OL3k4L9m1K3j5O6r1k4
3807c7K1m5J22n6Mj0O7l4k7k1P6n3J1m6P0l7o2P9rjLPk7J4M0l2k5j1NK5k4L7k4
3840@M2m5NKk0QN0n3J4J9o4L0J0J9l2L0l3jJj4mQJ8P1m2Nn0L7M7j15J02m4K7j9
3874Irl8l9M0P1o2LkM7lKll8N3kj8lK6k5jM9p1N8n0L1Nk4K6r6Q0k2LJ5Nl1l2O2
3911A6J5m3M5l9NJ3MJ9o5K9k2K8mK7L8r7M8m2J2K5J0m0M5MMk6K6n2l0N2K1l1M6
3944D1m7PJ6l5K9J4l3L6q2J03m4J6j3K2J1J5k4j9J0j9K9l8l0M0QOL5q9O1j2L1
3975D5l4n2j4Q6j7rM5m4K0o6L7J8NPo0pQ2m4J0K5Nok5j4MM9L4q0K4m0R1l5n8L5
$$ plain form
4009 17 -22 -19 -39 15 16 -30 -5 17 -38 -10 -25 -24 52 5 -29 -14 29 -3 21 -43 -17 28 37 -43 -31 21 -10 5 17 48 33 15
4041 15 41 -21 44 27 53 55 -3 -8 1 34 -23 -8 13 -16 7 67 16 -49 -3 24 -10 -26 -6 -5 54 11 11 -29 -28 -62 -24 1 -19
4074 -19 -74 61 9 -10 -56 -48 -9 -31 41 -43 34 -28 -70 -35 29 11 -26 44 -3 -25 12 -60 48 39 -10 -68 -14 14 18 17 18 12
4106 12 -24 34 59 -3 -33 20 -41 -9 22 -2 5 21 5 -3 -47 -12 -17 -4 -14 -24 -24 -24 5 -20 33 -22 -35 -19 -28 -30 24 -28 -17 -27
4140 -27 15 13 46 -73 -20 4 -1 54 -18 -50 -13 18 21 40 -48 -33 31 -26 10 8 17 40 3 43 -4 6 -6 11 -28 -12 -22 6
4172 6 -41 6 49 -41 -22 -17 10 4 -49 -3 2 29 -38 14 -5 -47 -19 -20 -7 -14 -57 36 -27 -34 4 49 -1 1 -66 -37 20 -16 -12 -5 15
4207 15 28 15 -11 -11 5 54 1 1 6 10 2 45 -13 -39 0 -41 5 -86 23 -27 -8 19 13 -13 3 74 -41 22 -34 24 -8 23
4239 23 -43 24 -40 12 12 -27 17 -1 -1 -7 13 -25 -61 44 29 19 -6 -4 23 3 -11 -2 9 42 -14 -10 -16 47 26 -54 -29 -12 59
$$ packed form
4009A7l9Lk0N4Jm6K5K2n5K8j5JP6m7l4J5M3l2K4o4K6M5Rq0J2N2l1J5J2L1j5j8
4041A5K6o2O5j7K6Kn8nRL3n7J5K1k9K3O0n1o5M6K7l4j6K0JN9m3%m0Jl4L8K5k0
4074a9n5J35n2j9m6QL9k2P2q4P7o2m2L5O4j8l7P0m7k2L7p2J08rm9n8N4K8MjJo
4106A2l6N8K5o2l0N3o1L2L1k4PJ6j6qm4L5nJ3j0j0%%K9k5N3n5j3J6rkN4n2J1j0
4140b7M2kL3j19N3K4nN5p2l2L7L1LJ9q8J5O4n7L6kRK3l7M0m7J0j2J7l9J6j0K8
4172Fm7M7M3r0J9NK7on3M6NK7o7N2j9m2K8jJ3pm3R3o3pL8M5n0Ko7K9N7l6MPK0
4207A5J3j3k6%J6M9n3%NMqM3n8k6L9m1M6r1J09n0J9K7ok6J6P1j15O3n6N8l2L1
4239B3o6O7o4N2%l9M4j8%oK0l8l6J05j5j0k5KK7k0j4RJ1L3n6MoO3k1q0K5J7P1
$$ plain form
4272 59 -23 -15 -5 29 30 -17 50 -31 1 -47 -30 -13 6 6 -23 12 -19 16 1 61 56 -10 -10 22 7 -10 -26 14 35 -19 -29 -11 17
4305 17 -8 -7 -1 -6 50 -57 5 54 7 -31 -30 -2 -1 10 -48 -38 7 -18 26 -7 13 7 -62 -47 -46 -31 -15 5 -33 -26 25 14 -20 -26
4339 -26 -12 37 65 -48 34 48 3 -43 18 10 -3 -50 -48 -19 27 -60 -6 -29 11 34 14 5 -33 45 -26 -7 -45 -15 -42 4 36
4370 36 45 -82 32 43 10 -14 57 48 -25 39 10 -19 16 26 -42 -37 40 -17 -9 74 -1 10 -27 55 24 -5 51 7 -17 40 -4
4401 -4 -26 -4 -30 35 -22 15 10 25 23 -2 24 -17 -12 17 -76 -43 -17 -7 -34 53 39 -13 11 -13 -1 -5 29 62 29 61 -25 -5 8
4434 8 -23 -10 6 9 -19 -33 -30 75 -13 -5 28 -16 -88 -12 -21 -40 27 -4 -27 17 18 46 -38 30 -38 31 6 45 2 0 18 -39 58
4467 58 -42 -41 -12 11 47 17 37 24 -42 -50 20 41 3 26 -48 -29 -1 32 -15 -17 -26 -18 26 -22 19 -37 68 -16 -19 -6 -20 -20 -43
4500 -43 38 -17 39 -16 8 47 1 -14 -13 -1 9 -46 -27 -45 -17 -27 1 0 17 21 2 50 22 -11 40 39 29 -34 -12 17 -6 45
$$ packed form
4272E9q2QJ0L4Jm7O7q1L2m8J7J7J9%k9L5l1L5j5O0no6%L2j5j7j6M0K1n4j0J8K8
4305A7k5JOnN6j07O2M9m7l8JK8JJ1n8J0M5k5M4l3K0oo9J5JJ5J6K0l8PN1j1l4o
4339b6J4M9K8j13Q2J4m5m6O1qj3m7KK9M6q7N4k3M0K3k0rl8P8p1J9l8L0k7M6L2
4370C6Rj27J14J1l3k4P1rp3O4k9k9L5J0o8NP7n7QQ3p5J1l7Q2l1k9N6m4k4N7m4
4401dk2K2k6O5n7L7nJ5kk5K6m1NK9r3L3K6J0k7Q7j4n2K4k4J2mL4L3l3L2q6K0J3
4434Hl1J3J6Lk8j4LJ05q8QL3m4p2P6rj9O7l1k3M4JK8q4O8o8O9k5L9m3kJ8n7R7
4467E8j00JK9K3L6l0K0j3o6qP0K1l8K3p4J9K8L3m7krQM4m8M1n6J05q4lJ3j4%k3
4500d3Q1n5N6n5K4L9m6j5JJ2J0n5J9j8K8j0K8jJ7Mj9M8k8l3N1jj0o3K2K9k3N1
$$ plain form
4532 45 -5 -1 -5 59 -58 6 37 -34 -17 -25 -16 -30 -16 2 -7 9 -60 23 -34 -1 -35 -7 -2 36 -48 -2 4 -13 34 -36 22 27 -19 -35
4566 -35 -27 11 4 -5 -82 -4 -7 -23 -15 22 -28 -27 -32 14 7 -11 -12 -28 46 23 -7 8 11 -19 38 -10 15 -5 0 -21 9 24 -3 2 -66 9
4602 9 -8 -37 0 -24 -9 17 11 56 10 -26 -21 28 -28 -54 -31 24 2 -24 -26 1 -75 -8 -5 26 -18 42 -1 -41 21 5 51 63 15
4635 15 9 11 -85 -9 39 -66 -56 -29 2 -77 -47 -2 -56 -46 32 -11 -23 28 31 54 19 35 19 10 -44 9 -8 30 2 -12 -16 -29
4667 -29 -17 34 -61 -14 28 22 6 -16 14 -24 -20 65 4 10 -3 15 35 10 -50 -12 0 28 -19 -47 -44 25 35 32 -26 2 -3 6 16 -1
4701 -1 -1 -57 25 33 -60 -25 -14 10 -20 -29 21 13 20 -8 -25 -16 -20 -38 -30 -33 13 -5 3 68 4 -5 -34 -20 -21 30 30 -2 38 70 -13 -12 -33 -11
4739 -11 -16 19 -28 5 23 43 10 -40 46 0 9 -71 48 -28 -10 7 -36 12 -18 -11 -3 22 -60 2 6 5 -12 -6 -4 7 -38 -5 35 4
4773 4 41 59 19 16 -31 1 -25 2 -28 -38 -19 28 48 3 11 -42 -43 43 18 15 34 6 32 4 4 -6 56 -25 -3 19 -9 -28 8
$$ packed form
4532D5n0MmO4j17O4L1p1J7qRj4J4J8rJ6o9Q3n7L3l4K8NL8q4M6Oj7M7p0N8Nm6j6
4566c5QL8prp7P8lj6QL7n0JnM6pj8jj6P4k3l0J5Ll0N7m8K5k0Nk1L0J5k7No8P5
4602Ij7k9L7k4J5K6oM5m6l6NM9n6k6K3N5k2k6kK7p6O7LL1m4O0m3m0O2j6M6J2m8
4635A5oKr6P6M8j05J0K7L1p9L0M5n4J0P8m3j2N1LK3l5J6j6rn4N3j7L8k8j4mj3
4667b9J2N1r5M7M2oj6k2L0l8MQ5o1Oj3J8K0k5o0L8J2K8m7k8LO9J0ln8K8nRJ0j7
4701a%n6Q2Qr3L5J1K4l0rN0qPk8j7Rmj8QlM6j8QO5o4rk9J4jN1%l2M0L2q3Jk1K2
4739a1nL5m7L3J8K0l3n0Q6m6Rq0J19p6J8J7m3M8l0PQK5q2O2Mjj7OKJ1m5L3M0l1
4773DL7J8m0lm7L2k6K7l0j0J9M7K0m5Qn3jQ6k5lJ9k8K6k8%j0O2q1K2K2k8j9L6
$$ plain form
4806 8 -14 -15 -21 31 33 -29 -10 0 3 39 -13 14 25 -3 20 -32 2 -3 15 -11 -13 31 13 44 32 -32 -6 14 -48 0 -22 31 -27 -29
4840 -29 5 -25 26 0 23 10 -30 30 -1 40 33 31 11 77 16 40 28 64 30 28 24 -28 -12 -13 19 -11 48 12 31 4 10 -12 -45
4873 -45 20 13 48 -1 -26 -10 -7 93 10 -25 40 -16 22 17 -6 -16 -18 5 -33 -8 68 -4 -9 15 10 -4 26 26 3 3 -32 15 2 43
4907 43 -36 -14 35 -12 4 -28 -18 22 36 -2 3 -41 21 -8 -84 -9 -41 35 15 53 -8 1 -25 15 38 -21 3 -24 17 40 67
4938 67 20 -29 23 4 -26 20 36 11 -44 0 9 34 52 -9 -18 6 -2 21 34 -15 30 3 -24 16 54 -35 15 -2 0 5 -18 46 66
4971 66 78 -23 12 -9 5 -2 19 -9 -5 -45 3 -10 9 -10 -29 26 -14 -12 42 18 64 10 -41 42 -9 -12 23 42 14 13 25 -16
5003 -16 -16 9 -33 5 3 38 -70 25 -32 -30 2 35 -27 21 33 -16 35 -20 30 -33 -39 58 -27 92 -31 -8 11 7 64 -36 19
5034 19 31 -17 -6 42 -36 -25 -30 -1 -34 26 -134 -77 112 132 101 -63 250 328 23 -194 -11 -22 9 -29 17 11 44 0
$$ packed form
4806Hk2joN2Ko2J9J0LL6n2K7J1k8K3n2L4nJ8k6kM4j8L1j2o4K6K0o2M8k2N3n8k
4840b9L4l0N1k6K3j3m0O0l1M1pkk0O6o1K4j2L6l4kmn2J6jL2l0N9l6J9k7Ok2l3
4873d5O5pL5m9k5J6LJ00q3l5O5n6L8nk3j0kK3l8K5P6p2nK4nj4L0%k3%l5M7j3M1
4907D3p9K2M9m7J6l2J0M0J4l8Nm4O2k9p6P5l2P6k0L8o1Rk6M0K3n9K4k7M1K3K7
4938F7m7m9N2j9l0M6J6k5n5M4RK5J8o1rK4qK3J3m9M5k7k7M0L8q9N0j7KNk3O4K0
4971F6J2j01L5k1J4pK1k8Mm0M8j3J9j9j9N5m0KN4k4M6n4n1Q3n1lL5J9k8jJ2m1
5003a6%K5m2L8kL5j08R5n7KL2L3o2M8J2m9N1n5N0o3oR7q5J19j23K3J9mN7j00N5
5034A9J2m8J1M8p8J1nK9l3O0j60N7J89K0l1j64L13P8l05k17J83j1L1l8M6oL3m4
$$ plain form
5062 0 48 -21 130 -25 -89 -61 59 59 -18 120 -32 -24 38 40 51 58 -20 21 -76 32 -39 -31 7 14 60 7 -18 34 28 34 -11 14
5094 14 4 49 -34 15 -16 40 12 53 -34 3 17 38 55 -3 -12 -13 84 105 -24 -60 -12 -50 -8 -29 -23 -24 -32 -29 20 21 7 11 23 -6
5128 -6 -19 25 -37 -4 -16 -31 -5 -30 -17 -33 -125 -101 194 16 130 -53 200 127 192 152 28 -13 -226 -23 70 48 3
5155 3 36 8 83 -25 22 14 -52 60 -108 22 -56 109 -91 60 -25 53 -28 -36 -12 25 -79 -36 -161 5 136 -30
5181 -30 31 60 -48 57 0 -6 43 63 -162 27 -28 81 -73 255 128 -153 -113 27 112 295 24 -41 160 -160
5205 -160 246 31 139 502 -426 -150 -107 -174 -285 -382 118 -57 -6 34 10 25 36 -65 32 -40 54 -36 -117 -129 181
5230 181 44 -5 91 8 218 12 -100 210 67 32 -155 -134 77 44 64 13 -69 -237 -172 90 -28 -27 43 -9 -25
5255 -25 78 13 -39 20 -54 18 -12 -11 55 -20 -40 5 -64 31 -6 12 31 -13 -26 15 4 3 -10 1 -52 -5 56 8 61 -1 -34
$$ packed form
5062@M8o9J51j55o4K8J20%p7J38j52QO2KJ1Pp8M1r7J08p1QL8PM6n3k5N2oOm5K5
5094A4j0M5q3M9l1N6k8M1q7L7J4K1J7n8rjR7K1j29l6M8l8M2k1OjqLM9Jj4MJ2k9
5128fj3M4o2L3j2j5K6k5J3j6r2K4K95j78J14j83K53p3O5m0j24m1k13K03R3k2m5
5155CL3k8P5j08M7qo6J12j68J30p8J65k00J51q5P8q1qK4L7j04M3j25J66J31j66
5181c0O1K9j08J05n7oM9K0k25J89n5J09j54L28j27k81M0J40Q5J83k71o5K01l20
5205a60M06k15J08L63r28K76M3o7j11r7N00j75N1M0k4J5J1j01R7p2R4r0q1j2L10
5230A81j37m9R6q3K10k06j12L10j43l5j87K1K11l3K0n1q2j68O5K62j18JP0n2j6
5255b5J03o5n2N9p4P2l0JO6p5k0M5o9R5l7J8J9m4j3M1j1jj3J1n3M7O1m8N3o2l3
$$ plain form
5286 -34 -29 12 9 -55 17 -9 -15 31 -48 -60 0 47 20 -56 -35 -9 12 -6 -2 -37 7 77 3 -18 -13 -49 45 -11 -1 44 -3 6 -1 10
5320 10 -52 16 -25 41 -27 29 46 -5 -47 2 60 23 10 -45 -12 20 26 29 -1 26 1 35 -43 -19 20 10 13 7 21 -30 28 3
5352 3 43 -33 20 -24 38 17 -62 -29 -58 56 -49 16 32 -53 -17 -32 17 8 -2 10 58 21 -26 -17 -13 31 -55 -9 15 14 7 -27
5384 -27 18 58 -76 14 -36 28 -11 -53 20 -40 -45 -5 -14 11 -25 29 17 5 -58 -2 6 -31 -49 22 44 -37 38 30 13 6 -31 -38 6
5417 6 -33 51 81 58 -32 -6 -6 -9 -27 -4 -24 -56 10 -17 24 -27 -43 34 -38 1 37 19 11 -5 4 32 10 12 30 11 40 -20 -19 -5
5451 -5 -15 -1 -17 -31 -48 23 -46 8 -66 7 20 -23 -2 -26 59 25 34 -29 -10 -10 -12 -36 -14 -9 10 51 -17 -27 -35 0 0 13 68 6
5485 6 18 32 -49 6 -11 57 -1 -33 38 -36 43 -42 28 -20 21 -33 0 -28 66 -12 -52 -7 -34 10 -6 -47 -33 7 -26 -13 -36
5516 -36 -3 -10 -29 -41 4 4 -1 30 19 -36 32 32 26 -2 2 -20 8 41 26 22 35 -9 19 -13 39 20 4 51 1 10 -30 -7 24 -21
$$ packed form
5286c4NM1lo4P2k6oM6p9j2O0M7k7p6K1K6K1j8Ml5M4P0p4k1Nl6R4n6J0M5m7RpJ1
5320A0o2O8m1O6o8N6J7n1m2M9N8l7j3n5L3L2OLl0K7k5L4p8K4L9j0LoJ4n1N8k5
5352CM0p6N3m4O2k1p9L3k9J14j05O5J6q5L6j5M9rj0J2M8l7m7RMM4q6M6K4jpl4
5384b7M5M0j34R0n0O4l9m2P3o0nM0rK5l6N4j2j2o3N6Ql7j8P1K2q1P5qj7pl7pM4
5417Fl9Q4L0k3r0K6%lj8K3k0l2O6k7M1n1j6P7p2L9L6j8qj6RK8k2KJ8j9K9o0JJ4
5451ej0J4j6j4j7P1o9N4p4P3J3m3K1k4Q5l4Ro3J9%kk4K2NJ9M1o8j0qL5%J3N5o2
5485FJ2J4q1N5j7O8n8l2P1p4P9q5P0m8M1n4L3k8R4p8m0M5k7M4j6m1J4M0l3J3k3
5516c6L3pj9j2M5%nL1j1n5O8%ok8Mk2K8L3j5mJ3m4K8l2N2j9j6M7n0Rm0K3L1m5
$$ plain form
5550 -21 17 46 6 13 14 13 2 18 -101 -9 21 -5 -11 -81 42 -1 -7 -42 15 -20 57 32 -33 29 -18 39 -19 11 -7 -21 34 99
5582 99 39 -4 7 19 -49 11 18 33 -38 8 -1 -1 -5 -13 5 16 -31 -12 33 39 8 50 -13 56 -21 61 -36 -37 16 -1 0 3 35 8 -37
5617 -37 4 32 19 -9 -20 14 -10 4 5 -25 4 -15 -19 -46 12 6 -33 -53 -31 -40 10 26 -6 6 -49 -34 -6 -17 6 20 17 -53 -15
5650 -15 -35 37 23 19 -12 36 -5 2 16 -26 42 44 35 7 -17 21 -6 16 69 -26 -26 28 -37 -18 36 8 -35 -30 -43 -8 -1 -21 22 52
5684 52 43 29 28 -37 26 -11 -4 -24 -40 27 -14 -13 32 -12 -38 -22 31 -4 -54 -29 -35 5 -29 -18 4 -19 1 28 -14 48 -31 56 11
5717 11 15 -12 49 -17 -45 17 28 -8 -41 -6 49 54 50 43 -3 -18 10 -3 13 7 19 29 54 -21 13 33 43 16 -19 -19 -2 3 63 -16
5751 -16 17 -5 -42 67 37 28 -49 -1 46 18 -30 -20 -34 32 15 10 -16 48 6 -50 -38 -30 -8 20 -31 38 6 48 -4 0 -45 -24
5783 -24 66 9 43 -12 25 -4 -27 -22 -11 30 -14 51 3 -31 -1 -9 24 33 -37 -10 41 -5 -51 -14 -83 -7 -12 -23 -17 -11 -29 -26 25 4
$$ packed form
5550b1L8K9m0PJjj1J6j19R2L0k6op0J23m3ol5N7l5P7k5o5O2m7N7n8L0j8j4N5O5
5582I9o0m3J1J2o8O0PJ5p1M6r%mqJ8J1m7J9M5Ol1M2o3O9p7Q2r7jN3j7JLL2k7m5
5617c7M1K8j3k8j1L4k4J4Jl0K9j9mk7N8ol9k0K2rN0J6l2J2n5J5K8j1K3J4lp0L8
5650a5k0P2j4ml1M8m1PJ4m2O8Krk8k4L8k7K2N3r5%N4o5J9N4k8m3Nj3L5Pk0M3L0
5684E2rj4jo5O3l7Pk0j6O7m1JM5m4k6J6N3l5n0K5oM0l4J1K2k3K0K7m2O2p9Q7m5
5717A1Mk7O1o6k8O2J1l6l3L5N5Nmpm6j5K8j3J6oJ2J0K5p5L4K0J0k7l5%J7NO0p9
5751a6L3k2l7J09l0rp7M8M7k8m8J0j4O6j7nk6O4m2n6J2QK2K8n1O9l2M2n2Mm5K1
5783b4R0n7L4n5L7k9k3NJ1M1m4O5m8l4L0qL3Rp0K7N1m6m6L7o9P6nj1OOj8LN1k1
$$ plain form
5817 4 -55 17 3 -12 13 -31 32 27 -9 -20 21 -52 12 42 -1 -43 26 27 -1 37 -60 35 51 -18 58 32 -38 -45 9 -20 -22 19 28
5850 28 -24 -33 -50 7 -21 1 -14 9 -3 36 -16 -4 -22 -19 -26 5 16 14 17 -6 14 23 -27 -32 -35 -20 11 -15 -16 11 -17 1 -37 7 8
5885 8 -16 2 13 0 -11 -21 -42 -68 -8 4 22 -18 -36 -60 30 -26 -1 -7 -3 -26 36 14 44 -8 10 -42 22 42 -13 12 41 44
5917 44 -18 22 -45 -14 -26 20 -6 0 -42 56 4 -27 28 10 23 2 -41 18 -42 17 27 6 -15 44 24 20 27 18 -22 27 -18 -12 27
5950 27 -22 42 -31 23 46 -38 -30 -1 28 38 81 -11 23 -67 13 -5 -8 18 -53 -52 4 -2 -21 10 -19 4 26 -12 -52 3 -42 43
5982 43 6 -54 -1 -1 -1 0 12 43 -52 -8 41 12 -9 -9 -13 26 -9 -24 21 -11 2 -20 33 -45 -47 -4 6 30 -37 -2 -9 13 33 27
6016 27 -45 -38 55 -41 -9 7 6 15 1 55 -3 -25 -42 40 12 -4 4 -7 -5 -47 -18 8 -30 -27 16 27 14 10 44 -18 15 6 20 34
6050 34 28 30 4 -4 -1 -78 -19 66 -25 22 -38 -58 28 24 21 23 22 15 7 -28 3 -26 -47 -15 -37 15 31 21 5 15 -11 -17 -4 22 32 -37
$$ packed form
5817Dn9P2j4j5K5m4O3nl6j1M1p3O4L0m3m2O9Jk8L8r7R5J6o9P6k6p0pN4k9kM1R
5850B8n2rj7N7k8K2j5K3j2L9n2J2j8LpL1J1kLk3K0Rn0nlJ5L1k6jK7k8J8l8M4J
5885Hk4J8J1j3j1j0k1k6O0J2J8m0j8k4R0n6K5oMk3O2k2L0n2J8n2O4K0n5K5K9L
5917D4o2M0o7L1j2M6k6Om2R8n2l1N5j8J3k1m3N9o0N9J0k1k1N9k0mPrm0M9m5OL9
5950B7m9O4p3N4K3q4QK9K9J0M3r2L4r0Q0j8lK6p1JN6oj9L1k9K3K2l8m0N5m5Q5
5982D3l7o0N3%%JJ2L1r5M4M9k9k1%mL9l5j5M5l2J3k2N3p8kM3J0K4o7L5pK2K0o
6016B7p2PR3r6L2J6jRj4N4n8k2j7Q2k8j6Qj1Km2K9K6l8LM3J1j3mL4o2L3rJ4J4
6050C4oKk6qLp7N9Q5r1M7o0k0Q6mlKjpql5L1k9k1L2k2N2J6j0j6J0k6oJ3K6J0o9
$$ plain form
6086 -37 -8 26 10 -33 22 -10 1 -21 -2 -20 -18 18 -19 17 49 -25 52 -24 12 27 33 -13 18 -33 6 31 -12 39 109 -13 -37
6117 -37 18 14 10 33 31 -10 29 -56 -30 2 -47 18 -28 23 12 59 20 6 61 -34 -38 -25 24 16 28 -37 9 19 -20 4 25 -48 33
6150 33 -60 4 -23 18 59 14 37 25 28 -20 13 -39 18 16 31 -27 -33 -4 9 28 22 39 -37 15 -77 -37 -12 -70 32 3 88 16
6182 16 28 -8 9 -24 -22 32 -90 -56 6 -3 -48 -4 32 -27 9 25 19 53 -1 91 -46 34 -13 -14 -51 -24 -10 -36 11 -6 -65
6213 -65 -10 24 -29 1 15 38 -31 4 -11 14 3 7 21 -58 -16 7 -68 -6 -10 -44 -3 40 -22 5 18 -65 -6 30 17 -3 -7 84
6245 84 10 9 25 -32 0 -3 23 4 -12 24 -8 -4 -37 -5 -9 -1 40 -14 -34 -20 -20 -30 11 26 -36 6 15 14 -32 46 -2 38 -2 -1 28
6280 28 -40 -25 13 50 -30 -15 -22 -29 -8 26 -26 16 6 65 40 -25 -14 73 26 -80 -35 12 12 -2 25 -23 28 -33 44 16 4
6311 4 40 35 -18 24 55 -37 6 7 -11 -56 33 -43 -25 -23 -11 -57 -35 75 22 -23 -36 43 51 0 -35 69 -32 -58 -20 -56 -67
$$ packed form
6086c7K9L4j6m3N5l2J1k2J9j8KL6l7L6L2p4P7p6L6J5Om6L1n1L9K5m3N1P0j22k4
6117c7N5mmK3km1L9q5K6L2m9O5m6N1j1M7l9j4N5r5mJ3M9qJ2o5M6J0l9K4K1p3Q1
6150C3r3O4k7M1M1m5K3j2Lm8L3n2N7kJ5n8oK9J3J9oJ7p6N2r2M0K5n8J02k9Q5p2
6182A6J2l6J7l3KN4j22L4O2rm5M4L6n9L6J6oL4n4R2j37Q0m7jl7K7J4k6M7j7n9
6213f5N5L4n3L0J4K3o9L5j5K5j1MJ4p9M2K3p5O2ml4M1M3o2K7J3q3N9L6j3k0mR1
6245H4p4jJ6n7L2lK6j9j6L6l2Ml3L2mQM1n4k0J4%j0M1J5o2M2Rjm6P8m8M0m0JK9
6280B8o8J5L8L7q0J5ppK1L4n2M2j0N9k5o5J1Q7m7j06M5M7%j4K7m8N1o1P7k8j2
6311DL6nn3M2L1r2M3Jj8m5Q9p6J8KJ2m6K2J10n3m5j3P9Qn1l5J04j01k6L8l6j1
$$ plain form
6342 -67 0 48 -2 -4 -16 -34 -2 21 9 -7 -49 -40 -43 3 44 -3 4 47 -36 -24 -5 -7 -3 3 -20 5 -45 -70 -65 -23 26 -9 21 -16
6376 -16 41 -22 -30 76 28 15 -21 -17 -10 -7 44 38 -52 11 -4 20 11 14 1 8 26 -25 1 -5 53 35 27 28 -24 -19 28 -20 12 -62 76
6411 76 19 -20 6 10 -1 13 2 22 20 -12 50 -8 9 50 21 16 25 -29 -27 -8 59 -23 -24 16 3 57 -13 -47 -14 -15 -11 -41 -30 -5
6445 -5 -30 -15 -52 40 50 -32 16 1 -20 -28 -30 -15 76 8 16 20 -15 -17 -9 35 45 -25 -73 -2 -25 -20 -27 -12 -19 39 -72 8 5 -42 -37 26
6481 26 -34 -18 -9 0 -43 -32 5 -5 -9 -28 28 16 28 -6 34 14 49 -26 -35 3 -52 -31 29 -13 12 -28 -52 -82 11 -26 17 51
6513 51 66 -16 82 -33 -190 92 -24 -52 -8 40 26 -5 12 44 -14 16 -2 11 -23 0 15 11 12 -25 3 -4 24 19 -38 27
6543 27 14 3 19 11 -19 10 49 -30 -40 63 -1 2 -66 24 -25 7 29 -28 23 21 16 15 -30 39 -53 1 6 -20 -22 -10 35 -24 47
6576 47 0 29 27 58 31 -59 8 28 17 -23 -33 32 -1 -2 39 42 28 -28 3 -41 -9 10 32 -12 32 -14 25 58 -47 -27 1
$$ packed form
6342f7O7M8n0kj2j8L2K3j2j6m2RlM6M1m7PM3q3J2J9kMOk3K5n0k5NM2M9l5L0l7
6376a6N7o3qJ06m8j3l6MPLN1or0O3j5K4rLj3PJ8n1K6oN8j8qJn2NM7m8L2p4J38
6411G6n7l9K6Mj1J4j1K0kl2O2n8J7M1k9nRn4KJ9O7q2jM0j3N4p0l4L3jMl0J1K5
6445ek5J5l7R2J0q2M8j5k1qkJ5R1o8QMl5kQM4J0p0m8P1k3NpJ5pN8j11Q0lm7NO3
6481B6o0J6RRm3J1L7j0mj9N6j2J2l4M0k0L5p5rL8n5K1O0m2K5m0k4l0R3l7M3L4
6513E1J5q2R8j15j57K82j16k8M4M8j4l1J7L2n8L0j8J3l4K3J5mJl7K8pK8nn7O5
6543B7j3j1J6ql0K9L9p9j0J03o4Lo8R0m9L2K2n7N1knjm5O9r2N4Nk6kJ2M5n9P1
6576D7m7K9kL1k7r0O7K0j1m0j0O5l3jM1Lj4n6L1m4L2J9K2m4M4m6L9L3j05K0K8
$$ plain form
6607 1 -35 -14 -8 46 2 0 -13 96 -50 -54 -38 -40 22 -20 -8 -23 -63 68 13 -18 -27 -12 7 12 29 -13 -10 -6 -18 -46 26 17 1 8
6641 8 36 4 52 -8 -34 -38 6 -31 -37 -3 -33 -24 62 49 -22 -30 92 -31 -52 48 109 28 33 37 -184 -338 168 -189 580 169
6671 169 -267 -5 190 145 69 99 45 -49 -2 -113 -29 -92 72 -65 158 25 -283 82 125 21 -106 35 -117
6694 -117 27 -67 -38 93 53 232 -67 -153 177 -39 -231 -74 -37 -155 -144 -510 -37 -58 382 171 -77 94
6716 94 273 355 42 38 -34 87 -51 16 -135 -89 -146 101 -258 101 -152 57 -260 66 -93 -260 69 79 40
6739 40 80 -68 -44 -15 12 -32 -85 2 -53 25 13 -47 -152 93 -66 -59 4 126 29 34 -2 -15 80 42 -15 35 59 -2 -52
6768 -52 -48 9 -14 -3 27 -18 -60 15 -27 85 -3 -13 -47 -8 -44 15 37 3 -11 71 4 25 1 19 18 12 21 11 -5 -2 -16 3
6800 3 -4 30 -37 8 44 -1 23 39 3 37 36 -46 1 -26 59 32 -21 -19 29 12 18 -21 48 4 -23 17 35 61 -29 6 5 5 -10 -6
$$ packed form
6607Al6K1ON4m4kj3J09j46mJ6kO2m2J2j5m0J31n5l1rJ5J9NJ7m2LMj2k8P2rj6P
6641HK8l2M8o0k6mM4l7oL4l0RQ6j3p1qJ22j23k1J00O1q1NMk21j54N06l57P69m11
6671A69m36K62J95m5p6L0n4r4M7j11Q4o3J64j37K23j33l08L65M3j04j27J41j52
6694a17J44r4K9J31m0J79k99q6L30k16j92J57L7j18J1l66M73k1M40k11k48J71
6716I4J79Q2l13mp2J21j38O7j51M6n7K47l59L59k53K09l17L26j59j67L29J0l9
6739D0M0j48K4K9K7m4n3Q7n5P8j2o0j05K45j59PO3J22r7Nl6j3R5l8n7N0K4o1n0
6768e2MN7k3J1L0m5m2P5m2J12q8j0l4L9l6N9K2l4j4Q2o7K1k4J8joRj0j6Lj4J9
6800CpL4o7M5L6m5K4J6l6L4jq2M7k7Q5k7n3KM8j7Ol9O9m4k7M0J8K6r0L5j%j5M
$$ plain form
6834 -6 -7 -28 -14 -40 -21 -9 55 14 -1 -5 77 14 -44 23 13 16 46 -30 -23 -28 64 16 -11 22 13 -25 -30 -50 -3 14 -38 28 47 44 -4
6869 -4 65 -67 15 -19 -43 0 1 -11 -41 19 -10 20 9 28 -8 -3 31 -57 23 -39 7 -14 -5 -12 47 -2 28 -46 49 -3 54 37
6901 37 10 -81 -47 45 13 58 -68 82 31 51 -83 28 66 -44 80 -153 -201 97 -55 199 -74 33 -28 -58
6925 -58 15 -24 191 96 -65 -32 51 -16 -49 -30 -67 -19 161 68 -78 182 -128 -257 -318 361 -262 130 53 125 148
6950 148 125 -332 -281 78 -83 167 -76 163 49 130 -56 -42 12 36 -142 19 80 -98 -80 -8 -25 -247 -52
6973 -52 -100 -149 -140 -91 -90 -101 -85 14 3 62 56 22 46 133 185 183 109 -307 2 216 -163 273 -54 -98 -188 248 -81 117
7001 117 -254 -102 234 392 -260 -119 201 -121 130 -119 -244 -305 -107 -243 -431 147 51 37 226 -67 15
7022 15 -58 -57 -285 69 148 116 106 51 5 115 -173 31 125 -47 95 -69 82 -122 -5 -59 126 359 -181 29
$$ packed form
6834fjk1J4k6J9J2O4m1j5mQ2o3n8O7j0LL0p6PnR2m8k7L3rl8nk0M7J7n2O6J9lm8
6869dO9j32Q2l4k4M3Jj2l0O0k9L0j1J9l6NL4q8Q0o2M6k1RpN9m9L0p4R5n2N7j7
6901C7k7r1L4R2l2M5j26J50n1K0j34J11L8j10J24k33m8K98j52K54k73J07o1l0
6925e8P3l9K15r5j61L3Q3o7l3J9l7M8J80r3j46K60l10j29o1O79o23L92p7P2K3
6950A48k3m57N1L59j61K50k43K39j14Q1j86J4N4K4j78J61O1j78J8P2j7k22J95
6973e2m8m9RM9Jj1J6R9j1N9ol4K4Q7N2kp4m16L09K14l79M36l27m4r0M36l29J98
7001A17l71J52L36J58o52J41L20l22K51k49j25o1J98j36j88N78r6j4J89k93Q2
7022A5p3Jk28L54P9l2j0n5m6J10k88K04R4j72J42j64J51k04J17n4J85K33n40K10
$$ plain form
7046 29 19 307 28 41 -233 180 200 -134 -31 140 -30 16 -20 29 55 41 -45 -48 11 7 30 66 20 -28 79 46 -93
7073 -93 -81 96 116 -190 101 121 154 3 118 -128 135 -68 164 -78 44 -122 -208 102 339 -51 -90 103
7095 103 -138 -153 35 33 15 -86 86 37 -72 -190 44 -5 49 -8 -30 -146 34 11 52 17 24 -22 23 8 221 121
7121 121 263 -12 -66 229 9 -12 56 24 40 61 38 10 74 38 -91 103 -102 300 -127 238 -33 -63 -1 33
7145 33 27 -57 -67 -74 -28 53 -32 -35 32 -7 -5 20 32 42 -2 44 -24 32 30 -2 -7 -36 10 -31 -21 31 15 42 19 -34 45 -34 13
7178 13 -8 -14 35 68 -32 6 12 72 13 7 51 -127 -512 76 235 239 28 57 64 96 -245 146 353 83 83 -56 7 -55
7206 -55 70 63 -33 20 50 15 45 -18 7 -30 13 -15 -46 28 41 40 -9 -16 -4 15 1 5 4 7 19 -42 -22 22 67 -18 43 35 -53
7239 -53 31 18 -2 19 -47 -29 -16 12 4 24 26 -49 -23 97 -124 277 -6 95 -21 83 -61 65 321 179 -6
$$ packed form
7046B9j0K88k79J3k74M13K0l34J03J71j70M6l6M9K6j4q6lN9mK3L6m6m8J07l3j39
7073i3J2J77K0l06K91K0L3j51J15k46K63k03K32k42J22j66q6L10K37l90l9J93
7095A03k41j5J88kj8j01J72m9j09j18K34m9N4n7k2j16J80k3M1l5Pm6M5j5K13j00
7121A21J42k75n4K95k20k1O8l2J6K1k3k8O4l6j29J94k05M02m27L65k71l0O2L4
7145C3oq4j0pM6Q1q5lO7l9KK5J2J0m4M6o8N6kl2nk9M6m1J0N2j6K7k3n3P9p9M7
7178A3k1oM9L3j00L8OO0n9oM4j78l85N88J59Mk11K9PL2l41L91K07k70%j39O3o2
7206e5J25pr6N3L0l5L0o3K5l7M3k8l1P4J3jm9pJ2J9j4MjLJ2o1K0M4M5q5O1qq8
7239e3Q4j3k0K1o6J8J3K8qK0Kp5K6J20k21M01k83J01j16J04j44J26K56j42j85
$$ plain form
7264 -6 -86 -106 -93 -554 184 144 67 27 -42 -87 95 69 -37 -127 -52 -85 70 82 60 6 148 45 -100 -25 15 -70 58
7291 58 -58 194 -28 332 -13 -90 144 -303 23 15 82 14 -42 -5 3 -16 13 -24 -6 5 101 9 -64 -51 15 1 -83
7318 -83 -28 85 -152 240 -221 55 19 14 -117 100 88 -162 238 -54 -61 -19 -314 -186 167 6 246 109 109 191
7342 191 80 -55 -17 -182 -50 -42 88 -151 -31 -154 -19 129 -36 -64 175 -151 199 -44 88 -64 -22 -55
7364 -55 20 3 83 -31 41 -22 -10 3 71 2 9 -8 16 -22 22 3 15 4 36 132 267 -59 -2 34 37 -28 46 183 92
7393 92 13 -93 32 -5 -209 -69 -152 21 -12 -108 105 -84 -157 229 128 86 -41 85 159 -215 93 18 87 -42
7417 -42 157 -119 -192 -218 81 -81 7 -19 -2 -14 100 107 -211 194 -80 284 -11 88 -149 183 -163 -25 155
7440 155 -189 169 -71 -115 60 78 -89 -32 61 -35 -27 27 -36 -48 -1 -27 -44 -15 -109 0 -39 -39 45 12 -41 27 -2 33
$$ packed form
7264fq0k0J3m61P38m0p7m0o9m5J82k6j06r0P5l3J55J2k2n4J42j03j45P5M0q5J28
7291E8j16K52k22L60l45p7K34m47L26qO7o8n6L7Qj9K9l7J8J1R6r2p3J3O6j4q4
7318h3N5J13k37L92m61K76l6nj31K17j2k50M00k92pM2k95J28L53j61K40j37%Q2
7342A91j11j35L8j65J32QJ30k39J20j23J35J48j65k8K39l26L50k43J32j52M2l3
7364e5P5j7Q0j14P2o3J2J3O8o9Pj7K4l8M4j9J2j1L2R6J35l26N7L6Lo5P4J37r1
7393I2p9j06J25l7k04J40q3J73l3r6K13j89p3L86j01m2j27J26P4l74L08p5O9j29
7417d2J99k76p3k6K99j62Q8k6J7j2J14Pl18M05k74L64k95R9k37L32l46J38J80
7440A55l44L58k40m4J75J8j67N7R3r6QN4o3j2M7k6j7K9r4J09l9%Q4l3n3O8k9L5
$$ plain form
7468 33 -20 -10 6 -8 -46 -21 17 -8 -44 26 63 -4 14 -21 32 -20 -24 16 -5 -7 -37 -23 3 0 1 9 -36 4 27 20 -1 6 61 29
7502 29 3 3 -26 -29 -37 -50 -22 7 -48 -40 -27 44 28 -5 -10 -22 -15 26 36 -43 26 -22 7 16 -72 -9 -2 7 -9 43 12 -29 19 -2 -40
7537 -40 -56 -17 -52 48 3 7 -13 56 46 -35 -7 15 -5 0 26 -23 -5 10 9 4 28 2 55 -2 -50 -10 42 -30 -9 -26 -10 -15
7569 -15 -50 -31 41 -52 -47 1 -1 -22 -9 -33 -46 37 19 -4 13 -2 -38 -47 6 -20 10 50 -3 26 -34 -13 -7 17 1 40 -33 -14
7601 -14 -1 -59 -2 4 30 50 -7 -37 -15 14 -22 14 14 18 -1 -11 -36 -51 -49 -8 14 -53 -36 -30 -19 18 -58 -10 59 -1 14 -14 -2
7634 -2 -25 -36 28 4 0 11 41 16 -8 26 -4 -34 24 28 13 25 -12 8 -24 -3 27 -1 44 2 2 22 4 -11 -22 -59 -26 16
7666 16 -28 -14 14 -14 12 21 12 -17 -14 -14 2 14 -51 -6 21 5 19 -7 9 -28 -31 -4 12 15 -9 -8 -9 -8 -32 -67 -11 -17 8 -9 -13 -6
7702 -6 -35 -31 18 25 24 41 23 -22 -19 18 -19 46 -19 42 38 13 -32 7 -23 3 -34 -12 54 18 36 4 34 -24 -22 7 32 26 -43 24
$$ packed form
7468C3n3J0J6j4l8K5L8k5l6P0L7o7J8l5N3n2mM0k1kl0J4K6lJQm5M0K3pk1PN5l2
7502B9k6%k9lqj3K8K9n5QJ3P1j6l3nj2PM1J0p9O9m8K9Rq8O3PRj6N2l1m1M8k1l8
7537d0j6L9l5J00m5Mk0O9j0q1K8K2k0NK6m9J8J5jnK4k6N3n7m8M0N2p2K1j7J6n
7569a5l5J9P2r3NM8kk1J3k4j3Q3j8k3J7j5l6rN3k6L0M0n3K9o0K1OK4j6L9p3J9
7601a4J3n8N7OK6K0n7l0K2K9l6L6%Mj9j0k5j5KM1K2o7J7OJ1L7p6M8O9o0J5k8J2
7634bk3j1O4k4mJ1L0k5k4L4l0l0N8Mj5J2l7K0l2K1L0k8M5m2%K0j8j5j1l7L3M2
7666A6m4J4K8k8K6Rrk9L%J6J2o5M5K7j6J4k6J6l7lK7J6Lk4JjJk4l5N6oK5j7mP
7702fk9MM9PjJ7j8m5LL7l7O5o5O1mk5m5L9l0K6l7K2O6l6J8l2L0n8KK9K5oo9O7
$$ plain form
7736 24 -36 40 17 12 -1 -30 -5 -15 -36 -2 14 17 -48 -13 18 -20 20 -27 61 -2 2 28 -18 -6 37 19 -25 -39 -2 -25 18 -6
7768 -6 -24 -37 -9 12 -15 -74 10 -5 9 -33 -33 6 -17 0 -48 -44 31 10 35 -15 -6 -55 55 -41 -21 -12 1 0 -22 13 17 3 -4 17
7802 17 15 0 64 9 -40 55 -30 8 22 24 72 29 -31 -21 7 8 25 -17 -22 -14 27 -47 -5 -40 -20 -2 61 -5 33 -13 6 34 -7
7835 -7 -18 -12 41 -34 4 -46 13 -21 4 -51 49 16 -36 -38 31 -60 11 12 5 35 9 8 0 -61 11 -51 32 9 6 26 16 -35 -37 8
7869 8 -30 -27 7 60 3 -17 11 14 -12 -26 -5 14 -14 -15 21 -33 26 33 -24 -36 -64 25 59 15 -29 53 -13 8 -13 42 25 20 17 -3
7903 -3 23 -2 8 -18 15 28 38 -13 -15 -36 -42 15 -3 -6 -13 10 1 -17 -22 -26 1 -14 34 3 0 9 -19 -19 -27 72 -14 -10 -51 -38 2 15 38
7940 38 -2 -8 -4 -17 -11 -8 20 6 33 38 70 -32 1 -33 61 -25 -17 9 -21 20 29 -17 -27 -5 -3 56 35 -37 64 18 -22 17 -39
7973 -39 17 -8 -12 -46 -5 12 -31 -55 6 21 -14 23 -12 -38 -45 20 -33 35 -6 -12 -4 53 -16 -53 21 -24 -17 -28 -5 26 33 46 22
$$ packed form
7736B4o0P6k3nj3k9K5j0k1L4J6Lo5L5L1l8M0m7Q8o3MK6m6J2M3j8m4j4L7k3M3k4
7768fj8j3K8K1k7n9Q4j5J4m2%L9k3J7m8MP5k1K5n0Rm9J10r6K0RJ3jk2L5Mj4pK1
7802A7kj5O4n5m9R5q5L8J4KM8m3o0J0K8JJ7m2nQM1p4M2l5K0J8O3o6L8m6J9K8m1
7835gj1ON3p5L8n0N9l4K5n5J00l3n2kO9r1P1JpL0k6jqo1P2o2Q3k3lK0j0n1kM5
7869Hl8LL4N3n7k0K8Lk6j4K1J9k8jL6n4N9Pn7j2k8Q9L4m4m4Q2o6K1k1N5j7nlk0
7903cK6k5J0k6L3J3J0n1kk1oN7j8lpK3rj8nmK7j5M8l1lRk8%qR9q6Mm1J3M0J3K3
7940C8m0oMj3OLK8j4K7NL2j02L3l4R4q6QK6l0M1Rm6j0K2KN9k1p2J01m6m0L9n6
7973c9N6k5ml4M1J7m3k4O1J5l5L7l5k6pO5n3O8m1oQN7o9l7P4m5Pj1K3L1PJ3k4
$$ plain form
8006 22 -29 36 -40 -38 0 26 51 -41 -10 22 -4 -37 17 30 33 18 40 -6 9 -18 7 4 52 27 16 49 -8 -13 -10 -13 38 -38 9
8039 9 26 -42 -10 43 53 -20 37 15 36 2 -24 -30 6 -32 26 11 -38 9 -1 -10 17 7 -14 17 9 -24 14 -34 35 54 -47 -39
8071 -39 32 10 -30 13 -39 8 54 -4 2 -10 -12 -27 -8 7 16 -22 10 36 41 -3 -49 71 -50 -25 -5 30 -32 3 37 -25 -33 2
8103 2 27 17 -22 58 37 -8 -1 -10 21 -26 -27 -23 58 35 -25 -23 39 -3 -31 17 23 32 -5 -33 -29 -50 -38 -19 -54 6 -23 -30 -60 2 19
8138 19 -23 23 -4 52 13 -36 53 18 9 -31 11 17 -4 -11 -27 24 -21 -5 -20 10 -16 -38 12 -2 -24 -26 1 -4 -9 -27 -1 93 -36
8171 -36 11 -7 -19 0 -52 -31 -13 -56 -24 -16 43 -22 15 -28 34 2 31 14 1 8
$$ packed form
8006B2n1O5p6KL8K6K5r2L1L2k6l3N4J3Lj5K2m6J5k7K5lM8k5j1L3n7nLlN1p6M7
8039IJ7o8L2N3J0p3N7k2K1l4k6oL6l8N8j5m9M7j0rK7j0k1L1ql3L8m8O9J9j01Q
8071c9P1k2m0M3n2M7M6n8Oj2kj5J9J5Rl8L2K6Nm4m6J20j21K5K0L5o2L5L4o2qL5
8103BK5j0l9Q0k1m5PrL1m7jMQ1k3o0KO2m2k8M8ORl7k8Mk1J2J9l5O0k9pl0O2J7
8138A9m2M6k7N6l9m9Q9l5rm0M2Ok1pj6N1m5J6j5L0k6k2N0j4k2kK7nnj8K6R4j29
8171c6M7j8j2J9n2K1J8m3L2QN9o5L7m3O2l2K9j7j3P
8191H
$$ Imaginary data points
##PAGE= N=2
##DATA TABLE= (X++(I..I)), XYDATA
$$ plain form
0 0 0 0 0 0 0 0 0 0 0 0 0 0 0 0 0 0 0 0 0 0 0 0 -7 8 -8 8 -8 8 -8 10 -16 16 -16 20 -24 24 -30 32 -35 40 -44 48 -55
43 -55 60 -65 72 -80 89 -99 108 -119 132 -145 160 -178 195 -219 243 -270 307 -347 396 -460 543
64 543 -655 820 -1079 1568 -2771 13658 8263 -14363 4264 9903 -4680 -6300 6572 -1304
78 -1304 -9403 -19 5227 -5029 -5651 1199 -329 -3425 968 858 -1596 1432 3937 608 1009 3289
94 3289 316 -2182 1625 1922 -2127 -1139 2298 -418 -2799 -189 648 -1395 -826 119 -1194 -1086 1336
111 1336 1202 -490 114 1489 1407 1311 532 -1337 -747 1486 425 -1586 -1107 -495 -1093 -979 193 -332
129 -332 -715 354 388 -390 717 1359 238 411 1206 742 -752 -87 477 -183 -147 -141 -789 -405 725 -81
149 -81 -618 -267 846 530 -318 -12 -333 -144 314 534 -235 -473 -16 370 -89 320 530 112 -10 -124
$$ packed form
0@%%%%%%%%%%%%%%%%%%%%%%pJ5j6J6j6J6j6J8k6L2l2L6m4M8n4O2o7P5q4R2j03
43e5J15j25J37j52J69j88K07k27K51k77L05l38L73m14M62n13N77o54P43q56J003
64E43j198J475j899K647m339J6429n395k2626J8627N639j4583j620J2872p876
78a304q099R384N246j0256o22O850j528l096M393j10k454L028K505l329M01K280
94C289k973k498L807K97m049R88L437k716k381K610Q37k043N69R45j313J08K422
111A336j34j692O04J375q2r6p79j869N90K233j061k011M79O12n98J14J172n25
129c32l83J069L4p78J107O42j121J73P95m64j494O65N64o60L6Oo48L84J130q06
149h1n37L51J113l16q48L06l21J89M58K20p69k38M57L86m59M09K10m18j22j14
$$ plain form
169 -124 -265 -733 -432 -63 -295 -419 555 146 -541 -141 705 982 396 381 98 -22 22 583 204 -338 -174
190 -174 -400 -1397 -1302 -202 -464 -1216 -435 332 95 -47 456 290 -38 559 1029 472 185 744 940 110
210 110 524 292 -427 -915 -375 -149 -802 -397 -429 -821 -678 523 126 -87 578 613 247 537 1360 277
230 277 -45 650 799 -622 -213 86 -944 -1250 -319 -238 -992 -254 339 1 52 1045 933 284 829 1135
250 1135 417 227 955 257 -841 -229 170 -967 -1262 -344 -580 -1309 -583 145 -271 -538 401 596 102
269 102 586 919 268 319 879 489 -50 161 155 -413 -425 11 -475 -928 -213 7 -708 -438 491 274 -169 364
291 364 675 311 352 702 321 -180 186 195 -561 -485 -40 -550 -804 -124 19 -781 -661 181 265 -21 410 669
313 669 276 320 847 656 148 261 382 114 -161 -240 -324 -374 -248 -382 -634 -463 -216 -438 -392 84 187 132
$$ packed form
169a24j41m68L01L69k32j24R74m09o87M00Q46K77n86j5k83j20M4N61l79n42J64
190a74k26r97R5J100k62p52P81P67k37j42N03j66l28N97M70n57k87N59J96q30
210A10M14k32p19m88N40K26o53M05l2l92J43J201l97k13O65L5l66K90Q23j083
230B77l22O95J49j421M09K99j030l06R31Q1p54P38N93l38N1R93j12o49N45L06
250A135p18j90P28o98j098O12L99j137k95R18k36p29P26P28m16k67R39J95m94
269A02M84L33o51N1N60l90n39K11on68j2M36m86m53P15K20p15K70R29k17m43N33
291C64L11l64M1L50l81n01L66Rp56P6M45n10k54O80J43q00J20Q42Q4k86M31K59
313F69l93M4N27j91n08J13J21k68k75p9q4n0J26j34k52J71K47k22M6M76J03n5
$$ plain form
335 132 226 328 226 352 568 456 103 191 142 -289 -259 122 -95 -443 -303 -140 -438 -320 5 -90 -120 222
357 222 420 26 18 562 543 209 293 219 -98 -124 -154 -403 -501 -219 -378 -781 -506 -81 -298 -248 266 331 100 438
381 438 594 350 353 782 416 -48 297 376 -461 -604 -27 -170 -670 -404 -309 -687 -446 338 127 -427 163 554
403 554 -57 63 673 501 7 536 487 -206 -179 222 -199 -531 -46 -23 -672 -633 12 -32 -180 218 233 -112
425 -112 341 726 355 204 639 512 -65 17 207 -245 -531 -251 -219 -575 -315 -294 -732 -446 365 260 -207
446 -207 -44 305 254 325 592 368 149 308 316 13 -38 -29 -242 -225 -23 -94 -402 -424 -220 -184 71 146 -159 -252 41
471 41 312 208 223 241 156 138 204 12 -104 -58 -61 -211 -331 -132 -209 -321 -148 72 130 141 179 55 175 405 325
496 325 87 31 137 2 -239 -253 -184 -199 -214 -162 -355 -274 -63 -36 -128 209 307 72 27 295 480 195 151 236 24
$$ packed form
335A32R4J02j02J26K16j12l53Q8m9m31L0L81k17l48J40J63k98J18L25r5l0L42
357B22J98l94qN44j9l34Q4p4l17k6l0k49r8K82j59m03K75M25k17N0N14O5k31L38
381D38J56k44LM29l66m64L45P9q37j43N77j43n00K66R5l78K41P84k11n54N90L91
403E54o11J20O10j72m94N29m9o93K7M01m21l32M85K3o49L9O45m4j48L98J5l45
425a12M53L85l71j51M35j27n77Q2J90m52k86K80L2l56K60K1m38K86Q11j05m67
446b07J63L49n1P1K67k24k19J59Ql03n1Rk13J7K02p1l08k2K04L6K55P5l05r3K93
471D1K71j04J5J8q5j8O6j92j16M6lj50j20J99p7j12J73K20N8J1L8j24J20K30q0
496C25k38n6J06j35k41j4O9j5j5N2j93Q1K11K7r2L37R8k35m5K68J85k85m4Q5k12
$$ plain form
521 24 -37 138 -57 -392 -266 7 -234 -549 -263 -143 -285 -64 216 100 -11 271 313 182 378 545 201
542 201 -51 171 132 -231 -284 -275 -443 -471 -137 -292 -584 -192 100 -12 -35 444 374 72 351 556 254 300 468
565 468 28 -277 74 75 -474 -384 -110 -370 -614 -209 -53 -454 -162 284 33 -141 344 381 0 283 685 259
587 259 -18 262 264 -150 -91 32 -379 -495 -143 -188 -518 -229 90 -220 -176 294 248 12 301 490 88 138 356
610 356 97 -166 -65 -30 -406 -363 -4 -244 -413 -122 23 -276 -70 222 72 -31 336 328 90 116 235 230 33
633 33 90 94 -111 -250 -77 -215 -310 -232 -188 -158 -164 -34 -21 -34 76 288 235 160 255 320 138 112 13 -12 -41 -80 -164 -248
661 -248 -298 -131 -127 -230 -142 -76 -53 38 139 172 207 197 287 205 144 122 94 -73 -28 -13 -133 -270 -264 -217 -100 -160 -197 -199
689 -199 -150 81 91 26 138 314 253 238 97 222 187 126 -1 12 -7 -106 -145 -258 -204 -142 -186 -240 -138 -35 52 31
$$ packed form
521B4o1J75j95l35J26K73k41l15K86J20j42K21K80j16j11K82M2j31J96J67l44
542B01k52K22l9l63n3Rj68k8L34j55k92L92K92j12k3M79p0l02K79K05l02M6J68
565D68m40l05L51Jn49R0K74k60k44M05J56m01K92M46k51j74M85L7l81K83M02m26
587B59k77K80Km14N9J23m11j16L52m5l30K89L19l10M4M70m6k36K89J89m02N0K18
610C56k59k63J01L5l76M3L59k40j69K91J45k99K06K92j50j03L67qk38K6J19nj97
633C3N7Mk05j39J73j38r5P8M4L0oJ30J3j3J10K12n3p5R5O5j82k6r9k5k9l9q4q4
661b48n0J67Mj03Q8O6K3R1J01L3L5j0R0q2o1k2k8j67M5J5j20j37OM7J17o0l7k
689a99M9K31J0o5J12J76o1j5j41J25l5o1j27J3j9r9l9j13N4O2m4n4J02J03Q7k1
$$ plain form
715 31 146 270 186 115 236 211 186 69 62 -50 -169 -111 -131 -254 -288 -150 -129 -221 -136 -133 -52 117 212 121 78 189 315
742 315 126 55 204 86 -98 -63 -70 -297 -191 -146 -213 -304 -118 -117 -130 -62 191 140 17 199 353 146 79 196 117
767 117 24 86 3 -316 -297 -89 -102 -353 -192 -70 -181 -122 28 71 87 293 228 70 188 253 179 42 115 101 -145
792 -145 -118 -71 -261 -285 -116 -70 -217 -144 32 3 -56 174 258 123 159 191 67 106 152 33 -154 -68 39 -204 -276
817 -276 -193 -138 -192 -159 -28 -174 -36 85 92 37 221 207 74 85 148 45 72 77 -39 -181 -204 -35 -112 -191 -78 -71
843 -71 -168 -83 1 -31 66 96 76 107 168 196 13 7 193 29 -61 -24 -71 -172 -177 -25 -120 -201 -97 -84 -73 -30 69 49 -31
872 -31 186 150 116 105 117 27 25 56 10 -98 -80 -77 -140 -175 -85 -155 -249 -80 -6 -94 -62 152 152 56 170 154 129 77 203
901 203 61 -78 9 15 -188 -215 -96 -175 -218 -93 -69 -154 49 157 9 -155 115 121 93 147 213 118 24 149 56 -94
$$ packed form
715C1J15J24q4p1J21k5k5j17pj12j19N8k0j23l4J38K1r2Q5LQ1J69R5r1m3J11J26
742C15j89p1J49j18j84L5pk27J06M5o7r1J86Jj3O8K53n1j23J82J54k07o7J17p9
767A17r3O2q3l19J9K08j3k51J61J22j11N9J50M3J6K06o5j58J18O5p4j37P3j4k46
792a45K7M7j90k4J69M6j47P3J76k9n9K30Q4j35L6L2j24L9M6j19j87Q6J07k43p2
817b76Q3N5n4L3J31j46J38J21Pn5J84j4j33J1O3j03K7Nj16j42k3J69p7p9J13P
843g1r7Q5Q4l2R7L0k0L1O1K8j83oJ86j64r0L7m7j01nJ52r5q1J04J3J1M3R9k0q0
872c1K17l6l4j1J2r0kL1m6j08J8Lo3l5R0p0r4J69P4q8L2K14%r6J14j6k5n2J26
901B03j42j39Q7Ok03k7J19p9m3J25K4q5K03J08j48j64K70Ok8N4O6r5r4J25r3j50
$$ plain form
927 -94 -84 -120 -196 -403 -178 -521 -107 210 -375 42 310 18 406 75 225 -46 -11 168 -51 55 -78 68
949 68 -127 -281 -217 -144 -228 -147 -126 -84 -81 -14 99 106 111 184 143 166 117 138 111 87 -37 -110 -129 -109 -152 -109 -195 -82 -165 -66
979 -66 -89 25 47 101 136 103 133 115 144 56 18 -13 -60 -57 -85 -83 -142 -77 -129 -116 -6 -52 -39 -27 108 8 88 100 108 84
1009 84 115 117 39 -22 17 -12 -83 -69 -65 -131 -108 -116 -60 -58 -60 60 -17 61 88 149 38 96 191 145 106 16 -14 -2 -24 -9 -122
1040 -122 -128 -117 -68 -135 -81 24 -44 -7 13 115 77 87 162 121 40 63 128 -24 20 55 -39 -135 -51 -46 -187 -152 -92 -58 -124
1069 -124 7 76 -34 14 111 85 60 121 155 79 55 105 7 -68 -45 -22 -140 -157 -70 -163 -111 -56 -45 -61 12 85 112 63
1097 63 125 154 102 91 133 56 -30 -52 33 -113 -130 -127 -189 -99 -99 -92 -101 -81 78 57 54 128 153 92 87 101 89 52 -41 27 -47 -84
1129 -84 -85 -111 -164 -140 -122 -4 -58 1 36 41 100 152 101 112 145 66 43 94 23 -25 -70 -91 -38 -135 -202 -86 -114 -101 -18 25
$$ packed form
927i4J0l6p6k07K25l43M14L17n85M17K68k92L88l31J50k71L5J79k19J06j33J46
949F8j95j54O4P3q4Q1K1M2LO7J13PNP3m1K3m9K1k7k4j24p3j9K0m3M3q6J13q3R9
979f6k3J14K2N4L5l3L0j8K9q8l8l1m7Lk8Kn9O5n2J3J10m6J3J2J35j00Q0J2Qk4
1009H4L1Kp8o1L9k9p1J4Mo6K3qN6KkJ20p7P8K7O1j11N8R5m6l9r0l0J2k2J5j13
1040a22oJ1M9o7N4J05o8L7K0J02l8J0P5m1q1K3O5j52M4L5r4r6Q4Nj41L5O0L4o6
1069a24J31O9j10M8R7k6k5O1L4p6k4N0r8p5K3K3j18j7Q7r3N2N5J1j6P3P3K7m9
1097F3O2K9n2j1M2p7q6k2Q5j46j7Lo2R0%PrK0J59k1lP4K5o1nJ4j2l7r3O8p4l7
1129h4jk6n3K4J8J18n4N9L5NN9N2n1J1L3p9k3N1p1m8m5k1N3r7o7J16k8J3Q3M3
$$ plain form
1159 25 14 -6 66 85 98 166 109 104 61 27 72 -37 -26 -8 -47 -39 -100 -135 -90 -87 -74 -28 5 -20 23 88 101 87 121 114 26 -3
1191 -3 16 -22 -28 -24 -40 -146 -142 1 -161 -113 -113 18 -20 -6 7 80 26 60 77 101 46 21 50 46 -15 -27 -48 -101 -57 -99 -81
1222 -81 -129 -159 -72 -69 -38 -48 55 65 61 96 99 123 63 57 18 23 -49 -39 -57 -80 -140 -81 -111 -123 -116 -59 -49 7 26 36 75 100 128
1255 128 4 112 88 24 -29 30 -38 -65 -58 -80 -156 -98 -43 -61 -95 -28 -68 5 132 138 123 82 115 108 61 44 37 -47 -95 -73
1285 -73 -78 -157 -84 -66 -184 -107 -72 -17 -62 -4 23 71 111 123 52 86 58 99 1 0 -27 -52 -85 -41 -88 -131 -130 1 -57 2 3
1316 3 23 75 122 50 55 71 36 84 73 13 -59 -42 -65 -77 -118 -82 -97 10 -134 -72 -57 70 -21 10 52 94 92 87 120 -6
1346 -6 22 40 36 -20 -30 -59 -88 -76 -80 -54 -103 -48 -26 25 -37 31 47 58 19 66 88 135 44 32 1 -18 -25 -10 -41 -47 -89 -28 -39
1379 -39 -42 -51 -81 -14 -55 64 -17 48 41 100 22 49 57 56 -8 -15 11 -49 -115 -100 -106 -132 -76 -71 2 5 -37 2 44 56 32 48 22 122
$$ packed form
1159B5j1k0P2J9J3O8n7nm3l4M5j09J1J8l9Qo1l5M5LJ3M6L3k5M3O5J3j4L4pq8k9
1191cJ9l8oMj6j06MJ43j62M8%J31l8J4J3P3n4L4J7K4n5k5K9mo1j2k1n3M4m2J8
1222h1m8l0Q7LL1j0J03J0mL5LK4o0ol9Np2J0j8k3o0N9l0j2PN7J0N6J9J0L9K5K8
1255A28j24J08k4o4n3N9o8k7Pk2p6N8N5j8l4O7m0P3J27Oj5m1L3pm7j7pq4m8K2
1285g3np9P3J8j18P7L5N5m5N8K7M8M0J2p1L4k8M1r8jk7k5l3M4m7m3JJ31n8N9J
1316CK0N2M7p2NJ6l5M8j1o0p2J7k3j2m1L6j5J07j44O2J5J27r1L1M2M2knL3j26
1346fK8J8mn6j0k9k9J2mK6m9N5K2N1o2O8J6J1l9M7K2M7r1j2l1j9pJ5l1om2O1j1
1379c9lrl0O7m1J19q1O5pN9p8K7Qjo4pK6o0o6J5ok6N6NP3Lm2L9M2J2k4J6k6J00
$$ plain form
1413 122 85 26 -13 9 5 -20 20 -60 -74 -65 -69 -82 -9 15 -20 -27 29 32 33 103 79 80 61 62 37 15 14 -41 -47 -108 -45 -39 -99 -50 -74
1448 -74 -58 -26 -12 32 38 82 115 92 80 56 65 46 45 33 -26 10 -102 -124 -118 -98 -117 -87 -107 -108 -27 42 79 70 50 44 89 107 62
1481 62 34 -44 -66 -26 -81 -76 -12 -91 -108 -20 -62 -87 -28 -1 2 -6 74 81 10 13 64 22 15 43 22 -64 -37 9 -46 -78 -59 -50 -18 -32
1515 -32 -17 29 46 32 29 68 108 46 59 37 61 -22 -6 -1 -99 -95 -61 -56 -28 -57 -63 -44 -25 8 17 13 19 74 36 100 70 58 32 62
1549 62 -26 25 -22 -41 -56 19 -38 -75 -78 13 -11 4 34 56 5 16 8 42 115 126 58 36 113 39 -27 -28 -22 -73 -108 -44 -10 -48
1581 -48 -159 42 -183 279 -43 -216 122 53 50 50 -101 -160 73 -9 2 191 48 258 -102 57 -103 85 12
1604 12 -7 -51 -22 20 52 16 69 62 45 29 86 48 9 -1 47 17 31 -10 -66 -82 33 -91 -37 37 11 -73 30 88 -1
1633 -1 92 75 77 34 26 -5 51 18 -4 -20 -41 -94 -43 -75 -64 -17 -60 9 -26 74 38 42 115 49 95 4 78 106 41 -42 -19 -11
$$ packed form
1413A22l7n9l9K2mk5M0q0j4Rmj3P3K4l5pN6LJP0k4Jj9Jk5k2jn5oo1O3Oo0M9k4
1448g4J6L2J4M4OM4L3k3j2k4Rj9jj2n9L6j12k2OK0j9L0k0jQ1O9L7rk0oM5J8m5
1481F2k8p8k2M0n5NO4p9j7Q8m2k5N9K7LqQ0Pp1LN1m2pK8k1q6K7M6n5l2J9RL2j4
1515c2J5M6J7j4lL9M0o2J3k2K4q3J6Nr8ML4NK8k9oJ9J9L3RmON5l8O4l0j2k6L0
1549F2q8N1m7j9j5P5n7l7lR1k4J5L0K2n1J1qL4P3J1o8k2P7p4o6jOn1l5O4L4l8
1581d8j11K01k25M62l22j73L38o9l%j51n9K33q2J1J89j43K10l60J59j60J88p3
1604A2j9m4K9M2L2l6N3pj7j6N7l8l9j0M8l0J4m1n6j6J15j24N4P4k6q4J03N8q9
1633aR3j7Km3ql1N6l3k2j6k1n3N1l2J1M7m3O9l5J00l6MP3o6M6r1P4K8o5q3K3Q
$$ plain form
1665 -11 -77 -31 -56 -94 -24 -59 -49 -11 -42 45 31 20 23 76 142 84 -4 -16 68 22 -11 53 -13 -61 -68 24 -19 -63 3 27 39
1696 39 59 43 63 4 64 71 -11 -19 7 4 -71 -25 9 -38 -92 -37 -54 -30 -40 -23 -82 37 61 44 57 40 55 41 98 57 79
1727 79 38 40 -55 32 16 18 -63 -35 -12 -54 -28 -4 -17 7 21 86 26 86 26 58 12 50 19 -35 -20 20 -29 -48 -25 -25 -47 -78
1759 -78 -21 -71 -9 -13 7 34 -22 1 -23 76 90 32 60 24 6 26 -33 -26 -40 -34 -25 20 -61 -48 -20 -11 3 11 28 -4 66 0 26
1792 26 -2 1 50 40 -6 2 -47 -25 -54 2 -78 -88 -60 -28 -31 36 -9 16 13 89 39 61 50 46 -19 17 71 -2 -16 -23 8 -33 -71
1825 -71 -66 -21 -53 -32 -7 30 -57 -9 30 59 24 16 55 16 53 -38 27 -19 -80 -77 -67 -56 10 -10 9 25 14 19 -40 33 64 61 73
1858 73 35 42 69 -4 4 -34 -7 -49 -18 -41 -40 -10 -39 -90 39 -25 -22 -61 4 69 4 71 44 40 13 10 27 4 -33 -49 55 -66
1890 -66 2 17 9 -72 -18 5 13 -27 -8 -37 30 32 -17 1 59 47 19 34 28 -30 -23 -12 -77 -69 -28 -36 -18 -10 -34 -39 18 2 37 -6 -14
$$ packed form
1665a1o6M6k5l8P0l5J0L8l1Q7j4j1LN3O6n8q8j2Q4m6l3O4o6m8pR2m3m4O6K4J2
1696C9K0j6K0n9O0Pq2qK6lp5M6L4m7n4N5j7K4j0J7n9J19K4j7J3j7J5j4N7m1K2
1727G9m1Kr5Q7j6Kq1K8K3m2K6K4j3K4J4O5o0O0o0L2m6L8l1n4J5M0m9j9K3%k2l1
1759g8N7n0O2mK0K7n6K3k4R9J4n8K8l6j8K0n9Pj4ORM5q1J3K8RJ4QJ7l2P0o6K6
1792B6k8LM9j0m6Qm9K2k9N6q0j0K8L2lO7m5K5lP6n0K2j1mo5L6N4p3j4pL1m1l8
1825g1NM5l2K1K5L7q7M8L9K9l5qL9l9L7r1O5m6o1LJ0J1O6k0J9J6j1Nn9P3L1lJ2
1858G3l8PK7p3Ql8K7m2L1k3JL0k9n1J29o4Ll9O5O5o5O7k7mk7lJ7k3l7j6J04j21
1890f6O8J5qq1N4K3Qm0J9k9O7Km9J8N8j2k8J5on8PJ1o5QM1qJ8Qk4nN7j6L5m3q
$$ plain form
1925 -14 28 -2 -17 -4 8 -15 85 -98 -16 -214 -30 -53 -131 187 -7 56 167 -243 -15 9 60 24 17 171 58
1950 58 -117 0 74 57 61 -56 -29 -53 -47 -58 6 -23 -4 -21 10 -21 2 30 61 67 35 43 23 2 -3 23 40 1 -7 -8 -12 -28 15
1983 15 6 -54 43 11 -12 -21 -31 15 -47 17 49 -21 13 -1 32 5 -24 -25 -42 -21 -36 -93 -74 -28 -51 22 -5 40 -37 23 25 -33
2015 -33 75 36 17 17 -11 -45 11 -77 -49 -63 -75 -53 -35 -40 -8 -3 -4 30 18 2 -24 14 21 75 24 41 -34 -6 -9 -28 -38 -46 -40 -32
2049 -32 -26 -10 -41 -37 12 25 72 75 -5 31 18 56 43 21 58 -15 5 -60 -15 -33 -91 8 -48 -78 -56 3 -46 14 15 8 40 13 -3
2082 -3 24 -23 22 72 30 22 -5 -15 -35 -30 -50 -46 6 -4 5 -13 8 -10 -23 27 41 46 5 0 26 1 18 -4 72 -36 34 -43 2
2115 2 -35 -70 -70 4 -55 -66 24 -36 16 46 -16 25 14 66 78 55 -42 -6 11 -11 -26 -4 -45 -6 -31 0 -14 -11 50 3 77 42
2147 42 -47 45 20 62 39 -11 14 35 18 36 -6 -75 -16 -22 -36 -73 -49 16 29 -26 -20 -30 18 36 65 1 4 20 7 -23 -13 -24
$$ packed form
1925a4M2l0j5J3J2k3J00j83Q2j98J84k3p8L18j94O3J11m10K28K4N1l6pJ54j13
1950E8j75J17P4j7Mj17K7k4Oj1O4k9J9j7L1l1K3K8L1Ol2Qk0k1nK6J7l9qjmj6M3
1983A5ro0R7l2k3rj0M6o2O4L2p0L4j4L3k7k9jj7K1j5n7J9M6k3P3k7M5p7O0Kn8
2015c3J08l9j9%k8l4N6q8K8j4j2K2J8nL2NjL4j2j6k6L8PN4n1J7p5K8lj9j0qOQ
2049c2OJ6l1MM9J3M7Lq0L6j3L8j3k2L7p3K0o5M5j8n8R9n6l0K2N9m9O0JpL2k7j6
2082cK7m7M5N0m2qk7j0k0Nk0MN2j0Rj8K1j8j3N0J4Nm1nK6k5J7k2P6j08P0p7M5
2115Bl7l5%P4n9j1R0o0N2L0o2M1j1N2J2k3r7L6J7k2j5K2m1L9k5L1j4LO1m7P4l5
2147D2q9R2k5M2k3n0K5K1j7J8m2o9N9oj4l7K4O5J3n5Oj0M8J8K9o4LJ6j3l0J0j1
$$ plain form
2179 -24 -19 -21 -36 -16 -23 -7 -24 -4 -4 -9 -15 8 -6 -9 -27 49 -9 21 27 74 -29 18 -9 -25 -41 -64 -2 -52 -61 4 21 0 61 38
2213 38 41 15 35 -4 26 -9 7 19 21 8 -5 -10 -54 -31 45 32 -30 8 -28 -6 33 -24 13 13 -38 16 72 2 -8 3 -23 33
2245 33 -37 -19 16 -30 -18 -41 -33 -39 -26 -19 26 25 42 45 66 2 27 -43 28 16 -18 27 34 10 -30 34 -53 -10 -30 -45 -53 33 -12 -21
2279 -21 -36 4 55 37 5 20 35 -7 28 14 -5 48 -27 -52 -36 -3 6 -75 -38 24 -39 8 -5 -7 10 -10 51 17 9 22 -13 -16
2311 -16 43 -8 3 -1 -32 -52 -30 -13 -35 -53 -44 24 6 17 54 16 5 22 32 95 52 -45 -1 12 -28 13 -39 -75 32 -49 -42
2342 -42 -18 2 29 -2 -32 -29 -21 35 -7 17 23 28 45 4 52 -27 31 -4 -10 -36 7 -40 -37 58 -11 -16 -15 -35 27 -14 37 39 28 1 -12
2377 -12 34 29 -28 -46 -35 -18 29 -11 -48 -56 -14 -49 -4 25 37 18 44 -5 -13 53 56 -31 59 23 45 -3 -23 -5 -3 -44 11 13 -6
2410 -6 6 68 41 40 13 36 42 -32 35 28 48 38 19 44 64 1 12 -52 12 -44 -50 26 -50 1 15 18 14 26 -5 51 -32 76 -12
$$ packed form
2179b4Nkj5K0pJ6j7K0%noK3j4lj8P6n8L0OM7j03M7k7j6j6k3O2n0rO5J7k1O1k3
2213C8Lk6K0l9L0l5J6J2Kj3j3nm4K3P6j3o2L8l6K2L9n7L7%n1N4N6p0j0J1k6N6
2245C3p0J8L5m6J2k3QoJ3PM5jJ7LK1o4K5p0P1j2l4M5Pk4m0O4q7M3k0j5qQ6m5r
2279b1j5M0N1j8l2J5J5m2L5j4j9N3p5k5J6L3Rq1L7O2o3M7j3kJ7k0O1l4qJ3l5l
2311a6N9n1J1ml1k0K2J7k2j8RO8j8J1L7l8j1J7J0O3m3r7M4J3m0M1n2l6J07q1P
2342d2K4K0K7l1l0LQN6m2K4ONJ7m1M8p9N8l5ok6M3m7LR5o9nJk0O2m1N1Kj1k7j3
2377a2M6nn7j8J1J7M7m0l7qM2l5M5K9J2j9K6m9qO6Lq7R0l6K2m8k0J8Km1N5Kj9
2410fJ2O2k7jk7K3Op4O7pK0j0j9K5K0o3J1o4O4n6oP6p6N1J4LmJ2l1N6q3J08q8
$$ plain form
2443 -12 -10 -76 47 -30 28 14 18 7 -22 -16 2 -72 92 18 -9 -40 26 4 -10 35 68 7 23 1 -13 14 -63 35 -23 0 -14
2474 -14 -9 -46 -12 -21 -57 -29 -18 6 18 27 32 24 0 -11 -7 92 30 -31 -14 40 -11 -12 -19 -29 -11 -34 44 10 31 -12 1 -32 43 89
2508 89 -31 -26 21 -50 14 15 9 46 -35 -7 -20 -24 -32 17 3 -2 -23 -14 70 48 25 31 49 41 22 -40 5 30 34 -7 -34 17 -60 -17 -17
2543 -17 -22 -34 -19 32 24 -36 29 0 46 4 33 -17 -7 56 26 -21 5 -70 -19 -13 18 -51 -1 -59 29 30 -24 22 23 -34 12 31 -7
2576 -7 53 -14 15 31 27 2 31 12 2 0 -53 -13 24 18 -7 314 -102 -7 -28 -57 189 157 81 -19 33 -28 41 -86 0 -1
2606 -1 17 -27 -12 41 -40 -33 -75 4 -29 -16 6 44 91 34 1 15 -11 -32 16 -47 29 10 -6 -18 -75 -28 -15 -7 1 -1 -41 -67 -25
2639 -25 -9 45 53 6 46 -1 8 16 -28 25 -6 2 50 16 -15 -24 18 -41 -21 -29 40 -23 40 -15 -3 65 8 28 60 3 -1 78 -79
2672 -79 57 2 -4 -46 -50 -15 -27 -38 -15 -21 15 -11 -5 -24 19 1 49 -3 35 -21 63 81 -16 -29 37 -32 14 -18 -3 -41 -53 5
$$ packed form
2443a2Ko6J23p7N8j4Mj1k9OJ8p4J64p4k7l1O6k2j4M5L3o1J6k2j4K7p7R8n8K3j4
2474a4Nl7L4rl6K8J1K4J2RNqk4j1MR9o2o1J7N4n1jpj0J8k3P8l4K1m3J3l3P5M6
2508H9j20NM7p1O4JoL7q1K8j3mqM9j4nk1RQ4k2k3OJ8qj9o2M5K5Mm1k7N1p7M3%
2543a7nj2J5N1qo0O5k9M6m2K9n0J0O3l0m7K6p5N1OL1o9N0n8Q8Jn4M6Jn7M6J9l8
2576gO0o7K9J6mk5K9j9j0kn3M0L7ok5L21m16R5k1k9K46l2p6j00N2o1O9j27Q6j
2606aJ8m4J5N3q1Pm2P9l3J3K2L8M7n7l3J4k6k1M8o3P6j9j6j2n7M7J3QQkm0k6M2
2639b5J6N4Qm7M0m7RQm4N3l1QM8l4l1rM2n9K0qO9o3O3n5J2O8n7K0L2n7mP9j57
2672g9J36n5om2mL5j2j1K3oL6k6Oj9M3j8M8n2L8n6Q4J8r7j3O6o9M6l2J5l8j2N8
$$ plain form
2704 5 -8 72 23 -6 46 65 -67 -96 36 17 -26 -12 -44 31 -69 -74 -43 -5 -17 -5 -66 0 1 0 15 15 36 6 -19 8 -23
2735 -23 38 -37 82 -116 164 28 -193 -57 -92 196 -153 45 -42 10 -12 15 -25 24 4 64 1 8 17 -43 -45 71 7
2762 7 18 6 -9 -27 0 -51 -6 55 18 25 -43 -4 48 35 25 -25 6 35 95 19 10 -17 4 -21 -26 0 -16 38 -9 48 43 4 -12
2795 -12 28 -11 -27 -1 37 -5 60 2 6 40 42 -84 7 -75 101 32 666 -144 346 -15 -492 262 186 -82 -88 -75 -19
2822 -19 21 79 225 -8 132 190 141 -134 306 -221 -196 -220 -126 5 -252 321 69 357 143 120 -49 -66 -282
2845 -282 125 23 -11 112 70 74 -91 -103 118 -158 -36 -128 -203 -4 21 -33 2 -14 -3 32 -8 53 -10 34 39 -22 -13
2872 -13 -3 -6 -50 -77 0 -35 -1 -43 4 -20 -7 -10 -11 -7 -47 -22 88 40 24 -51 49 8 1 25 5 38 7 -10 -15 2 20 16 -24
2905 -24 -3 19 1 30 10 74 -2 13 89 12 60 -18 27 7 -41 -6 -27 -19 20 -30 -8 -37 0 37 14 2 -15 57 91 -212
$$ packed form
2704Ej3Q0m9k9N2J9j32k9J32j9m3J4l2P5j00nL1L8j2J2o1O6JjJ5%K1l0k5K7l1
2735b3O1p5J19j98K80j36k21J36l5K88l49J98q7N2k2K7m0M9k0O0o3PRo0kJ16o4
2762GJ1j2j5j8K7n1M5O1l7Po8L9N2j3j0n0L1K9O0p6rk7K1k5nK6j6N4m7N7nl9j6
2795a2M0l9j6K6L8m2O5n8ML4Kj26R1q2J76o9O34q10M90l61m77P54p6k68oJ3N6
2822a9M0N8J46k33J40N8m9k75M40n27K5k4R4J31k57N73k52K88k14k3j69j7k16
2845b82M07j02l4J23m2Mj65j2K21k76J22r2p5J99K5n4L5j6J1L5m0O1o3M4No1R
2872a3J0lm4k7P7l5L4m2M7k4J3ljMm0K5J10m8j6p5J00m1pK4k0L3l1j7nJ7J8mm0
2905b4K1K2j8K9k0O4p6J5P6p7M8p8M5k0m8L5k1QL9n0K2k9L7L7k3j2j7P2L4l03
$$ plain form
2935 -212 -15 25 33 9 -42 -112 -20 21 -49 35 0 -10 0 -37 67 10 -35 21 32 -25 77 -11 111 -62 246 195 147
2962 147 -127 -136 27 117 194 53 1 99 117 21 -7 65 -54 336 -62 225 -189 -5 103 -11 -207 14 188
2985 188 242 -96 -195 -93 -19 84 151 -131 -98 93 -32 -56 -258 288 308 59 9 -36 189 76 0 -126 -203 84
3009 84 -28 74 -194 -44 -52 -103 271 60 278 4 105 -31 -85 -275 -26 7 94 48 -135 181 -2 -60 -42
3032 -42 -131 -102 -142 -101 -58 -4 -127 -249 66 -54 -67 46 -23 2 28 -4 49 22 35 -56 -11 -5 27 -80 -19 10 68 -34
3060 -34 37 -124 154 -207 -103 -9 -96 76 -137 285 218 -4 -246 -90 186 -105 -43 21 -301 -275 -24 226 -39
3083 -39 49 8 2 -21 40 -35 40 15 14 0 66 -2 -76 -37 17 -33 -24 -96 183 205 -316 -248 -51 -216 -41 184 19 214
3111 214 80 -101 131 0 -81 -3 60 73 8 56 38 -90 23 33 -1 202 16 -36 91 47 34 49 6 -37 42
$$ packed form
2935b12J97M0Qk4n1p0R2M1p0Q4l5j0J0l7J04n7m5N6J1n7J02q8J22j73L08n1m8
2962A47k74rJ63R0P7j41n2R8J8r6k8P2j19L90l98K87m14J84J08j14j96K21J74
2985A88N4l38r9J02P4J03O7k82L3J91j25k4k02N46K0k49n0m5K25j13p6j26p7K87
3009H4j12J02k68J50qn1L74k11K18k74J01j36n4j90K49L3Q7m6j83L16j83n8J8
3032d2q9K9m0M1M3N4j23j22L15j20j3J13o9K5K6l2N3k7J3r1M5OL2j07O1K9N8j02
3060c4P1j61K78l61J04R4q7J72k13M22o7k22k42J56K76k91O2O4l22K6K51K50k65
3083c9Q8m1ok3O1p5P5k5jj4O6o8p4L9N4n0Rp2K79K2n21O8J97j65J75K25j65J95
3111B14j34j81K32j31q1P8O3J3o5M8j8j28J13J0l4K03j86n2J27m4j3J5m3m3P9
$$ plain form
3136 42 -4 37 1 20 26 -20 5 1 5 -1 -9 26 -98 -68 19 234 -152 299 183 -196 -107 90 177 -161 332 206 70
3163 70 26 -33 28 5 7 -51 14 -24 36 -1 -40 51 13 -21 -32 27 -27 -23 -25 12 9 34 54 16 -3 -13 -14 19 -43 -12 -18 -59 -37
3196 -37 -40 5 38 -63 51 44 -30 40 27 48 47 36 18 -6 -5 8 -42 24 -13 36 -51 -49 6 51 -33 14 74 -147 123 35 36
3227 36 35 24 163 86 -299 -12 125 -21 -126 337 -92 34 75 -49 39 97 -179 48 -12 -288 -7 -112 203
3250 203 -124 160 -13 -179 -18 3 -309 -75 107 13 -144 -355 -221 276 -224 121 -150 223 21 175 -14
3271 -14 -36 -101 -47 -54 50 10 29 -96 29 -18 1 -5 18 -24 8 162 -10 -15 38 -33 16 56 4 150 18 20 -17 1 23
3300 23 -41 70 -117 -51 63 78 3 -32 -33 -17 42 20 19 -10 -11 36 24 17 -28 -8 20 -36 38 -35 -18 -35 6 -57 56 -14
3330 -14 -14 7 30 41 14 88 14 45 23 -3 49 58 11 -36 -35 -18 -26 6 -55 55 -22 8 -48 19 -8 -22 -10 12 12 60 28 30 -21
$$ packed form
3136D2m6M1l6J9Om6K5mMoqL5j24L0Q7K15l86M51j16l79Q9J97Q7l38M93j26j36
3163G0m4n9O1k3Kn8O5l8O0l7l9R1l8l4j1N9n4MkL7lK5K0l8j9j0jL3o2L1om1K2
3196c7lM5L3j01J14pp4P0j3K1jj1j8k4JJ3n0O6l7M9q7KN5M5q4M7O0k21K70q8J
3227C6jj1J39p7l85K87J37j46j05M63m29J26M1j24Q8N8k76K27o0k76K81j05L15
3250B03l27K84j73j66J61K1l12K34J82r4j57k11J34M97n00L45k71L73k02J54j89
3271a4k2o5N4pJ04m0J9j25J25m7J9oK3m2L2J54j72nN3p1M9M0n2J46j32Kl7J8K2
3300B3o4J11j87O6J14J5p5l5jJ6N9k2jk9jM7j2pm5K0K8n6P4p3J7j7M1o3J13p0
3330a4%K1K3J1k7P4p4L1k2k6N2Rm7m7JJ7qL2o1J10p7L0n6O7k7j4J2K2%M8l2Kn1
$$ plain form
3363 -21 -8 -67 -6 -4 -38 -25 41 5 5 35 -6 -71 -17 -4 54 55 33 54 -14 -24 -3 24 28 32 -38 3 -5 -3 -1 -39 -43 -50 3 14 -31
3398 -31 -19 10 9 1 26 -3 10 -61 -28 -24 6 -14 23 20 -29 21 6 -3 -7 -10 -41 0 -41 -7 35 -5 -34 47 61 -43 -34 -15 59 -45
3432 -45 -32 -21 -28 12 13 -17 -58 21 42 -21 -3 43 27 27 4 2 74 59 15 36 37 48 -33 31 -10 -34 -29 3 -38 -2 42 -51 -11
3465 -11 44 8 22 26 -2 -1 -7 62 25 31 -4 2 0 -56 2 37 -20 -35 47 -44 -20 18 7 -56 -27 42 -30 -3 39 -3 11 15 53 -28
3499 -28 -45 45 10 -42 4 -23 -26 -60 -49 -50 -4 12 23 -56 17 1 33 -26 -14 22 -17 -19 46 -14 35 -86 -63 -91 -16 34 -14
3530 -14 -31 18 12 -39 29 40 -36 5 -26 -17 -6 -8 57 -29 -49 45 -17 15 -32 -18 -34 41 -8 7 -5 31 -3 -42 -1 -16 -16 -23 -3
3563 -3 17 -26 35 -75 20 23 -49 -15 4 -19 10 -38 -7 -6 39 18 43 33 10 20 -33 2 24 15 -13 -25 -19 30 16 -61 -52 -33 -55
3596 -55 -1 -73 8 -4 -14 24 -48 -2 15 19 -11 45 28 3 -2 -16 -22 -7 15 15 -22 7 -59 -9 26 -16 0 36 11 38 -8 18
$$ packed form
3363b1J3n9O1Kl4J3O6l6%L0m1o5N4J3N8Jk2K1o8j0K1K7MMp0M1qKKl8mpN3J1m5
3398c1J2K9jqK5k9J3p1L3ML0k0L7lm9N0j5rmll1M1m1L4M2m0k9Q1J4j04RJ9P4j04
3432d5J3J1pM0Jl0m1P9K1o3J8M6j6%k3kP2j5m4K1JJ1q1O4m1k4NL2m1L6M4r3M0
3465a1N5l6J4Mk8JoO9l7Ol5Okn6N8L5n7j5Q2r1K4L8j1o3K9O9p2K7M2m2J4ML8q1
3499b8j7R0l5n2M6k7ll4J1jM6J6J1p9P3j6L2n9J2L6l9kO5o0M9j21K3k8P5N0m8
3530a4j7M9on1O8J1p6M1l1RJ1kO5q6k0R4o2L2m7J4j6P5m9J5j2L6l4l9M1j5%pK0
3563cK0m3O1j10R5Lp2L4J9k3K9m8L1JM5k1K5j0k3J0n3L5K2rk8j2OM9j4p7RJ9k2
3596e5N4p2Q1j2j0L8p2M6J7Ml0N6j7k5nj4oJ5K2%l7K9o6N0L5m2J6L6k5K7m6K6
$$ plain form
3628 18 -11 -10 22 28 46 -46 30 -5 -2 20 -5 -42 -10 -59 -33 14 -23 4 47 -6 -30 39 33 57 -46 9 -2 -29 -15 49 21 -2
3660 -2 4 -16 -8 -27 8 -1 -3 41 -35 -45 18 8 -38 -24 -16 -31 1 -2 18 74 40 -23 0 -62 12 -35 2 -41 2 -17 44 6 -23 39
3694 39 -21 16 -7 -12 -10 -76 12 0 -8 23 -27 -5 -2 -27 -60 3 43 -43 -42 36 -8 18 0 -31 -27 -39 0 4 21 -15 -52 -11 40 -6
3728 -6 7 -17 6 20 -39 -35 -22 24 -27 64 53 -40 34 -17 -14 -2 -47 -42 11 26 12 -59 13 54 -4 -53 -38 27 40 10 2 57 37
3761 37 35 -20 -1 29 6 -2 -23 -59 -34 -52 -37 -3 -18 -57 -12 36 83 42 46 -11 -7 -29 -14 -8 46 41 21 27 17 -9 -11 -32 13 27
3795 27 -33 -26 -14 -56 -32 55 -18 3 6 -16 6 -14 -5 -4 -31 -1 -1 45 32 3 -24 -2 -66 -36 -42 16 14 -16 33 -24 -42 -20 4 0
3829 0 -14 46 -34 -7 16 27 47 -61 13 3 7 -4 -38 26 -4 -11 -19 -37 49 -18 -16 -17 -13 40 -33 35 -44 -10 -34 -12 -69 -15 -38
3862 -38 26 -12 32 24 -39 -3 60 16 -65 65 8 28 -26 35 0 24 15 -2 -9 26 1 -22 45 -31 -8 19 10 -37 8 32 1 22
$$ packed form
3628A8k9JL2OJ8r2P6l5LK2k5l7L2m9K6M7l7K7M3n3k4O9oK4j03N5j1k7J4O4k8k3
3660bOk0Qj9L5rkM4p6j0O3j0m6J4Qj5L2lK0N6l4o3K3o2P4m7L7m3M3j9O1l8k9O2
3694C9o0L7k3nKo6Q8j2qL1n0K2Lk5l3O3M0q6JP8m4K6j8l1Mj2L9MJ7l6l7M1N1m6
3728fJ3k4K3J4n9MJ3M6n1R1j1r3P4n1LJ2m5NN3J5j4p1P2M1n8m9J5O5J3l0qN5k0
3761C7kn5J9L0k3qk1l6K5j8J5L4j5l9M5M8M7m1Mn7Mk2J5ON4nk0Oj0k6kk1M5J4
3795B7o0PJ2m2K4Q7p3K1Lk2K2k0RJk7L0%M6j3k9k7K2o4L0oN8kl0M9n7j8K2K4m
3829@j4O0q0K7K3J1K0j08P4j0Mj1l4O4l0pqj8Q6o7KjMN3p3O8p9L4k4K2n7N4k3
3862c8O4l8M4qo3L6O3m4q1J30n7K0n4O1l5K4rj7pL5k5k3O7p6K3K7rm7M5K4l1K1
$$ plain form
3894 22 66 44 -3 -17 0 -2 31 15 30 1 -21 -10 57 37 4 -29 2 -49 -33 -50 50 -26 -16 35 -45 25 6 51 25 -8
3924 -8 65 -45 -67 -6 -58 37 -35 -15 -29 -21 -43 49 -29 21 -15 -46 7 -42 0 -11 4 -3 -10 -7 -24 5 -10 -37 -45 0 42 48 20
3957 20 -28 24 29 23 24 41 9 25 18 1 -6 -14 -38 8 -21 48 6 38 -15 24 -15 -11 12 47 31 36 -28 -14 10 29 29 -3 -8 0 -3 61
3993 61 44 -13 -58 -17 6 -40 -5 -1 38 14 73 35 44 10 1 10 42 12 5 -12 3 2 21 5 -15 -6 41 9 -25 42 15 -33 16 55
4027 55 -6 -4 -54 -15 -25 31 26 27 7 -2 -47 53 40 -11 -28 -22 27 29 41 28 -15 -14 32 -22 -9 11 6 -4 32 17 -2 29 6 2
4061 2 -46 42 18 -22 -5 -2 -5 26 62 34 27 -39 9 -27 -7 8 20 -58 -31 33 -22 8 9 2 25 25 -23 46 -4 -22 17 13 41 12
4095 12 -1 -5 30 -24 11 -25 -45 8 34 -5 -33 -26 -16 -7 18 33 -53 1 17 -20 39 -37 -23 -14 -16 0 -4 38 -36 -35 -8 -32 -32 -7
4129 -7 25 25 -38 -3 34 18 -17 2 -1 57 15 5 -37 -25 51 -38 -3 3 -20 35 44 -3 6 -28 -11 -31 2 -6 2 -68 -24 46 -55 20
$$ packed form
3894B2M4k2m7j4J7kL3j6J5k9k2J1O7k0l3l3L1n1J6j7J00p6J0N1q0P0j9M5k6l3
3924hP3j10k2O1n2R5p2K0j4Qk2R2p8N0l6l1N3m9M2j1J5ppLj7K9j5k7qM5M2Ok8
3957B0m8N2NoJJ7l2J6pj7pqk4M6k9O9m2L2n3L9l9MK3L5j6No4J4K4J9%l2nQlO4
3993F1j7n7m5M1K3m6L5ML9k4N9l8Rl4rRL2l0pj7J5jJ9j6k0RM7l2l4O7k7m8M9L9
4027E5o1Kn0L9j0N6nJk0rm5J00j3n1j7OM9KJ2j3m3JM6n4J3K0nj0L6j5j9L1k3m
4061Bm8Q8k4m0J7LlL1L6k8po6M8l6K0J5J2p8K7O4n5L0JpK3%m8O9n0j8L9mK8k9
4095A2j3mL5n4L5l6k0N3K6l9k8PJ0RK5J5q6N4J6l7N9p6J4RkJ6mM2p4JK7k4%K5
4129gL2%o3L5L7j6l5J9lN8m2j0m2J2P6q9L5Ok3N5Rm7Rl4J7k0L3qQp0M4P0j01P5
$$ plain form
4163 20 18 -1 4 -10 19 13 -5 18 -17 -6 -24 33 28 -23 15 50 4 0 18 -26 37 45 6 46 -8 38 50 -31 -22 39 40 -38 12 -46
4197 -46 -8 27 14 12 20 1 7 6 56 27 -70 30 87 29 52 -32 -26 -7 30 29 -28 28 21 38 11 2 6 81 19 29 19 -23 8 48
4231 48 -34 -2 14 5 -37 29 9 48 -81 2 -67 -5 7 -39 5 14 -25 -8 4 -9 -34 -4 -43 0 -6 55 8 30 13 -1 12
4262 12 -28 -1 -60 -4 -18 8 -23 64 -43 -49 71 36 -8 22 1 68 -5 -16 -9 13 29 -20 4 -15 44 -24 0 -6 -37 -48 35
4293 35 61 3 -34 8 -31 -17 27 13 8 -22 17 30 -6 -8 18 35 6 36 -39 3 -1 48 40 -10 -19 27 41 -6 -26 -5 -45 -3 39
4326 39 3 -17 -28 26 21 52 5 25 41 -11 31 20 -39 5 15 -27 2 57 6 35 -14 -15 39 -11 -17 -12 -21 57 -22 3 11 25 -18
4359 -18 -18 -59 61 31 -4 -21 -11 -43 -54 -6 -32 16 11 -20 30 -2 14 10 30 -30 13 50 -22 26 -9 15 31 29 14 68 -3 6
4391 6 -10 -40 43 -30 12 22 63 -25 32 -2 33 -44 16 25 -48 -15 29 -44 -42 14 -11 -28 32 -50 -7 5 -12 -19 -35 -16 50 -41
$$ packed form
4163B0kj9Nj4K9oj8K3l5J1j8N7nn1L8L5m6mJ8m4O3Ql9M0n4M6J2q1RO1Jp8N0n8
4197d6L8L5j3kQj9OjN0k9r7J00N7n8K3q4OJ9L7jn7N6pJ7k7rMP5o2J0j0m2L1M0
4231D8q2L2J6rm2O6k0L9j29Q3o9O2J2m6M4Rl9J7J2j3k5L0l9M3oO1m7K2j7j4J3
4262A2m0K7n9N6j4K6l1Q7j07oJ20l5m4L0k1O7p3j1PK2J6m9K4j9N9o8K4ol1j1Q3
4293C5K6n8l7M2l9J4M4j4nl0L9J3l6kK6J7k9L0p5M2mM9qn0rM6J4m7k0K1m0M2M2
4326C9l6k0j1N4nL1m7K0J6n2M2j1n9M4J0m2K9N5n1K9m9jN4n0oNrP8p9K5QJ4m3
4359a8%m1J20l0l5j7J0l2j1M8k6M8nl1N0l2J6mK0o0M3L7p2M8l5K4J6kj5N4p1R
4391Fj6l0Q3p3M2J0M1q8N7l4L5p7O0Rp3L3M4p3KN6k5j7O0q2M3J2j7pj6J9O6r1
$$ plain form
4423 -41 -3 -45 -38 7 -19 16 15 -34 7 66 7 17 -19 -24 20 7 16 4 -15 -8 -50 -56 -30 71 11 -7 40 -23 5 -2 -4 -28 40 -5
4457 -5 -11 11 49 -16 39 -3 -80 -23 14 48 5 -31 50 -6 -56 30 -73 -34 6 44 62 11 36 38 31 -60 12 -27 53 18 -39 -37
4489 -37 15 21 6 -33 32 68 -22 5 -57 -16 -30 -26 28 30 -16 -14 -25 0 9 9 49 -1 -1 -5 8 22 2 32 13 -49 8 2 26 13 38
4524 38 44 -26 33 63 3 -17 -8 47 5 -8 3 -1 -42 -8 46 -18 -3 31 -6 -14 -41 25 -52 17 21 17 5 -1 -35 17 11 21 53 -7
4558 -7 18 -7 37 -28 -3 38 -51 -12 8 35 6 -4 -30 10 -30 13 -6 -40 21 18 18 -12 -12 2 -27 -4 -74 -17 -20 -35 16 12 -13
4591 -13 -7 36 -15 28 1 -33 18 20 25 32 -12 -19 32 30 10 -43 30 37 -44 6 -22 44 11 -4 8 10 17 0 -2 33 7 15 -33 -5 -6 -23
4627 -23 -33 -41 17 41 9 -57 -34 -17 39 16 -34 6 -36 34 17 -27 11 16 -7 -3 21 23 -35 -59 16 -21 -10 -33 18 24 24 -17 -26 15
4661 15 -22 -40 -39 -53 -15 13 -25 -11 -16 21 6 1 34 -9 26 62 -7 -12 -14 -16 -32 29 -4 3 21 19 -12 -27 18 50 16 44 49 4 23
$$ packed form
4423d1L8m2PM5k6L5jm9M1N9n9J0l6nM4j3Rj2j9Pm2oK6J01o0j8M7o3K8pkk4O8m5
4457eoK2L8o5N5m2p7N7L7L4m3l6Q1n6n0Q6j03L9M0L8J8n1K5Kpr1P2l9Q0l5n7K
4489c7N2Oj5l9O5L6r0K7o2M1j4MN4Km6Kj1K5R%M0n0%mJ3J4k0L0j9o2N7oK4j3K5
4524C8Op0N9L0o0k0RN5m2j3J1mm1L4N4o4J5L4l7qk7O6p7O9Mmj2ol4N2oJ0L2o0
4558gK5k5M4o5K5M1q9L9K0K7k9j0k6M0m0M3j9l4O1l%l0%J4k9K3p0N7lj5N1mk5
4591a3OM3n1M3k7l4N1KNPm4pN1kk0n3P3Pq1N0k8O6l3j5J2KPj7kL5k6Qm8K8jj7
4627b3j0qN8K4l2o6K3J7N6k3n0M0m2P0j7m4L8Nk3MK4Kn8k4P5l7J1k3N1O%m1rM1
4661A5l7j8Jj4L8K8l8J4nL7j5nL3m3L5L6o9nkkj6O1l3PJ8kl1j5M5L2l4K8Nm5J9
$$ plain form
4696 23 -47 16 11 -53 -19 20 22 -7 -57 22 28 52 19 35 37 -12 40 31 39 -64 52 68 16 14 52 -11 12 -7 -45 34 -21 19 14
4729 14 34 29 -2 22 28 12 -27 -23 -3 -47 16 28 3 27 -24 67 4 -55 27 -10 -39 -32 -25 15 -14 14 -27 13 -1 13 -30 -1 0
4762 0 12 -17 -16 -14 -7 -28 -26 -16 9 27 -16 -23 5 45 63 3 -7 1 4 -22 -14 15 -19 -32 -43 64 -41 69 -47 32 62 27 5
4795 5 -54 -2 -17 -28 -5 -3 8 101 10 14 3 -3 -41 9 -2 21 89 13 5 74 4 20 28 -35 38 29 24 -24 -4 -28 -19 -40 -48 -29 11
4830 11 34 10 -20 -23 -41 42 -20 -22 13 -37 -14 7 29 -10 -2 38 1 17 48 39 75 9 -26 32 39 73 -4 16 53 24 -35 50 47
4863 47 22 41 2 -32 -40 61 18 23 9 46 -25 11 8 -49 -51 -44 27 11 -8 -30 -22 -26 -38 9 3 26 36 24 21 -31 7 18 -21 -28 -25
4898 -25 -38 -42 36 -4 43 -5 32 49 -58 2 5 -21 -13 37 -30 26 -29 -42 7 8 -35 -67 18 -42 -41 -1 5 -34 -16 -29 1 33 40
4931 40 34 -17 6 -66 8 -53 41 -7 11 53 -9 15 -13 10 -5 4 52 2 -9 -19 -20 1 38 -4 -15 38 20 -17 1 -39 -16 -37
$$ packed form
4696B3p0O3no4L4L9Kk9n0P9OK4l3J6Km9N2rQj03J16J6n2kL8o3K3j9l8P9n5M0n
4729A4K0nl1K4Oj6l9MK0m4O3J2k5K4n1R1o3n9Q2l7k9PPM0k9K8m1M0j4J4m3K9J
4762@J2k9JKPk1KJ0K5J8m3pK8M0J8o0j0QLk6QK9l4j3j1J07j05J10j16P9L0l5k2
4795En9N2j5j1K3KJ1R3r1Mj1ol8N0j1K3O8p6qO9p0J6Qo3P3rnm8K0k4Rk1qJ9M0
4830A1K3k4l0lj8Q3o2kL5n0K3K1K2l9QM0l7J6L1rL6o6l5N8PL4p7K0L7k9n9Q5l
4863D7k5J9l9l4qJ01m3Nj4L7p1L6ln7kPP1j6j9k2Qmj2M7oK3J0j2ln2L8J1l9pL
4898b5j3mP8m0M7m8L7J7j07O0Lk6QN0o7N6n5j3M9Jm3l2Q5o0JM0Ol9J8j3L0L2P
4931D0on1K3p2P4o1R4m8J8M2o2K4k8K3j5RM8n0j1j0jK1L7m2j1N3j8l7J8m0K3k1
$$ plain form
4963 -37 -86 -6 -10 -16 -23 -72 -37 -3 -18 40 63 -22 56 7 -43 -42 28 -2 29 6 13 -6 15 -48 19 42 -5 -1 -44 26 -22 -50 -44 -1
4997 -1 -74 36 -19 -8 -25 -44 7 -42 -13 16 -46 42 26 -46 -34 -18 26 -40 8 26 7 12 -32 -11 67 1 60 27 13 -7 -42
5028 -42 43 -15 -9 -3 -1 24 -6 26 -8 56 -37 59 -32 76 -36 83 48 568 199 175 -11 202 86 148 -287 -561 -172
5055 -172 -136 27 3 -20 -23 27 37 55 53 -271 55 -68 50 29 49 63 -114 56 -16 -12 -39 -8 -67 10 -36 -26 -25 -26 -9
5084 -9 37 -26 -24 -17 -8 2 22 -39 -13 -21 -53 19 39 -7 30 -27 -13 -42 49 31 -24 -17 114 4 -13 3 -27 15 -49 4 40 32 41
5117 41 10 -46 38 38 16 12 6 2 12 -2 9 -3 -3 0 5 -18 38 -17 28 26 41 188 190 -14 49 -96 117 49 -144 -198 41 125
5149 125 65 126 -77 70 -19 35 15 28 -146 1 -32 40 88 -89 -132 69 58 -63 -26 -58 15 -42 140 29 -112
5174 -112 26 -69 65 -16 32 -35 54 14 13 -172 -24 134 -32 -102 44 -11 -35 -51 -66 -99 -185 -133 65 -190 126
$$ packed form
4963c7m9Q0mopm9L5L4j5N8K3q5P8m9n0JP0l0L1k3Pj9K1o3O7K3m7Mm3P0m8k8OM3
4997ap3J10n5J1j7j9N1m9K9K9o2Q8j6p2J2J6M4o6M8J8j9Nm4K1P8o6N9l3j4k0l5
5028d2Q5n8OOKK5l0L2l4O4r3R6r1J08j12J19l5N20l69k4j86K13j16O2m35k74L89
5055a72L6J63k4k3lN0J0J8kl24L26j23J18k1K0J4j77J70p2Mk7L1n9P7m6J0JjJ7
5084iM6o3KPRJ0K0o1K6ql2P2K0m6L7n7J4k9R1j8n5PJ31j10j7J6l0M2o4N3L6qR
5117D1l1n6Q4%k2momJ0j4J1j2%LNk3N6n5M5kJ5J47Kk04O3j45K13o8j93n4K39Q4
5149A25o0O1k03J47q9N4k0J3j74J47l3P2M8j77m3K01j1j21L7l2P3n7J82j11j41
5174a12J38r5J34q1M8o7Q9m0jj85J48J58j66p0J46n5k4j6j5l3q6N2J98k55L16
$$ plain form
5199 126 24 8 187 246 -82 -390 219 129 335 -163 -355 209 47 -143 221 140 40 -35 26 -50 8 -33 28
5222 28 -56 44 -7 65 -47 -23 -370 -73 -19 91 82 -24 56 -148 85 69 -53 -4 85 -65 175 19 0 -8 142
5247 142 39 8 -101 148 152 -4 -39 -6 0 -30 -34 -10 -27 2 -29 10 20 7 7 -23 16 48 10 -2 -47 4 20 -11 56 -34
5277 -34 -42 -26 40 29 -57 -19 -4 11 -3 -38 -20 -16 5 -31 36 6 -20 7 -39 22 -31 -6 -58 -16 -71 19 -6 13 -9 24 9
5308 9 -39 -27 20 10 9 56 -27 43 -17 39 -63 24 7 -2 20 8 31 -15 -19 31 2 -8 30 -31 23 -5 -25 34 32 -18 -23 22 -35
5341 -35 14 -16 5 -12 -3 -2 -6 -25 39 31 -1 -17 10 45 -16 10 14 -17 -32 18 49 47 -17 -21 27 20 -7 -21 -19 -33 -59 -45 -48 24 -42
5376 -42 -35 7 -64 -6 10 -25 4 56 -30 15 -18 -3 2 -24 -26 39 -8 39 -32 30 -18 9 24 -43 -81 -13 27 34 8 -31 -23 28 -40
5409 -40 32 -1 -16 -27 -13 -12 16 -49 11 -1 -43 -16 10 -11 44 -15 -5 8 11 -3 -45 10 -61 -53 -1 50 77 -25 -38 12 26
$$ packed form
5199A26j02j6J79N9l28l08O09r0K06m98j92N64j62j90L64q1j00p5O1p6N8m1O1
5222B8q4J00n1P2j12K4l47K97N4J10rj06Q0k04K33j6j22M9Q9j50K40j56j9qJ50
5247A42j03l1j09K49Mj56l5L3Ol0mK4j7K9l1L9J0j3%l0L9L2l8j2m5N1J6l1O7r0
5277c4qJ6O6j1q6L8J5J5j4l5J8MK1l6O7l0k6K7m6O1n3K5n2M2n5R0k5J9k2L3j5
5308Im8J2M7j0jM7q3P0o0N6j02Q7j7rK2j2K3m6mN0k9j0L8o1N4k8k0N9kn0nM5n7
5341c5M9l0K1j7RJmj9O4ql2j6K7L5o1K6Ml1j5N0L1ko4mM8pk7j4Kj4k6J4lP2o6
5376d2PM2p1N8J6l5K9N2q6M5l3J5Nk6kO5m7M7p1O2m8K7J5o7l8O8M0Pk6l9QN1o8
5409d0P2l3j5j1J4JK8o5O0j2m2K7K6k1N5n9J0J3Lj4m2N5p1QN2N1K7j02j3N0J4
$$ plain form
5440 26 44 8 23 17 68 -51 26 42 26 -4 -23 37 16 45 3 -11 -15 -15 -6 -19 -9 -67 -40 -20 -20 9 -40 -31 9 -19 22 41 -10
5473 -10 -28 -16 -35 22 0 20 27 -24 -85 33 -24 5 -53 -31 -7 8 0 12 25 0 28 -3 8 -28 8 -10 -19 52 -15 -47 8
5504 8 -35 58 -31 -48 -32 26 9 30 -47 -31 -47 35 -22 -39 -40 35 0 5 9 -35 0 -16 17 -44 -34 7 -11 17 -24 -28 54 21 35
5537 35 -9 -41 26 -7 5 -1 -15 -26 0 20 12 4 11 30 16 -39 15 0 -9 35 -16 28 1 -16 15 -5 47 3 27 -22 5 56 -5
5570 -5 67 53 -10 28 19 80 12 24 33 -39 5 -4 18 -19 -40 -6 -87 -17 -57 -27 -57 -34 -62 -101 -17 13 1 -43 -7 -10 -35 -35 7
5603 7 -3 -12 -8 48 -69 -8 23 7 16 13 -51 12 -16 1 -18 72 -41 -17 -25 -6 35 -4 -30 -24 0 -4 11 42 -58 -47 3 -48 -11
5636 -11 -49 -18 -44 8 30 9 14 15 -13 5 -1 -7 -50 -18 3 -34 26 35 -15 -22 -42 48 -29 32 -11 -24 24 -26 -12 -9 -3 -36 34 11
5670 11 40 -15 22 0 -9 35 -20 -61 23 11 15 -32 -14 -17 -32 -27 -15 -45 -16 -31 -10 -45 -35 -37 12 -5 5 -3 -18 -39 22 -13 1
$$ packed form
5440B6J8l6J5oN1j19P7J6j6l0j9O0k1K9m2j4m%Rj3J0n8K7K0%K9m9RM0k8M1J9n1
5473a0j8J2j9N7k2K0Pn1o1J18n7K9n8K2K4J5qJ2J3k5K8l1J1l6L6j8rP1o7l2N5
5504Hm3R3q9j7J6N8j7K1p7J6j6Q2n7j7jP5l5NMm4L5j6L3o1J0M1j8K8m1mQ2l3J4
5537C5m4l2O7l3J2oj4j1K6K0qqPJ9j4n5N4j5rM4n1M4k7j7L1k0N2m4K4m9K7N1o1
5570eP2j4o3L8rO1o8J2Rp2M4rK2l7k1L4q1P0m0L0l0K3k8l9Q4L0j2m4L6lk5%M2
5603Gj0rMN6j17O1L1j6Rlo4O3k8J7j9R0j13K4qJ9M1l9k6OK4mJ5L1j00J1N0n1L7
5636a1l8L1k6N2K2k1NJk8J8oom3L2K1l7O0Rn0pk0R0p7O1m3j3M8n0J4LOl3P0k3
5670A1K9n5L7k2rM4n5m1Q4j2Mm7J8lj5NJ2l0K9j5K1l5J0kM9j7J0qj5k1O1l5J4
$$ plain form
5703 1 -36 15 -47 -52 -21 -101 23 27 3 -36 -45 -4 -20 33 6 -12 -26 27 -47 -43 31 -40 24 6 19 31 -44 -23 24 18 -14 31 80
5736 80 -38 -8 21 32 3 -3 30 35 -14 7 9 6 11 -14 -38 35 12 6 -64 -77 84 -25 -20 0 -23 -39 -30 -46 -21 -13 23 -20 2
5769 2 -16 -56 -16 5 12 26 -31 48 15 -43 -8 22 29 68 1 59 -48 -4 -31 35 49 -40 25 -37 -5 4 -12 -3 -7 -9 -20 -16 26 -24
5803 -24 -41 30 -37 -17 18 0 -43 26 12 10 -32 -12 32 -31 20 23 -4 73 -5 26 -2 -4 35 -7 -13 82 29 45 18 -24 -26 -50 -7
5836 -7 -60 -17 -8 10 -17 -41 -6 40 -14 -14 -2 23 20 -47 73 30 -55 14 6 -17 -61 2 9 -26 -49 0 13 -6 2 9 20 4 -3 -48
5870 -48 6 -18 54 -8 -15 -31 -88 -57 -33 -9 -27 -40 -39 -6 -52 -49 34 -22 -18 -6 -32 27 -10 47 12 -82 -36 14 -49 12 10 45 14
5903 14 -28 7 -56 -4 -17 -10 35 -12 -53 -2 -8 37 32 37 64 12 10 0 -20 -19 -7 24 -9 -27 16 -25 -9 35 -73 17 -12 28 -43
5936 -43 -66 -27 17 11 43 -31 9 17 18 -11 11 38 -11 8 -16 48 17 1 2 -22 51 -10 15 15 25 53 31 -2 -56 -3 -19 -49 -31
$$ packed form
5703Al7N1o2nL1q0J24Mk4l9rM1j6N3k7j8j4N3p4MP4p1O4j8J3J2p5K1M7ol2M5M9
5736H0j18L0K9J1k9oL3Nm9K1KlNk5k4P3k3op0j3J61j09NK0k3j6Rj6K5QL6m3K2
5769Bj8m0M0K1PJ4n7P9l3n8L5L0PL9o7N8j07M4k7O6J4q9O5o2L2Rj6Rmkj1MM2n0
5803b4j7P1o7K0L5j8m3O9j4km2K0M4o3N1Lk7P7p8L1k8kL9m2oR5n3J6k7m2kk4M3
5836gn3M3RJ8k7k4L5M6n4%J2K5lo7J20m3q5O9qk3m4O3Pl5k3M9J3j9QPJ1j6pm5
5870d8N4k4P2o2pj6n7L1K4K4j8j3JL3m6LQ3n6MJ2k6N9l7N7l5r4M6N0o3O1kL5l1
5903A4m2L5o3N2j3PM5m7m1N1oM5nNK7n2kj0k0JJ2L1l3j8M3m1J6M4j08R0k9M0p1
5936d3k3L9M4oL2p4M0QJk9K2K7m9J9k4O4l1j6Jk4P3o1K5%J0K8k2l3n4N3j6l0J8
$$ plain form
5969 -31 10 -11 -4 27 3 -4 -13 7 -14 34 55 42 -71 24 -52 -45 10 42 65 -49 -45 11 8 87 32 -20 1 -6 3 9 8 23 8 -36
6003 -36 -12 27 -15 -18 -46 5 12 -34 23 -47 22 -5 0 9 7 33 24 8 -19 -16 32 -31 1 -12 14 -25 13 -41 -17 28 -2 17 7 -1
6037 -1 9 25 58 30 -28 -21 25 51 -26 -48 -51 3 -20 29 -15 -23 41 21 -46 65 -74 -40 -56 -40 -22 -5 -50 -3 27 -8 17
6068 17 -38 72 -43 -13 17 -27 -46 32 2 -30 56 15 -42 0 -17 -29 -34 27 -19 -1 -3 -9 -25 64 6 -33 12 -7 -34 20 -16
6099 -16 11 2 16 -56 -17 3 21 -22 -29 -6 1 33 -22 -22 93 -23 4 0 -49 68 61 -16 8 8 -36 -1 40 -50 -64 -49 -19 6
6131 6 -33 -21 -10 14 19 15 -28 6 20 -3 43 35 -46 -8 -37 -20 -60 -31 -32 -71 -28 -7 -2 3 2 12 25 -7 56 52 -5 13 7 -3 34
6166 34 -14 9 3 -39 7 17 -11 -32 20 -20 6 3 33 -50 -30 -13 10 28 29 -6 22 -15 -54 -29 -17 -52 -6 -4 -21 -45 14 -44
6198 -44 18 -16 -7 14 -11 6 -5 45 7 -14 0 -50 8 15 6 -6 33 31 -36 57 5 18 11 15 -34 7 -3 44 38 0 29 22 -1 11
$$ packed form
5969c1M1k1PL1k4prK0k1M8K1j3j13R5p6PN5L2K3j14MN6lP9n5n2K1pROjJ5j5m4
6003c6K4L9m2lk8N1Pm6N7p0O9k7NRkK6rj6k7LM8o3L2j3K6l9L8n4K4M5l0J9j0q
6037aJ0J6L3k8n8PM6K6p7k2lN4k3M9m4qO4k0o7J11j39L4j6J6J8J7m5M7L0l5K5
6068A7n5J10j15L0L0m4j9P8l0l2Q6m1n7M2j7j2nO1m6J8koj6Q9n8l9M5j9k7N4l6
6099a6K7rJ4p2L9K0J8m3pK3PL2n5%J15j16K7mm9J17pp7K4%m4L5M1r0j4J5L0K5
6131Fl9J2J1K4Nmm3L4J4k3M6qq1L8k9J7m0K9jl9M3K1NNjJ0J3l2O3mn7J8oj0L7
6166C4m8K3om2M6J0k8k1N2m0K6lL0q3K0J7K3J8Jl5K8l7l9K5J2l5M6Kj7k4N9n8
6198d4O2l4RK1k5J7j1N0l8k1J4n0N8Prj2L9ko7R3n2J3pMm9M1j0M7ol8K9pk3J2
$$ plain form
6232 11 43 43 -59 -40 -22 -9 -39 12 -18 19 44 24 35 18 69 -11 43 84 -28 20 5 -7 12 -10 -23 7 -6 -28 4 -68
6262 -68 -2 24 -37 45 -64 -30 14 -21 -44 -24 -39 13 7 38 76 41 27 -11 -1 6 4 6 27 30 8 22 16 19 17 17 -9 -10 2 6 20
6297 20 56 44 8 53 18 -23 -6 32 45 -11 -23 -10 -22 -9 -87 -6 -26 5 -7 -14 0 -26 65 23 -52 10 35 5 5 51 -15
6328 -15 26 18 -1 -21 24 11 -26 18 34 60 47 18 18 14 -15 -105 35 12 -12 -54 5 -20 -27 17 9 40 -10 -56 -78 -17 -58 -4
6360 -4 15 -5 -51 42 -10 -23 36 26 29 -10 -14 7 -3 -18 22 22 46 -26 52 43 28 -11 60 24 9 3 66 -1 -14 32 -43 58 24
6393 24 19 -23 -50 -4 1 -32 -28 -49 31 13 20 46 8 -17 54 43 21 -13 11 17 20 -3 -7 28 -31 26 -13 13 42 0 9 19 0 31
6427 31 -29 19 18 -33 -55 -39 22 -31 -11 11 -16 6 -39 -32 -34 -22 0 27 -47 33 -15 -12 18 35 56 67 -4 20 -22 15 -13 -9 49
6460 49 -46 -40 29 -4 -38 13 -35 -54 9 3 -12 49 -6 -54 15 30 -53 -6 9 14 21 -9 48 56 9 22 8 15 1 47 4 -59 27
$$ packed form
6232A1L2%j02J9J8J3l0N1l0L7K5k0J1j7N1q0N4M1j12M8j5j2J9k2j3L0j3k2L2p2
6262f8O6K6o1Q2j09L4M4l5k3K0j5N2oL1L8l5j4l8J0PkKK1Lk2J4oLk%k6jJ2MJ4
6297B0L6j2l6M5l5m1J7L8J3n6j2J3j2J3p8Q1k0L1j2pJ4k6R1m2p5O2K5l0%M6o6
6328a5M1qj9k0M5j3l7M4J6K6j3k9%mk9r0J40k3k4m2N9k5pM4qL1n0m6k2O1m1N4
6360dJ9k0m6R3n2j3N9j0Ll9mK1j0j5M0%K4p2P8rj5l9P1l6j5oO3o7j3M6p5J01l4
6393B4nm2k7M6Nl3Mk1Q0j8PK6l8k5P1j1k2l4K4OLk3mL5n9N7l9K6K9m2RJ0j9L1
6427C1o0M8jn1k2J6O1n3K0K2k7K2m5PkJ2K2K7p4Q0m8LL0J7K1J1p1K4m2L7k8MN8
6460D9r5OO9l3l4N1m8j9O3oj5O1n5m8O9J5q3M7J5NPl0N7Qm7J3j4Pj4M6m3o3Q6
$$ plain form
6493 27 57 -7 6 12 43 18 13 12 57 12 1 57 43 -10 -6 -17 28 -47 16 -49 -2 3 -13 -16 -5 -5 16 -14 27 15 15 -1 2 -50 -17
6528 -17 22 -26 20 25 12 16 17 9 -33 -19 -6 68 4 -29 26 -15 17 -58 -13 -8 57 -19 42 18 -3 -5 23 56 -18 10 -16 -6 -11 47
6562 47 -28 24 6 -19 -24 29 -2 -54 -27 -16 -25 -19 -22 -9 2 3 3 32 3 20 10 30 -9 8 -32 54 -10 -42 61 15 -7 27 -49
6595 -49 2 -51 56 -26 -57 21 -28 -26 -55 3 -75 39 48 81 -42 -29 -46 0 -24 34 -9 9 -18 -8 25 -21 43 1 -10 4
6625 4 -2 2 7 11 38 63 60 23 39 67 56 -2 30 -11 37 -6 27 8 -17 5 6 1 -60 1 1 -3 1 -77 9 30 6 -66 59 -49 32
6660 32 -54 -29 85 35 -49 144 -37 -552 207 101 -38 -3 55 110 219 115 -61 -134 29 134 23 1 -18 60
6684 60 -210 -69 -57 -65 42 178 45 -63 60 -89 143 29 45 20 252 50 -150 62 -25 211 -25 90
6706 90 203 -4 11 -476 66 101 150 -38 -86 42 14 -168 4 239 -57 28 151 11 -68 -209 158 149 -300
$$ packed form
6493B7L0o4J3OL1k5njM5m5j1N6j4n3Mj1M5p5O3o5M7Nj6lJ1%K1l0M1j2%j6Ln2L3
6528a7L9m8M6Nj3MJqm2J4J3P4o4l3N5m1L2p5M5NO5p6O1k4k1kK8L3p4K8k6J0nN8
6562D7p5N2j8k5nN3l1n2K7J1rOlJ3J1J%K9k9J7j0K0l9J7m0Q6o4l2J03m6k2L4p6
6595d9N1n3J07q2l1P8m9Kk9N8p8J14RL3j23J3j7M6k4N8m3J8k7J0L3m6O4m2j1J4
6625DoMNMK7K5ll7J6K8j1n8L2m1M8m3L3j9k5K2Jno1O1%mMp8Q6K1k4p2J25j08Q1
6660C2q6K5J14n0q4J93j81n15P59j06j39L5N8N5J09j04j76p3J63J05j11k2j9P8
6684F0k70J41J2qJ07J36j33j08J23j49K32j14J6k5K32k02k00K12q7K36k36J15
6706I0J13k07J5m87N42L5M9j88m8J28k8j82J72K35k96Q5J23j40p9j41L67rm49
$$ plain form
6729 -300 53 170 139 427 114 82 -272 -205 76 -111 43 70 32 25 -55 -26 56 15 114 -63 6 -7 -82 -134 -93 -47
6755 -47 -91 95 146 -22 30 -13 -16 -34 -63 53 -13 25 9 -19 1 90 27 24 -50 3 -19 30 -28 41 -13 -70 38 -20 -47
6784 -47 -6 -25 12 -22 -34 49 0 1 43 18 -18 42 17 54 52 34 79 36 20 57 -3 9 -70 4 65 26 -18 -49 -63 -12 -59
6815 -59 22 20 -41 -22 -5 -21 -44 19 -22 -49 51 0 -50 33 49 -40 -17 -21 -11 30 32 39 -29 30 15 16 15 0 -48 -18 20 -35 20
6848 20 17 12 24 29 -11 0 -23 32 -39 -71 -7 16 -13 -43 -20 48 -16 -5 -59 -23 14 -69 -18 -8 57 9 24 57 4 18 -14 6
6880 6 29 36 44 21 -42 -30 30 68 -32 17 -7 -21 -4 14 -37 -11 -4 17 65 -14 -24 -48 -80 -72 29 -1 -45 -25 -25 -23 -112 -120 -131
6913 -131 18 -78 75 -56 32 -157 39 207 -9 84 -190 122 -39 -71 82 39 68 67 16 51 53 -7 -74 -40 -57
6938 -57 143 -160 -119 -182 -327 84 -205 -288 -298 -47 68 341 -267 39 -38 112 368 -58 -96 -2 -32 -128 -66 20
$$ packed form
6729c00L53J17l1K88l13l2l54O7K81j87J54K7l8pq0K9Q2m1R9j77O9j3p5n2M1M6
6755d7m4J86N1j68N2m3lj8k9J16o6L8j6k8K0Q9o3lp4N3k2M9n8O9n4n7J08n8k7
6784d7M1j9L7l4j2Q3m9JM2k5l6O0k5L7kj8M5m3j6L7o0J2p9P4O1l9m4l1j4N1m7
6815e9Q1ko1J9J7j6k3O3m1k7J00n1n0Q3J6q9K3mJ0M1KPo8N9j5Jjj5m8L0L8n5N5
6848B0lnJ2Nm0J1k3N5p1l2O4K3k9l0K3O8o4J1n4L6L7q3N1J0O5m8J5L3n3J4l2K0
6880FK3PQk3o3J2O0L8j00M9k4j4J7J8n1K6PK1M8p9j0k4l2QJ01l0m4K0%Kq9qj1
6913a31J49r6J53j31Q8j89J96J68k16R3k74L12j61l2J53m3K9jn1L5Ko0o7L4j7
6938e7K00l03M1o3j45M11k89q3j0K51J15K73o08L06p7J50K56m26l8R4l0r6O2Q6
$$ plain form
6962 20 -31 -4 79 -3 67 55 -9 -65 122 -37 53 189 115 -68 149 85 -81 66 28 -35 -13 -50 -24 70 2 145
6988 145 -51 15 -189 154 63 -125 80 275 -165 -191 264 -155 -156 -181 117 -121 -78 -319 137 257 288 -5 -106
7011 -106 336 98 128 -335 -61 -37 -31 39 -174 134 -180 123 143 -180 -21 -197 212 -126 172 95 49 -43 -41 -134
7035 -134 22 -106 -22 -48 -1 -43 74 287 -88 385 64 34 143 393 217 59 -94 -326 -70 155 -10 33
7057 33 55 65 40 24 -44 -90 42 -73 -39 22 21 -98 -84 -7 -36 -83 -28 -155 5 -25 46 14 76 -238 -161 -131 -103 117
7085 117 -20 259 -203 -125 -40 -5 -214 -236 -71 -89 -135 -180 -115 -14 -38 52 -33 -20 -81 2 109 -45 -11 -38 -44 -60
7111 -60 -14 -89 1 -48 36 -21 -72 250 134 435 -40 -109 80 140 -69 104 45 22 7 -10 -146 78 49 -99 179
7136 179 107 -205 35 135 46 40 36 45 136 -32 56 37 80 48 -28 -47 -8 -23 -78 -18 -30 -28 -9 -1 -18 -53 -30 -11 -4 51 -2
$$ packed form
6962B0n1K7Q3q2P0j2o4n6J87j59R0J36p4j83K17o4j66J47l8o3K2l7K6R4o8J43
6988A45j96O6k04L43r1j88K05J95m40k6M55m19jk5K98k38M3k41M56J20L1k93j01
7011a06M42k38L0m63K74K4OP0k13L08l14L03K0l23J59j76M09l38K98p7m6r2Kr3
7035a34J56j28Q4k6M7m2J17K13l75M73l21l0J09K50j76j58j53k32K56K25j65M3
7057C3K2J0k5j6o8m6J32j15L4O1jj19J4P7k9m7N5j27J60l0P1l2O2l14P7L0K8K20
7085A17j37K79m62P8Q5L5k09k2J65j8m6m5O5J01k4R0q5J3o1Q3J07j54L4k7oj6
7111f0M6p5R0m9Q4n7n1L22j16L01m75o9J89O0k09J73n9k3j5j7j36K24k9j48K78
7136A79p2l12K40J00q9omRR1j68Q8j9M3l2p6j9L9j5n5O0j2KJ9Qj7l5K3J9PN5n3
$$ plain form
7167 -2 -25 7 -13 -16 13 -1 -20 -24 -7 15 -14 29 0 44 32 3 -8 -34 -2 -17 46 335 48 64 -167 138 -109 -101 -132 67
7197 67 -116 -14 283 -159 54 -66 40 40 4 -62 -147 -141 42 -113 19 -56 51 -10 31 -11 0 1 -29 -30 1 -14 7
7224 7 62 17 6 50 41 -51 27 22 60 11 -75 -4 -43 -32 -57 -26 -12 14 -37 -39 -31 -56 -44 -24 -64 -7 32 58 231 6 144
7255 144 -13 -1 84 13 107 -384 -266 -126 -397 120 -191 64 179 5 44 35 95 72 -123 37 17 -27 -112 -28
7279 -28 141 -163 74 -22 0 -76 -109 -94 52 1 -175 133 -5 80 58 297 76 168 106 60 8 -95 93 -54
7303 -54 57 62 69 40 33 -5 45 -32 39 -32 6 -19 105 -26 -19 69 38 -62 6 19 -53 -39 40 47 16 167 -253 32 -40
7332 -40 -49 56 -171 69 0 -102 -262 -29 -6 213 36 293 458 -79 -63 188 -52 161 156 -92 -28 -42 76
7355 76 -235 -149 170 36 97 93 -124 33 -73 -27 -50 -12 -71 14 5 54 -83 7 -28 -1 18 -4 35 -10 -34 -9 25 -49
$$ packed form
7167bk3L2k0lK9j4j9mJ7K2k9M3k9M4j2k9j1k6L2j5O3K89k87J6k31L05k47Ql1J99
7197F7j83J02K97m42K13j20J06%l6o6q5OJ83j55J32p5J07o1M1m2J1Jl0jL1j5K1
7224GN5m5j1M4rr2P8nL8m9q6P1l9J1k5L1J4K6n1kQk5J2K0m0N7L9K6J73k25J38
7255A44j57J2Q5p1R4m91J18J40k71N17l11K55J15j74L9rO0k3j95J60k0m4q5Q4
7279b8J69l04K37r6K2p6l3J5J46n1j76L08j38Q5k2K39k21R2o2m6n2j03J88j47
7303e4J11NPk9pl8N0p7P1p1L8k5J24j31PQ8l1j00O8J3p2J4P9Pl1J51m20K85p2
7332d0rJ05k27K40o9j02j60K33K3K19j77K57J65n37J6K51k40K13nk48O4j4J18
7355G6l11Q6L19j34O1mk17J57j06M6k3L8n9Q5rM9j37R0l5K7J9k2L9m5k4K5L4p4
$$ plain form
7383 -49 37 130 -258 46 93 71 -188 -10 -190 21 -29 -173 82 11 280 -30 273 -303 19 -285 132 248
7405 248 -11 -29 35 50 186 -345 -160 -165 112 -35 -251 53 -140 64 -61 52 27 -14 -42 19 -121 13 -34
7428 -34 -27 -104 -146 -64 -27 -94 137 -2 201 117 -21 95 316 264 201 45 0 -19 -110 58 -81 31 -37 9 5 32
7454 32 51 -43 -10 6 3 -9 -56 26 37 -60 4 22 -13 15 4 27 -6 38 37 -34 -3 31 37 59 1 20 -13 -19 -16 -37 2 23 -61
7487 -61 -14 -35 11 -80 -15 2 -79 -27 -18 -33 5 -44 -20 17 -8 -34 18 -18 12 16 47 67 -1 9 37 -19 -17 52 38 -82 -37
7518 -37 0 43 29 24 -27 5 4 -3 42 -63 4 19 33 -5 -6 -68 -42 -15 -29 18 11 -65 36 4 7 11 13 32 33 66 -15 -33 -12 -14
7552 -14 49 16 27 37 6 -17 -62 36 -46 11 93 46 -11 -14 -24 -29 27 -23 -5 20 13 -24 -1 -9 18 -41 -8 -34 13 2 -17 8
7584 8 -55 14 27 17 4 47 -57 36 -2 1 10 13 66 -16 -1 15 28 11 82 39 8 46 15 -8 -19 35 -16 -18 -15 -14 41 29 -30
$$ packed form
7383d9Q6R3l88L04M7k2k59J78j80K11n0j44K55p1K69l10L03n76L22l04M17J16
7405B48k59j8O4J5J36n31J85nK77j47k16L04j93K04j25J13k5m1k8O1j40J34m7
7428c4Pp7m2Q2L7o7K31j39K03q4j38J16K21n2o3j56m5j9r1J68j39J12o8M6mK7
7454C2J9r4L3J6lj2m7Q2J1r7O4J8l5K8j1K3l3M4jp1L1L4OK2n8J9l3oLk1L9K1q4
7487f1M7k1M6r1O5J7q1N2Rj5L8m9K4L7k5k6N2l6L0ML1K0o8J0K8n6KO9j4j20M5
7518c7L7M3j4nn1L2jpM5j05O7J5J4l8jo2K6K7j4M7pp6J01l2LMKJ9JL3q1j8K1k
7552a4O3l3J1J0l1k3m5R8q2N7Q2m7n7lj0nN6n0J8K5pl7K3qK7n9L3k6M7j1j9K5
7584Ho3O9J3j0j3M3j04R3l8LRLN3q2J5J6J3j7P1m3l1L8l1k3j1N4n1kLJN5j2n9
$$ plain form
7617 -30 -30 -4 -45 -9 1 -8 -38 -7 -7 6 -34 -50 -7 9 31 5 15 -55 10 20 39 -13 16 -23 -13 3 -10 -26 -35 -10 -26 34
7649 34 4 -35 -23 -13 6 -8 -28 -3 -10 11 -3 35 -16 34 -24 25 29 -42 20 -2 -56 -3 22 -20 14 -76 -2 36 -23 -8 -3 -25
7681 -25 33 36 -1 29 14 -34 -22 18 38 -3 -26 16 36 -12 -21 21 51 -11 1 -3 -39 -7 -18 -5 29 -67 3 -4 -7 -8 -35 1 52
7714 52 7 14 22 -17 71 -26 -46 -36 -74 3 -51 88 8 -10 -10 50 48 -27 -9 -6 -21 -65 37 18 6 31 13 13 -28 -6 -49 -13
7746 -13 -25 -61 -22 -35 -4 -20 -2 0 38 -30 -4 -64 -26 -50 7 -60 12 51 40 -15 -37 -21 41 -26 51 -17 5 29 17 46 -47
7777 -47 -32 7 30 -6 -17 -33 20 -44 17 29 -12 17 32 -42 24 6 -7 22 -7 -12 -18 9 42 -4 -4 -12 -45 12 -30 14 38 -14
7809 -14 -15 -8 -29 52 13 -2 -12 34 41 -15 13 39 60 -19 30 -9 6 -15 -55 -67 -14 -66 -57 -39 -9 4 -5 -11 40 -1 -10 -28 -14 -26
7843 -26 -2 -2 26 -18 12 7 40 52 63 37 13 32 14 22 22 -32 -37 57 33 -7 -6 -12 -50 -5 -16 -25 -14 32 63 -13 10 -10 -36 -57
$$ packed form
7617c0%K6m1L6J0rl0L1%J3m0j6M3J6K2k6J0p0O5J0J9n2K9l9J0J6j3j6rK5j6O0
7649C4l0l9J2J0J9j4k0K5pK1j4L8n1N0n8M9Mp1O2k2n4N3K5m2L4r0P4L8n9J5Nk2
7681b5N8Ll7L0j5m8J2M0K0m1k3M2K0m8rM2L0o2J2ml6L2j1J3L4r6P0pljk7L6N1
7714E2m5PQl9Q8r7k0J0l8P7n4J39q0j8%O0kp5J8Lj5m4J02j9j2K5j8%m1K2m3L6
7746a3j2l6L9j3L1j6J8KL8o8K6o0L8k4N7o7P2L9j1n5k2J6O2o7P7o8K2K4j2K9r3
7777d7J5L9K3l6j1j6N3o4O1J2m1K9J5p4O6j8j3K9k9noK7L3m6%ql3N7m2M4K4n2
7809a4jPk1Q1l9j5j0M6Pn6K8K6K1p9M9l9J5k1m0j2N3n2RJ8L0J3roN1m1rj8J4j2
7843b6K4%K8m4L0nL3J2J1k6k4J9j8Q%n4nR4k4m0Jol8M5j1rJ1M6L1p6K3k0k6k1
$$ plain form
7877 -57 -37 -33 -36 -57 -70 -24 -10 4 29 -54 -73 11 3 -44 -14 36 -17 24 36 38 29 -1 -56 27 -29 -22 8 22 -25 15 13 86 54 -26
7911 -26 -11 -3 -19 55 3 55 -10 25 -13 45 -17 -46 59 1 41 -3 -5 -19 10 51 50 0 44 5 14 -5 59 35 19 -16 -58 55
7943 55 18 9 8 -43 -30 -52 -7 16 10 -56 -3 -3 33 -46 2 -25 0 -32 12 -15 4 -10 17 -14 -4 48 -13 -52 -3 4 -67 6 30
$$ packed form
7877e7K0Mlk1j3M6J4J4K5q3j9Q4qm7L0N0n3M1J2Krl0n5Q3n6PL0J4m7M0kP3l2q0
7911b6J5Qj6P4n2N2o5L5l8N8o2k9J05n8M0m4kj4K9M1jn0M4l9Rj9O4k4j6l5m2J13
7943E5l7rjn1J3k2M5K3oo6N3%L6p9M8k7K5l2M4k7J9j4K7l1J0N2o1l9M9Pp1P3K4
$$ [...]
8191c2
##END NTUPLES=NMR FID
##END=
