##TITLE=1H_DE-80H_X3
 200.13MHz, d2o
 8 sc
 
 19ns.26.2.2025
##JCAMPDX= 6.0         $$ Bruker NMR JCAMP-DX V2.0
##DATA TYPE= NMR FID
##DATA CLASS= NTUPLES
##ORIGIN= UXNMR, Bruker Analytische Messtechnik GmbH
##OWNER= pz
$$ XWIN-NMR		Version 3.5
$$ Fri Jun  5 10:44:56 2026 Russian Standard Time (UT+4h)  Yarkov@DPX200
##.OBSERVE FREQUENCY= 200.1313
##.OBSERVE NUCLEUS= ^1H
##.DELAY= (6, 6)
##.ACQUISITION MODE= SIMULTANEOUS
##.ACQUISITION SCHEME= undefined
##.AVERAGES= 8
##.DIGITISER RES= 18
##SPECTROMETER/DATA SYSTEM= spect
##.PULSE SEQUENCE= zg30
##.SOLVENT NAME= DMSO
##.SHIFT REFERENCE= (INTERNAL, DMSO, 0, 14.3821)
##AUDIT TRAIL= $$ (NUMBER, WHEN, WHO, WHERE, WHAT)
$$ ##TITLE= Audit trail, XWIN-NMR		Version 3.5
$$ ##JCAMPDX= 5.01
$$ ##ORIGIN= Bruker BioSpin GmbH
$$ ##OWNER= Yarkov
$$ C:/Bruker/XWIN-NMR/data/yarkov2/nmr/H-C/1/audita.txt
$$ ##AUDIT TRAIL=  $$ (NUMBER, WHEN, WHO, WHERE, WHAT)
(   1,<2026-06-05 10:43:59.70 +0400>,<Yarkov>,<DPX200>,
      <created by zg, POWCHK disabled, PULCHK disabled
       configuration hash MD5:
       00 E9 B6 7A A2 85 ED C7 34 08 36 98 17 FE 4E 26
       data hash MD5: 16K
       47 F4 AF 83 4E D4 69 CF B2 A0 7D E5 AF C5 44 87>)
$$ ##END=
$$ 
$$ hash MD5
$$ BE A4 31 35 51 A8 2C 19 36 96 DF 02 2C 5D B7 F7
##$RELAX= 
##$RELAX= 
##$RELAX= 
##$RELAX= 
##$RELAX= 
##$RELAX= 
$$ Bruker specific parameters
$$ --------------------------
##$DU= <C:/Bruker/XWIN-NMR>
##$EXPNO= 1
##$NAME= <H-C>
##$PROCNO= 1
##$TYPE= <nmr>
##$USER= <yarkov2>
##$AMP= (0..31)
100 100 100 100 100 100 100 100 100 100 100 100 100 100 100 100 100 100 
100 100 100 100 100 100 100 100 100 100 100 100 100 100 
##$AQSEQ= 0
##$AQ_mod= 1
##$AUNM= <au_zg>
##$AUTOPOS= <>
##$BF1= 200.13
##$BF2= 200.13
##$BF3= 200.13
##$BF4= 200.13
##$BF5= 200.13
##$BF6= 200.13
##$BF7= 200.13
##$BF8= 200.13
##$BYTORDA= 1
##$CFDGTYP= 0
##$CFRGTYP= 5
##$CHEMSTR= <none>
##$CNST= (0..31)
1 1 145 1 1 1 1 1 1 1 1 1 1 1 1 1 1 1 1 1 1 1 1 1 1 1 1 1 1 1 1 1 
##$CPDPRG= <>
##$CPDPRG1= <>
##$CPDPRG2= <>
##$CPDPRG3= <>
##$CPDPRG4= <mlev>
##$CPDPRG5= <mlev>
##$CPDPRG6= <mlev>
##$CPDPRG7= <mlev>
##$CPDPRG8= <mlev>
##$CPDPRGB= <>
##$CPDPRGT= <>
##$D= (0..31)
0 0.7 0 0 0 0 0 0 0 0 0 0.03 0 0 0 0 0 0 0 0 0 0 0 0 0 0 0 0 0 0 0 0 
##$DATE= 1780641839
##$DBL= (0..7)
120 120 120 120 120 120 120 120 
##$DBP= (0..7)
150 150 150 150 150 150 150 150 
##$DBP07= 0
##$DBPNAM0= <>
##$DBPNAM1= <>
##$DBPNAM2= <>
##$DBPNAM3= <>
##$DBPNAM4= <>
##$DBPNAM5= <>
##$DBPNAM6= <>
##$DBPNAM7= <>
##$DBPOAL= (0..7)
0.5 0.5 0.5 0.5 0.5 0.5 0.5 0.5 
##$DBPOFFS= (0..7)
0 0 0 0 0 0 0 0 
##$DE= 6
##$DECBNUC= <off>
##$DECIM= 32
##$DECNUC= <off>
##$DECSTAT= 4
##$DIGMOD= 1
##$DIGTYP= 9
##$DL= (0..7)
0 120 120 120 120 120 120 120 
##$DP= (0..7)
150 150 150 150 150 150 150 150 
##$DP07= 0
##$DPNAME0= <>
##$DPNAME1= <>
##$DPNAME2= <>
##$DPNAME3= <>
##$DPNAME4= <>
##$DPNAME5= <>
##$DPNAME6= <>
##$DPNAME7= <>
##$DPOAL= (0..7)
0.5 0.5 0.5 0.5 0.5 0.5 0.5 0.5 
##$DPOFFS= (0..7)
0 0 0 0 0 0 0 0 
##$DQDMODE= 0
##$DR= 18
##$DS= 0
$$ [...]
##$SUBNAM2= <"">
##$SUBNAM3= <"">
##$SUBNAM4= <"">
##$SUBNAM5= <"">
##$SUBNAM6= <"">
##$SUBNAM7= <"">
##$SUBNAM8= <"">
##$SUBNAM9= <"">
##$SW= 18.0517328524113
##$SWIBOX= (0..15)
0 0 2 0 0 0 0 0 0 0 0 0 0 0 0 0 
##$SW_h= 3612.71676300578
##$TD= 16384
##$TD0= 1
##$TE= 0
##$TE2= 300
##$TE3= 300
##$TEG= 300
##$TL= (0..7)
0 120 120 120 120 120 120 120 
##$TP= (0..7)
150 150 150 150 150 150 150 150 
##$TP07= 0
##$TPNAME0= <>
##$TPNAME1= <>
##$TPNAME2= <>
##$TPNAME3= <>
##$TPNAME4= <>
##$TPNAME5= <>
##$TPNAME6= <>
##$TPNAME7= <>
##$TPOAL= (0..7)
0.5 0.5 0.5 0.5 0.5 0.5 0.5 0.5 
##$TPOFFS= (0..7)
0 0 0 0 0 0 0 0 
##$TUNHIN= 0
##$TUNHOUT= 0
##$TUNXOUT= 0
##$USERA1= <user>
##$USERA2= <user>
##$USERA3= <user>
##$USERA4= <user>
##$USERA5= <user>
##$V9= 5
##$VALIST= <valist>
##$VCLIST= <CCCCCCCCCCCCCCC>
##$VD= 0
##$VDLIST= <DDDDDDDDDDDDDDD>
##$VPLIST= <PPPPPPPPPPPPPPP>
##$VTLIST= <TTTTTTTTTTTTTTT>
##$WBST= 1024
##$WBSW= 4
##$XGAIN= (0..3)
0 0 0 0 
##$XL= 0
##$YL= 0
##$YMAX_a= 95083
##$YMIN_a= -92503
##$ZGOPTNS= <>
##$ZL1= 120
##$ZL2= 120
##$ZL3= 120
##$ZL4= 120
##$ABSF1= 10
##$ABSF2= 0
##$ABSG= 5
##$ABSL= 3
##$ALPHA= 0
##$AQORDER= 0
##$ASSFAC= 0
##$ASSFACI= 0
##$ASSFACX= 0
##$ASSWID= 0
##$AUNMP= <proc_1d>
##$AZFE= 0.1
##$AZFW= 0.1
##$BCFW= 1
##$BC_mod= 2
##$BYTORDP= 1
##$COROFFS= 0
##$CY= 83.5205535888672
##$DATMOD= 1
##$DC= 2
##$DFILT= <>
##$DTYPP= 0
##$F1P= 10.8118882576601
##$F2P= -7.23987719738617
##$FCOR= 0.5
##$FTSIZE= 0
##$FT_mod= 4
##$GAMMA= 1
##$GB= 0.15
##$INTBC= 1
##$INTSCL= 1
##$ISEN= 128
##$LB= 0.25
##$LEV0= 0
##$LPBIN= 0
##$MAXI= 10000
##$MC2= 0
##$MEAN= 0
##$ME_mod= 0
##$MI= 1.114404
##$NCOEF= 0
##$NC_proc= 0
##$NLEV= 6
##$NOISF1= 3.799351
##$NOISF2= 2.8
##$NSP= 1
##$NTH_PI= 0
##$NZP= 0
##$OFFSET= 14.38212
##$PC= 1
##$PHC0= -6376.443
##$PHC1= 8.221958
##$PH_mod= 1
##$PKNL= yes
##$PPARMOD= 0
##$PSCAL= 0
##$PSIGN= 0
##$REVERSE= no
##$SF= 200.129724274929
##$SI= 16384
##$SIGF1= 3
##$SIGF2= 2
##$SINO= 400
##$SIOLD= 16384
##$SREGLST= <1H.CDCl3>
##$SSB= 0
##$STSI= 0
##$STSR= 0
##$SW_p= 3205.1282051282
##$SYMM= 0
##$S_DEV= 0
##$TDeff= 0
##$TDoff= 0
##$TI= <>
##$TILT= no
##$TM1= 0
##$TM2= 0
##$TOPLEV= 0
##$USERP1= <user>
##$USERP2= <user>
##$USERP3= <user>
##$USERP4= <user>
##$USERP5= <user>
##$WDW= 1
##$XDIM= 8192
##$YMAX_p= 0
##$YMIN_p= 0
$$ End of Bruker specific parameters
$$ ---------------------------------
##NTUPLES= NMR FID
##VAR_NAME=  TIME,          FID/REAL,        FID/IMAG
##SYMBOL=    X,             R,               I
##VAR_TYPE=  INDEPENDENT,   DEPENDENT,       DEPENDENT
##VAR_FORM=  AFFN,          ASDF,            ASDF
##VAR_DIM=   8192,          8192,            8192
##UNITS=     SECONDS,       ARBITRARY UNITS, ARBITRARY UNITS
##FACTOR=    0.0002768,     1,               1
##FIRST=     0,             0,               0
##LAST=      2.2672688,     0,               0
##MIN=       0,             -92503,          0
##MAX=       2.2672688,     95083,           0
$$ Real data points
##PAGE= N=1
##DATA TABLE= (X++(R..R)), XYDATA
$$ [...]
1851g75J217J472o57j599j303R08J282R53n26j388j347L08J718J088n06j356j103
1868a614K71J528J363j91j472j057K93J270J194k0j418j474P6J347J055l3j339
1885b21j267k22J490J396N9j272j198j29J153J782K39j216j504j82R56J490K89
1902A643j210j620m51J127J345K82r12j715l64J222J586M56j084j147o53R50J770
1919A225O76j254j287n96P62J308Q37r38j855m63P46J305N50k91j592r84J039
1936h12J447Q70o43j146r01M14J759Q13q27j370o79N7J452R37o10j579o89L30
1954a177J390Q30j12j550r03O26J483J014o24q86j109P9J518J056n14j300q82
1971a061k35J110J360k26j422q70J64Q23J410J69j313j214L79J109J022J53p88
$$ y = [-775, 442, 1914, 1257, -342, -1645, -737, 545, 1498, 972, -416, -1763, -1455, 263, 1351, 845, -511, -1614, -1343, 185, 1548, 1357, -115, -1172, -879, 391, 1585, 1565, 147, -1327, -1251, 96, 1151, 1118, -221, -1488, -1710, -220, 1176, 1235, -37, -1235, -1364, -211, 1571, 1810, 594, -910, -1092, -136, 1354, 1643, 433, -1187, -1638, -511, 834, 1116, 204, -1511, -1875, -653, 933, 1389, 305, -842, -1495, -545, 1225, 1901, 647, -640, -1236, -474, 834, 1671, 733, -1122, -1585, -839, 466, 1016, 725, -867, -1851, -812, 635, 1505, 862, -284, -1185, -771, 988, 1801, 974, -396, -1075, -1018, 434, 1371, 761, -818, -1507, -1177, 213, 1043, 931, -619, -1522, -896, 587, 1601, 977, 91, -1018, -939, 579, 1635, 1121, -179, -1061, -1296, -186, 1174, 948, -474, -1344, -1180, -357, 1053, 1222, -91, -1305, -926, 183, 1205, 1358, 570]
1988E70j545k50J514P78m7q29j371l77J138J334o8q56j109j56P32J535N89j465
2006A17j017K8P66J064O24p97j841o8Q71J098J45m88j419o51Q97J378J99m33j103
2025f30n94O02J566N91p41j047n46L51J097R74q62j305n84M76O64R72k52j342
2043f10p10L50J180O27j3j103j086O97J271N78k75r36r16KJ191R14m62j167o20
2062a088J2R43J015j11j043q54K37Q10J123J06j051j101K52J151O78J74q48j233
2080h28k34J163P37K9p04j080l99R07J158Q7q26o51l44Q38J036M59q67j128j80
2099h27P31J042M36p61j271n26Q73O50M09k81j298p38R15J345K56n95p59n89N30
2118d58J386N01o41j106m68J43R84Q32n82j351m76L39R26O41k16j182n23N17J225
$$ y = [570, -975, -1225, 289, 1067, 1020, 191, -1180, -1557, -419, 915, 847, -9, -1118, -1274, -542, 993, 1582, 117, -900, -872, -106, 958, 1582, 785, -1056, -1124, -253, 845, 990, 502, -917, -1568, -671, 707, 906, 473, -630, -1224, -622, 944, 1535, 794, -253, -799, -448, 649, 1623, 761, -544, -1128, -652, 12, 984, 732, -610, -1320, -970, 210, 837, 824, -279, -1365, -668, 603, 1181, 906, -30, -946, -944, 247, 1161, 699, -468, -1088, -1076, -133, 882, 771, -272, -1126, -889, -79, 1044, 1150, 99, -1002, -750, 401, 1079, 1253, 405, -828, -1062, 101, 838, 867, 163, -917, -1316, -409, 749, 836, 10, -641, -985, -147, 889, 1348, 481, -647, -827, -96, 946, 1382, 621, -650, -1176, -303, 347, 756, 475, -823, -1561, -646, 699, 955, 360, -399, -988, -458, 928, 1429, 788, -318, -786, -643, 341, 1173, 591, -760, -1236, -897, 29, 670, 454, -728, -1251, -734, 491]
2137D91N59j99r77q08L28J167P16k84j066p64K6J026N15j76r27q00K96Q70R54
2156I47j45j129p83K90R36Q52N6j034p02J75Q26Q35j80q06r76r5P53R83j93q06
2176a96q49k51J083R54K67r08r14j22R09Q81L41q10j074j41N95R55K66q73q79
2195g66m89R78P40R4m22p89l95N34J105N09n44j116j89O08R22L28o39q71o37M26
2215f13J007M08k87j131o07O03J112L32l29q40o15N94J046K99m25p28n54L02Q03
2234C77P31l14r73o91K75Q85L27k87p26n92O4R26P51m0p22o36K18O83P47k04o38
2255A61p79j08Q31Q29k34q31p66N3N58Q97M7p21q90L3O92R63qm62q29j95Q99P52
2277H92P8p14q63l47P20P50K45o94q69j23L51R69J76m11q50j86O31R18L79o70
$$ y = [491, 1050, 851, -126, -934, -606, 561, 1277, 993, -73, -837, -811, 215, 730, 554, -373, -1173, -877, -7, 947, 802, -327, -1110, -820, 116, 968, 1024, -10, -712, -537, 289, 1124, 944, 138, -838, -933, -180, 803, 610, -196, -1045, -1296, -213, 741, 1008, 100, -814, -936, -27, 854, 1195, 385, -689, -830, -235, 720, 986, 113, -766, -1255, -277, 463, 557, 135, -654, -1049, -515, 590, 1099, 555, -561, -750, -142, 780, 1108, 469, -402, -1039, -613, 394, 802, 515, -616, -1223, -620, 492, 824, 495, -345, -960, -366, 680, 979, 554, -174, -728, -426, 377, 1108, 794, -179, -870, -595, 290, 617, 330, -396, -988, -924, 2, 753, 713, -9, -645, -427, 256, 1003, 799, 161, -618, -726, 105, 934, 700, -131, -897, -844, -286, 611, 658, -63, -953, -920, -228, 735, 727, 265, -564, -759, 140, 892, 970, 256, -607, -954, -234, 516, 761, 67, -802, -925, -574, 395, 571, 160, -690, -876, -245, 673, 1052, 382]
2297C82q31j34M13Q17L65m59r46n12N50Q57K28m11r27l25M39O72O49l31r41l91
2317h36L70P57P23l78p85o22M24N85O02k75r10n62L37O94N47k87p34m67J77P97
2337A57N91r9q41o30M50M59O77p3n84r78J82Q10L45K48o86q66o2P02P57P6o94
2358e9q01N9P38P21M02q96p15j58R15M88K40p10q14r3M68P48K8m51p66l47O20
2379c83J056j01l87n47j81L43Q86R3n11o38j79J55P99N07n87p78l62M28N44L45
2399E02k78q20k70N33O61M02m35n99n24M62Q34L36m51o34n20L36Q43M42m92p73
2419d45k94K12M98P65j69q50m71L96M30M93K37q90n39J12R03M07k33m75q81J63
2439f31Q48L76n8n83o59lN33Q92j31p70m89J60L99Q62K8q38n45L92M24K19K16
$$ y = [382, -449, -583, -170, 647, 1012, 553, -393, -905, -355, 502, 730, 319, -608, -933, -494, 178, 827, 496, -445, -836, -466, 291, 1014, 636, -149, -771, -347, 238, 840, 565, -345, -907, -570, 124, 671, 384, -350, -817, -640, 157, 748, 649, -192, -822, -372, 87, 764, 691, 107, -871, -689, 121, 466, 714, 28, -838, -900, -198, 559, 635, -59, -860, -801, -63, 658, 1060, 164, -551, -709, 206, 694, 934, 224, -590, -683, -215, 533, 561, 110, -656, -1003, -383, 673, 572, 185, -362, -543, -200, 686, 779, 268, -370, -549, -394, 405, 912, 325, -453, -815, -387, 157, 502, 224, -596, -866, -333, 328, 730, 295, -304, -828, -366, 468, 804, 353, -281, -801, -465, 378, 820, 328, -445, -739, -527, -29, 736, 567, -283, -754, -358, 72, 565, 802, -88, -627, -515, 388, 795, 562, 87, -794, -631, 217, 593, 535, -48, -707, -710, -177, 715, 584, -186, -675, -515, -116, 746, 774, -64, -609, -217, 207, 426, 642]
2460F42m02p81l01N83P49n2k59o10k83M95P19K04p84m23j7K02R79L23r09n31p1
2481e27M90M26J67m66n80k09M68M88J00j87o03k77M61P21Q9j77o33k78K57P33
2501D63L0k9n97m85K94M77M28m10n05l20K22M41O67k13p46m20M09N78L40j82o28
2522a86l69K59P10K07k00m83m61j17P55N41m09m00l02n5M84O50o1n96n67J46M70
2543A6N20R2l57q98J79N44L34P6l61p95j53Q15M56o5n35m15n7L12P82N6m12n07
2565c73p2L67O12L45p98k94l32K77P48n7j86q83k8M01N07K91l42m85k42K55P06
2586D17K89l68l59m50K53M95K76k62n85m01N19L43K99k51m57n39K94N61M00q4
2606C90n25l72J99P45K36j13o73m03J50L97M68k02m94m25J45M75N56j10p97j99
$$ y = [642, 240, -541, -842, -259, 490, 438, 179, -431, -714, -219, 500, 704, -80, -503, -520, -318, 661, 984, 75, -456, -527, -37, 389, 556, 90, -490, -699, -231, 257, 357, 170, -433, -710, -249, 472, 561, 384, -249, -527, -270, 463, 493, 464, -133, -618, -324, 153, 581, 171, -334, -654, -432, 9, 676, 463, -283, -703, -294, 284, 624, 442, -186, -555, -296, 414, 621, 421, -62, -523, -640, 115, 656, 247, -153, -455, -510, -26, 624, 563, -33, -600, -454, 16, 536, 628, 271, -627, -448, 96, 430, 506, 145, -650, -803, 12, 468, 403, -132, -547, -604, -292, 490, 546, 134, -373, -445, -78, 534, 879, 81, -213, -545, -268, 480, 423, 237, -646, -674, -273, 234, 525, 183, -302, -544, -289, 417, 706, 338, -21, -471, -218, 277, 553, 291, -294, -695, -176, 167, 466, 215, -242, -781, -487, 74, 474, 390, -135, -507, -308, 437, 673, 560, -113, -516, -366, 31, 499, 297, -197, -622, -477, -2, 554, 444, -353, -552]
2626e52J74N18M45j26m80l58J86L60M62j06m69n18N2M85M88p8n44o11R2M46M09
2647B75J93n84m92K25L51N40j48j53m42k06M44N08j25r5m45l25J73P71O5m39n57
2668d66n9L49L47K59l06l36k56K65O16J23k17o30m0J78N48K43m99m97j67L93K36
2689H4L26l32l63k49K88O44Q7k24l79k74K91M16J82J5o16m17M09K65L21j67l94
2710h7n19M11K23K68m5m13l07P9M67M99k00l51n26K78M34L13j55k91n84NN26M15
2732D40q3m96l62j5M09K18K72m35k04j79L97M86J43m16m35k13N38L82N4l64l78
2753b41j43K39L77K01m34k40k13N4R24j30k27m21pK12N50P3l81l72j41N3O01J03
2775D37k87n02j39K79M57J59l32l86l92M20N27J43q7n14l0R4M77K1o8l54l32J02
$$ y = [-552, -378, 140, 585, 459, -21, -379, -193, 167, 629, 523, 54, -464, -412, 73, 561, 483, -61, -672, -580, -134, 275, 468, -116, -608, -383, -32, 508, 360, 207, -235, -441, 3, 511, 386, 291, -154, -479, -306, 465, 530, 91, -466, -525, -176, 171, 430, 124, -212, -468, -203, 413, 536, 319, -311, -351, -173, 375, 618, 119, -378, -545, -152, 84, 410, 78, -285, -534, -246, 398, 485, 261, -118, -392, -101, 315, 497, 512, -104, -521, -112, 153, 474, 307, -87, -606, -195, 28, 296, 251, -162, -469, -390, 77, 576, 376, 25, -501, -223, 211, 524, 369, 78, -506, -501, 25, 440, 357, -139, -501, -516, -107, 111, 383, -52, -256, -435, -38, 448, 591, 175, -260, -473, 65, 447, 501, 137, -241, -384, -145, 232, 433, -1, -241, -454, -400, 524, 394, 167, -254, -261, -49, 501, 574, 193, -179, -320, -267, 334, 437, 150, -352, -491, -212, 245, 404, 72, -314, -706, -286, 241, 384, 297, -217, -247, -153, 324, 345, 277, -77, -409, -307]
2797c07L88M63l20l22l19O1K18N32m8m52l33K84K49J61J65l98k27R4L69J31J04
2818D93n47k16l9K49K06M5l34l41j74M99M96R8l75k94N9J36M02J46k91n74K56
2839a00O9L04J49n28l50J33L12M9J07n5m25j32N49L71q1k99k81q9J88M12J59m51
2861A1k66k6J28L75J46j65o36j11J76K68M03j05m85j19L36K79L39l06k27l98J40
2882b43M67K71l12k74l57R5M77J84k30k71k14K55J71L36p8m82r9K20K04K55n7
2903C18k24k97j08M32J24P2k28m48p9M71L75k04l57j50Q1J65K55J58l90l42K58
2924a18O5K86J36k36n42K00L33Q3n8o7n23J8L23M70k77J3m15n4L04M20p3k55j40
2947a07m1J8L07J83l08k72k77L90J52K47j94l63p4Q4L89J48j42l9m05J64L63j11
$$ y = [-307, 81, 544, 224, -98, -417, -356, -138, 394, 346, -106, -439, -155, 94, 255, 420, 22, -205, -111, 258, 389, 493, -54, -270, -309, -60, 146, 191, -143, -484, -658, -159, 337, 435, 60, -234, -175, -39, 363, 509, 218, -356, -100, -31, 273, 422, -106, -456, -323, -11, 38, 145, 90, -335, -467, 82, 453, 372, 73, -208, -297, -109, 303, 462, 11, -255, -281, -153, 222, 368, 203, -433, -544, -368, -100, 303, 198, -287, -406, -70, 209, 548, 242, 15, -383, -243, 224, 495, 183, -91, -448, -353, 124, 308, 78, -193, -407, -152, 19, 355, 277, -205, -304, -84, 120, 375, 318, 94, -203, -311, 121, 245, 317, 89, -359, -438, 33, 408, 204, -153, -303, -222, -57, 198, 356, -34, -376, -118, -53, 233, 369, 133, -409, -209, 124, 207, 149, 82, -441, -423, -100, 370, 93, 106, -309, -363, -59, 361, 288, 33, -107, -148, -130, 177, 360, 52, -220, -497, -107, 45, 292, 98, -265, -339, -255, 134, 282, 140, 101, -304, -140, 223, 112]
2969A12J05l86k0J75P6K21j19j64j85r0L44P6nj35l31J26K89J66j5l19l52J91
2991b40N36jl2l35k43J04L63K54k80k03j90K0L80K24k62j53j23o5K42M15n6m9
3013C06m14j17L12L11j11j27l24l3M2K80K09l32j92j53K56N35Kl07m01L1K95K17
3035B85K0j15k15r4M2K07J91k34j65j36O0L71l9k83L4k15J21R9K29m1k25j82J91
3058i4K40R0ml09j16J33L16M5j40l83p3P5L78n1K4j61p1j93J97K80k8k20j52J82
3082c5K30J14l5o7m26R8O2K30rk92nj46L54k2K52m22k12J17L58K08n9l50j43o0
3106b60K00K58R5l04k85o6K10K67O4j80j79K4J25K38J15k75l44J11K00K05j5O
3128B10m70Q1j10L44J00j59j34j78R7L16n3r0q7j60J82J43J62j10n0l01L00n0
$$ y = [112, 217, -169, -189, -14, 62, 283, 164, 0, -185, -275, 69, 145, 140, 5, -326, -200, 89, 255, 240, -79, -431, -240, 296, 295, 263, -72, -315, -211, 152, 406, 126, -77, -267, -247, 133, 357, 95, -58, -181, -246, -4, 411, 355, 306, -108, -225, 87, 398, 287, 160, -164, -197, -155, 125, 334, 2, -190, -343, -87, 448, 450, 143, -258, -227, 68, 285, 305, 190, -25, -119, -77, 130, 321, 87, -78, -214, -154, 217, 178, -105, -71, -286, -165, -66, 163, 122, -103, -285, -94, 146, 236, 232, -77, -193, -60, 256, 301, 161, -222, -295, -220, 158, 107, 131, -30, -101, -294, -97, 183, 155, -65, -217, -35, 195, 309, 274, 207, -219, -121, -59, 171, 162, -130, -135, -281, 73, 51, 303, -119, -331, -214, 144, 352, 293, -57, -200, -260, -60, 198, 293, -11, -296, -362, -152, 115, 179, -1, -180, -156, -31, 207, 322, 47, -297, -186, 14, 219, 204, 210, -260, -179, -289, 55, 155, -4, -138, -316, -219, 97, 44, -46, -133, -293, -111, 32, 194, 84, 34, -267, 33, -17]
3150a7M3K04m26r1Q1J54K32k27j54k85K43L47K22k46j01k70L7L57K00j57j59q2
3172i5Lj4N15j82j94j89N1L4K85j14k12n9k53M76m7K18q9k51Q4o9K91n0k13k1
3196i5j95K73R8N6j3l05o7k9L74O2m4l76m6J08N09q3k57q9j24J45L34Nm4l47k01
3221c51L13J90Q0j35l11j1M0L76j84N4j55k2N5J02K96J8j53l53K14J45k2pl23
3244a44O4j47M26j40M3l86K18r9K52M2n8j06j52J9K26J54j57n8j50Q5K31J88n7
3267B94j20l65L9K41N8K6k22k33J07J35K78O2k64j11N0m1J20L17j24o39K24J15
3289e3K57j54L2j45k40J32K97Q0k43J5k46J22M12l8k39j05j4j5M49j52r2l05N7
3312a88n7J96J73j50n0k03K11K07J54k69k08j52J84K32J51m8j30k50J14R5L18
$$ y = [-17, 26, 230, -196, -287, -206, -52, 180, -47, -201, -486, -243, 104, 326, 80, -21, -291, -254, 103, 303, 146, -13, -95, -92, -106, 409, 227, 33, -156, -105, -71, 214, 100, -112, -171, -424, 52, 5, 223, 134, -117, -33, -102, 189, 139, -74, -95, -290, -17, 81, 137, 124, -181, -248, -277, 97, 159, 115, -261, -307, -199, 310, 227, -30, -119, -243, -98, 236, 241, 197, -150, -351, -38, 152, 232, 97, -214, -225, -185, 191, 7, 61, -94, -116, -61, 41, 337, 355, 202, -151, 63, 208, 186, 179, -144, -80, -227, 199, 59, 102, -284, -66, -165, 87, 129, 71, -35, -187, -168, 58, 212, 55, -3, -153, -68, 163, 351, 294, 174, -191, -152, 89, 147, 173, -49, -282, -175, -40, 238, 300, 36, -75, -25, -66, 54, 371, 247, -392, -168, -53, 204, 50, 82, -63, -303, -171, 126, 206, -37, -22, -268, -146, 266, 228, -11, -116, -130, -145, 304, 152, 60, -245, -188, -245, -49, 124, -26, -76, -279, -68, 139, 293, 24, -184, -336, -152, 80, 231, 183, 53, -197, -83, 12, 330]
3333C30j17k42p3q0K00K3K6j75J46k71K76K45o3l38J39K1R5J9j9m9r3j59J89J48
3357A78k24J09k41o2M17l5j02L4j16M0JK84j02p2j41j57N0M60j65k07j03j60L12
3380bj1K59k14n1j99K56l8J15L5j20k43M4L52n7q0k16J17j61K73N2k1k19j03K37
3404ER5J31j96j09q1J13J93j26K08k61k54M2L72O4J7k20j34J21mK67k33r1k23
3427c04j2L28K67l23J43j98k1M4K31j11j43L5o8P6J18j1j60J52k46J89J44J95
3449C25m02j14J64j45L44O4j71r2j37J04J44k2J6j55n2J32J62J36k19l40J23R3
3471d2m8K35j85p7M5J66M4P2k57J40j68j57K27K50o8l03o2K65j40J38K33m39r9
3494b30P6N9K34R2m05m5J28J42J55j16j76m5j4rK76p8j11K7q5J11J38M2j56r0
$$ y = [330, 213, -29, -102, -182, 18, 41, 67, -108, 38, -233, 43, 288, 225, -113, 26, 47, 142, 161, 142, 93, 0, -159, 30, 178, -46, 63, -178, -240, 177, 142, 40, 74, -42, -2, -1, 283, 181, 109, -32, -189, -139, 321, 156, -51, -154, -314, -2, -13, 246, 32, -19, -218, 38, 0, 115, 150, 30, -213, -169, 183, 126, 46, -170, -53, -214, 59, 111, 90, -129, -232, 5, 100, 231, 35, -74, -155, -42, 151, 25, 233, -28, -282, -240, 132, 196, 213, -7, -141, -20, -24, 243, 10, -81, -304, -316, 12, 279, -44, 99, -99, -120, -76, 155, 44, -99, -64, -132, -56, 62, 51, -109, 43, -203, -14, 130, 325, -77, -191, -27, -172, 172, 236, 65, -27, -164, -60, 84, 62, 78, -77, -129, 3, 165, 301, 82, -258, -135, -42, -90, 145, -40, -117, -72, 94, 138, 210, -47, 93, -75, -232, -5, 245, 177, -126, -188, 77, -63, 75, 308, -131, -230, -154, -95, 139, 231, -174, -219, -91, 51, 206, 90, -86, -131, -145, -154, 122, 44, -67, -40, -125, -14, 124, 166, 10, -80]
3518h0j64K47O5L30m24k00J73J2K68R4m07k36K25J04J26Q2j14l40O2K70k5J45
3540B13k36j6n2m7L14k2j73m6k22K63J42K92k86q9l57K79L30k19N0j81k43L55
3562D9O2nN9j75j53N8M20l7j57k81j56L34O6J59j62l43K53ok1J60oj78k55L05
3586a0J31O6j17k58L7l7K14J08L4j82j79R2K11Q8j08o8l35J28P1L49r1k55j57
3609b68QL38K65k87j52j49k4K43L06K0l11j38n6J72J34J09j09k0k06m6L25j31
3631B3j6k5j05j4M13r8k48k3rL8K50j15j55j58K73J1J59k6j34r6j13K29N2R3j11
3656I5k21q2Q6K72Q6j96k67J02L2L27j07m7l41J28K7J15K23j19l28R7N9J07J72
3679B20j47j05j95J17L60j7K22n12k68J36L01J3L06l40p3j31R9K15j18j77o5o7
$$ y = [-80, -244, 3, 68, 398, -26, -226, -53, -41, 227, 321, -86, -322, -97, 7, 133, 215, 101, -239, -177, 93, 68, 213, -23, -39, -91, -138, 176, 154, -19, -65, -287, -24, 118, 410, 124, 35, -322, -43, 287, 68, 118, -63, -306, 49, 111, 106, 165, -10, -163, -105, 315, 278, 121, -160, -316, 18, 84, 243, 81, -262, -9, -15, -36, 124, 118, -60, -315, -10, 121, 187, 70, -188, -151, -188, 26, 134, 168, -14, -193, -101, 110, 198, 90, 22, -313, -185, -114, 235, 144, -111, -268, -260, 78, 343, 56, -96, -245, -269, -26, 280, 300, -11, -149, -205, -33, 101, 210, 101, 81, -125, -171, 154, 23, 7, -18, -123, -137, 276, 178, -70, -93, -102, -64, 186, 71, -84, -242, 31, 42, 201, 175, 41, -55, -168, 61, 113, 206, 95, -126, -208, -122, 150, 236, 40, -227, -125, -93, 234, 127, 80, -261, -133, -106, 9, 232, 113, -215, -118, -59, 48, 220, 73, -32, -227, -110, 250, 233, 455, -57, -325, -189, 112, 125, 431, 91, 18, -113, -14, 201, 83, -94, -159, -226]
3701b26K83K11j24rl42j9K21J98J1j91k69N9J56J97pk52n1o4J45K25L2k10k05
3724b31L3rM62jn3l40j29L30R0P8j29m28J84M0K44Ln9k51l7J69J83N6j5l82l0
3749b22O5K92Q4j51j82m4J06P7J5m4n0k03QL33K16j95k26l8J59N8P1L3o02K50
3773a90K2J76K73k34r4j39j3K87P0K4l99%K11j35K35P5j15k29J55O9ML98m99l32
3797c80J71K03L29j44l60Q7k02K62K40j83Pj96P0J18J58Mj65l0k38J45K86p5k09
3820a02M5n8P7J94qk08l06L53O0J37L3m1l38j17L2L81k7n4k40n2P6M37m4l39J81
3845G2m10K89J06%Q7j42k99K10J00K47k08j58k20J75K63J98l32j93p1K45M6L66
3867C71k33l9j75r7K12j5J72j49j90J70p8L20r3k45j10M1K40j7Q7k65j11J12K28
$$ y = [-226, 57, 268, 144, 135, -207, -226, -5, 193, 204, 13, -256, -197, -41, 156, 149, -103, -154, -218, -73, 152, 184, -26, -231, -198, -207, 255, 254, 201, -139, -268, 62, 152, 230, 101, -327, -143, -103, 141, 144, 85, -166, -203, -34, 149, 205, 190, -192, -222, -157, 135, 219, 68, -114, -158, -52, 25, 40, -4, -54, -257, -249, 84, 300, 105, -121, -159, 0, 58, 129, 162, -440, -190, -168, 8, 281, 47, -47, -186, -199, 88, 158, 182, -217, -217, -6, -141, 94, 169, 54, -175, -20, 49, 53, 451, -48, -380, -209, -6, 323, 179, -181, -94, -296, -34, 206, 23, 30, -166, -96, 22, 180, 184, 19, -11, -249, -104, 182, 107, -102, -57, -115, -38, 156, 148, -60, -366, -13, 47, 184, 217, 176, -162, -279, -247, 134, 107, 53, -187, -239, -163, 274, 230, -109, 72, -338, -49, 57, 57, 144, 2, -297, -87, 13, 260, 52, -106, -326, -151, 112, 310, -22, -215, -286, -41, 5, 371, 138, 99, -76, -173, 39, 24, 196, 47, -143, 27, -51, 269, 176, -69, -179, -138, 102, 85, 172, -93, -204, -92, 136]
3890A36P8p9k28r4R8L9L73k76j18L9j99J86J8J36j03q1j45K93L3m9J5p9k20K34
3914GP3K08k32q3j9M6P3M7J37l51k14K51J08J16k68K2l1L2J57J34J8l24j36J19
3938a10K63p5n6j17r3J59K24q9o6k08j53K47K28Q9j23j64k14Q1J96M35n34or0
3961a76k9L76j25K71m11j09J92N3J46q5j38k66j0L75J51k7k21j79M8J74K19q1
3983A48k87o1q2M88J4q3l00q0R9J5L25j32j0l66J70Q8K95J21l24k73n2L73J46
4006B32L7l20r6L9nK29o8O6l33Q2n1M35j12k64j41qL28J69j5j20l34J25L0J42
4030D7J63q1j53j57J19K78kj10k05k29K18K05P1j10j52j93K38J03J15j57j17p1
4052a80J3J42Q5J04k81j55J35K86Ook91P2m5J90J62j32l99O6J35K10J14j53m0
$$ y = [136, 214, 135, -93, -187, -89, -50, 323, 47, -71, -32, -231, -45, -27, 109, 6, -75, -220, 73, 106, 57, 72, -7, -227, 7, 80, 288, 56, -27, -46, 0, 73, 120, 257, -94, -308, -57, 51, 167, -101, -79, -110, -78, 79, 213, 231, -93, -229, -110, 153, 78, 22, -95, -188, -29, 195, 106, 40, -168, -321, -74, 154, 243, 120, -44, -258, -177, 19, 454, -80, -86, -176, -205, 171, 46, 317, -94, -203, -11, 42, 188, 103, -35, -301, -311, 64, 215, 188, -33, -212, -164, 10, 229, 148, -139, -200, -282, 206, 220, 137, -163, -243, -144, -129, 196, 64, 54, -312, -142, -54, 241, 362, 38, -235, -287, 86, 232, 269, -51, -147, -108, -113, 116, 48, 114, -219, -137, -188, 247, 135, -129, -270, -278, 50, 219, 204, 84, -250, -125, -95, 47, 210, 129, -24, -181, -62, 216, 214, 104, -101, -330, -112, 93, 164, 54, -98, -291, -53, 50, 165, 8, -109, -180, -167, -25, 60, 164, -117, -272, -137, 149, 155, 149, -142, -70, -115, 75, 237, 105, -294, -228, -93, 117, 231, 78, 38]
4075C8j41R8M0K47j84j12l35K12L07N7j8l37q7J3K73L28r5l80k5k19K82M57j90
4098B29j71q9k30L67P1rj7n36L42o0K73pk48j65l2K00K69L6j21k14j57R6L07L28
4122D62k61m11j89L60J78N8j66J5j30K5K80J30j81m37J66P5J85L0k04r4j56J55
4144a10K12M1m8m3l85R6K60K0P2k63q6J49Q8K39r4k11k08J0K80J13k5ol00j33
4168c32M91J74k40n6l65O2K57Q4j23J16l50L8K68K5K54l93qj97L16P0R2m5l62
4191b24J5K33N7J58j75j36N2J40J24L2l85j41q2K63L70L7m36j43j6J66L14K4k74
4214b7j64q2L17mK00p0l69k0j4L46K46l37k28k2J68N02k32j68k66l2K67N7J77
4237B45k43j64p1J35K12N4j04j01j82N2L75N7n1l28j25K65P9O1p0j36l46L58J91
$$ y = [38, -103, -5, 35, 282, 98, -14, -349, -137, 170, 227, 209, -128, -215, -202, 71, 399, 304, -76, -101, -320, -38, 419, 229, 58, -31, -261, 106, 177, 168, 151, -385, -43, -103, 170, 163, -85, -250, -282, -82, 187, 223, 102, -112, -269, -173, 134, 462, 201, -210, -399, -39, 139, 197, 31, 46, -84, -59, 221, 351, 170, -267, -101, -26, 159, 189, -15, -109, -265, -110, 102, 143, 95, 52, -333, -237, 23, 43, 115, -148, -234, -85, 3, 242, 148, -63, -271, -261, 19, 132, 107, 101, -199, -332, 159, 333, 93, 37, -328, -266, -9, 75, -48, 68, -282, -244, 24, 49, 303, -90, -98, -295, 21, 91, 183, 138, -224, -209, 24, 81, 239, 64, -72, -20, 120, 244, 276, -109, -250, -332, -69, 301, 338, -98, -241, -257, -91, 223, 247, -27, -191, -273, 44, 40, 240, 170, -199, -219, -233, 113, 359, 22, -206, -228, -60, 442, 210, 42, -224, -256, 11, 68, 245, 2, -162, -233, -98, 114, 168, 64, -37, -219, -167, 208, 265, 214, -114, -239, 26, 105, 166, 96, -40, -386, -28, 163]
4260A63K11k98q5p5k03M61O3j13l37Q9j37L06K96r0l81J9qJ18P5J22l60j36O9
4283b31J91K43j97r0m47N00J85J3M8k10j82j50K59K29J41k67l39N4J07M50p9k39
4305a1k14J94o1K28N8j93j54q8K60J51l3j23l14q1M94O8J0l46J8j89K08J14J85
4328A81j40l06J48P0J94J12k44j05m9J66O5J62j16k37JN9M18j73k15k1l10K33
4350a07L32N4k86n6j14pL89Rj32j89k13K24K28M7k15k7k19K59J70o6O1j88j93
4373b39P0M34j23o3N3j20k32K88J28ok73k25J56J69J06P8k57j95J98o1K29J34
4395B49j29l12P1O6K21P5l06p1j44K08K91k6k62L2k22J5L70P5j65m67J32L12K64
4418B77q6k27j44J47J50J70j52r5k37L5j12M71L8j39p3k77K42J08N5M5k15l25
$$ y = [163, 374, 76, -9, -84, -287, 174, 237, 124, -213, -124, -261, 45, 341, 251, -130, -111, -119, -1, 74, 196, -164, -300, -231, -40, 203, 6, -84, -531, -31, 154, 167, 215, 5, -177, -327, -68, 161, 302, 35, -304, -250, -143, 307, 228, -11, -225, -31, -92, 136, 194, 1, -153, -241, 19, 170, 137, 14, -300, -381, 113, 181, 191, -155, -137, -326, -118, -4, 181, 41, -265, -117, -47, 147, 259, 15, -90, -139, 27, 92, 254, 138, -99, -98, -39, 379, 206, -9, -30, -340, -107, 225, 279, -7, -63, -177, -184, 205, 214, 82, -107, -320, -96, 132, 179, -36, -63, -282, -23, 147, 81, 142, -46, -239, -169, 265, 142, 79, 132, 12, -220, 68, 196, 190, -83, -308, -152, 17, 123, 201, -56, -251, -53, -114, 115, 249, 120, -192, -121, -55, 166, 241, -65, -136, -280, -72, 219, 193, -69, -37, -259, -244, 126, 201, 36, -431, -299, 13, 277, 191, -36, -180, -33, 117, 287, 135, 40, -197, -162, -274, 197, 235, 96, 23, -254, -12, 96, 151, 196, -19, -344]
4440c44L37J05R4j11j94j29J36L40j49l4k05j17L02o7K19nk50j19R3K05L73m69
4462A1l8k86K88J38j5j84O5j14j03K55J29jp7j20j22L33J36q6l18j39J4L86J2
4485A64n9p1k24K4K73J07k34n4j49J4J34L68n1l10j74R1J59K06Qk57j94l8M20
4508A53R4q7l49J51k17K97J80k6j54l07J77P2J37j8j09k94J04J40L33j51J9k86
4530a41O0K14J8M3k16m0k00J91J86k2k22q3M5J64J3L22l28j33OQ4P7N4q4k52r2
4555c36K29J80J5l1j64j3r0L22k5K6k49q0m0M50J4j66j52j66K20oK41j22j18M0
4579b1k25L22JL0j18k28j0L95o6k2p7j76J31K34L4j45J6l09m2L16J52O5j54j50
4603d7q4O4L34j48j35j84j21M41qN4k50n2j36J88M40j58l86qL3K33K78l59O3k05
$$ y = [-344, -7, 98, 192, 81, -113, -242, -106, 234, 85, 51, -154, -271, 31, -36, 183, 178, -72, -191, -98, 107, 480, 11, -27, -313, -25, 113, 98, -86, -21, -135, -238, 17, 146, 145, 68, -52, -174, 159, 295, 209, -109, -248, -234, 152, 164, 105, 34, -190, -166, 107, 214, -20, -74, -223, -209, -75, 293, 242, -68, -242, -151, 8, 214, 222, -35, -229, -267, 153, 247, 160, -189, -38, -255, 42, 222, 196, 42, -265, -88, -16, 121, 103, -6, -300, -196, -56, 277, 126, 145, -141, -81, 133, 151, 194, -22, -62, -262, -71, 115, 93, -129, -212, -167, -3, 10, 332, 4, -129, -123, -39, 38, 92, 8, -244, -336, -107, 73, 88, 57, -107, -120, -210, 112, 87, 113, -136, -216, -256, 194, 208, 42, -110, -276, -56, -62, 179, 57, -61, -21, -246, 76, 77, 107, -11, -239, -249, 146, 80, 58, -19, -195, -64, 170, 204, 59, 75, -234, -276, 40, 192, 257, 103, -47, -131, -67, 267, 119, -16, -200, -321, 120, 112, 166, -84, -136, -272, -84, 356, 198, -188, -196, -163, 70, 348, -11, 52, -153]
4627a53O8pQ9K49k84j65j5K98O8j76O5k13j56J65K99r1j24k2k26K55P5K15r7j76
4651e9l29L08J70nM5j3l61J73L07j85Qj66j47K92L0K23P0m92Q0q5L20L3%k82n3
4676a18j9J51K94k42N3k89J46K5K19Q1l23k00K07lK05j24p3j57nK26Q0lk34j91
4700b94R9R7L92j97k19Kj71M25J23j80r8k79J57K08J12q2r0j20k9N6K88m7l04
4723a51p2k7J98K08pq7l11O8K22J09P5k59k4j85J74K46K2k20p3q2J35K04N2k29
4747a4j76J06nK27l3M9j87j33J96K79j27j20l14J98O6J22J60j45k84q7K77j6K51
4770B90k57j04j6K33l2J93j85j21r0R5J82M5k33j73N4j01K72O7lr2k55J42L03
4793B14j03Q5l00o3K4N3K75q0k78j4J50O4J02Pk29n5q8L42P2j87j04j26J05K25
$$ y = [-153, -85, -92, -3, 246, -38, -203, -218, 80, 148, -28, 37, -176, -332, -167, 132, 41, -83, -105, -331, -76, -1, 214, 117, -59, -388, -80, 90, 85, 130, 117, -244, -71, 236, 51, 59, -107, -254, 38, 68, 291, 361, -131, -51, -136, 184, 217, 217, -65, -118, -137, 14, 308, 66, 119, -170, -24, 1, 220, 301, -22, -222, -15, -18, 187, 63, -10, -167, -172, 54, 134, 131, -103, -294, -195, -98, 294, 97, -122, -120, -291, 134, 257, 77, -21, -300, -143, 65, 177, 95, 5, -115, -144, -88, 200, 153, -151, -223, -250, -52, 156, 149, 62, -249, -181, 41, 150, 225, -34, -58, -243, -69, 177, 199, -21, -94, -176, -41, 163, 215, -14, -190, -84, -89, 138, 105, 154, -33, -166, 30, 309, 182, 62, -252, -54, 12, 134, 294, 149, -135, -222, 55, 39, 290, 33, -71, -87, 146, 114, 307, 122, 1, -89, 6, 188, 233, 0, -173, -119, -220, 52, 119, 116, 24, -231, -89, 214, 111, 196, -104, -167, -143, -90, 185, 105, -173, -187, -37, 27, 129, 136, -93, -148, -236, 106, 178, -9, -113, -239, -134, 91]
4817I1J83k08j35l9L5%K53m2k54k9J71P2n4Kq9j86J22Q8J86K8j68j70j91L51K60
4842B77ok40m5jM2J18j9k10p4j6R6J68O1J9j34l19M6K31L03j85k49k3K32o4K02
4867B10k88k1j84L09P0J33k29k04l1M3L09J55k14k28L6O9Q0O3Q8k14j24J07L42
4890B77k21J9j19r1J83o6o3Q5j59N5p6J83K96j83j85o0J25K8K17k51r1k4K6K57
4914A62O7r5j51j56k4K46J50P2l76j53o9K50J99K78l57j19n3M9K37j6q4l1k35
4937b09K76K7o1k00Pj4N8K20p0k8j89O7O5klK2j87J8K35N6j37J60k35j42K40M06
4963C80p8l16j68r5L36L4J63j86j20j12J37J84kj45j64o7K14J33K8O1l30J75J5
4986G7R8r2N3r2k37J70P8K37k88j35P6L6J90j39j09j13K25k83N84l52lj09q8J37
$$ y = [91, 274, 66, -69, -108, -73, -73, 180, 138, -116, -145, 26, 98, 44, 46, -43, -229, -107, -19, 167, 195, 27, -143, -334, 17, 277, 271, 31, -14, -15, 27, 145, 126, -84, -158, -174, -78, 90, 151, 170, 36, -283, -237, -6, 297, 112, -137, -160, 72, 8, 210, -78, -99, -283, 26, 96, 229, 0, -204, -235, -192, 117, 272, 58, -170, -134, -65, 15, 78, 166, -48, -172, -65, 277, 56, 75, -44, -135, 48, -18, -81, 4, -155, -100, -176, 7, 303, 120, -65, -125, 0, 28, 245, -6, -97, -121, -95, 162, 229, 134, -17, -173, -197, 49, 199, 271, -105, -258, -327, -77, 122, 400, 43, -76, -129, -80, 157, 141, 57, 26, -209, 67, 94, 33, -167, -160, -174, -116, 104, 34, 6, -183, -116, -51, -53, -56, -34, -221, -203, 32, 88, -49, 111, -124, -266, -26, 380, 302, -14, -182, -277, 59, 93, 256, 70, -50, -162, -25, 159, 157, 12, -152, -219, -5, 128, 156, 217, -113, 62, 77, 175, 83, 136, 44, -193, -23, 55, 292, 4, -131, -55, -19, 171, 32, -77, -190, 35, -248, 336, -16, -19, -128, -216, -79]
5010g9P8K71J9m45j38K88J73pR7l30n5R6J61K52k71r3l01J92N1J55j95N4Nl59
5034c81M90J79j60j58m2j21L09K77k82j41j90J0J38L24l5l10j41J62n7L17j26
5055F2j12n7Qq9L88m2p8k27N2K11J2Ko2j85P4q1K81j00j51N9j53K34R8Q3k24j57
5081a54pL8L32j35J2j79j71K70O1j3j25n2j38K43J09L9j70j18j3Q4J78Jl4q3j74
5106a99J68K62j8j24j9j63O1L7K21j81j61k67K35K99p5L1k75P1q2J93L34k43j99
5129i4m2J34n6K01j39q4j8K4K09QN0k78k4j25L09K07j90k24J0p1L93j27o7k55
5153b49J93m2J97rO9j96p5kJ69k6J87k80j43J20PJ25Q7p7k21P7J40J33pk19rj25
5179a76P3K86r6m4k19L0Q4K23M4k37k65J28K44NL6j53K5l8j05L90j88qj79L3J95
$$ y = [-79, -1, 270, 289, -156, -294, -6, 167, 160, 257, -73, -128, -32, 129, 381, 110, 17, -284, -92, -41, 114, -81, -27, -22, -381, 109, 288, 128, -30, -72, -193, 116, 393, 111, -30, -220, -210, -72, 252, 217, -93, -234, -72, -129, 188, 62, -50, -107, -99, -188, 200, 158, 80, -147, -95, 116, 128, 130, 68, -117, -43, -124, 157, 57, -94, -35, -188, 46, 144, 227, 3, -154, -161, -123, 209, 74, 86, -93, -264, 6, 67, 54, -71, -123, -261, -18, 91, 130, -40, -158, -171, -87, 91, 92, 58, -25, -199, -31, 231, 213, 89, 70, -93, -32, 5, 226, 45, -116, -383, -148, 151, 76, 107, -168, -97, -179, 14, 348, 105, -94, -136, -2, -58, 143, 4, -80, -98, -74, 135, 143, 193, -85, -109, -234, 75, 282, 92, -132, -122, -193, 200, 73, 6, -249, -56, -98, 99, 90, 159, -37, -112, -114, 55, 29, 216, -64, -207, -87, -80, 45, 132, 55, -166, -89, 51, 184, 177, -42, -51, -176, -103, 183, 87, 43, -176, -146, -62, 161, 205, -32, -297, -169, 75, 80, 116, -37, -12, -50, -155, 235, 47, 39, -140, -107, 88]
5204H8j11K77k56j50Q5r5K18J22j37L8m88N7L98J13j67o3R3j82L62K7n1l57K49
5227G0k03K85N3j86M8k00J32J97J8j12m3k85P2L58o1o5m7j00Q7O6m0N7j33j85
5251b17J31Q9J52k7k42j39R3K03j65J51r9R4q7J24K4N9k50j18J93KL53j05l16
5274i7L0j20l3K18j1N4k96P1K66J6J13k17j28J57j09P7P2L0j20J3J0M6K87l78
5298d9j02j67L73J31pj8l00m0K12J56j43J8k97J42O7K51q9k1L2m00K24Q4J26j65
5322A8r0j87R4J55J06J5o9r7r0J76J37J5l20j11J62J24P0M8l14J18Q1m6J47r1
5346E1k69k4K79J7M2j52K1j60J36n9K93ok10n4J05L8N1j80n1p8J13J25J08k50
5370a14Q1k1P7q5L22j47j74o0j0J66K4L3j14l9k08L35J85j16J9j74j19o7L59r6
$$ y = [88, -23, 254, -2, -152, -67, -162, 56, 178, 41, 79, -409, -352, 46, 159, -8, -71, 22, -160, 202, 229, 178, -179, 70, -133, 152, 205, 19, 67, -133, -1, 196, 214, 102, 59, -226, -154, 204, 143, 78, 31, -69, 18, 84, 44, 101, -32, -217, -86, 3, 155, 128, -114, -253, -160, 43, -122, 29, -70, 24, -63, 61, 85, 144, -106, -224, -31, -29, 324, 219, -97, -67, -187, -220, -2, -13, 41, -255, -184, 82, 98, 211, -6, -134, 23, -86, -9, 63, 93, -27, -14, -4, 42, 329, -49, -151, -318, 55, 186, 179, 161, -139, -179, 33, 189, 46, 64, -233, -91, -24, 227, 138, 117, 149, -251, -27, 57, 183, 18, -72, -259, -165, -10, 96, 111, 42, -55, -145, 31, 168, 183, -137, -248, -86, 38, 108, 156, -158, -40, 41, -5, 142, 51, -218, -242, 37, 54, 96, -56, -35, -195, -59, -118, 175, 169, -41, -95, 10, 48, 99, -81, -132, -210, -97, 28, 136, -114, -33, -54, 23, -62, 260, 113, -61, -121, -131, 35, 59, 92, -22, -61, -269, 66, 251, 135, 154, -20, -139, -206, 153, 57]
5394E7o7k4Pl4N1Q0L5m8k93K33O7R8k29r7R8n2J19K10j59j80j4J54J44J1o6j31
5420c0j65J16K15j61J3q6J3J90Q3J4j95j26N9k7K88J07l86m6Q7N5J20k4J07j97
5444B4j44K16n3J77k54k0m0K5J73L1j36pj04j38K98M5P8k42k7m2K02Q8k06l0l0
5469a16L9J52J21p2j67n9j8J55J35n1n1k98K36N9Q4o3j29j47J46P6N7K34j22j74
5493B7k31K38M4J20k51k29N0M04m0r2Q6l43J97P3J24k36pq5K10n6Q2J48r0j52
5517ik39L73o0L8L9k96J70l6Q5O8k23l5J99j31J73pq8q2n9J05K7M7j08j27p3K62
5543A3j28K49n8k13J7J05J38Po2k00Ml9L13j8J8k29J1kJ16J65j30j55lP8K36J03
5569C36j68k99nq8K16J44O9k71j87J23K19j6J01l11l2L5K30o6J81k62r9P1K12
$$ y = [57, -10, -34, -27, -61, -10, 70, 105, 57, -236, -3, 64, 162, -67, -164, -66, -118, 1, 211, 52, -128, -142, 12, 156, 167, 101, -30, -195, -79, 136, -25, -12, -98, -85, 105, 188, 202, 7, -119, -60, -87, 201, 308, -78, -124, -37, 18, 138, 114, 221, 24, -120, 96, 43, 220, -34, -54, -94, -69, 104, 135, -1, -8, -112, -250, 48, 93, 171, -71, -98, -140, 62, 150, -56, -86, -116, -77, 75, 196, 124, -43, -102, -120, 35, 170, 119, 68, -230, 6, 65, 149, 86, -43, -190, -44, 32, 89, 323, 201, 27, -204, 34, 78, 198, -53, -282, -232, 172, 132, 40, 126, -217, -20, 53, 177, -59, -66, -151, 59, 3, 85, 233, 143, -9, -248, 125, 65, 103, 142, -154, 16, -20, 65, 133, -90, -125, 74, -57, 116, 109, 21, -61, -120, -15, 12, 59, -49, -176, -249, 13, -115, 134, 76, -137, -120, -15, 123, 130, 68, -132, -128, -167, 146, 128, 146, -83, -72, -74, 42, 207, 77, -78, -81, -3, 233, 336, 168, -131, -136, -224, -8, 136, 205, -66, -253, -130, 89, 73, 174, -137, -169, -134, 96, 30, 211, -51, -150, -79, 133]
5592A33J35j82n7k70K63n0N6n0n9R1K9P4nm9k58R2J55lJ55j7j66p1j37M24j47
5617H6j31Q1j56m8K68J6m7j04m3Q9Q4J18j76J0l6q3Q9J75n4k81Q2j02J27J70r3
5642D1J90l44M3n4K85j58L7J6l07L34j31m6J4O4p4r2J93J06K1j72j43n2K80O0
5666A11Ok10k8l4Q3J20j59O5N1j04J05J56J9j86j25P0J31o7K49j95l30L80r2K07
5690B23j46j27j03J38m6L72j59j69O7M5k12Q7J06j73r8J34J00j0K03l47q4K94
5712I5o8J04j84J75k02L5R8k6R5k23J49p0N6n6k7j28Q5q9J96l8L11k37k39J56
5736c2j33L62J17l22j42l5O7K78j57j19Q6j23rK17o0m8Pk09J26K73j00J7k44J36
5760d7J62n7J35ml36LR2K14m0j52N4k40L55k52L51j46j35j3J43l9J9M7j60K9l6
$$ y = [133, 268, 86, 29, -241, 22, -28, 28, -22, -81, 10, 39, 113, 108, 59, -199, -107, 48, 45, 200, 183, 17, -54, -191, 233, 86, -45, 36, -120, -168, 100, 116, 69, -35, -78, 11, 95, 213, 37, 47, 11, -72, 17, 192, 138, -143, -61, -163, -36, 134, 41, 231, -113, -70, -124, 161, 3, 40, 56, -251, 83, -48, -94, -80, -16, -90, -182, 11, 117, 138, -34, -177, -229, 51, 111, 117, -93, -121, -155, -72, 48, -111, -46, 5, -99, 6, 162, 181, -5, -130, -60, 71, 4, 253, 58, -272, 108, 16, 223, 77, -50, -153, -15, -61, 311, 152, -17, 50, 95, -117, -30, 76, -97, -195, -61, 39, 29, 232, -115, -199, 95, 27, 131, -53, 122, -80, -45, 53, 27, 122, -101, 48, -22, 34, -22, -49, -177, -92, -181, 15, -23, 288, 51, -188, -32, -165, 197, 314, -8, -150, -185, -118, 160, 3, -116, -30, -153, -162, 55, -5, -53, -46, -255, -129, 144, 44, 61, -183, -47, 115, 58, 193, 189, -147, -144, -52, 162, 122, -30, 24, -216, 139, -113, 238, 92, -43, -56, 87, 48, 67, 114, -46, -17, -53]
5785e3J90o3k61J37j4j59L46k2l5J8k29J04M9O0N9j86J16j89L38j54j04M6k18
5808b24J68p9J85k81L00j37K3J59Pl9j02k30K25r6K12n4n7j19J58O3L3L8p5j86
5832a08K18n2P6po7n4J5oJ50o7Pm1j28P0K34m6k27K3J04j8L7j1k14L6q7K5J45
5859GR5n5j39M8N4J46k23j63K48j88J79O6J73j04k81K3J95p2J36j35N1j06J08
5882F3o2M8N4q3Kj05Q1J12j7k63J13m9J71Q0j00q4L2J4J21J28j89O2j39k32K08
5907c4P6n7k02R8n0N2K37p3Q7L6j83n6J35m9K4o0L1K0N7o0j1j8j4j26K86j60o2
5934g6k6J58j2P3j66R6j74K02k63K23Q3o1j84L6R4J25q9l1k38J67M5J44j49np0
5959i8J52l9m4K54l06q5J18J08r5K60k51j12L8j2L23k3o5k12j52J16K60m7rj32
$$ y = [-53, 137, 74, -187, -50, -64, -223, 123, 101, 66, 84, -145, -41, 8, 68, 127, -59, 57, -132, 206, 52, -52, -6, -224, -56, -135, 50, -231, 69, -68, -45, 114, 121, 82, -20, -250, -25, -121, 91, 37, -20, -139, 19, 82, 115, 153, 78, -108, 110, 58, 134, 127, 60, 6, 21, 15, 165, 98, 105, 64, -64, 6, 240, 194, -33, -10, 94, 76, 113, 102, -112, -76, -163, -138, 7, 102, 47, -92, -44, 10, 156, -67, -230, 18, -170, 9, 75, 248, 144, -137, -114, 81, 9, 145, 10, 61, -45, 63, 1, 49, 103, 20, 22, -83, -2, 110, 93, -170, -57, -106, 65, 145, 45, -39, -7, 7, 128, 256, 67, 129, -10, -242, -34, 42, -15, -217, -119, -169, -117, 120, 47, 134, 170, -13, -69, 66, 17, 41, -19, 12, 32, 89, 29, 18, 0, -14, -140, 146, -14, -76, -102, 56, 44, 117, -49, 47, -127, 75, -188, 35, 118, 57, -127, -91, 3, 128, 39, 8, -230, -63, -18, 126, -23, -28, -98, 54, 15, -29, 225, -81, -166, -48, 60, -35, 225, -26, -138, -100, -112, 211, 188, 123, -89, -241, -125, 135, 88, 79, -53]
5983e3p2m4K37O2j22k12K03J38k26K59j59j06L1n4J14K35k78O1m8Q5oM5P3r9j60
6008i6J05q1J25r9m3J66j28Q7j2J09k51J48Q2j69J26j17Q9m8J59j03J24m4l18
6031a89J72J8Q6o3Q3k09pK01Oj33j31J39J44j10oJ25j35j05J01k6l8O8J01o5k05
6056a78R8J07q2J29j14K0n2p4lJ66J16k87N3J76J8K6j84k00K7K23K3J73k3k92
6080a34M2P8O3J47j23N6j66Op7K04J4k00oR7jP0j11J88j50m7J75n3m5M1k20K11
6106E9m5J27j9k31j11J58Q7j30K24j51j34j0J38K6J09m9j56J30L3k9Q3P3k58J2
6130f4q9R5J81j01j32KK66j23M7j44L1L4p5J99M3q3k84J39O4%k3J05k44J95j91
6155a52L38k53j9J19J35l22K32j51Ok6l8L02p7J09l83J26j22K49J5J56k89j5J86
$$ y = [-53, -125, -169, 68, 130, 8, -204, -1, 137, -89, 170, 11, -95, -64, -118, -4, 231, -47, 14, -34, 51, 45, 90, 163, 64, -96, 9, -72, 53, -46, -89, 77, -51, 36, 24, 133, -118, 30, 112, -57, 69, -48, 41, -7, 152, 49, 173, 129, -189, -17, 1, 87, 24, 107, -102, -109, 92, 98, -35, -166, -27, 117, 7, 1, 126, -9, -114, -13, -39, -77, -9, 92, 27, -178, -80, 27, -55, 74, -40, -20, -72, -146, -149, 17, 133, -154, -101, 75, 93, 119, -65, -265, -238, -15, 8, 181, 158, -134, -92, -14, 49, 196, 73, 129, -37, -31, -108, 96, 110, -90, -96, 1, 0, 70, -41, 147, -3, -50, 125, 72, 27, 68, -152, 59, 14, 141, 122, -109, -220, -62, 25, -105, 119, -32, -166, -176, -38, -12, 97, 48, -108, 22, 55, 26, 109, 182, -76, -64, -153, -58, 123, 22, -110, -108, 158, 35, 82, -62, -31, 3, -72, 127, 170, 87, -197, -58, 6, 6, -17, 88, -156, 39, -152, 186, -67, -86, 33, 168, -154, 78, -73, -67, -93, -131, 171, 94, 203, -180, -54, -176, 73, 88, 244, -45, -60, 126]
6178A26j54J34j57J03j12N5l9O3J03j63j36J10l3K61j17O3n0j08K6o1K01j28O3
6201E0j07O8j15K26qj33j50J49j7L7j10J98l60Q0K77j74K50k19j86J32R4Q8m0
6224C0n0m2j22K93q4q0R7k45j2K94Q2j47r9K56k44R5Q8q2J8k25j9J09K2N2l8q7
6250a40J20O5L0p4j11k31L19M8J36k61M2oo1N9N9N1q3o5j3J84j09J31o4P9n4m
6276D7m6Q6r4j22K19j98J45n4R2j83J61k44J51P8K5j36R0l6j30J45N4nj17J16
6300D4j6K2P4j36q7K9N2K9M2j02P2oK4P0j10P4k03L8K55k3j46l7J27j18O5K3q
6327D8J7k7j87L35j7k6p2j40k2N1L6Rq9R0KO0j16J02j64N7p5K28p7M0km9J26j76
6355c8J09j71N2j42M95l00J41m7J23m44J36NJ67L7j18N5j32r3K09l9OQ6k92J35
$$ y = [126, -28, 106, -51, 52, -60, -5, -44, 19, 122, -41, -177, -67, -100, 161, 44, 107, 57, -51, -25, -86, 115, -13, 50, -57, 11, -104, 122, 114, -19, -169, -20, -37, 0, -110, 88, -272, -192, 85, -89, 161, -58, -244, -112, -18, 70, 30, -20, -62, -184, 109, 25, -55, 42, -203, -215, 79, 161, 14, -85, 171, -73, 22, 110, 28, 46, -179, -198, -89, -67, -15, -53, -140, -20, 45, 75, 1, -110, -341, -22, 26, 162, -99, -57, -63, -124, -65, -6, 45, -38, -103, -116, 68, -41, 90, 26, 105, 51, 47, 1, 87, -7, -129, 90, -108, 37, -17, 75, -108, 53, -191, -40, 38, 63, -73, 17, -19, -149, -4, 50, 45, -72, 44, 28, 50, 124, -12, -99, -70, -18, 11, 53, -49, 23, 17, 41, 111, 1, 75, -128, -90, 165, 142, -4, -41, 86, -32, 33, 56, 48, 65, 38, -149, 186, 169, 143, 71, -69, -91, -40, -4, 5, -84, 6, 8, 68, -48, 54, -110, -53, -128, 100, 23, 63, 61, 12, 138, -38, 71, -100, -48, -190, 305, 5, 146, 99, 222, -222, -86, -81, 86, 123, 5, 60, -72, -165, 44, 5, 11, 97, -195, -60]
6379f0N7K24k9j41k82J73J33Mk0j87P8R7p6O0L5J6j23N9O5K4Rj85J51j84J49L9
6405H6q0Oj22K22k02J73n8R5j97J37%P0n7m6r6j06J55M4J9O1j27L6p9o1K30k09
6431a06J61j97J61J41n9j37N1j29J33J24j10q5O7j09P6o8K49k16J61j8j4j67J64
6454G3l37K28K4q3J96j36J1K0k01O8L1P1J9j02o2J19J33L5p6J28k60Q7J55r8j06
6479f3O5O8k84J62R8m4j09J68j09o6K8Q3m8j02K23k8q6k4J82k12P4QO0m5K5q6
6505f2M3K20j91J60j54r7PJ21k1J19j31j31j7N5L9j9K8L3q1R6R6q6p3q5l9J36
6531c4K4L6k9k4L5J63m7j20rj14J47k02L06j43l4j07l3J75R1P2r5k0Ro4j9J69
6557A33j64j37%K20K1j60O9r2L14j22K6l8j50R9k50K29K16k50J1J3j87K89k51
$$ y = [-60, -3, 221, 192, 51, -231, -58, 75, 79, 59, -128, -50, 47, -29, 31, 66, 82, -41, 18, 83, 107, 116, -69, 82, -102, 47, 86, 6, 12, -110, 112, -90, 83, 25, 120, -77, 60, 60, 130, 73, 27, -69, -175, -20, 24, 43, 104, -23, 13, -66, -127, 103, -106, 55, -142, 19, 160, 101, -36, 15, -114, 19, 143, 33, -52, 15, -94, -18, -86, 163, -53, 108, 90, 76, -91, 73, -264, -36, -12, -95, 101, -35, -24, -4, -205, -137, -106, -35, -16, -118, -180, -61, 72, 107, 31, 159, -101, -14, 141, 43, -63, 2, 70, -214, -52, 46, 2, -107, 61, -48, -114, -86, -3, -51, -153, 70, 42, -44, -68, 114, -98, -24, -16, 44, -1, 24, -62, -19, 201, 10, 170, 16, -81, -74, 47, 26, 145, 14, -117, -134, -79, -40, -59, -31, 2, -79, 17, 113, 27, -46, -131, -170, -34, -10, 26, -3, -27, 8, 171, 124, 4, -5, -119, 28, -174, 132, -11, -45, -152, -185, -10, 81, 153, 58, 38, 47, -17, -36, 133, -31, -168, -168, 52, 73, -87, -18, -110, 204, 82, 108, 70, -80, 19, -231, -2, 214, -36, -25, -12, -199, 90, -161]
6580a61K54j82K71j33l6J92j30j99p8J64m9K0N2n7M2J22r5K9q4J74j21k5j1J08
6604F7J75k87J01k50Q4j5J97pj48R5O3j65Q8q5l7K0J3K1K23n8j35p0J60J39j75
6629A4j10K07j27j28J91j48L34m27J90k53K46L54m90J79j62N5n1J53l6Q5j02J09
6651H3j01J63M0K4m1l12J92l9p3M8n7k6O9K56j96o0j1n9Q2jm5K08%m1r4P2mj90
6679a13J9J36J73j45k29J51n7J0K27o2PJ16JJ33o09M4J59J23Q7j33J04k80m0m8
6703b26j19l12J100l50K21J99j17K57q00PJ53p6l13J20M46r00P39l24K77k74O84
6724C92r99K05k86N11p9J50k6J49l05L05k92L66k28l9K31R8m22R0O1%M73n39L28
6747A44l66L33J7k30M33j27m67J59K4J38J12l32K50j4j80l29K81L29o47K20M27
$$ y = [-161, 93, -89, 182, 49, 13, 205, 75, -124, -202, -38, -87, -67, -15, -72, -30, 92, -3, 26, -58, 116, -5, -30, -41, 67, 242, -45, 56, -194, -110, -125, 72, 65, -83, 12, 75, -90, -2, -87, -124, -104, -91, -70, 153, 95, -40, -110, 50, 189, 14, -96, 111, -16, -144, 47, -101, 233, -194, -4, -257, -11, 343, -147, 32, -130, -75, -126, 27, -9, 76, -26, 83, -18, 145, 185, 209, 168, -144, 48, 9, -64, -16, -73, -99, -30, 226, 30, -30, -41, -100, -18, -19, -64, 144, 144, 103, 9, 81, 77, -113, -94, 42, 215, 70, -159, -8, -65, -55, 172, 110, 117, 233, 234, 367, -242, -198, -39, 84, 171, 38, 142, -138, -178, -226, -345, -657, 443, 93, 314, 513, 396, 653, -147, -140, 13, -63, -376, -256, 190, -710, 29, -295, -18, -292, 392, -607, -402, -688, -177, -256, -106, -132, 17, -288, 17, -275, 91, -137, -176, 55, 153, -269, -179, -118, -118, 355, -184, 144, -222, 111, 128, -102, 331, 204, -263, -104, -80, 58, 170, -162, 88, 74, -106, -435, -154, 175, -472, -252, 175]
6768A75L81o56j28j89K39K97L7j36j4l06J36L5K86j81j33K2J56J5J30M5j70p8
6790c7K2J87m3q5j54m5K4K42oR1k40q1Rk3J16N1p9J71j21J4nK34j80j5j06J24
6816F5L1p6J25k94J09M6J05k05J93j20J42q9Q3j14K6k11N7K40j51N5qp2L0R8n2
6841A3K0k4K9Qm0j18K20j56o3P8J60j46j05K17j79P3P4n9j2l9k7K23k12P0J37
6866A42k04l0j5P1K02l0k23M7L3R6j03J43k2j38p0Q7q2J11P2j38r8J86q4J17o4
6891Fj14N6J46q4J24j24n5q3k6J65l6r6K10j40J00j28Q4K57k63n2K0O9O3J1k2
6916H8r7N1K5o9M5n4J9mo8K23j07lj06j64K50j23J17o6k37J13J89j57J76k9p1
6941e9R8J09K5j43P7l3j37P6nJ59k00K27j93n9n9J41J19j77n0J7K90k89N6j06
$$ y = [175, 556, -100, -228, -417, -178, 119, 156, 20, 6, -300, -164, -129, 157, -24, -157, -135, 21, 36, 166, 211, 41, -37, -15, 172, 129, 44, -110, -155, -131, 111, 105, 196, -44, -125, -116, -139, -23, 28, -51, 120, -1, 13, 8, 242, 62, 47, -59, 65, 96, 20, 145, -149, -40, 6, 111, -94, 99, -21, 121, 32, 115, 1, 27, -184, -127, 113, -38, 17, 9, -63, -33, 65, 13, 33, 9, 38, 46, 6, -112, 108, -48, -111, -33, 127, -19, -124, 93, -86, -13, 61, 2, -10, -49, -76, 147, -65, 5, 142, -62, -92, -107, -36, 166, 136, -87, -40, -7, 89, -14, 129, 107, -31, -101, -14, -96, 15, 87, -51, -149, 37, -47, 70, 6, -108, -52, 94, 10, 134, 10, -45, -128, -154, 11, -25, -121, 89, -51, 49, -79, 5, 262, -1, -53, -33, 36, 99, 110, 88, -9, 42, 67, -2, 43, -11, 8, 4, -64, 159, 52, 49, -57, -221, 29, -94, 23, -43, -280, -167, 22, -135, 41, 12, -59, 39, 148, 173, 30, 107, 74, -63, 13, 8, 167, -33, 194, 1, -58, -117, 24, 143, -34, -84, -67, 223, -66, -10, -116]
6965a16M1kL6K46l93K08j33R9J26Ln0j03J2MR0P9o2L3j16k8J75l1m5l7l2j02l8
6992a36K02O5p1K3k32J81P4lK1k15K9J06K6l7J76k58n1J01J57ol9k32P4L1K3p9
7018g0J13o4P8l5Oq6K00k62J95n0R4o6k9l7q5J66j29O8J3J4q9K2J05j23J36n4
7044C1lJ1r3r7J97k7l9J11P7K2Qj20q1j1m2J73oPj92P4r1J72r1j07L3p3K80j5
7072A08m5j2k10P6J99o4mn8Nn1O5K5j92k0K31j79K02R3n7j30p2NJ02n7K11j27
7098D4r7O3k9j4J99j24m7j35J84J87k05qk03O3k5K37M6k62P6j07K43n3o2K0o1
7123g0J49j12N4Jj06k03K52j93L27nj22j2n6P2qJ71k72J33o1KJ06q3J23k66J93
7148A4j31J63N4j56J2j48K30j3J37m7j73J61j71R0Q5N5k21J34P7k51K20kr6k58
$$ y = [-116, -75, -77, -41, 205, -188, 20, -113, -14, 112, 115, 65, -38, -26, -22, 68, 147, 85, 118, 2, -26, 149, 118, 73, 36, 4, -98, -136, 66, 131, 60, 83, -149, 32, 106, 103, 124, -91, -62, 44, 70, 33, 209, -49, -100, 1, 158, 152, 113, -119, -45, -14, 9, -70, 43, -21, 57, 22, 28, -58, 142, -120, 75, 25, 119, 53, 24, -13, -98, 68, -61, 7, 20, 34, -55, -33, 72, -51, 85, 31, 28, 39, -54, -151, 46, 19, -20, 91, 168, 190, 198, 78, -3, -14, -56, 117, 111, 118, -74, 0, -91, 81, -10, -117, -84, -157, 123, 108, 63, 51, -159, -83, 116, 52, 48, -10, -5, -56, 9, 34, -158, -178, 53, -126, 76, 169, 112, -18, -90, -85, 17, -40, 171, 44, -53, 10, -19, -33, 166, 42, -5, -140, 44, 231, 26, 18, -185, -122, -147, 90, 136, -126, -50, -157, 86, 33, -29, -9, -70, 79, -33, 21, 22, -84, -287, -35, -228, 99, 94, -28, -40, -96, -24, -32, 139, -133, 0, -61, -59, 47, -36, 87, -179, 14, -117, 46, 100, -56, -44, -192, 38, 25, 162, 115, -58, 103, -68, 22, 107, 162, -59, 75, 152, -99, 121, 119, 23, -235]
7172b35J83N0J32j65j6Q7l1j00K62j54j11LJ85j49J84K2l26J84l1kN2J0J5j48
7196i9n2p4J75k9O7j36J25j03J74N8k25l6J71m6J53j55j3m8K0J81p8P9j20j9K0
7221a0j04K06pj9j93k44K40J11J02m8k3m0l1N2J38j21J0j3L4n1Q4R5k33rJ71j47
7247e0K16o5p6n7O4J76r5j22l1P6k3J57k3k39L7M1j1j5J83j13j62O4O1MKK8m9
7274b2N2J22j36O3j19L1l7jk1J58N1j18j55N8k0O1L9j02J18j26j28L35Q2j85j55
7299a55J31j2J04J00q1k27J21n7J36J62j51k25K93r4n3l6J09k2k5m7K5Q2k64J74
7323a2j00K11j9L0j66J57j98k5K22R6j33p3j19J64n6OJ2p3J2Q7Q6M8j30k33K27
7348B1j21Q2Q1l3j56n4P8J39r1K39j53j31Q9M3K14k03k07J42J08k25J15P5L2q6
$$ y = [-235, -52, -2, 130, -35, -51, 36, 5, -95, 167, 13, -98, -95, 90, -59, 125, 147, -179, 5, -26, -28, 24, 34, 49, -99, -151, -225, -50, -79, -12, -148, -23, -126, 48, 106, -119, -155, 16, -30, 123, -32, -45, -93, -73, 108, 30, 109, -11, -30, -10, -114, 92, 85, 66, -127, -371, -131, -20, 82, 34, 11, -29, -60, -8, 130, 9, 19, 6, 40, -11, 73, 168, -65, -74, 97, -50, 166, 101, 25, -32, 32, 208, 113, -9, -40, 36, 13, 170, 147, -92, -55, -14, -25, -40, 143, 30, -132, -68, -7, -3, -1, 27, -22, 30, 152, 16, 79, -40, -9, -46, -47, -68, 90, 141, 23, -132, -74, -94, -33, 6, -96, 22, -104, -232, 103, 185, 0, -155, -24, -36, 68, 168, 87, -140, -19, -76, 60, 222, 71, -154, 139, 45, -8, -44, 65, 43, 18, -29, -4, 78, -186, -12, -112, 99, 80, 110, -56, 101, -97, -122, 100, 196, 63, -10, -129, 35, -21, -15, -3, -76, -64, 23, 109, 157, 27, -206, 21, -100, -18, 63, 30, -126, -180, -102, 37, -54, 185, 32, -99, -10, 33, 247, 44, -163, -21, 87, -138, -23, 52, 84, -2]
7372bO0K01k35l3J11j52n1J79k07J49o0j75J05J06J66j2r4j67P3L2J89n8j75n0
7396a00m3J7J56%R2j58J90j66r3J38m7lj5J36J3nj30r7R4rJ35P5o5k21J52k38
7422a92J69J60k27J7l6L4J89m9j09J36r1l5nn3J08J66l10M1J75Q0j24j61k5n7
7446a99K13l0O3J4j29k1R1O6J7j42j44J17K42n2M1Oj70lJ48k3k26J57j40MM1J67
7472A08j04N3p9J35o2J09l7l44K52j1j2J1J2J3l1j44K07q4K60k76q7k7K88j76
7496b6RJ06r4j24J46L6N8j75R6j42J04J9O7l6Rk64K45M4r9Q0j63K7O5J04J49l54
7522a13J4lJ01l5NK8P9j37J1J0L2J17j08k6J89k1J3k8k39J08k17L06mK7j32J23
7548A00m6N7p6n0Q1j57o4J22P6n3k9L0L3P9j77k2k3j25K07K4M9Q1j16k01K78o4
$$ y = [-2, 58, 259, 24, -9, 102, -50, -101, 78, -129, 20, -40, -215, -110, -4, 162, 150, 56, -111, -38, -6, 183, 125, -50, -100, -143, -126, 30, 30, 122, -36, 154, -12, -105, 33, -14, -17, -32, 104, 117, 112, -18, -115, -21, -30, 105, 180, 115, -106, 46, -192, -23, 137, -90, -73, -109, -75, 114, 65, -44, 92, 1, -34, -39, -92, 16, 182, -128, -87, 88, 168, 44, -117, -142, -199, 14, -16, 47, 61, -68, -89, 2, 68, 85, -57, -201, -84, 158, 106, 147, 153, -17, -20, 128, 105, -121, 36, -104, -100, -59, 108, 4, 57, -22, 113, 51, 160, 123, -221, 31, 20, 8, 19, 31, 44, 13, -131, 76, -8, 252, -24, -111, -138, 150, -26, -17, 89, -5, -129, 17, 53, 111, -64, 32, -110, -6, 13, 80, 44, 53, -211, 34, 78, -21, 59, -104, -77, -12, 92, 241, -113, -99, -102, -1, -36, -31, -3, 76, -61, -50, -40, -8, 109, 1, -25, 164, 143, 156, 128, -111, -3, -220, 86, 82, 109, -23, 100, 54, 111, 35, -15, 66, -91, -155, -33, 43, -10, -39, -9, 24, 103, -74, -96, -119, -244, -37, -13, 36, 117, 1, -200, 78, 14]
7574A4l4K9r5K54r1j39K76k9j65k14K19m1J75r3j0j20oJ49j20lN0Mp3K13k0j0
7600A20j0l80J75J24k8J34j70l7J14Rl5K5l6Mn2m6J97j8j7k68J84M5m4Q4k34M9
7626a11l5J22O7J6j31J25j12j49K54J81j04K0j55Q7J3J0q5n4J9N3j9R2j61J4j07
7651a50J2O3K22j01j97L1L1J45J13p7j22k06L39J09j96J24k31K41k26J21q9J00
7673E6j69kQ8lJ20P3k07r4L4p3K20j20M9k1l2Q0k5Mjj9l7L4P5R5p1l6k11L09j22
7702fO3q5K23j72j4n5J13j5j15n7M2R1M6o3n8R3O0P3j4l02N6J30mL2K33k58k47
7729b10K30O6N9j31R6k14k2r5K61M5m5k2m9K7J22j32oj80N6K23N5j14m0Jl4J0
7755d3K24j18m1o3Pk07J73K69j21q6j42L02k51J05R5j28M5o3K3J51m3l2j02q8
$$ y = [14, -20, 9, -86, 168, 77, -62, 214, 185, 20, -194, 25, -16, 159, 66, 56, -64, -70, 79, -41, -44, 6, 10, -63, 150, 130, 120, 110, -270, -95, 29, 1, 135, -35, -72, 42, 51, 16, 41, 5, 9, -43, -89, 108, 90, 73, -195, -11, 34, -10, 74, -160, -111, -146, -24, 43, 59, -72, 53, -59, -208, 46, 227, 123, 143, -12, 75, 88, 98, 13, -41, -22, 31, 12, 104, -57, -43, -150, -138, -75, 147, 46, -151, -120, -89, 56, 169, 92, -30, -236, 103, 212, 16, 140, -91, 150, -76, 45, -44, 56, -113, -115, -27, -30, 90, 163, -44, -138, -104, -177, 43, -77, -28, -49, -81, -1, -26, -22, -23, -42, -79, -45, 30, 125, 54, 18, -193, 116, -6, 57, -28, 195, 23, 9, -46, 67, 52, -63, -120, -78, 13, 59, -4, -62, 31, 91, 164, 150, -152, -96, 34, 30, 62, 295, 37, -210, 20, 86, 145, 14, 110, -104, -126, -221, 40, 85, 40, 18, -31, -4, 118, -14, -20, -200, -144, 79, 134, 20, -20, -19, -53, -43, 181, 63, 22, -41, -34, -241, -68, 201, 80, -6, -148, 154, -97, 8, 103, -25, 20, -43, -20, 131, 88, 56, -46, -134]
7779a34K65j85J53j89j19J23Q7J7M8j22o4K01Oj4j9j61k6J42J27j35M7j96J71
7802B3n6K2J02Mj3k41KJ26J72j32qJ8o6N3L4K12l66N3J08j34K47j27j01o3M8K5
7828e8J17j22N7o8oJ29O2qj97l1M3K7Q6M5n1p2J10j29J1K14j21j02m2J68p0J52
7854A44kl26P0J52j03M0m9Q1j73J75K05r9J4k99JJ99L0l2mk50Q4J58r0L06l33
7879a01p8KL22n8j14llj80K58J8R1K4l08J14r4J04J88j30k19Q4MP8O8J07j48r6
7905g0q7P9K20p0l8q9l9J72o2J68k12J0m4mO5J00q6j88J95m4j52L45j96q2O1P9
7931C1M4J34k76L8m9J50k9p0m3l3J16oJ24j00K0M7k48J57m9Q2J36o4j03l5K07
7956A81j72p6n3j11L11l5p2k2o2O0J68k78L65k65j28J66j83K47J99j82j43n7O5
$$ y = [-134, 131, -54, 99, -90, -209, -86, 1, 18, 66, -56, -120, 81, 87, 73, 54, -107, -133, 9, 136, 1, 48, -148, 23, -33, -11, 91, 95, 82, -159, -157, -31, 141, 9, 1, 19, -47, 6, 40, 252, -114, -61, 47, -87, 160, 33, -68, -131, -83, -58, 59, -63, -6, -74, -80, 49, 111, 103, -94, -125, -82, -55, 31, 76, 25, -47, 63, -66, -55, 159, 38, -64, -106, 62, -8, 144, 142, -184, -114, 38, -65, -25, -74, 7, -166, 9, 214, 115, 129, -170, -169, 30, 60, 28, 24, -226, -142, 16, -74, 232, -101, -179, -177, 145, 87, -27, -30, -33, -213, 45, 63, 154, 178, -130, -16, -110, -6, 182, 52, -167, -83, -79, -1, 67, 174, 26, -70, -157, -78, 142, 72, 34, -55, -94, 78, 16, 184, -28, -18, -62, -66, -1, 99, 13, -175, 20, -24, -176, 169, -27, -109, -48, 31, 75, 209, -67, -29, -78, 72, 43, -27, -70, -103, 13, 7, 131, 31, 51, 98, -150, 7, -42, 40, 176, 112, 9, -26, 181, 9, -67, -120, -231, 80, 45, -27, -49, -111, -51, 117, -161, 204, -61, -189, -23, -206, 41, 240, 58, -85, -142, -77]
7979g7K27r0L4K2r5k9O9j62n1K59k48lK38j26M9J11k20j11J91J4K37l94J88j54
8003a21K20j58J96j32k2R8j23K30j25N3j93J27k17K10M1p2N5k6l8r5M1R7l7k08
8027a99J77JJ97k46j62K12j53L78k03R4l23R4J81J18J09m88N5J68n9J68k3J1l1
8050G6j20O6M1P4p8j33o4P7R6P7k89K09r0Q7J64j08L2q0P0k09J12k2J45l01L3
8075a35J36m1p7l1j6p4J42l7K44j14p8pQ6Q7R9j62L6j66k7J22M8J13k49J89J2
8100A00L8r2O3Rk11K1J29j3j67K27o0j35K34j64J50K5k33O9q9J54k06nJ27r0K12
8125I3R7L9j81r5J35m0j11J63l0j29j9J61L2K3r8l3K0n8M8J10j52k47J35N8M2
8150c7J59L8k14L1J33j17K00k09J14r0n1J50j42J77k75L2n2K6J7J56j63K0O4p
$$ y = [-77, 150, 60, 94, 116, 21, -8, 61, -101, -152, 107, -141, -144, 94, -32, 17, 128, -92, -203, -12, 2, 239, -155, 33, -121, 99, -59, 137, 5, -17, 81, -42, 188, 63, 116, -77, 50, -167, 43, 84, 12, 67, 41, 3, -92, -51, 46, 9, -199, -22, -21, 176, -70, -232, -20, -173, 205, 2, 96, -227, -133, 48, 166, 275, -213, -158, 10, -49, 119, 96, 107, 76, -44, 22, 63, 137, 59, -74, -138, -61, 35, 112, -177, 32, -58, 29, 193, 85, 117, 37, 107, -102, 10, -12, 133, -168, -135, 1, -40, -117, -148, -164, -238, -96, -133, 111, -3, -81, -88, -2, 85, 184, 22, 58, -108, -135, -13, 35, 148, -101, 88, 100, 138, 46, 109, 118, -93, -72, 57, 44, -123, 104, 44, -91, 143, -21, 129, 154, -79, -10, -99, 55, -151, -156, -29, -119, 93, 190, 229, 48, -47, 88, 48, -63, 100, 70, -59, -78, 83, 115, 138, 40, 7, 27, -31, 17, 127, -25, -272, -137, -79, -37, 122, 160, -54, -23, 110, -7, 193, -16, 98, 8, -43, 107, -35, 142, -133, -101, -153, -127, -110, 46, -117, -97, -33, -40]
8174d0K47k97M7J09j07J08K04k81J23j53j47K17R1k06O7M7J1
$$ y = [-40, 207, -90, -43, 66, -41, 67, 271, -10, 113, -40, -187, 30, 121, -85, -18, 29, 40]
8191D0
$$ Imaginary data points
##PAGE= N=2
##DATA TABLE= (X++(I..I)), XYDATA
0@%%%%%%%%%%%%%%pJ5j6J6j6J9k7L2l7M5n3O1p2Q3r1J04j20J38j61J83k06K32
36A22k59K91l27L65m07M54n02N55o16O81p51Q29r13J003j104J217j344J483j636
55h59J811k008K234k497K807l175L621m181M906n883P275r438J3278k2095Q0757
70F6553K434j61490P3505Q1356p2548m4016R9485o752j02763J4226R8428j8143
82C0275n6041K2298K4741m2257o312N1795J5552m9013k0326L2094J6418k4277
94e053N437K8149k8085m9699L5994O3243l5593n5782L9133K4818n8443K833Q3680
107E0632j8346r3726K5133Q6495k5468n1594M2540K1062o5383j0190O8591N278
119C5024n6576l648K8159r482l891L0842J64m0928q587L2531J2686j4443n89O601
$$ y = [0, 0, 0, 0, 0, 0, 0, 0, 0, 0, 0, 0, 0, 0, 0, -7, 8, -8, 8, -8, 11, -16, 16, -21, 24, -29, 32, -40, 43, -48, 56, -64, 74, -87, 96, -110, 122, -137, 154, -173, 192, -215, 239, -263, 292, -324, 357, -394, 435, -478, 525, -579, 638, -706, 777, -859, 952, -1056, 1178, -1319, 1488, -1687, 1934, -2247, 2659, -3224, 4051, -5387, 7891, -14204, 66553, 68987, -92503, -18998, 62358, -10190, -54206, 45279, 38527, -64236, -50010, 48418, 30275, -25766, -3468, 21273, -20984, -27296, 24499, 40051, -8962, -29288, 2806, 19224, -5053, 384, 28533, 448, -49251, -13257, 49986, 14393, -41389, -2256, 22562, -35881, -33048, 50632, 32286, -61440, -36307, 50188, 24720, -26874, 15666, 36728, -28655, -38845, 29746, 35024, -21552, -25200, 2959, -6523, -10414, 20428, 20592, -20336, -28923, 3608, 16294, 1851, 1262, 7863]
133G863j6499j1970K9715K8615k6321l5863J4829K4034j2911m731K2779j1825
145G715m2328J0296M7731l698l7734M021K2340j1811p455K9094J0863l2575j7982
158b1523K0965J3499p525p99J20j7678o691K3891J5458j6433j3640K854l949K66
172a1185K2958R061k9401j7338K2880J6613q542J341N843j9099j3349K4037K0794
185B4613j6369j9370O32J265J033J3269O608j4666j3949N537J3504R283K079r597
199C872j4066j302J3703J2434j789j2081p901Q45M037P535J0131o708k5243n860
213b2393K4658J2406j3842l846N003j3779n468L0086J6198k8188j8586J7495Q002
226G746p603J1308P079k6933j7485K2318J7629j0745o214K107j2126m661K4534
$$ y = [7863, -8636, -20606, 9109, 37724, 11403, -24460, -9631, 14403, 1492, -3239, 19540, 7715, -34613, -24317, 23414, 19716, -18018, -13997, 8343, -3468, -10923, 18171, 29034, -3541, -21523, -558, 12941, 5416, 4617, 4737, -12941, -19632, 4259, 19717, 3284, -10356, -7502, -11451, -11185, 11773, 20834, -8567, -25905, -3025, 13588, 5046, 6387, 12230, -6869, -20218, 3819, 24613, 8244, -11126, -10494, -9229, -8196, 5073, 11681, -2985, -16934, -11397, 2107, 11390, 13469, 3872, -10194, -11496, 2207, 14641, 12852, 771, -7130, -6285, -2248, 5287, 15418, 8710, -16533, -22393, 2265, 14671, 829, -3017, 1986, -11793, -17261, 12825, 29023, 835, -17751, -256, 7746, 143, 11451, 18530, -8403, -25888, -3570, 14059, 3314, -2900, -793, -12919, -17580, 6954]
239F954J5759k0196j9113P690R974r4O935P953j4672k0596R084K6692J450k0998
253c178o728N944m570j163K0183P314k7853j6916K2349J8088r163k982O276j3713
267f112j1889K3301K1898j7561k1013N549M260m254J2832J2341k1034k2962J4488
280a0156K2227m406q317L634p599j3786J3390K6376m326k5256l882J3977L410
293E286j318Q037k325k1525p578K0818J4964j0740j2415p95j913Q24J5001R739
307A6060j4507j7636N678J4992M731n15k039j1723j0650J1346K0011j899j8585
320d736o789N587K041M058J1246l372k2242o392K0704J2927p862n562rp913j376
335i690J9115J0963j6082j5496M050O749L752P542k261j7557p672J2144J1920
$$ y = [6954, 22713, 2517, -16596, -8906, 1068, 974, 7909, 15862, 1190, -19406, -10322, 16370, 17820, -3178, -9906, -3962, -8532, -9695, 10488, 17802, -10051, -26967, -4618, 13470, 4307, 1325, 7601, -6112, -18001, 5300, 27198, 9637, -11376, -5827, -1567, -5821, 7011, 19352, -1682, -24644, -10156, 12071, 7665, -652, 2982, -4617, -18403, -5013, 21363, 17037, -8219, -12101, 1876, 5286, 3968, 12005, 9680, -11845, -19423, 1395, 16359, 5619, -6796, -7591, -9504, -8680, 6321, 16060, 1553, -16083, -10405, 4587, 9318, 8803, 6764, -4959, -15609, -4263, 15748, 13849, -4736, -11525, -5938, -3897, 161, 11407, 8035, -14207, -20599, 105, 13032, 5170, -392, -401, -8314, -9690, 9425, 20388, 4306, -11190, -7140, -391, 3361, 10903, 8642, -8915, -16587, -4443, 7477]
348G477L25m223q027p932M971J5118O817p911j1870m950O555J1907M021o126q168
363b016p315M35J2568J0570q526j4914j934N055N167Q943K377j4685j1122R366
377f031J2020K385M34o082j4066l51J8779Q004j1402p862k144m166O006J6074
391A1598j109j8003o583Q572O085M651L787p165j2725O48J3112P890k329p361
405A068p457j764P716R988J611r879j2069m80J1469P847k508n559o603n411P260
420d771J6163K055j4119p905M275M576M937P158m381j6150n005J3273J0143l200
434G049o965m616m814J202J2558Q908j0041j4859J226J0001M294K499K007r924
448a475j2620Q214J8190J6j1869m253k000l207R820J2494p865j7125r02R769N377
$$ y = [7477, 7802, 3579, -4448, -12380, -7409, 7709, 14526, 6615, -5255, -10205, -3650, 8257, 12278, 6152, -2016, -9331, -8896, 3672, 14242, 5716, -9198, -11132, -6077, -910, 8033, 10410, -4275, -15397, -6031, 5989, 8374, 8808, 2726, -11340, -11691, 7088, 15092, 3690, -4172, -6316, -10482, -4476, 11598, 10489, -7514, -14097, -5525, 560, 5211, 8998, 1833, -10892, -10244, 2868, 10758, 8429, 1068, -6389, -8153, -437, 9551, 11162, 1283, -10786, -11266, 203, 8050, 5542, -17, -6620, -12031, -4771, 11392, 13447, -672, -8577, -4302, 274, 5211, 12369, 7988, -8162, -13167, 106, 10249, 7049, 84, -4532, -9346, -8144, 4414, 13322, 3281, -11578, -10352, -351, 3943, 6442, 8449, -1475, -14095, -5881, 12309, 12325, 456, -3797, -5797, -9004, 816, 13310, 5445, -11680, -12582, -2813, 2564]
463B564L656K74r775q292N307J1467N759l770j0430o362O053Q425K387O44n852
478B055j4311n44J8925O941j2697n906J478n862M293J9632n14k1506l943J2758
492G99K414J530Q836p929j8905L686J7409J225o105j587q285o353J1848J3072
506A1655n183r592l827k573O757J3455j108j2198l220J548P09J1148Q655j4478
520A748j4906P427Q640j473N257Q40j8499p824J9242J0655q603l830j159r165
534a1650M756J9476Q07j5862l683L712q23P315R241q526j4389J055P687L232M536
549F884j325j2645o318J0195Q834J48o93p187j0043P205J5155J587q930n130l322
564e585m19J1240Q644r850j2243J84M252M255P257j347j3448n448Q904P991J990
$$ y = [2564, 6220, 6494, -3281, -11573, -6266, 5201, 10960, 7190, -3240, -9602, -3549, 4876, 7263, 7907, 2055, -12256, -12800, 6125, 13066, 369, -5537, -4059, -9921, -5628, 14004, 13490, -8016, -11959, 799, 3213, 4743, 13579, 5650, -13255, -9569, 7840, 9065, 2960, 1373, -6912, -13265, -1417, 11655, 6472, -3120, -6947, -9520, -2763, 10692, 9584, -2614, -5834, -4286, -3577, 7571, 16226, 1748, -13158, -5731, 2909, 1436, 6693, 7533, -10966, -18790, 452, 11107, 2504, -1326, -2485, -11650, -6894, 12582, 13389, -2473, -6156, -2444, -3267, 4048, 13289, 4763, -9626, -8571, -884, 2348, 6884, 5559, -7086, -13404, -3209, 5625, 5773, 5080, -2107, -12150, -4945, 10210, 11797, 2867, -2263, -5585, -6004, 5236, 13880, 4030, -8213, -8029, -3777, 478, 7735, 6388, -7060, -12508, -3604, 4387, 6377]
579F377K6o584r270L568J2686L996n545o357n189j062Q849Q605m321j0600m963
594i784J960O536Q050J97j0183p945M223R910N812j749p230o829J083Q954O698
609I703k192q100o894O70O572O716p44p575o750r2O558P892J717o907q016K3Q290
626H71P565J234o092q972k365Q238Q813j044q197o633j791M951R024K339q342
641d01q230R30N856N763L950l879r094l009P392Q069J268m100p272m809M042Q989
657E465K772o225q027l563L669Q816M201m846q109k605M330P867N160l298r027
672c420l397M762O405L435k174p754o258L022Q882L201l959n838n694J249Q290
687G52P121l160q242l976K813P634O205q83q648o274K779P821M269k052p477o730
$$ y = [6377, 6403, -181, -9451, -5883, 6803, 10799, 5254, -1103, -6292, -7354, 1495, 10100, 5779, -4821, -9784, -7824, -1288, 6762, 6959, -3224, -11169, -6946, 2964, 8776, 7027, -203, -7032, -5949, 3005, 9703, 7511, -589, -7483, -6813, -241, 6475, 5731, -1844, -8594, -8686, -2128, 5764, 7481, 574, -7442, -7419, 871, 8436, 9670, 3578, -5394, -7759, 479, 9292, 8248, 51, -6582, -8373, -3422, 5602, 7941, -401, -8631, -7701, -1845, 3918, 7868, 3989, -5105, -8114, -722, 7347, 8615, 4515, -2757, -7566, -3524, 5465, 8237, 2012, -6015, -9578, -5909, 2907, 7108, 2262, -5847, -8452, -4122, 3745, 8905, 5607, -3420, -6817, -2055, 4350, 7785, 5611, -2143, -8401, -5379, 3503, 6704, 2745, -3093, -8787, -7538, 752, 7873, 4713, -3529, -7505, -4692, 2942, 9147, 8264, -384, -6658, -3879, 3942, 8211, 6159, -1318, -8048]
703h048P21P572O314k067p088m998O93O611P405m5p228o300J306O892O175J79
719H094o407p384n37O670O630l94o747p580j228O451P428Q56o530p172o75P391
735a134Q249R91o301o517r64N195P662J946p221q345o75N460N543J619l647p829
751e968l697N902Q444J847m961o126k806M160Q376M476n026q563k405N090O888
766E631K921m116q750m661M778Q290K310n126o627k746L396P634M775l050p818
781c159l581M241P228L544k805p135m856K688O837M268k658p596n644K399P677
796A448M510k678o572m690J824Q080O045k458o933m047J523O357O116j700q335
811a510n584K760N675L528n49n704o821P21P791N137j046m929n172n92O834O987
$$ y = [-8048, -7327, 245, 6559, 4492, -2596, -7594, -6901, -290, 7115, 7070, -158, -6458, -5152, 1740, 7915, 8094, 1687, -5697, -6234, 436, 7066, 6672, -75, -7655, -8883, -2432, 4996, 5852, -678, -7850, -8525, -1134, 7115, 8106, 1805, -4712, -5676, -481, 7181, 9127, 1906, -6439, -7114, -1654, 3889, 5508, 1861, -5968, -9665, -3763, 4681, 6528, 1567, -4559, -7365, -3205, 5171, 9647, 4621, -3942, -6347, -1257, 5631, 8552, 4436, -4314, -8975, -4197, 4093, 6403, 1277, -5350, -8096, -4700, 2934, 7709, 4659, -3159, -6740, -2499, 4729, 8273, 5468, -1667, -6523, -3835, 3002, 7270, 4612, -2984, -8628, -6229, 1448, 5958, 3280, -3292, -7982, -6158, 1922, 7967, 5509, -1424, -5471, -3948, 2409, 8525, 6825, -1510, -7094, -4334, 1341, 4869, 4320, -1384, -8205, -7484, 307, 5444, 4398, -531, -5703, -6295, 539, 7526]
827G526q69n922m691q95M738P398Q47q032o977P21N307M970J262n382p179l98
843g576O663N911O91m254o036j305N933O470L45m559n021k481L420O670J700n294
859A277n940j955K868O437L306m584p015j292M444N677K722j950o565l805M436
874a939P299K078m179o179k782K431N693L365k746p229m108M097O963J971k360
889B375m762m066J736P715M686l608n861k369J416M604N197j269p611m760K636
904c941N333L190q06n804n006J412O023M641j98n210n855J904P172L546j870l235
920A296m757k372O241P262k758p307k185K95J691O197K764p475p170L083N805
935F10K739J727k643p172j151P179N302j060l773m932l124N043O666o18n306l867
$$ y = [7526, 6657, 735, -3956, -4851, -113, 7285, 8132, 100, -6877, -6156, -849, 4121, 5383, 1, -7178, -7576, -913, 4998, 5689, 1435, -4601, -5906, 27, 6497, 6842, 2283, -2738, -5219, -1799, 4871, 6571, 1277, -4663, -6618, -3750, 2687, 5993, 1409, -5606, -6898, -2454, 3223, 5945, 3995, -2570, -6375, -1939, 5360, 7438, 3259, -2920, -5702, -3271, 2422, 5787, 3041, -4188, -8296, -4199, 2764, 4735, 2375, -2387, -6453, -4717, 2998, 7684, 4076, -1785, -4154, -2738, 1866, 7063, 5794, -1817, -6577, -3941, 1392, 4582, 3776, -2028, -7034, -5622, 401, 5042, 4844, -366, -6221, -4317, 2855, 6401, 4531, 1296, -3461, -5833, 408, 7670, 4912, -2395, -4580, -4285, -2594, 3603, 6367, -1108, -8278, -5195, 610, 3349, 5076, 2433, -4739, -5890, 1289, 6591, 5531, 1758, -3174, -6298, -1255, 5411, 4793, -513, -4380]
951d380k062K765P939K040o852m691J229J777M305N494l471r455k53P022K628
966D035J14M69o172o548M759Q588l40n075k780l320Q16P941M505n224n952q5K037
983b232M913M957k740q173k273M542L702K193o65o733m810L930O084J085j065
998B715l859n816J117Q447L820m382m273j383J07M555O442j435p828l067K438
1013b402L486L397o4o203n506K303N874K700m16l684n039N1O539N311j889m752
1029b94l390l44M590N454n19n901m256Q48L507M471O70n339n401N43M652L935
1045C226L12l268m578j152N055N661O55m050n045j149M109M973L79m811m259j002
1061d944K567M905K698m119o167m71M535L891R59k018m557k739M054N982J022
$$ y = [-4380, -6442, -3677, 4262, 6302, -550, -5241, -4012, -2235, 2070, 7564, 4093, -5362, -5615, 1407, 4035, 4149, 4618, -1554, -8102, -3343, 5245, 4905, -170, -2950, -6270, -5454, 2487, 6992, 1768, -4184, -4269, -2232, 2681, 7638, 4898, -3275, -5548, -1006, 2696, 4889, 4224, -2509, -7319, -3389, 2695, 3780, 2715, -1144, -6960, -5843, 2604, 6424, 2042, -2231, -3614, -3507, 1048, 7490, 6055, -1773, -4840, -2402, 1084, 4481, 4417, -1786, -7292, -4989, 885, 3585, 3169, -515, -5554, -5503, 1036, 6347, 4458, -294, -3684, -4028, 562, 6016, 5497, -404, -4660, -3812, -305, 4166, 4836, -503, -5904, -5361, -709, 3226, 3538, 270, -4308, -5460, -405, 5256, 5911, 1861, -3184, -4333, -224, 4749, 5128, 317, -3942, -4944, -2377, 2528, 5226, 1107, -5060, -5531, -996, 2895, 3854, 1836, -2721, -5460, -1406, 4576, 5598]
1076E598l172m084k237J726N342K701m001n817j112K373L815K648j563n155k965
1091e903K787N770K591k179m605k423K135M401K690j593m888m012J692N815K434
1106D712k546m084k463L59M316M063j618m938k611J657M077L547K81m513m289
1121d050J341M523L264j352m156l820j7L719M077r6m425m460O95M745L622l44
1137C266l179l423m73L801N136J22m748m236N87L012L673J065l672n043p30L947
1153h95L987K71l408m131p15L360M525J435k433m419j250L695M052O66k456m008
1169a724l085K310N594J649m066m307o77J760L828L104k540n435j555L661M405
1184B922J394j526l881k722J946M890J896k204m544k851J943M543K004k211m103
$$ y = [5598, 2426, -1658, -3895, -2169, 3173, 5874, 1873, -3944, -5056, -2683, 1132, 3780, 2217, -2938, -5903, -3116, 2654, 5245, 3066, -1539, -3962, -1827, 2574, 5264, 3671, -1217, -5229, -3537, 2278, 4712, 2166, -1918, -4381, -4022, 294, 4357, 2739, -2199, -4810, -3153, 924, 4471, 4752, 239, -4050, -2709, 1814, 5078, 3726, -430, -4250, -4267, -548, 3529, 3433, -992, -5452, -4757, -12, 3610, 3266, 87, -3336, -3809, -8, 5128, 5250, 502, -3734, -3147, -135, 3538, 4603, 931, -4112, -4842, -895, 3092, 3363, -45, -4176, -4891, -1531, 2994, 4429, 1996, -2423, -3673, 22, 4074, 4740, 2284, -1724, -4809, -2499, 3095, 4744, 678, -3629, -4306, -2546, 1282, 4386, 1846, -3589, -5144, -1483, 2922, 4316, 2790, -1091, -3813, -1867, 3023, 4919, 2715, -1829, -4680, -2737, 1806, 3810, 1599, -2504]
1199b504k630J030N023L625j839m542j778J686L789K810l75m837l544J472M394
1214A780K307r28l566l872K96M459L470j475m245k891J108M016L417m10l566l450
1230c550P01M056L483p24l971l168J53L273L015L40l803m216k47M000L965j55
1246C152l556l203k77L397M277P14l636m060N2L338L519N83l042m368j315L689
1262g36L856j38k896l430j381K580M632J265l261l589n59K940L851J243k524l616
1278a763j258K102L491J584k469m359j768K559L708J134j490l534k409K025M586
1293B139J838k199l340j799J513M352K423k335m154j344J304K925K363j318m299
1308a931k448J614L616K085j095l388k336J061M037K371o31k998k708M59L653
$$ y = [-2504, -5134, -4104, 919, 4544, 2705, -1837, -3615, -1929, 1860, 4670, 4295, -542, -4086, -2614, 1780, 4087, 3159, -407, -4279, -3983, 476, 3946, 2471, -1774, -4665, -3557, 459, 3876, 3466, -100, -3550, -2849, 1207, 4690, 3966, -5, -3173, -3020, 253, 3268, 3608, -195, -4411, -4658, -658, 3307, 3152, -404, -3607, -3884, -487, 3790, 4504, 868, -3192, -3140, 198, 3717, 4300, 1258, -3110, -4425, -736, 3120, 2982, 86, -3344, -4725, -2145, 2487, 3752, 491, -3098, -3657, -717, 3134, 4377, 1853, -1763, -3021, -919, 2572, 4156, 1687, -2672, -4440, -1881, 1827, 2961, 1471, -2063, -4472, -2447, 2139, 3977, 1778, -1562, -3361, -1848, 2504, 4927, 2592, -1562, -2906, -1602, 1323, 3686, 2368, -1931, -4379, -2765, 851, 2936, 1841, -1547, -3883, -2822, 1215, 3586, 2955, -43, -2751, -2292, 1361]
1323A361K789j182l683k569N37L068K581m44l355l004L62L358K878k65l142k477
1339c187N22K910L143K21l180l020K52K767K325N01k665l741n30L034L225k80
1355B297k467k982p93K435L997J156k730l232o04K610L548Q00k633l280q93J884
1371h87L128J457k612m026l37K095K225J340j049l496k095L051L529N73j325k338
1387g67k175J117M305J668k555l236j057P43L029K360j837l843j702J663K732
1402D45K293n22l744k162J971L178J432j32k957l177J011M163J846j689k464k268
1418b776m12L283L422j754l654j399O24K220L110L62l649k556J324K699J899L81
1434C124k208l542L5L348K328o96k508k691p29L166L250n16k949k001k27K156
$$ y = [1361, 4150, 2968, -715, -3284, -2747, 321, 2902, 2458, -897, -3901, -3539, -181, 2697, 2432, -710, -3187, -2665, 245, 3388, 3609, 429, -2591, -2339, 428, 2753, 3254, 589, -3152, -3682, -648, 2577, 2297, -170, -3152, -3945, -1510, 2487, 3643, 913, -2319, -2923, -313, 3235, 4035, 1402, -1878, -2771, -887, 2241, 3698, 1086, -2940, -3277, -1182, 1043, 2383, 1334, -2162, -4257, -1206, 2323, 2896, 1571, -767, -2942, -1825, 2480, 4148, 1593, -1643, -2700, -1957, 1072, 3432, 1595, -2248, -3950, -2287, 445, 2738, 2216, -1528, -3690, -1719, 1459, 2891, 2759, -198, -3375, -2364, 1799, 3645, 1956, -508, -2776, -3188, 95, 3517, 1763, -1891, -3290, -2666, -446, 2664, 3026, -623, -3179, -1855, 844, 2743, 3124, 916, -2626, -2591, 757, 3085, 2389, -119, -2810, -3539, -373, 2877, 2361, -588, -2589, -2816, -660]
1450f60L387N43k985k753M01K169K445J080k233l735q60L151K313J74j755k986
1466b304j499K368L566L60k340k231p44J400L388J462k156l046o49J614K779J280
1482C248j601l456j705K332K834Q50j300l027j751J791L458Q35j753k177j055
1497b477Q98L304J944j642l235r49J152K268J720q05l300j995J257K702J377o22
1513A597k663k288R77L500J559j062j799j883J71K885K438j069k995j254K24J870
1529B08K205P0l231k428Q87K242J647L22k115k708K83K970K113l31j717k184l06
1546b073K405K294l95k174j767p43J718K885p4k532k267R5J606K401J015j985
1562D09k631M1K181K028P29j301k833q77K302K195J84j648k093j418J513K633
$$ y = [-660, 2727, 3270, 285, -2468, -2067, 102, 2547, 3627, 1394, -2341, -3201, -50, 2263, 2437, 682, -2304, -3803, -1435, 2131, 2491, 151, -2080, -2824, -1424, 1964, 3426, 1270, -1776, -2425, -811, 1968, 3248, 1647, -1809, -3514, -1182, 1652, 2502, 1202, -1825, -3576, -1785, 1673, 2508, 755, -1422, -2477, -1579, 1725, 3669, 2027, -1208, -2157, -1005, 1263, 2983, 2178, -1122, -3117, -1860, 842, 2219, 1597, -1066, -3354, -2377, 1123, 2682, 1620, -179, -2062, -1891, 994, 3432, 2363, -632, -1886, -1662, 208, 2413, 2483, -748, -3176, -2289, -47, 1600, 1922, -193, -2901, -2618, 352, 2465, 2134, 417, -1767, -2073, 332, 2626, 2231, 57, -1710, -2453, -735, 2150, 2076, -456, -2723, -2628, -1022, 1379, 2394, 409, -2222, -2181, 0, 2028, 2757, 1456, -1377, -2254, 48, 2243, 2427, 779, -1314, -2732, -1219, 1414]
1578A414P58j917j994j035J204K752J516j671k209q73J451K281J445j257k933
1593a068j073J485J922Q38n52k619j861J164K558Q89p78j762j733O76K970J688
1609B744j115j995j412L94K337J791p58k834j031L16J502J894j85k603j886J054
1625a787J772J522J37j655k260K43K824J634l13j472k035n50K286K262m56k227
1641g5j812j76J413K334L38k452k069K38J853J790J068j892k319LJ960J965K72
1658B439j268k453p81J793K257oj689j900r17J196K673N15j536k137n20J364K294
1675A324J124j449k153n81J340J928Q81j171k479j081J268J971O58r21k150j205
1691b696J163K313Q77q00j724j260Q46K452J501j184j879j281Q12J812J487p82
$$ y = [1414, 2172, 255, -1739, -2774, -1570, 1182, 2698, 1027, -1182, -2055, -604, 1677, 3122, 1865, -1068, -2141, -656, 1266, 2104, 1552, -1067, -2928, -1764, 794, 1683, 905, -857, -2590, -1914, 1056, 2744, 1629, -366, -1778, -1384, 953, 2744, 1986, -848, -1879, -1563, -61, 1833, 1648, -955, -2841, -1787, -15, 1507, 1644, -11, -2271, -2028, 796, 2430, 2117, 645, -1390, -1940, 346, 2608, 2152, -75, -1887, -2063, -650, 1684, 2022, -430, -2499, -2261, -408, 1382, 2450, 558, -1761, -1758, 202, 2167, 2439, 1171, -1282, -2063, -270, 1987, 1981, 292, -1608, -2525, -1329, 1344, 1859, 323, -1814, -2334, -970, 1324, 2448, 999, -1154, -1735, -395, 1533, 2414, 1243, -1236, -2317, -1049, 922, 1580, 659, -1491, -2696, -1533, 780, 1657, 857, -867, -2127, -1281, 1171, 2672, 1488, -391, -1672, -860, 952, 2439, 1657]
1707A657k447j466N54K055J281o18k039j297P18J986J589m84j768j412P19J894
1723I22J232k49j843j526L5J807J497k72j908j743K2J862J569q9j750j579k1J996
1741c8J719K9j592j532M0J731J623J1j732j725k59J409J654k9j339j846m54J543
1759g87J914M72j419j707k32J553J848N11j487j751m12J252J725N34j513j766
1775a265p18R95J899O43j222j955m93J125J725R82o81j746q28J085J798Q95q77
1792A362j799j049R27J605Q08r57j704j282R43J646R71o87j644r59O34J887J063
1809A765k06k008r55N20J691J167k55j869j460K72J508J078n6j628j624M58J469
1826a33J390k51j092j311k19J628J678r6j326j316k18J373J358J37j465j610j3
$$ y = [1657, -790, -2256, -1702, 353, 1634, 1016, -1023, -2320, -1602, 384, 1973, 1489, -279, -1691, -972, 922, 2154, 1905, 62, -1464, -1429, 378, 1875, 1603, -305, -2048, -2026, -164, 1405, 1316, -434, -2013, -2034, -38, 1681, 1710, 118, -1414, -1374, 357, 1980, 1991, 259, -1466, -1725, -316, 1338, 1309, -30, -1876, -2330, -787, 1127, 1599, 180, -1527, -1759, -206, 1642, 2153, 666, -1085, -1497, -245, 1480, 2014, 501, -1265, -1983, -988, 911, 1554, 332, -1623, -2116, -991, 734, 1716, 1035, -711, -1539, -454, 1344, 2239, 1362, -437, -1486, -559, 1046, 1854, 897, -807, -2089, -1146, 500, 1471, 784, -860, -1819, -1185, 702, 1765, 1559, -449, -1404, -884, 807, 1974, 1719, -150, -1610, -1338, 170, 1248, 1192, -436, -2060, -1602, -133, 1257, 1006, -86, -1397, -1616, 12, 1690, 1594, 268, -1048, -1266, 107, 1465, 1602, 137, -1473, -1486]
1843a486J206J244M19j517j426j37J179J605L45p81j638k86J348J532J49j011
1859G45j251p51P65J833L62j317j564m57P76J508Q18q79j754n43R53J680P68o98
1877I94j584q66J156J496P29r57j695r03Q54J493N60p76j367p13L49J488R31l45
1895H44j656p06O68J476Q50j60j575j100O10J584Q74o80j469r85r8J698J194n75
1913G94j210j322M26J391J430k21j433j233M41J195J272O7j327j581L64J277J145
1930A475j75j334j293k70J234J385P2j248j008j68J107J421M13j512j043J0R36
1947BJ371L27j162j773o0J141J137L90j097j504n91J187J405K19p70j014o49P42
1965f99J623P33j280j167l30Q40J013Q34q28j586n26Q50R41O10m47j705o02R57
$$ y = [-1486, -280, 964, 1383, -134, -1560, -1697, -518, 1087, 1432, 651, -987, -1273, 75, 1607, 1756, 745, -506, -1257, -492, 1341, 1703, 386, -1178, -1635, -859, 649, 1467, 588, -1166, -1709, -756, 924, 1692, 994, -590, -1456, -300, 1196, 1925, 968, -727, -1630, -776, 717, 1277, 501, -866, -1579, -1230, 258, 1189, 844, -812, -1518, -850, 626, 1476, 1316, -259, -1359, -749, 835, 1709, 1029, -440, -1425, -1523, 175, 1369, 794, -416, -1738, -1312, 79, 1509, 1288, -145, -1378, -937, 258, 1530, 1597, 270, -1311, -947, 330, 1475, 1300, -34, -1327, -1597, -363, 1022, 1094, -154, -1162, -1330, -223, 1198, 1611, 99, -944, -934, 2, 1373, 1700, 538, -1235, -1295, -154, 983, 1373, 276, -1228, -1819, -632, 773, 992, 222, -792, -1441, -699, 924, 1657, 377, -790, -1120, -280, 733, 1567, 739, -847, -1373, -523, 418, 1028, 581, -1124, -1726, -769]
1983g69J441N03n20j139p97N45J679N04o76j075p68K10J468J053q63j364m80J85
2001h63R90R55j09j491q84O84J221O13J9j048j239L41J363P92k96q31j127j49
2019a059J170R71l74j074r30K7J137J185K5j597n69J13O85J248M03j150j228j5
2037a032J014J027J34o42j322n60J127R64O3q39q33m75Q04J404L87r74r87k52
2055i92P19J400L13q11j246k60N25J139M63p94j420k63P63R45M51m65j014q76
2073a423P99J340K12l03j023l62J82J324O25n06j075o65J01J090R28o13j246m80
2091a095J0J255Q63k36j299p62M15J267O65j44r65j062M16J181O20k59j036p89
2109i55j40J049J147k55j229n69j63Q95J032J58j170q79J53R76R68P9p79j075
$$ y = [-769, 672, 1175, 655, -484, -1281, -736, 943, 1447, 771, -304, -1072, -862, 606, 1659, 796, -568, -1048, -863, 127, 1082, 973, -518, -1402, -718, 503, 1116, 1135, 87, -1152, -811, 552, 1344, 1048, 217, -910, -1059, 111, 1082, 708, -366, -1296, -1269, -132, 1053, 1078, -519, -1088, -975, -290, 958, 1361, 211, -1017, -1032, -18, 1009, 1143, 501, -821, -1381, -254, 710, 773, -66, -899, -1374, -570, 834, 1221, 247, -740, -992, -273, 1127, 1440, 629, -617, -877, -352, 787, 1250, 456, -964, -1227, -464, 481, 932, 467, -547, -1423, -624, 716, 928, 625, -398, -760, -578, 746, 1371, 865, -210, -875, -774, 316, 1244, 631, -615, -1095, -1085, 170, 1033, 797, -502, -1264, -849, 418, 1083, 939, -26, -1088, -672, 509, 1129, 870, -166, -955, -1095, -46, 1101, 846, -383, -952, -1115, -220, 812, 970, -200, -1079, -926, 50, 1018, 1097, 318, -757]
2127g57j1P47Q96J86p85j103l69R12J062L3p74q44m15R44R65J60q91q20L9O33
2147a92Q99Q24j126j066r6O34P57N07p08j393l20P62R62K01l73r27n04N17J490
2166H48Q7l14q56o60N22R71O01o25r19o53M90Q47O44n21r93q04O56R31N33l12
2186D73j083l11J33J243M92j61p34q02J84R66N31j65q67r11K63Q15P60j42j024
2205c40o86J36Q34J017j27q19p57J24Q40O49J11o43j112j14J081P35k54o68o96
2224f89l52R38O04P3n23j019rP54R39K7n57p44k07P15O27L01o12q79l04N50O95
2245C28N51o95r89k96N64Q52N13p63n57o13P51P45O93n69q35l58K03J088K48k52
2265F09j045l28K44P64M01k89j006k39K91P86O02k61p19l81J98P82O37l71q19
$$ y = [-757, -768, -21, 875, 1061, 276, -827, -1196, -284, 778, 811, 37, -807, -1222, -278, 687, 847, -44, -864, -825, -192, 707, 1531, 405, -661, -757, -123, 634, 1141, 433, -960, -1280, -518, 444, 645, 272, -655, -1159, -642, 848, 935, 621, -235, -895, -373, 598, 1199, 574, -345, -998, -508, 339, 983, 462, -531, -1335, -679, 252, 785, 473, -610, -921, -788, 455, 947, 786, 52, -750, -566, 400, 931, 766, -101, -1012, -749, 66, 826, 684, -340, -1026, -890, -56, 961, 834, 15, -742, -618, 222, 871, 982, 339, -773, -887, 194, 929, 675, 7, -689, -1041, -103, 501, 574, 51, -968, -977, -223, 716, 743, 186, -558, -765, -50, 577, 878, 266, -613, -917, -367, 328, 879, 184, -805, -1101, -537, 315, 828, 65, -492, -1105, -354, 391, 1084, 515, -320, -678, -475, 613, 861, 609, -436, -764, -520, 244, 645, 356, -650, -889, -598, 188, 790, 529, -190, -571, -373, 409, 1046, 675, -144]
2284a44m64K47Q01M55l74p75o92J84P57P75j72p47o53j3P95P98R1q55n88o5P69
2305A30P32J02r12o28j50O48O91n8n99r36o0P74Q50np61o93OO57Q80Q7n05p69
2327e19m18Q14Q69j1n71p35l74O34O90L27n63p29m16O50P82J36l67n40l80M73
2347b48R66L00m13p38n31L02O54O32k71j012l45J37O71N34k38q30m37L57Q17N02
2367H09l47n77n39L72Q61M26l82p50o10K77O95O54o47n41l96l6P23O68j05q08
2387b53n05K01Q47M19J28o94o25j01R55K18J7n31q52l3P51P03j76o84n75n4N92
2408b52R15M7q39m29l5N75P44K7n27o06j93N65N00P5k93r49l10O85O55J24k57
2429B22p89m16O79J029P2o54l57l51L50Q90J78n53n66k92L56M77L52k83j034r8
$$ y = [-144, -608, -361, 440, 895, 521, -254, -946, -762, -5, 770, 598, -149, -802, -815, -20, 778, 869, 14, -574, -639, 130, 862, 964, 52, -576, -726, -78, 613, 555, -44, -980, -1040, -266, 584, 579, -182, -875, -869, -212, 668, 755, 250, -519, -937, -123, 746, 735, 164, -571, -945, -311, 379, 706, 143, -586, -1002, -352, 430, 566, 199, -341, -721, -248, 718, 1018, 605, -133, -664, -362, 292, 924, 653, -359, -704, -567, 104, 638, 400, -430, -867, -510, 307, 809, 462, -115, -654, -282, 579, 1005, 623, -127, -737, -460, 235, 889, 242, -299, -695, -731, -8, 660, 555, -253, -758, -557, 290, 709, 837, 143, -482, -583, 372, 590, 607, 76, -776, -809, -58, 645, 469, -215, -790, -844, -252, 663, 710, -129, -558, -593, -18, 726, 753, 226, -380, -573, -8, 492, 567, 274, -675, -985, -300, 355, 479, 222, -567, -983, -304, 725, 797, 143, -214, -565, -215, 675, 853, 300, -266, -558, -202, 275, 627, 344, -690, -788]
2449g88M41N56M13l30o92n28N48R54J27j98o06m08Q1Q76M53m22p39k64k25Q69
2469A18O26m82o00n30N53L58P36l78p53j61J24O32M59jp39l61n5O65L13j47l91
2490a4p28J29N57M78j08n80k75mM25Q03j76m36m16j55N57O94j03n23o16K00L04
2511A3N37J2n54n50j79N95N23l5k42m47l46L80Q06K97n18n67p7J57O33M82o12
2532C08p02k80M01O12J73l60p13j95L95O84L24k43p53l11M98O87J79l47l94m62
2552d99O5Q05L51n96m00l02j08O90M85l37m62l37K85M46N31j28p06j42K8M63M92
2573F24j1p88l79K23M76M81m17m45m59K36L50P75j97o22l69J95N44L25K35o61
2593A16o01O9N45L96p7l75n16j33M38L82L62m97o90j70P13M77J96o64l15j27M21
$$ y = [-788, -347, 209, 622, 292, -400, -928, -380, 574, 701, 503, -103, -511, -430, 446, 899, 477, -262, -526, -751, 118, 744, 262, -338, -868, -315, 43, 779, 401, -352, -513, -389, 243, 702, 701, -38, -399, -454, 211, 524, 377, -14, -742, -613, -56, 422, 314, -266, -541, -545, -120, 683, 507, 71, -345, -500, 57, 751, 648, 125, -491, -291, 13, 550, 562, 8, -542, -721, -126, 397, 362, 120, -327, -673, -293, 513, 810, 292, -275, -352, -195, 438, 920, 308, -394, -674, -273, 339, 512, 152, -561, -756, -361, 323, 647, 404, -349, -660, -162, 525, 704, 357, -37, -499, -434, 371, 722, 126, -274, -576, -684, 6, 491, 154, -308, -645, -360, 86, 617, 489, -217, -359, -331, 132, 624, 613, -175, -554, -331, 145, 626, 209, -236, -695, -459, -109, 666, 469, -153, -522, -327, 217, 542, 777, 116, -485, -416, 129, 525, 448, 73, -443, -576, -138, 244, 606, 109, -581, -751, -38, 439, 635, -29, -344, -471, -50]
2614e0O38L7l96m47j39K12O36n8j55p64MR1N78K11l06n88k00M40N95j5j13m97
2636b86k23L10N69K10k24o09j31KO02L80l37n04m20J80M61M97k60l78n27N20L90
2657B22K72Mm99m34J27M56L38j26o30m09K53M19M42k51j98n32Q9L66M77j21m55
2678a90k73P6P16L27j36l17o14K8K87N56j32m14k63j91M62K02K01l37m72J5M27
2699d2L11J73l67m71K1L34O07q4l64l68j98L84L80K5k48m74k12M37M52K13k83
2720B26n65j89L18N77J27l80k32l07L36M86J96l57l09m56K60M70L29m51m36j80
2740e37J97O31J26l34k90k11J19M93M02l36l44j59l2M89K73j16m27m73J32M24
2760B7L13o4m92k06O9N31J71p5j47n70K26L09L59m9k83l98Q3L49L44l07j08m88
$$ y = [-50, 588, 625, 229, -218, -357, -145, 491, 433, 278, -486, -482, -391, 187, 398, 92, -496, -696, -256, 339, 324, 211, -286, -509, -199, 370, 580, 356, -253, -384, -382, 220, 600, 263, -241, -661, -481, -20, 477, 217, -161, -688, -168, 222, 494, 498, -1, -435, -308, 148, 486, 360, -270, -679, -426, -7, 435, 184, -14, -546, -457, -91, 386, 265, -190, -463, -387, 329, 656, 520, 203, -411, -383, -96, 460, 328, -86, -349, -540, -78, 124, 325, -12, -484, -469, -42, 269, 442, 75, -396, -375, -41, 566, 482, 118, -250, -448, -64, 316, 341, 93, -381, -593, -156, 296, 509, 226, -339, -528, -210, 367, 494, 114, -118, -425, -89, 397, 593, 236, -73, -529, -269, 201, 530, 79, -357, -537, -340, 291, 417, 83, -207, -418, -299, 194, 596, 260, -84, -243, -275, 214, 487, 371, -56, -529, -397, 27, 340, 276, -216, -422, -353, 178, 349, 274, 127, -443, -217, 92, 451, 402, 119, -279, -196, 153, 497, 190, 82, -406]
2782d06Q1L02L67q1k81k93j8J62M57J83m04m18j01L43L24K34n12l53R4L82K73
2803C35K4l15m52q4L48K79K28k29l44l34M34M17J81j66n88l1K24O33j07k16m70
2824b33j28J52L67K31j37n97j66K33L57L32j27l17l08K59L58K56k46l42k96K05
2844a47L23J00k08k45l58J73L87L69j98n01r0R4L15L63r6l72l5q1K12J84N8l08
2866f1m23N14k8K47J18l73m14L6L77K55L0l28k84J3L17N36k36k74l00PJ94L60
2888B83J54l77l51j10K99L01k3Ko96K32P9M44jj3m79QN6N10P2l14j28k07J99K60
2912B00J79k49l86k63L40Q0M39k52l01k01K64K35L14j72k67k84J46M15K33k22
2932B48k28j95p5L10J67l2k41j66j16L53J95k64k9k43J36J43N69j50l66l51R0
$$ y = [-406, -325, -23, 344, 263, -18, -311, -329, -167, 290, 473, 69, -349, -450, -107, 217, 451, -61, -414, -320, 62, 335, 359, 44, -408, -492, -144, 135, 363, 134, -210, -544, -110, 307, 488, 322, -266, -297, -73, 560, 453, 237, -233, -361, -209, 158, 389, 252, -345, -511, -278, 79, 411, 284, -33, -341, -82, 276, 532, 286, -56, -352, -147, 176, 276, 68, -177, -535, -362, 25, 394, 196, -305, -395, -301, 14, 377, 281, -91, -126, -207, 5, 189, 247, -61, -484, 30, 2, 249, 367, -6, -420, -384, -7, 248, 278, -50, -334, -321, -4, 532, 296, 22, -278, -271, -77, 283, 437, 60, -291, -401, -102, 199, 176, 178, -518, -286, -207, 237, 236, 223, -256, -248, -192, 318, 390, 76, -52, -259, -60, 200, 379, 130, -256, -519, -179, -99, 340, 88, -213, -414, -150, 85, 399, 227, -40, -324, -178, 237, 470, 248, 20, -175, -250, 60, 227, 195, -46, -212, -328, 25, 220, -44, -73, -316, -180, -37, 532, 382, 16, -335, -245]
2953b45K59J94K13l46l10j78N19J51j5l13j43k45M99K12j30q1k95O4J87L61r5
2974B63k01k04q6L55J13K4k21k03j71J94J83K91k16l00k99M60K48Oj94k71O7Q0
2996h2M38o7k35j03k14J47K34R7lm64j68L75P6O5o3k87K2K84K60j37O5j97k75
3019b32J56L72O1j72l04o9lK40J91k4l17l00K34J67J55q2l16J14j40K97K92q1
3041B39k89j23P5J17L44j61p4l66j19L26nK28j63l26P2K1M19J86m17q3l27L66
3063f0L94n7k04j88l8J35K75J62l98j68k23L78J15N3j89j59J7P5M20j57j49j94
3085a60qJ36J58R9k1k79p4J4K76J02k82p4k52K11L61O5j59l31j4J83K37P2m8l22
3109a10j95K78J10M28l33l13j49m6K92K66k03j97k23K08L02J58k02k13q8J27M2
$$ y = [-245, 14, 208, 421, 75, -235, -413, 106, 257, 242, -71, -214, -459, 40, 252, 122, 41, -254, -190, -3, 358, 263, 62, -142, -228, 127, 240, 264, 43, -160, -331, -137, 46, 337, 121, -179, -478, -18, 230, 236, 42, -229, -162, -82, 356, 289, 54, -49, -263, -116, 118, 215, 212, -252, -420, -45, 31, 96, 33, -254, -232, 52, 312, 175, 240, 43, -232, -76, 296, 357, 185, -119, -188, -191, 49, 240, 216, -101, -401, -167, 0, 155, 73, -243, -129, -269, 28, 320, 239, -50, -173, -98, 19, 363, 202, 128, -238, -357, -31, -36, 192, 29, -297, -225, -204, 215, 401, -16, -99, -426, -60, 334, 277, 73, -115, -153, -18, 257, 419, 21, -147, -370, 8, 123, 176, -13, -172, -155, -80, 340, 183, 34, -160, -168, -32, 126, 225, 204, -75, -149, -135, 141, 243, -39, -113, -365, -154, 207, 272, 113, -218, -232, -49, 188, 260, 212, -110, -305, -27, 83, 511, 178, -135, -284, -330, -38, 228, 25, -172, -395, -187, 115, 273, 71, -142, -230, -103, -61]
3130f1J63O5j21m28K92K13P6K5n01J07O4J21J88n9k14J20k73K57K27l7p3k41q6
3153a76L43J63j60j65R5k78J05K64P0k63j38k74K84L67n0m9k54k1J60J20K40l38
3175D5j78O5k5J97K63k90j16j08rK30J74k12r9k85J69J42L42j44j06k07l7K88
3197I9R8K5l63o5J65K1M68l37l16J58j18QL42Qm22J21k76L81K0J92j56l21J10
3220a58L11J42J43k76m15l2K71J61Q2j90j04o3J98J42Q7m05kk8P6K32R6j22k18
3243g2L6K0K55jk88r0J5l7L73j9l22j36R4L4J77K79k50j12j08J45R1K11k52j12
3267f9MJ37P7K6J1o4k05o6J79J97q3l45J12j68L45J35m3k70n9J4K26J50j70n5
3291A6k09k5J01K25O7r6m52J67J47J96J2j63r6q9M9L20Q5k74n6K8K2J99R1j04
$$ y = [-61, 102, 167, 46, -382, -90, 123, 199, 224, -277, -170, -106, 15, 203, 144, -70, 50, -223, 34, 261, 224, 151, -90, -176, 167, 330, 170, 5, 100, -178, -73, 191, 261, -2, -140, -414, -130, 237, 187, 138, -116, -137, 23, 143, 383, 45, -133, -68, -93, 104, 367, 77, -39, -147, -156, 74, 248, 36, -63, -348, -179, -37, 305, 161, 55, -152, -189, 99, 197, 222, -141, -206, -41, -20, 448, 111, -205, -47, -165, -157, 185, 193, -229, -108, -384, -3, 17, 209, 53, -268, -158, 153, 295, 438, 162, -253, -285, -14, 147, 229, 39, -65, -128, 70, 212, 299, -106, -108, -136, -60, 172, 268, 146, -72, -36, -16, 239, 238, -50, -140, -125, -162, 211, 192, -130, -266, -172, -138, 39, 318, 68, -44, -152, -7, 84, 295, 43, -69, -65, 72, 149, 175, 186, 122, -83, -149, 30, 227, 144, -201, -89, -257, 88, 223, 180, -90, -149, -135, 91, 241, 71, 16, -193, -218, -117, 108, 175, 79, -373, -206, -59, 137, 149, -14, -110, -199, -150, 170, 255, -19, -75, -47, -25, 174, 265, 161]
3315A61j89j63J82K00K5j37j67l7K36J14K1j15j89p6p9M20K2k55oj27J70M8K8
3338H7o4j89r0K21J05p5R1j73n1l8K44j12qn9j10K10J34J58k18r7j54J66n0K78
3362B06p3o7l25J22J75J32o0j12j88N5K92o6o0N6j92o9J75J83J9j20j23j7L09
3385B52q7j46k02lP6J19Q5K5k88K5KJ52L18j98j34N4p5k1J67J11k08k13o3J90
3409f2K42j04n0j02k89K02L19%o4j00l9l1K59j80n7K3k66M20q3J76l26l3r5J45
3433i5K63J7j3j52k3r6J06J79p9r5k43R2K75K8rk50M6j22L07L9n6k08j87J83J82
3458H9j4J22k47j24J28O2J75k1j03k23pO7M39k71r8k19Q4K19K16k27r5k37n1L63
3482B7J13K4j97k42M1L41Q2O0q5k91q9L02L8j52J16j83n0J39j48K24k56M5r3J58
$$ y = [161, -28, -191, -9, 191, 216, 79, -88, -125, 111, 225, 246, 131, -58, -134, -213, 207, 229, -26, -32, -159, 11, 59, 87, 23, -166, -256, -35, 70, -5, 86, -87, -138, -176, 68, -44, -52, -111, -221, -11, 123, 281, 63, -34, -188, -22, -72, 206, 133, 66, -259, -137, 38, 170, 110, -2, -190, -135, 157, 91, 31, 87, -105, -174, 1, 184, 203, 83, -40, -57, 252, 165, 19, -183, -186, -110, 9, 94, 119, -169, -144, -142, 10, 328, 130, -4, 50, -25, -46, 121, 232, 24, -189, -252, -62, 180, 76, 26, -76, -365, -163, 156, 156, 92, -8, -47, -78, 181, 1, -56, -33, -299, 121, 38, 214, -112, -145, -240, -95, 168, 185, 172, 20, -3, -99, 7, 186, 107, 12, -231, -139, 136, 164, 155, -95, -49, -171, 136, 175, 119, -89, -276, -93, 89, 75, 197, -50, -174, -46, 16, 191, 170, 67, -156, -163, -96, 343, 72, -26, -245, -161, 58, 274, 47, -48, -285, -336, 27, 140, 164, -33, -275, -234, 107, 189, 249, 164, -127, -216, 86, 124, -28, 88, -95, -145, -6, -154, 70, -186, -141, -234, -76]
3506g6Q9M1J03j85p5L6L83j42j14k45J09O2J37j6p2k92M6J39L25j85k2Pk8j40
3530a15J43J21P9l07k17J83K96L5m9k76p5Q6O1J71j24j6q7m9L47o1L8j96k84J51
3554a45J90K09q4j2l81J83R5O0J5r7j54K6J29J14J87m15j42PL18J83m8j44k31
3577a37q0J2M22j16K3j19l42J53M08j43L7l62R7K74N9j6q4j34Nj46L04J89l70
3600f6j22n6M14r7J26j50j35o8K5M2K13n7j26k37J53L39m6M4j82j05j8K20J31
3623B42j25k82j23J47J82R2n2k58J5q1L01K57k29l0j55j5K10mN1j74l13K15J3
3646a16L54q5k25k01J03L62J9Jj89j79J05j2J86o2L5j70j1R8K05n5m4k13j52M4
3670b02M24j76j19j81k7M09L9Q8k24j70j74K46K30J3k33M0j22J23L74k62r0j38
$$ y = [-76, 13, 54, 157, -28, -103, -67, 316, 174, 60, -185, -76, -14, 123, 107, 35, -257, -211, -72, 253, 68, 46, 53, 25, -115, 28, 149, 228, -79, -296, -113, 183, 218, 169, -107, -182, -96, -35, 136, 12, -4, -91, -140, 207, 146, 184, -12, -296, -145, 45, 254, 170, 158, -223, -40, 55, 115, 130, 33, -121, -95, 34, 148, 335, -80, -222, -215, 103, 286, 238, 94, -137, -217, -205, 217, 101, 124, 5, -337, -184, 224, 81, 118, -244, -147, 127, 186, 170, 86, -48, -43, -189, 115, 304, -66, -188, -244, 170, 73, 199, 49, -86, -154, -129, -87, 126, 69, -57, -294, -141, 198, 152, 196, 14, -91, -109, 111, 242, 117, -165, -288, -141, 41, 133, 81, -177, -162, -243, 58, 315, 86, 56, -99, -114, 96, 92, 143, -31, -344, -129, -116, 238, 153, -72, -273, -170, 192, 211, 212, 23, -156, -51, -63, 123, 61, 96, -74, -85, 13, 218, 163, 119, -94, -246, -202, 222, 46, -73, -254, -281, 128, 167, 255, 31, -139, -313, -67, 163, 176, -57, -17, -139, -16, 358, 96, 6, -132]
3692a32m4J54P2J18p9j84L0Q6k1R3Q4k18j07J21J42J23j53j40k6L4K59j23L5k58
3716a34j48O0J96L63k66j56k57J89K96K5j19j16j40P4O1L28m6k51q6k3K60J57
3738B67o2l32ml18M18K42K9j88m31J77L38K09k60k3m24K34j8L33O2k49k50N9K01
3761A0M1K7p8Jq0K56j3Q2k61j19r5K53P7P1q6j34j29J95K25j37o1k33n4L03P6
3786A37J54j83k62J1oJ80n1J72q6l62K52J86J57k55o3l00J34L41o8l7n1k58K83
3809B5pN5M7j82k69K78R5Q9q6k06R3q3J98L55j99l19j34K89J29j9Q4j67k17j8
3833a69Q8K48j03j42j59J15J21J91L3n41L0J13K64R7l5j38Rl34K86J79O4j96j55
3856a34j39K23K20o3r8k28k5R7K44J05k46Q2j24O1K58n1j56j21L7J31J27J30l45
$$ y = [-132, -176, -22, 50, 168, 89, -95, -65, 21, 0, 93, 177, -41, -148, -27, 115, 238, 85, -55, -81, -47, 212, 89, 124, -134, -282, -222, -26, 337, 71, -85, -342, -153, 143, 168, 49, -67, -207, -133, -72, 256, 210, -41, -127, -150, 110, 267, 205, -127, -131, -449, -31, 211, 240, 52, -379, -202, 136, 345, 85, 62, -362, -128, -146, 187, 249, 0, -250, -191, 10, 51, 78, 0, 1, -79, 177, 164, 246, -15, -134, -229, 24, 101, 172, 86, -48, -177, 18, 243, 106, 45, -188, -242, 61, 137, 291, 108, -154, -143, -149, 31, -20, 152, 66, -296, -44, 142, 299, 44, -19, -319, -185, 156, 88, 51, 0, -258, 25, 18, 73, 120, -62, -331, -53, 42, 131, 45, -161, -68, -151, 47, 402, 203, -116, -250, 39, 168, 149, 233, 66, -151, -169, -81, 167, 64, -78, -237, -122, -1, 190, 223, -318, -288, -175, 89, 186, 151, 13, 22, -312, -26, 153, 217, 21, -134, -273, -50, 170, 107, 9, -219, -244, -147, 97, 202, -44, 38, -86, -25, 233, 182, 26, -95, -58, 73, 200, 330, -15]
3879a5j62r5J69M57j47Kk80j03J40l5J14J10k20r2PL86O3k49j49j38P9M40Pl29
3903d0j89q9K53J61J53j45k74j63L15O9K91j89k08j05j8K01J47J06l91L2j36L84
3925A65n3J64l01j34J29j2K81p2j15l44K37K05J93k47j16k81K06LL07p6l3l48
3947b42N2J57R3K02l26j25M3m0L23M2l34%q7L01J63j06j71Lj90J63K89J89n39
3970a40J7K3K4K63q6k7k90P9L8M01k07j1rn11L38L31n3k87L7o4K06j9K26j38k16
3995g5j54J25K40Ll7j55j82K08J23n3K1k76j56K62K73o8n1o5p9o7L71j6m2q5k63
4020a98K9K48L45l78P2k12r3J37L59k35l9o5M3k09L05L40l79k39j06J78K62m3
4042A22j95j94j43M11L20j38k17knn4L48q9j71k71J6L10L07j47k50j42J48J8J50
$$ y = [-15, -177, -272, -103, 354, 207, 209, -71, -174, -34, -69, 45, 155, -65, -157, -150, 236, 299, 50, -99, -237, -158, 282, 289, -40, -229, -318, -65, 96, 249, 104, -170, -333, -18, 51, 342, 153, -55, -160, -178, 23, 170, 276, -115, -83, -219, 165, 112, 276, -25, -159, -30, -42, 239, 167, 52, -292, -55, 150, 343, 96, -20, -301, -95, -92, 215, 139, 106, -242, -190, -33, 60, 262, -64, -189, -146, -186, 137, 179, -155, -155, -242, 59, 222, 116, -55, -52, -242, -79, 210, 399, -140, -123, -100, -76, 187, 101, 74, -216, -137, -99, 302, 95, 84, 75, -436, -98, 233, 180, -107, -70, -134, 72, 53, 279, 141, -75, -229, -104, 136, 139, 102, -53, -235, -27, 96, 43, 64, -212, -368, -106, 167, 99, 48, -17, -96, -163, 208, 192, 150, 65, -198, -169, 79, 424, 46, 118, -94, -187, -50, 309, 74, 35, -30, 13, -196, 109, 449, 70, -169, -275, -97, 165, 122, -73, -267, -410, 1, 321, 183, -34, -36, -41, -95, 253, 164, -7, -278, -262, 48, 355, 208, -42, -184, -36, -18, 132]
4065A32r3r3Rj16J67L15j94j70j56J4K76l0K9j76j19o3M5M05R6k15k23j55L27
4088A2J65k6o6k56LQ0J73J76j15k33o5K48M4J44k87m8k17J49K22P9m5k89k20L37
4112c5J63l3N9l17o4J31J54J9J63m56M7j4N6L26k06r2n0J20p0N72k01m12r6J44
4136i2Q2J96m4j56k61P1K29J28Lj24k46J27O5K59j78j4j73m5J54K03K42m09n2
4159c5k02L15N5lj30k50Q5K90R1j1m7k59q2O1L15Oj42m7l03P5L64m2p5j38j14
4184b23J56K97m6j34k58p6K73K04j62Qn9k41J07J57K05k31k62J20J45N3J97k59
4206b9m8k21J50J60K64j84j52q8J05J08J25K6q9m05J92K86j27J37k57j45J14J26
4228D8Q2O3k26q6KK86P3j38j99Kp5K93k8M6k42n8j20L18O7J9Mm10J07J15M3L37
$$ y = [132, 39, -54, -45, -161, 6, 321, 127, -43, -199, -185, 91, 61, 90, -86, -205, -268, -223, 182, 278, 63, -160, -315, 12, 177, 151, 85, -171, -168, -88, 85, 261, 146, -87, -152, 96, 140, 284, -3, -51, -268, -119, 103, 182, 137, -152, -372, -35, 128, 95, 154, -163, -227, -96, 58, 77, 240, -216, -169, -183, -127, 199, -7, -99, -149, -29, -99, 473, 272, -140, -236, -92, -10, 186, 142, -14, -275, -204, 25, 153, 156, 32, -214, -87, -22, 237, 59, 45, -128, -173, -19, 184, 426, 17, -35, -237, 78, 133, 130, 0, -250, -165, 125, 216, 205, 158, -101, -183, -122, 193, 199, 57, 10, -293, -218, 146, 104, 29, -109, -223, -67, 230, 184, 50, -208, -284, -11, 193, 31, 39, -20, -261, -154, 3, 208, -23, -285, -165, -20, 33, 230, -29, -77, -298, -148, 12, 276, 92, -60, -148, -43, 65, 190, 216, 127, -278, -86, 200, 73, 210, -47, -192, -78, 48, 130, 193, -33, -119, -117, 169, 242, 104, -95, -93, -168, 125, 97, 143, -99, -157, -277, 41, 108, 127, 131, -279, -172, -57, -14, 323]
4254C23l55j63q2L12J42l6p0j54k01K08L43k12j05k06j41K39M97r8j81k95j18
4275c53K20K39J26j46m34M8J84L09q2K09m56R8j38M01J25m06J0j59J22J15J83
4296B15N0n30J58P7L4K02P0k78k17J34J38J16p4j16j86JL42o8o6p8j53J43K79
4319A93K2k18l6j71OK74J05m0k49Op0K44J34p1j61j24j05K35K26n9j89k95J97
4342a46R7K44q6k10N5j55K15K12p5k30j09o9K15K49r4q6j86O1M6M04q2k57k67
4365b54K59K6n2K30j75l54Q9L77p6n3L1p7j89L38J25o0j73j70K3M7K14j30J61
4388A57n20P5J80J87J31j3j79k12J15R1J94k86R7n9j86M52k5o8k92l2J92m4J74
4411A29o1o5j95J29L0L40j45l01j36L70k3MJ0k52o4J89L0J73Q7m66j20M28J2O4
$$ y = [323, -32, -195, -277, 35, 177, 141, 71, -83, -284, -76, 267, 55, -50, -256, -397, -158, 339, 241, 60, -235, -353, -133, 106, 232, 86, -348, -300, -116, 193, 111, 320, -136, -38, -176, 225, 350, -56, -46, -205, -83, 32, 215, 265, -265, -107, -30, 4, 206, 276, -2, -219, -85, 53, 169, 95, -21, -207, -206, 136, 68, 2, -76, -229, -86, 193, 215, -3, -39, -210, -204, 70, 175, 135, -114, -108, -178, 66, 200, 129, -32, -156, -261, -26, 200, 141, -48, -343, -146, -49, 195, 109, -101, -46, -201, 14, 226, 151, -79, -188, -257, -42, 207, 113, 27, -159, -98, -52, 352, 270, 13, -254, 5, 31, -21, 209, 34, -320, -231, 146, 70, 17, 48, -29, -218, 120, 245, 185, 12, -158, -135, -88, 126, -4, 157, -363, -288, -108, 79, 210, 197, 18, -194, -79, 12, 206, -80, 17, -42, -228, 224, 199, 131, -161, -193, -1, -45, 129, 68, 3, -192, -63, -33, 307, 162, -139, -275, 95, 72, 76, 86, -166, -230, -41, -11, 162, 249, -217, -337, 91, 103, 167]
4435A67k69O3N2n1r9M58l38K8k16k8K62K25r2k19n8j76L19J20Q4k81k32L7M22
4458A78N8O4m14j11J55OK02p4J86k87j19K08J79J20m56M1Q5k68K23K67k59j91
4480b07j59L17K85j77k1p3j22M8L42kp4k53j18K90J48m2o5l06j09K44RL82k89
4503D8k48n9LM40J4k35r6j49K34J35K60m42m9j37J88K93j62K03m46M4m3L54j41
4526IN9k00j19Q5L24K42k21k94p6K18M8Q6l5j35j84R6K70j39O6j80k0m8K29Q7
4550A68P4l62j56K5J67L64pj21l42J05R9K00k2l08j03NK14K76k18m4k49N9J45
4573c1J10J18k88k25J58K66J20J8j27l47J2L37o2K08k05k73j02J75M36q6j01l99
4595b88K16OK72m3m0l16j27L37m6K10j09q3j50J37J47J80j92j85n1J5K67K30k60
$$ y = [167, -102, -39, 13, -38, -137, 321, -17, 11, -205, -233, 29, 254, 162, -57, -115, -291, 28, 148, 232, -49, -281, -244, 178, 236, 300, -114, -225, -70, -64, 138, 64, 250, -37, -156, 52, 231, 351, -105, -64, 21, -247, -24, 243, -16, -207, -366, -49, 236, 59, 38, -35, -157, -109, 233, 231, 157, -96, -214, 76, 224, 182, 117, -189, -298, -54, -45, 337, 48, -200, -259, -256, 184, 198, -37, -133, -282, -48, 87, 347, -95, -144, -281, -93, 200, 38, 241, -205, -161, -204, 150, 9, 68, -132, -251, -166, 158, 400, 179, -115, -191, 27, 75, 161, 126, -9, -193, -97, 173, 34, 100, -80, -100, -148, 81, 168, 242, -120, -276, -251, -84, 280, 273, 152, -190, -85, 14, 214, 192, -116, -219, -214, 0, 276, 58, 14, -235, -176, -31, 79, 197, -91, -316, -158, 108, 228, 246, 119, -228, -216, 121, 59, 267, 62, -211, -313, -138, 298, 212, 111, -288, -72, -66, 206, 163, 123, -193, -320, 17, -29, 181, 72, -11, -161, -24, 123, 303, 111, -74, -125, -110, 157, 387, 127]
4618A27j88j34P6K74Q8j49j3k70m0K94K64k37k02kj02L56K48j98k17r3L1K68O9
4641B50j02j69p7l7J89N4k0o8k98L1L33P6r4k0j63n9K21K28j80r7j76N6K99j59
4665A8J46O5n26J95K37J30j64J3l58R1K83k6m3m4r6R4N6L6J32j99k88K51L5J95
4689B33o9k32q2J14o0P7mR0j01PJ8P2Q6j91j12p0K85J25N3k34l71K95o6L73n6
4714A80j29j26j45jM79J2M0l55l07R3L20O5N6l86N6lM20k7l04P0j94J00K93Q5
4738B92k59n1j61J26J25M4r2J5k61J25J85J16k07J2j35o2L30j4k28J2Q1oK63j49
4762A01J09k82k19R6N5L18o3k19j03k4K86q3N2l5j27r8L56J15kl19j30l1J74K50
4786A77M5k44k35J76N6J74J91o14K64k64K32J95k6o1k34J3J83m7K7R1l12N5J23
$$ y = [127, -61, -195, -119, 155, 243, 94, 81, -189, -229, 65, 329, 92, -110, -112, -214, 142, 390, 192, -25, -118, -87, 181, 250, 148, -21, -98, -135, 54, 108, 88, 20, -278, -247, 86, 162, 68, 48, -115, -174, 47, 275, 95, -2, -178, -122, 177, 18, 164, 229, -297, -102, 135, 265, 101, 114, -244, -153, 130, 104, 61, 17, -79, 15, 71, 107, 239, 40, -248, 3, 38, 233, 164, -68, -150, -36, -96, -19, -23, 67, -34, -27, -9, 63, 149, -42, -154, -224, 61, 186, 239, 5, -366, -71, -137, 236, 180, 51, -75, -220, -221, 258, 270, 310, -45, -352, -259, 61, 126, 182, -204, -148, -151, 269, 242, -62, 8, -186, -86, 207, 292, 33, -18, -179, -53, 72, 116, 24, 39, -222, -97, 88, 204, -3, 9, -126, -188, 142, 128, -100, -88, -7, -13, 250, 101, 210, -72, -291, -195, -140, 178, 115, -104, -207, -231, 55, -28, 24, -11, -138, -236, 120, 235, 233, -86, -216, -247, -73, 177, 222, -22, -257, -81, -25, 149, 340, -274, -10, -274, -42, 153, 127, 66, -168, -155, 28, -19, 8, 99, -213, -158, -35]
4809c5J87M4K2m06oQ1J95n5J17l34J46R2m4K37k51l8j43J58K24p8j15j04j88L40
4833D6J64j04r5l06L6J37L98j40j39j08j09L5K34K59j77k51k76L42pM03k24j78
4855f0m0j34K69J80j91j37k32J64J86K9j6m3q4KK23P9l1k11k49J08J50K46Rk09
4879Hk89P1L5J92K55l48j99Q0K77P3K24j98l20r1K27J18J54j32k00j21J55J66
4901A37%j51j71l3Q2L20j39N2l46N1J45K01J54l62KK3p7K15O4j71j84j45K15J85
4925F7J67l34lm2N1J50J61j40k89J53L9J89j81R1j53j98J93K95n4j53p3j05J04
4948f5J52L6q7k7k43K35J54j96P8n4j97P2K44J45n7k03q0J00J88k4j03N4l18R2
4972a04J52J51r5k20r0J51J42J30p5K8l31o6K64J52Nj39k76R3J18N5O0o7r1o8
$$ y = [-35, 152, 196, 218, -188, -194, -113, 82, 27, 144, -190, -44, 48, 4, 241, -10, -48, -191, -33, 191, 113, -2, -106, -294, 46, 210, 106, 11, -295, -259, -122, 276, 136, -3, -111, -220, -185, 49, 308, 131, -120, -396, -54, -61, 342, 118, -60, -100, -234, 35, 215, 24, -113, -345, -181, 5, 34, 18, -25, -109, -107, 116, 195, 164, -47, -296, -188, -38, 208, 217, 8, -281, -210, -175, 17, 272, -76, -275, -195, 82, 155, 379, 181, -139, -230, -3, 115, 269, 137, -63, -184, -29, 137, 137, -14, -185, -218, -136, 184, 45, 97, -249, -198, -53, 148, 302, -60, -58, -35, -112, 103, 167, -4, -188, -333, -118, 67, 234, -100, -103, -145, -94, 56, 217, 77, -212, -59, -20, 169, -12, 79, -74, -272, -79, 216, 162, 9, -64, -169, -65, 87, 123, 36, 9, -234, 1, 155, -41, 37, -17, -214, -142, 102, 247, 190, -13, -93, 7, 195, 171, 68, 122, -196, -104, 48, 199, 104, -116, -206, -55, 87, 217, 142, 170, -161, -227, 37, 189, 194, 55, -221, -128, -10, 45, 105, 38, -53, -121]
4996a21R7K37j31n4l8p2K8K22J22p6m89J14Q3P0K98k36k7j49K4J25K04j13k21
5019a03j60K47J60Rj10j33j41L30J02q1n0j83M4P6J94lk67j27l2K65p3K57j50
5042G1l42K83j05J44Q9j71O3j29ML20k26K38l60n2L1K46J12J5j22k64J45J12J08
5065B10j27j50p7m9J78J99K5k39k7k6K46J39j57j9l47J18K12k3J9l6l60J06J80
5088eL09k91lj44oJ82J03J4j45k17N6J79Q3m8j25j25q0L55P7j23Q8k22k15L51
5112D8J06O4k29j13J02l7J12J43k34m1j78K95pn6K32l58m8K64R7q5j65k05J68
5135a25J26J15N5j20k20K8J5J45J63j56l5j00n2L35j89J49k91n1R1L19j26j00
5157b4l9k40K61J06N0L8k01q3pJ94J31q1j82m6QQ0M10l10m4k41K80J09j02J15
$$ y = [-121, -24, 213, 82, 28, -10, -82, -54, 168, 290, 214, -275, -161, -78, -8, 290, 54, 27, -122, -98, 27, 231, 118, -103, -263, -16, 144, 153, 43, -90, -231, 99, 201, 120, 70, -113, -69, 7, 201, 198, -69, -196, -228, 37, -36, 221, 71, -271, 12, -93, 51, 140, -31, 32, -97, -93, 227, 1, 239, -121, -173, -142, 104, 216, 231, 109, -155, -10, 102, 210, 83, -67, -144, -193, -15, 184, 209, -30, -57, -83, 163, 302, 145, 126, -221, -103, 109, 86, 105, 69, -291, -185, -5, 304, 13, 10, -134, -140, 42, 145, 159, 14, -203, -147, 32, 115, 67, -58, -183, -263, 92, 169, 46, 134, -88, -303, 48, 154, 218, -11, -124, -22, -59, 53, 196, -38, -79, -257, 38, 31, -25, 207, -151, -199, 65, 162, 77, -88, -293, -125, 1, 116, 171, 51, -169, -141, -126, 19, 182, 26, -9, -109, -161, 174, -15, 134, -157, -208, -117, 202, 76, -24, -63, -303, -42, 64, 114, 152, -49, -132, -139, 55, 186, 105, -77, -123, -115, -35, 375, 65, 21, -220, 60, 169, 67, 182]
5181A82j43j18N9j7K65j48m6j63J60J81j35J4j77j67K6K41J64q8j11k26J35J84
5203G2m6K27l53Q7n5J29O5o8j8k24K10n2K84j19j52j27J56J31kj61m0R2k14K79
5227A01N8j22O4k94ml5L49Q2l20k8j44K8K76Q0o9k49J57j34L45j26K9r0J00j53
5251i9J32K80k82j74J6p5L33R1j11k03J06l9R5J52j30j91l7M9N8Q2O3j35m1p4
5275a34K28op6Nj23K7P6nJ02k31l1l7L58p6j4k0k30J08K3J19J22k34j5j04J64
5300dN1K65l71Ql1J52k2K1j14n3j46K93m4o8O2q8M0J10j1J34j79j24J30j8J08
5325A01N8k33o2N7J01j9J55p0k04P9N9J73j10N7k04M2Q5Q4j8k7q9%l8K05n5q3
5351D4j74m3K33J33Q4l52ook8K51p1L4l09k6M23j89J10j18m4nJ02O4m9L3r8j24
$$ y = [182, 39, -79, -20, -37, 228, 80, 34, -129, 31, 212, 77, 91, -86, -253, -227, 14, 178, 90, -21, -247, -112, 72, 26, 253, -100, -13, -68, 61, 126, 58, 40, -184, 26, -26, 258, 139, -13, -140, 16, 147, 145, -16, -56, 36, -178, 101, 159, 37, 101, -193, -197, -232, 117, 199, -121, -149, -293, -265, 11, 91, 22, -227, -70, -204, 141, 15, 44, -46, 54, -99, 33, 313, 31, -143, -127, -202, 131, 222, 111, -92, 14, -25, 70, 222, 92, -99, -136, -87, -29, 53, 116, -19, -60, -134, 94, 88, 12, 17, -106, -79, -3, -8, 94, -137, -168, -205, 153, 77, 63, 43, -187, -79, -56, 63, 185, -49, -64, -168, -4, 47, 312, -59, -51, -82, 70, 48, 69, -45, -98, -244, 49, 5, -63, -1, -89, -49, 61, 50, 184, 5, -119, 11, -7, 101, 159, -74, -136, -79, 22, 3, 158, 88, -116, -37, 22, 195, 85, 142, -62, -20, 65, 149, 131, 104, 15, 15, -23, 182, 127, 44, -130, -173, 60, 193, 277, -75, -81, -87, -115, 136, 65, 99, -210, -236, 187, -2, 108, -10, -54, -59, 43, 107, 58, 91, -7, -131]
5377a31nJ92p7j1o6l2L56k76K74j98j44J15K36j86J77k24j19K0p0K11j2M0j48
5400g8l0k2LK26j38J2o5N5R3L8N4j91r1R8J40O2p8j85j04k6J71K60j36l2j41q2
5426a87L90j66M5k64J24p9J89K93l24l4k12J13n1M36k06n8j96Q0n5J59p5K3J2
5449d3n9J78N3rQ8m25R1K9K04M5p9j22k04K04JN9l6j44mJ40J58k1jk7k32K00k1
5476B3o7O6Q5k19RK91Kj41j06m7O3K8J91j67O4j19M0J59j17r1j34j0J62R1K00
$$ y = [-131, -136, 56, -21, -32, -98, -130, 226, -50, 224, 26, -118, -3, 233, 47, 224, 0, -119, -99, -169, 42, 30, 70, -78, -108, -130, -127, 99, -39, -27, -92, -37, 56, 94, 148, -43, -134, -36, 104, 166, 88, -97, -201, -227, -56, 204, 68, 36, -105, -187, 203, 37, 82, -182, -58, -137, 52, 345, 21, -13, -225, -112, -163, 273, 67, 9, -187, -107, -162, -3, -78, -55, -43, -102, 76, 129, 120, 208, -217, -126, -97, 107, 152, 73, -49, -253, -49, -48, 11, -25, -169, -173, -33, 125, 104, 103, 76, -156, 44, 23, -44, 22, 107, -112, -103, 188, 190, 49, -57, -104, -41, -13, 178, 11, 75, -44, -4, 155, 38, -53, -187, -197, -35, 56, 256]
$$ [...]
8191A69
##END NTUPLES=NMR FID
##END=
