##TITLE=1H_DE-80H_X3
 200.13MHz, d2o
 8 sc
 
 19ns.26.2.2025
##JCAMPDX= 6.0         $$ Bruker NMR JCAMP-DX V2.0
##DATA TYPE= NMR FID
##DATA CLASS= NTUPLES
##ORIGIN= UXNMR, Bruker Analytische Messtechnik GmbH
##OWNER= pz
$$ XWIN-NMR		Version 3.5
$$ Wed Mar 19 16:29:02 2025 Russian Standard Time (UT+4h)  Yarkov@DPX200
##.OBSERVE FREQUENCY= 200.1313
##.OBSERVE NUCLEUS= ^1H
##.DELAY= (6, 6)
##.ACQUISITION MODE= SIMULTANEOUS
##.ACQUISITION SCHEME= undefined
##.AVERAGES= 16
##.DIGITISER RES= 18
##SPECTROMETER/DATA SYSTEM= spect
##.PULSE SEQUENCE= zg30
##.SOLVENT NAME= CDCl3
##.SHIFT REFERENCE= (INTERNAL, CDCl3, 0, 14.3821)
##AUDIT TRAIL= $$ (NUMBER, WHEN, WHO, WHERE, WHAT)
$$ ##TITLE= Audit trail, XWIN-NMR		Version 3.5
$$ ##JCAMPDX= 5.01
$$ ##ORIGIN= Bruker BioSpin GmbH
$$ ##OWNER= Yarkov
$$ C:/Bruker/XWIN-NMR/data/yarkov2/nmr/H-C/1/audita.txt
$$ ##AUDIT TRAIL=  $$ (NUMBER, WHEN, WHO, WHERE, WHAT)
(   1,<2025-03-19 16:27:35.10 +0400>,<Yarkov>,<DPX200>,
      <created by zg, POWCHK disabled, PULCHK disabled
       configuration hash MD5:
       00 E9 B6 7A A2 85 ED C7 34 08 36 98 17 FE 4E 26
       data hash MD5: 16K
       5E 8B 69 04 EB 68 7B 3E 2E 32 2F 80 2B F6 E2 D2>)
$$ ##END=
$$ 
$$ hash MD5
$$ 80 4A C4 66 0E 6A D8 8B 26 02 93 E3 F0 7E F9 FA
##$RELAX= 
##$RELAX= 
##$RELAX= 
##$RELAX= 
##$RELAX= 
##$RELAX= 
$$ Bruker specific parameters
$$ --------------------------
##$DU= <C:/Bruker/XWIN-NMR>
##$EXPNO= 1
##$NAME= <H-C>
##$PROCNO= 1
##$TYPE= <nmr>
##$USER= <yarkov2>
##$AMP= (0..31)
100 100 100 100 100 100 100 100 100 100 100 100 100 100 100 100 100 100 
100 100 100 100 100 100 100 100 100 100 100 100 100 100 
##$AQSEQ= 0
##$AQ_mod= 1
##$AUNM= <au_zg>
##$AUTOPOS= <>
##$BF1= 200.13
##$BF2= 200.13
##$BF3= 200.13
##$BF4= 200.13
##$BF5= 200.13
##$BF6= 200.13
##$BF7= 200.13
##$BF8= 200.13
##$BYTORDA= 1
##$CFDGTYP= 0
##$CFRGTYP= 5
##$CHEMSTR= <none>
##$CNST= (0..31)
1 1 145 1 1 1 1 1 1 1 1 1 1 1 1 1 1 1 1 1 1 1 1 1 1 1 1 1 1 1 1 1 
##$CPDPRG= <>
##$CPDPRG1= <>
##$CPDPRG2= <>
##$CPDPRG3= <>
##$CPDPRG4= <mlev>
##$CPDPRG5= <mlev>
##$CPDPRG6= <mlev>
##$CPDPRG7= <mlev>
##$CPDPRG8= <mlev>
##$CPDPRGB= <>
##$CPDPRGT= <>
##$D= (0..31)
0 0.7 0 0 0 0 0 0 0 0 0 0.03 0 0 0 0 0 0 0 0 0 0 0 0 0 0 0 0 0 0 0 0 
##$DATE= 1742387254
##$DBL= (0..7)
120 120 120 120 120 120 120 120 
##$DBP= (0..7)
150 150 150 150 150 150 150 150 
##$DBP07= 0
##$DBPNAM0= <>
##$DBPNAM1= <>
##$DBPNAM2= <>
##$DBPNAM3= <>
##$DBPNAM4= <>
##$DBPNAM5= <>
##$DBPNAM6= <>
##$DBPNAM7= <>
##$DBPOAL= (0..7)
0.5 0.5 0.5 0.5 0.5 0.5 0.5 0.5 
##$DBPOFFS= (0..7)
0 0 0 0 0 0 0 0 
##$DE= 6
##$DECBNUC= <off>
##$DECIM= 32
##$DECNUC= <off>
##$DECSTAT= 4
##$DIGMOD= 1
##$DIGTYP= 9
##$DL= (0..7)
0 120 120 120 120 120 120 120 
##$DP= (0..7)
150 150 150 150 150 150 150 150 
##$DP07= 0
##$DPNAME0= <>
##$DPNAME1= <>
##$DPNAME2= <>
##$DPNAME3= <>
##$DPNAME4= <>
##$DPNAME5= <>
##$DPNAME6= <>
##$DPNAME7= <>
##$DPOAL= (0..7)
0.5 0.5 0.5 0.5 0.5 0.5 0.5 0.5 
##$DPOFFS= (0..7)
0 0 0 0 0 0 0 0 
##$DQDMODE= 0
##$DR= 18
##$DS= 0
$$ [...]
##$SUBNAM0= <"">
##$SUBNAM1= <"">
##$SUBNAM2= <"">
##$SUBNAM3= <"">
##$SUBNAM4= <"">
##$SUBNAM5= <"">
##$SUBNAM6= <"">
##$SUBNAM7= <"">
##$SUBNAM8= <"">
##$SUBNAM9= <"">
##$SW= 18.0517328524113
##$SWIBOX= (0..15)
0 0 2 0 0 0 0 0 0 0 0 0 0 0 0 0 
##$SW_h= 3612.71676300578
##$TD= 16384
##$TD0= 1
##$TE= 0
##$TE2= 300
##$TE3= 300
##$TEG= 300
##$TL= (0..7)
0 120 120 120 120 120 120 120 
##$TP= (0..7)
150 150 150 150 150 150 150 150 
##$TP07= 0
##$TPNAME0= <>
##$TPNAME1= <>
##$TPNAME2= <>
##$TPNAME3= <>
##$TPNAME4= <>
##$TPNAME5= <>
##$TPNAME6= <>
##$TPNAME7= <>
##$TPOAL= (0..7)
0.5 0.5 0.5 0.5 0.5 0.5 0.5 0.5 
##$TPOFFS= (0..7)
0 0 0 0 0 0 0 0 
##$TUNHIN= 0
##$TUNHOUT= 0
##$TUNXOUT= 0
##$USERA1= <user>
##$USERA2= <user>
##$USERA3= <user>
##$USERA4= <user>
##$USERA5= <user>
##$V9= 5
##$VALIST= <valist>
##$VCLIST= <CCCCCCCCCCCCCCC>
##$VD= 0
##$VDLIST= <DDDDDDDDDDDDDDD>
##$VPLIST= <PPPPPPPPPPPPPPP>
##$VTLIST= <TTTTTTTTTTTTTTT>
##$WBST= 1024
##$WBSW= 4
##$XGAIN= (0..3)
0 0 0 0 
##$XL= 0
##$YL= 0
##$YMAX_a= 130611
##$YMIN_a= -149786
##$ZGOPTNS= <>
##$ZL1= 120
##$ZL2= 120
##$ZL3= 120
##$ZL4= 120
##$ABSF1= 10
##$ABSF2= 0
##$ABSG= 5
##$ABSL= 3
##$ALPHA= 0
##$AQORDER= 0
##$ASSFAC= 0
##$ASSFACI= 0
##$ASSFACX= 0
##$ASSWID= 0
##$AUNMP= <proc_1d>
##$AZFE= 0.1
##$AZFW= 0.1
##$BCFW= 1
##$BC_mod= 2
##$BYTORDP= 1
##$COROFFS= 0
##$CY= -3
##$DATMOD= 1
##$DC= 2
##$DFILT= <>
##$DTYPP= 0
##$F1P= 0
##$F2P= 0
##$FCOR= 0.5
##$FTSIZE= 0
##$FT_mod= 4
##$GAMMA= 1
##$GB= 0.15
##$INTBC= 1
##$INTSCL= 1
##$ISEN= 128
##$LB= 0.25
##$LEV0= 0
##$LPBIN= 0
##$MAXI= 10000
##$MC2= 0
##$MEAN= 0
##$ME_mod= 0
##$MI= 1.114404
##$NCOEF= 0
##$NC_proc= 0
##$NLEV= 6
##$NOISF1= 3.799351
##$NOISF2= 2.8
##$NSP= 1
##$NTH_PI= 0
##$NZP= 0
##$OFFSET= 14.38212
##$PC= 1
##$PHC0= -1187.078
##$PHC1= 11.39223
##$PH_mod= 1
##$PKNL= yes
##$PPARMOD= 0
##$PSCAL= 0
##$PSIGN= 0
##$REVERSE= no
##$SF= 200.129724274929
##$SI= 16384
##$SIGF1= 3
##$SIGF2= 2
##$SINO= 400
##$SIOLD= 16384
##$SREGLST= <1H.CDCl3>
##$SSB= 0
##$STSI= 0
##$STSR= 0
##$SW_p= 3205.1282051282
##$SYMM= 0
##$S_DEV= 0
##$TDeff= 0
##$TDoff= 0
##$TI= <>
##$TILT= no
##$TM1= 0
##$TM2= 0
##$TOPLEV= 0
##$USERP1= <user>
##$USERP2= <user>
##$USERP3= <user>
##$USERP4= <user>
##$USERP5= <user>
##$WDW= 1
##$XDIM= 8192
##$YMAX_p= 0
##$YMIN_p= 0
$$ End of Bruker specific parameters
$$ ---------------------------------
##NTUPLES= NMR FID
##VAR_NAME=  TIME,          FID/REAL,        FID/IMAG
##SYMBOL=    X,             R,               I
##VAR_TYPE=  INDEPENDENT,   DEPENDENT,       DEPENDENT
##VAR_FORM=  AFFN,          ASDF,            ASDF
##VAR_DIM=   8192,          8192,            8192
##UNITS=     SECONDS,       ARBITRARY UNITS, ARBITRARY UNITS
##FACTOR=    0.0002768,     1,               1
##FIRST=     0,             0,               0
##LAST=      2.2672688,     0,               0
##MIN=       0,             -149786,         0
##MAX=       2.2672688,     130611,          0
$$ Real data points
##PAGE= N=1
##DATA TABLE= (X++(R..R)), XYDATA
$$ [...]
1901c56L17j11r4J99O86p90M7R47l75n21N28M45r61j91N61k67o00J89M61p21K24
1922c83L56R6k84K20r8P9N7m8L44K35l57o5L42k75p01M65M70p81l65P98K9q07
1944f73K27M37n56k66Q16J36n79Q07J13m79J80L54M6j37J6o02M28k31k91Q0K77
1965A03m75l70Q41j7p34L34J027o78n70J291n5q39K77O85j125o9Q74k95p86L14
1985b67L36o99M06K93l09Q5R5j30j4M05j57r2K21k64N9N70ro27l53J209q21l42
2007d05P48l68n77K36M95o76j76P18Mk51J75J61P2K18j29L08k41J4j85J69k00
2028A10m10n2L64l58n09P46j00k47L00M97m57l05Q33J10o59J06Q56l93l85N5P
2049A09j14k55M26k84l68M20j2l74q8M37J09K7k13K76K34l69j31Q30l90m46mQ10
$$ plain form
1901 -356 -39 -150 -244 -45 641 -149 -102 845 470 -51 477 922 -39 -230 331 64 -536 -347 114 -607 -383
1922 -383 -27 69 -215 5 -93 -14 43 -5 339 574 217 152 494 219 -482 -17 453 -328 -693 105 134 -673
1944 -673 -446 -9 -565 -831 -15 121 -458 349 462 -17 163 517 563 426 442 -160 268 37 -254 -174 103
1965 103 -372 -742 99 82 -652 -318 709 31 -539 752 697 -142 135 820 -305 -374 500 205 -581 -267
1985 -267 69 -630 -224 69 -240 -155 -60 -190 -204 201 44 -48 173 -91 -32 538 529 -98 -451 758 -63 -405
2007 -405 343 -25 -602 -366 129 -547 -723 -5 -1 -252 -77 84 156 374 245 553 312 326 141 310 110
2028 110 -300 -352 12 -346 -855 -109 -209 -456 -156 341 -116 -421 412 522 -137 -31 825 432 47 102 109
2049 109 -5 -260 166 -118 -486 -66 -78 -452 -540 -103 6 33 -180 96 330 -39 -170 660 270 -176 -180 630
2071F30q48k70L93K31p01J07Q20m68n99O73K34p60K01P86l55j60K36M81k43j41
2091B47J38j38n57P9N8J94l67L65k87Q5j62p4M24p2l62O30N5p73L53O79k38m79
2113b02M08K34n85J57O5j4m09O9M24j42m86O16j32k80j67L42J48o4K98m38L91
2134B33j64L51L7p5p06J77M12m69k40K74K80n24Q3J23j99P6K53M75r31Q30J62
2155D58m98n7L67n7l50l6L00k63k64M23p6j94p2R9M63N2m21J75J45l59P1L64l7
2178B33n01M19L88o32k32P34j18m52J34M12m67k42L61k98o0K29J37p3j83j1L35
2199A13J69l4j84k6J44m7k58R0M0k9M0j53m68M39K27m28j22N46p7j94J52M55m33
2222c8j59N14k87J2j89L52k34k11L00Q4m12P7J4j42J03n7L38M3L0n28R31j40m94
$$ plain form
2071 630 -218 -488 -95 136 -565 -458 362 -106 -705 -32 202 -558 -357 429 74 -86 150 631 388 247
2091 247 385 247 -310 -231 -173 21 -346 19 -268 -183 -345 -419 5 -67 -429 201 256 -517 -164 515 277 -202
2113 -202 206 440 -145 12 77 63 -346 -277 147 5 -481 135 3 -277 -444 -102 46 -18 280 -158 233
2134 233 69 420 457 382 -324 -147 265 -204 -444 -170 110 -414 -331 -208 -407 -331 -78 397 -534 296 458
2155 458 -40 -97 270 213 -137 -173 127 -136 -400 23 -53 -247 -319 -220 243 295 -126 49 194 -165 -94 270 233
2178 233 -268 151 539 -93 -325 409 291 -161 -27 385 -82 -324 37 -261 -321 -92 45 -28 -211 -222 113
2199 113 282 248 64 38 182 135 -123 -33 7 -22 18 -135 -603 -164 63 -365 -487 59 -18 -212 -60 395 -38
2222 -38 -197 317 30 42 -147 205 -29 -240 60 144 -268 -191 -177 -319 -216 -273 65 108 138 -390 541 401 -93
2245i3K24K81j67l71M02j46n49L85K19l40k22j6J35P0k98M68L35l59N7M60k59
2266B16k55K12J07k48l50M63N1m34KR4j09Q8k07J58j76L04m3L90n16K16J28J43
2288B34k32k78M23Rl54K20K01j62j89J52J1n83N16Q6k25l74M29J3Ql7O26o68k5
2311a99L78n8J95m54M38k07K4R5k35J17k69J09K5k20J65l1m9J7q4N09j68l03J39
2334f6M04k33J8O1j85L82j46J17l59j26q5L98m57K57k19Np9M64L9J62j18j58P1
2357A47J03m9r6j37J89l00L44k11k82M57k4k42k89K71O0j26K6L33j07k09M78l43
2379gK15K2J42m51j44P0L34j56K4j34j65m4l7M35j18J46m51J34K58j76L79j24
2401A52K21k79l70K74r0K65J93n26m3L30j72k80P4J61K14j46n6J15n1K53n31M84
$$ plain form
2245 -93 131 412 245 -126 276 130 -419 -34 185 -155 -377 -393 -258 -188 -486 -18 317 -42 15 475 216
2266 216 -39 173 280 32 -318 145 196 -238 -236 -142 -251 -163 -370 -212 -388 -84 -127 263 -253 -37 91 234
2288 234 2 -276 147 156 -198 22 223 61 -128 24 35 -548 -32 54 -171 -545 -116 -103 -95 -132 494 -174 -199
2311 -199 179 121 316 -138 300 93 117 212 -23 94 -175 -66 -41 -261 -96 -127 -176 -159 -243 266 98 -205 -66
2334 -66 338 105 123 184 -1 381 235 352 -7 -133 -218 180 -277 -20 -239 -234 -313 151 190 352 234 76 147
2357 147 250 201 105 -32 157 -143 201 -10 -292 165 141 -101 -390 -119 -59 -185 -159 174 67 -142 336 -7
2379 -7 208 230 372 -79 -223 -153 181 25 49 -85 -250 -294 -331 104 -14 132 -319 -185 73 -103 276 152
2401 152 373 94 -276 -2 -92 173 366 -160 -203 127 -45 -325 -251 -90 124 -22 -78 37 -14 239 -292 192
2423A92q0N0q0K32l08j92L91p4k25j02L79m71J74j06J67o5j59J44j71J94J16K91
2445B97l78m6J74j14J59M2k9J00n98J44L76l73O0k10K69km4L15J2Rk77M94k35
2468A45j03m5J05L13o96M58Nk20L9J37k30k10K44j97J27O2M3R8n0K55l07J3L04
2491B90k95N5m6m4l7J1J8j28L93j29l88N8L8J55j07J69l67J69k13L85K3k53M16
2514A73K04m15L42l36RJ39p6j75K0M91n52oq8J48K54j30Q2o3k56L02j21j20R2
2537h2K11mM4j62%r2q0n1q1L82j96j78O7L6O7J04m5K16k12K7M6O6j09j31J98K69
2563C10m6k58k19K28L44k95k9j26j37rM39p7l06R2L99l80j6N2J57o8J68q4j49
2586a0j45J84K89o02L41j55k00K01j29j81N39N8J6R1l28j12K71L41n25J32O6J97
$$ plain form
2423 192 112 162 82 314 6 -186 205 131 -94 -196 183 -288 -114 -220 -53 -118 -277 -133 -304 -110 6 297
2445 297 -81 -127 47 -67 92 134 105 205 -393 -249 127 -246 -186 -396 -127 -129 -173 142 154 163 -114 380 145
2468 145 42 -3 102 415 -281 177 182 -38 1 138 -92 -302 -58 -255 -128 -66 -23 75 25 280 -27 -14 290
2491 290 -5 50 4 -40 -77 -66 -48 -176 217 88 -300 -242 -204 -49 -156 13 -354 -185 -398 -13 10 -243 173
2514 173 377 -38 304 -32 -23 116 40 -135 -115 376 -176 -182 -270 -122 132 2 84 21 -235 67 -54 -174 -82
2537 -82 129 125 169 7 7 -85 -165 -216 -297 85 -111 -289 -222 -186 -119 -15 -60 156 -56 -29 17 83 -26 -157 41 310
2563 310 264 6 -213 15 359 64 35 -91 -228 -237 202 125 -181 -89 310 -70 -86 -34 123 55 223 139 -10
2586 -10 -155 29 318 -284 57 -98 -298 -97 -226 -407 132 190 206 297 -31 -143 128 469 -56 76 142 339
2608C39l87L63l14j16L70j61k16M0J12j43k03L01J96j57J18j98R8J54p3p8K51
2629B96k46kk3p3k6o0n4J75m82k18O71J55p2o6K20m48O6J99Q8k6k46J71j25m0
2653a66J41on8PM0j94L7J85J58l53j87L79L41l04j80J73K58Kl49L81l52j90L34
2676I7J36k85j51Jn0K11k86M72p5j84J51J28k22O4K3L31n4p4l01O5o6L24l83K11
2700H3l11J09n4k8L98j64R8m28L55J16j24N1J55j09j30L96k65n1r6j4L5N3K9j75
2724g1k8R6M6r4N4r2j16M92l9k6l53L23l54N60p9l32J25n1K1J73m94J56j9L4K29
2749A61k96k20L45j82P6K02P0k97M22j04k21K92l03J43K21l00M9J26j30j82J9
2770a09Q5p0J41o3J89k58K41P0l60M3l5K80L1l4K22j53q3K8m15L44l54M72m42
$$ plain form
2608 339 -48 315 1 -115 255 94 -122 -82 30 -113 -316 -15 181 24 142 -56 42 196 123 45 296
2629 296 50 48 25 -48 -74 -134 -188 -13 -495 -713 -42 113 41 -25 195 -253 -187 12 100 74 -172 -1 -126 -166
2653 -166 -25 -31 -89 -82 -42 -236 -199 -14 144 -209 -396 -17 324 20 -160 13 271 273 -76 305 -47 -237 97
2676 97 233 -52 -203 -202 -252 -41 -327 145 70 -114 37 165 -57 7 30 361 307 233 -68 -3 -69 255 -128 83
2700 83 -228 -119 -173 -201 197 33 131 -297 58 174 50 101 256 147 17 413 148 97 1 -13 22 75 104 -71
2724 -71 -99 -3 43 -51 3 -89 -205 287 248 222 -131 192 -162 398 319 -13 112 61 82 255 -239 -83 -102 -68 161
2749 161 -135 -355 -10 -192 -116 86 156 -141 281 177 -44 248 -55 88 309 9 58 184 54 -128 -109
2770 -109 -24 -94 47 -16 173 -85 156 226 -134 -91 -126 154 185 151 373 220 137 165 -250 94 -260 212 -230
2793b30L50p4k59K02k87K62J77o6q8K61j97q8Q1J57l54P3K72k14Qk50J95p7J06
2816d0R3m70L47J99P0m53K52Qk74M48j27j24L79k91K38k26j66j38K41r3J62k77
2838b42K94j82k04M12o7l9O9J3k53N7K19J08j60l53O11J40m63J2J96P8j12L3m2
2861A25m85K54J23M6j87m1L87k83J38j99K18J5l50M45Mk41R8r1L9l30K58J06q9
2884d0J53Ok47O7P7q6r3j43J11j3K27j68M53k44m9J55p2q9J94j79J36j97k78M85
2908A66k66o7J15j10L45m45K86J92j04j24K12j22j10K04m03J31K8N7j72K54k61
2929a94N7K11m77M31j2pk85L00l4j28K47p8n2J64l22J53J57k53J11L0k2J15j69
2952e7J1Qk2k32L64q6L4j18O4m6P6r1j97M53J9P7l63J64j9O2J18k71J72k27N7
$$ plain form
2793 -230 120 46 -213 -11 -298 -36 141 75 -13 248 51 -37 44 201 -153 -80 192 -22 -14 -264 -69 -146 -40
2816 -40 53 -417 -70 129 199 -254 -2 6 -268 180 53 -71 308 17 255 29 -137 -275 -34 -127 35 -242
2838 -242 52 -130 -334 78 11 -28 41 54 -199 -142 77 185 25 -328 283 423 -40 -28 168 246 134 167 125
2861 125 -360 -106 17 63 -124 -165 222 -61 77 -122 96 111 -239 206 210 -31 67 -24 15 -315 -57 49 -40
2884 -40 113 119 -128 -61 16 -70 -163 -306 -195 -208 19 -149 304 60 11 166 94 5 199 20 156 -41 -319 166
2908 166 -100 -167 -52 -162 183 -262 24 216 112 -12 200 78 -32 172 -231 -100 -72 -15 -187 67 -194
2929 -194 -137 74 -403 28 16 9 -276 24 -10 -138 109 31 -21 143 -179 -26 131 -122 -11 19 -3 112 -57
2952 -57 -46 -38 -60 -292 72 -14 20 -98 -34 -80 -4 -95 -292 161 180 257 -106 58 39 101 219 -52 120 -107 -50
2977e0J21l08N9O5o7M58L8k46J1K99l97N3J42k82K70j76J11k99K27R9k92K00p
3000B9k61M68m14N29l89J18J46j83J06k0j41K21p8nl52j0J76k73K57J40j57J59
3022F6q5m1J42k52J89nm8q9k1L62j58k56r7M41o2o6R3j40M3k27J64J09n9j48K02
3047E7M1J53l50j2L98k46j9o1q3lJ59Qk23J50P8%j30Kq4q7Q4M30q6l91K20m1Q7
3074E1J7J71l8l13R9M6j70j16K64k10J88n8k12o8K57Ml18K46J66m5K12k14m2r3
3098a76j12N68k35L04k50l16J92M0lj08J22n4M4R0Q7l24K46j37P2J31k81K4K78
3121B02j88J50NJ21k04m4OJ76rR8j56j08k78L92q4r6P2L1O6p7n4j55J90k0j24
3146h8mR9M81m25PJ49l39J05J91k12L57m2n37L90n1j03k52K46K18l9k12M6j20
$$ plain form
2977 -50 71 -237 -178 -113 -180 278 316 70 81 380 -17 36 178 -104 166 -10 101 -198 29 128 -164 36 29
3000 29 -232 236 -178 351 -38 80 226 43 149 129 -12 209 131 126 -226 -236 -60 -333 -76 64 -93 66
3022 66 -19 -60 82 -170 19 14 -34 -123 -144 218 60 -196 -293 148 86 20 113 -27 16 -211 -47 62 3 -145 57
3047 57 98 251 -99 -111 287 41 22 -39 -122 -125 34 42 -181 -31 47 47 -83 -81 -165 -252 -168 262 176 -215 5 -36 51
3074 51 68 239 201 -112 -13 33 -137 -253 11 -199 -11 -69 -281 -349 -92 -88 -406 -160 6 -39 173 -41 -83 -176
3098 -176 -288 280 45 349 99 -217 -25 15 12 -96 26 -28 16 106 193 -131 115 -22 50 181 -100 -76 202
3121 202 14 164 169 290 86 42 48 224 215 313 157 49 -229 163 79 -17 55 86 152 75 21 -134 56 36 -88
3146 -88 -92 7 488 63 70 219 -120 -15 176 -36 321 279 -258 132 81 -22 -274 -28 190 151 -61 -15 -135
3169a35J97j33M8p0M0j51L90o4l26K58k06l5J67l09L35J7k04O2j06J92j5M55k96
3192A11J96q7j56j98R4o3M03l24r1J11M06l03l52K99J6J23m37J51L8O0J2k10L16
3215A15k39N5J2Q9j32k07m3J48J28J65J74N0r5l17Q3J52p2k35K88N7m14J22J31
3238A5J82j54j59J99l68K02j9J04k3N3J77j46r3l2K47l58J88J79k97M18k02m64
3260c51K11J23K9Q6l04J26K8k09K81j79K13n9L1K44k09j80n2M15q6p7j16K57l4
3283A88l24J33L24l39M00l30j12j55J28K37n2j23k83L17j52K9R8%j30M4L6j39
3305b05L0n0K34j4K3k06p3K26o3Q3J34jl63K51j32M3Q7J86k6j46L47j92k25j0
3329f2j42J32k63K93o7K69J24M7l78J17k10Q2K18j49k01O03m37NK18q8j27J43
$$ plain form
3169 -135 62 -71 -23 -93 -53 -204 186 122 -204 54 -152 -187 -20 -329 6 23 -181 -119 -225 -33 -48 407 111
3192 111 307 220 64 -134 -40 -103 300 -24 -115 -4 402 99 -253 46 62 185 -252 -101 -63 -3 9 -201 115
3215 115 -124 -69 -57 32 -100 -307 -350 -202 -74 91 265 315 220 -97 -14 138 66 -169 119 176 -238 -116 15
3238 15 197 43 -116 83 -285 -83 -102 2 -21 32 209 63 -30 -62 185 -173 15 194 -103 315 113 -351
3260 -351 -140 -17 12 98 -206 -80 -52 -261 20 -159 54 -5 26 270 61 -119 -171 244 158 81 -35 222 188
3283 188 -136 -3 321 -18 382 52 -60 -215 -87 150 98 -25 -308 9 -143 -114 -16 -16 -146 -102 -66 -205
3305 -205 -175 -225 9 -5 18 -188 -261 -35 -98 -15 119 118 -245 6 -126 -83 4 190 164 18 365 173 -52 -62
3329 -62 -204 -72 -335 -42 -109 160 284 331 -47 70 -140 -58 160 11 -190 413 -24 -19 199 111 -16 127
3351A27J08m17L95q1l08K21J20m13K11p8K59M7j2k81O8m6J49j19j32L54Ok49q8
3374a59m8K81l1l8k2K44l09Q4j28Q9LP9K30O0j78j4O0m93J2K51K18J24L8m92J98
3399E9M9k80J22P8J03o5r3j50K20pn7J80p6k3k48Q0K46k55%J23R4M9m15L55m2
3424D7K99k52p6l9k00K41K84l93j38M13j77j40M5J86j00jL58n50M17j96RQ8l76
3447b51L49K04j76k14J23o4m9j5MJ71k19K5n0J08K47k90P8J25k61L84r2k18J8
3470f3k59L88k7j5l35L88p4L16m89J43J79j16Q7l73J98K05J51m50J75j84K14L4
3492I3K05j37q8jJ64j03k25R2j41M48l5k71q9k75J46J49K70j00J10l85K10J51
3514A88n2j28K03l62M52l30Q3k9k66K19NJ37m00M49j32O2K54l45q3J2j07J12J56
$$ plain form
3351 127 235 -182 213 132 -176 45 165 -248 -37 -115 144 191 179 -102 -34 -80 69 -50 -182 172 178 -71 -159
3374 -159 -207 74 43 5 -17 227 -82 2 -126 -37 -34 45 275 335 157 143 203 -290 -278 -27 191 315 353 -139 59
3399 59 108 -172 -50 28 131 66 -27 -177 43 36 -21 159 83 60 -188 -108 138 -117 -117 6 100 149 -266 89 47
3424 47 346 94 18 -21 -221 20 304 -89 -227 186 9 -131 -86 100 0 -1 357 -193 224 28 37 125 -251
3447 -251 98 302 126 -88 35 -29 -78 -93 -89 82 -137 -112 -162 -54 193 -97 -19 106 -155 229 137 -81 -63
3470 -63 -322 66 39 24 -311 77 3 319 -170 -27 152 36 123 -250 -52 153 304 -146 29 -155 59 93
3492 93 298 161 73 72 236 133 -92 0 -141 307 272 1 -88 -363 -217 -68 202 102 212 -173 37 188
3514 188 136 8 211 -151 301 -29 54 25 -241 -22 -17 120 -280 169 37 99 353 8 -75 -63 -170 -58 98
3537I8j14J70k53J37j41M54k9l15K24j48Ljn9nj36K17m9n0p4J01J88q0jjj75N8
3563A9P8j03l2K02l4p8k88L55J44k75K10l30K15J6r6k02K91j77J40l64K55L40
3585B86j12J30j72j72K02k84j48J95J00OL19l49m8j56M79l08j8N3K10l58K24N5
3607A34k02P9J34j13L32n91K6N3L63m35L07P7j10n3K55j56j18J97k52j69J24L19
3629B01n5j50j34J15j14o2j9R2j49K85M2j25r8L05j69p8L44k01K61l71N7k18M79
3652B38l57R3m1K44l43K1L52j73N3j89q3L94l56J40O1M8k6k51J92J19l27J13J71
3675I3Q0j01J62l23k6O3Lj17L12l31NM14k89J05l5j64M3J62o0J64q3k15J22q3
3699i9j02K49j25J91k40Q1J4r9o8J36J07K69q5k11J94K9j37j14L19j23k43j13
$$ plain form
3537 98 -16 154 -99 38 -103 351 322 7 231 83 86 85 26 21 -115 102 53 3 -71 30 218 138 137 136 -39 19
3563 19 97 -6 -38 164 130 52 -236 119 263 -12 198 -132 83 99 3 -199 92 -85 55 -309 -54 286
3585 286 174 304 132 -40 162 -122 -270 -75 25 31 350 1 -47 -203 276 -32 -50 3 213 -145 79 134
3607 134 -68 11 145 32 364 -227 -201 -148 215 -220 87 164 54 1 256 100 -18 179 -73 -242 -118 201
3629 201 146 -4 -138 -23 -137 -199 -218 -126 -275 10 52 -73 -171 134 -35 -113 231 30 291 -80 -23 -241 238
3652 238 -119 -26 -67 177 -166 -145 207 34 87 -102 -185 209 -147 -7 54 102 76 -175 17 136 -191 -78 93
3675 93 173 72 234 -89 -115 -52 -49 -166 146 -185 -180 234 -55 50 15 -149 -106 56 -4 160 77 -138 -16 -99
3699 -99 -201 48 -77 114 -126 -45 -31 -130 -198 -62 45 314 229 18 212 241 104 -10 309 186 -57 -170
3721a70q2N08l54k34K94j36J43j07K10K7j74K52k3l56K46k6j78L51l26M52n02
3742a85J4J58k50K39m3J70K12k22N8j72r8j44K18M07o31L87l31K65J7j94m4J88
3764A9N2k75K45k0Nl1j20K53k33J92J34k18p5j27J07L25k03J14r0J52l77J41L66
3787C36k62j67J16j34K07lM0k51m7J54J82j05k23J06K84nJ16m45L6j68L53L5q1
3810G4j82K47k1J6k41j38N32l18J27j78P9J95j32J30j80Q4P3l42Q8K82k83j2N3
3833d7J52k31L24o6m77K30k2J53R3M31m29j0K5o5j9P6J76k8j68K9k64L07o1J3
3857A22l63K9J26o8O2O7J19k15J48K0ok53J2R8j60K15j63j26J59K41J80m19K46
3880G1l5q5L73l65j89J41L6l4J40J48o6J7k32K98k36L9m0L0n6K77J3k75J38j60
$$ plain form
3721 -170 -252 256 -98 -332 -38 -174 -31 -138 72 99 -75 177 154 -202 44 18 -160 191 -135 317 -185
3742 -185 -171 -13 -263 -24 -67 103 315 93 151 -21 -119 -263 -45 362 -269 118 -213 52 69 -125 -169 19
3764 19 71 -204 41 21 26 -5 -125 128 -105 87 221 3 -72 -199 -92 233 30 144 54 206 -171 -30 336
3787 336 74 -93 23 -111 96 93 133 -118 -165 -11 171 66 -157 -51 233 228 344 -101 -65 -233 120 155 74
3810 74 -108 139 118 134 -107 -245 287 -31 96 -82 -3 192 60 190 10 94 167 -175 -87 195 -88 -100 -47
3833 -47 105 -126 198 132 -345 -115 -137 16 109 540 111 101 126 61 42 118 294 266 98 127 -137 170 109 122
3857 122 -241 -212 -86 -154 -92 -25 94 -121 27 47 41 -212 -200 -102 -262 -47 -210 -336 -177 64 244 -175 71
3880 71 36 -49 324 -41 -230 -89 -53 -87 53 201 135 152 -80 218 -18 21 -19 11 -45 232 245 -30 108 -52
3904e2P3K35Ml72j23K25q0K88j31n74K93J98J5K0m6O7K00l33j6J52K7R7k53M9
3928c7J85r1J63k66M1J43O1k76J84P0N3N1l08n6K99l62q7L69j78J46m8l18j46
3951d08L72J60j04M4PN9l64K65k47M48M8j67j92L47j52m8m3J93m3j76k1j46m9
3974b17K69L39n66J04q2K16K92p4k85R8j06r6m4J90%J67k00m42M29k85N07j95
3996A9M1n9j49J29O2k02J80K29j05j37k03K98j37k19J54J64l4J22m80M42j66p1
4018a22K87mj30j02L00k63J97Q5m06K69m38K37K83l25K61l02j62M32j37n5Q7j5
4040b3l8p2o8L70j75N0K2k81L84k31K65j06l54L45K32k29j67j31Oq4L93K09l54
4063c7K91m15K37j86M4P7k4J19o1p2J52j49j71J86o73Q28j90K3P3l6k27L29k49
$$ plain form
3904 -52 21 256 260 -112 -235 -10 -90 198 67 -507 -214 -16 -1 19 -27 40 240 -93 -109 43 70 167 -86 -37
3928 -37 148 57 220 -46 -5 138 199 -77 107 177 230 281 -27 -83 216 -146 -233 136 -42 104 56 -262 -408
3951 -408 -36 124 20 64 71 130 -234 31 -216 232 280 113 -79 268 116 68 25 218 175 -1 -22 -168 -217
3974 -217 52 391 -175 -71 -153 63 355 281 -4 94 -12 -108 -152 38 38 205 5 -437 -8 -293 214 19
3996 19 60 1 -148 -19 43 -159 21 250 145 8 -195 103 -34 -253 -99 65 31 153 -327 115 -51 -122
4018 -122 165 161 31 -71 229 -34 163 248 -158 111 -327 -90 193 -132 129 -173 -335 97 -40 -95 -8 -23
4040 -23 -61 -133 -201 169 -6 44 66 -215 169 -62 203 97 -257 88 320 91 -76 -207 -201 -285 108 317 -37
4063 -37 254 -161 76 -110 -66 11 -13 106 45 -27 125 -24 -195 -9 -682 146 -44 -21 52 16 -211 118 -131
4086a31J39K69l46J87km4k38j33K44R2J27M3o55L71k0j30Q9j6K42p7k80J78PO4
4110b0j52K00J42l32K51j77O2K1Q2J22j86q0jO6L20l54k49M3M84j22o0p6j65L27
4134A46n01N01n4j80j41P5M32k81O5l28M56l4k15k3Q5k11K03j40p2N55k74k81
4156b17P73m63j63N52o78J23L9J61q8J20k10K26l96J49K05j09J51p5k14L0L24
4177B40J57l00j68K14l39J90k30P4j0K65k27j4R7Q3j60J97J09l13K8K8q5J1L79
4200B26k48K36m17J93k13O20l83q3O6K55j07m66K48P4j0J07p4j81J31j51K12j8
4222A7j41N8KRJ77j24k0r6K49l3p7j38L07k62j6Rj62J78M06j88j16O1l25J67J9
4247c9K06M5N8k46M60j36l23J09j59j45L95j62j9j33J55j27O5k8j61L22r2l17
$$ plain form
4086 -131 8 277 -69 118 116 72 -166 -299 -55 37 164 207 -448 -77 -97 -227 -138 -154 88 11 -269 -91 -84 -20
4110 -20 -172 28 170 -162 89 -88 -26 -5 77 199 13 -67 -68 -2 318 -36 -285 -242 242 120 60 -16 -181 146
4134 146 -355 146 92 -88 -229 -154 278 -3 62 -266 190 156 -59 -82 3 -208 -5 -145 -217 338 64 -217
4156 -217 556 93 -70 482 -196 -73 -34 127 39 159 -51 175 -221 -72 133 24 175 100 -114 -84 240
4177 240 397 97 -71 143 -196 -6 -236 -162 -172 93 -134 -148 -51 32 -128 69 178 -135 -107 -79 -164 -153 226
4200 226 -22 214 -203 -10 -223 397 14 -69 -3 252 145 -321 -73 1 -9 98 24 -157 -26 -177 35 17
4222 17 -124 -66 -64 -55 122 -2 -22 -118 131 98 21 -117 190 -72 -88 -79 -241 -63 343 155 39 100 -225 -58 -39
4247 -39 167 212 270 24 484 348 25 134 -25 -170 225 63 44 -89 66 -61 4 -24 -185 137 45 -272
4269b72K37q2P42o35l2J93j07j07P0j12m5KJ34k70K37K03j58j06j4R0Q4R7p0j64
4293h5J46l01J82J69M01l68J37l41LM0J42k37j44O29k70n4J3L5J44j26j67N2j6
4316a6K7k50K74J37k31j37J96J02oj19j35K50j55J7J85j57J81K90m53R0l2j31
4338g3MM60j72k24J84j05rP0l16K58j16o7K38j32K64k18j83R1R0m2J8k4J3K43
4362B52m56R4M0n5R0l7j5j44J09j42J15j70K59N6n6r5L39l1j48J92J1j00k98K54
4386F4O6k59K60j08n6k21L38p2KL2K46m67J46J57n7n5j3K0J40k51J70k23J35k00
4410b06L28q3j50j94K22q3J54K03l46K42o6k38J6J47o7L34k56J53J65q6j25j67
4432a03L71j02l14L54k35J38Pj96p1O4J17o9K16j03j87K81l33M38p5q3j87M3Q
$$ plain form
4269 -272 -35 -117 625 -10 -42 151 44 -63 7 -105 -150 -148 -14 -284 -47 156 -2 -108 -122 -32 52 149 79 -85
4293 -85 61 -240 -58 111 512 144 281 -60 -57 -17 125 -112 -256 373 103 49 62 97 241 115 -52 0 -16
4316 -16 11 -239 35 172 -59 -196 0 102 96 -23 -158 92 -63 -46 139 -18 163 453 0 90 58 -73
4338 -73 -69 391 219 -5 179 74 65 135 -181 77 -39 -106 132 0 264 46 -137 -46 44 2 20 -4 9 252
4362 252 -204 -110 -70 -125 -35 -72 -87 -231 -122 -264 -149 -319 -60 -4 -60 -155 184 153 5 197 208 108 -190 64
4386 64 130 -129 131 23 -33 -254 84 12 14 46 292 -175 -29 128 71 16 3 23 163 -88 82 -141 -6 -206
4410 -206 122 39 -111 -305 -83 -166 -12 191 -155 87 21 -217 -201 -54 -121 213 -43 110 275 189 64 -103
4432 -103 268 166 -148 206 -29 109 116 -80 -151 -87 30 -39 177 74 -113 168 -165 273 198 115 -72 -29 -21
4455b1p0J82m9j73O5j24K39j52J15l67O07n0o3j99M5K36l93J45M03k54j80l6J10
4478A6j68J60j00m0n6M09m66J88K92l23j43k6K36o5p9o1L81J09j51J55l39L75
4500C04j67k76K0L29k10j01K94j72r4N9j04K04p8J42k40J19J07k73J93Q7j04Q0
4522A19J35k68k94L26K0o0o2M83k17j27p9k24M43k74O8j14K45J62l97k4M04l11
4544d6K65l03K2j74K71q3j38K76k33J47j21r1Q0K60j01r3K33k01Q2K3P0k32N97
4567E10m70l1J14n5l19J73J56j25n1J10Q2k23L4J49k9rK26k47j18J08k05L8J32
4590e0k24K58j88K44Qk38K12J86o79L52J86l0L5N7j50j30J76K8L5o0K88l09L8
4613D5k8o5k93L37R8Q3j72j12M15m48J92l5J92r0k23KM57l56j9l59L65M6j93l6
$$ plain form
4455 -21 -91 91 42 -131 -66 -190 49 -103 12 -355 252 202 139 -60 -15 221 -172 -27 376 122 -58 -94 16
4478 16 -152 8 -92 -132 -188 221 -245 -57 235 -88 -231 -257 -21 -86 -165 -226 155 264 113 268 -71 304
4500 304 137 -139 -119 210 0 -101 193 21 -73 -14 -118 86 8 150 -90 29 136 -137 56 143 39 119
4522 119 254 -14 -308 18 38 -22 -84 399 182 55 -24 -248 195 -79 -11 -125 120 282 -115 -139 265 -46
4544 -46 219 -84 -62 -236 35 -48 -186 90 -143 4 -117 -208 -128 132 31 -62 171 -30 52 75 145 -87 510
4567 510 40 9 123 68 -251 -78 78 -47 -98 12 94 -129 -95 54 25 16 242 -5 -123 -15 -220 -182 -50
4590 -50 -274 -16 -204 40 48 -190 22 208 -471 -119 67 37 72 129 -21 -151 25 53 88 28 316 7 45
4613 45 17 -48 -341 -4 94 177 5 -107 308 -140 52 17 209 119 -104 -102 355 -1 -20 -379 -14 32 -161 -197
4637a97K33Q7k33j52N4J83K53P5m84K36p8nN0K17j15k75O6l6K9M4K61l17M7q5
4661a42j4J60j41J28pP9l6L3Pl8O4jNj32K38p8j11j56m7J94L39k71J09k71R4j60
4687a55Q9J14K76k18k27JK04J26l78K23j9o2k79M74K81l52k6L17l69p6K00k75
4709a31o5R9J00K5j04M23l78J13p8M9J30l94L57j84rr5j18J10j01M41p1m4k29
4732a54K10j71K36K3j88k18L83m04O74ol65m7l1L79l40j79K36k26J27J49l98L15
4754EJ36k99M2L13K27l28k4L67k53J57l23J20k62L85R4m28J74m0J79k64R4q3L7
4777B6k9J05m0j38o0J47j2j17J01K5k37J05n7K05m01M21j07L24l01L36m41L10
4799A65k83K31j4m00L49Q2K8K69n00J34k69J37K18m91L36j32R4K34K4p1l49O10
$$ plain form
4637 -197 36 123 -110 -262 -208 -25 228 303 -181 55 -23 -28 22 239 124 -151 -85 -121 -92 -48 213 -104 -57 -142
4661 -142 -156 4 -137 -9 -16 63 27 60 67 29 93 92 97 -35 203 125 14 -142 -189 5 344 73 182 -89 5 -155
4687 -155 -66 48 324 106 -121 -120 84 210 -168 55 36 -26 -305 169 450 98 72 389 20 -56 144 -131
4709 -131 -196 -97 3 28 -76 347 -31 82 4 53 183 -211 146 -38 -47 -142 -260 -150 -251 190 119 75 -154
4732 -154 56 -115 121 144 -44 -262 121 -283 391 385 20 -27 -58 321 -19 -198 38 -188 -61 88 -310 5
4754 5 141 -158 -116 197 424 96 72 439 186 343 20 140 -122 263 357 -71 103 63 242 -22 72 -11 26
4777 26 -3 102 62 -76 -136 11 -1 -118 -17 8 -229 -124 -181 24 -377 44 -63 261 -40 296 -145 165
4799 165 -118 113 99 -301 48 130 158 427 -73 61 -208 -71 147 -344 -8 -140 -46 188 212 141 -208 402
4821D02k90m1k60N9L69m5q9j30K36n0k45K50m32L25o2j03K03j28Q1q5j07k12N09
4844A55k0r0k47K13P2k78J73N2J65k59J58k30m3Q6L00%k72K30m10j69L87j5O9
4867B7j27K82k30J8M42o48M45k62J15J10j98j59j29J51R5LO3Rm5j08rL40O1j05
4891A41m67M58k12J6K58l08N01l52L64j72l2l28P8J30oO8K5p3n1K1k64K53l73
4914c25N61n54L28j56m9N70k05n2l6K03j58q7k32l0k7N70j60k52j49J86jR8j26
4937h3nN8M5k61Q0K82j96J78J6m6m6j47J38P3r5j57J92j2j12K22p3j2O5k58Q6
4962f8P8K20j13K87p7k06l6j4N1k02M00k73l5J67j83q5l13O97n58L71k0o5J93
4985B16j23K08n22K27J36J71m36l22L98j46K49J7k54K03K16j56j52P0K37k21j03
$$ plain form
4821 402 112 71 -189 -130 239 194 105 -25 211 161 -84 166 -266 59 -3 -106 97 -31 50 -35 -142 -354 155
4844 155 135 45 -202 11 83 -195 -22 30 195 -64 94 -136 -179 -93 207 207 -65 165 -245 -414 -27 -42 27
4867 27 -100 182 -48 -30 412 -236 209 -53 62 172 -26 -185 -314 -163 -68 -65 -2 7 -38 -146 -155 185 246 141
4891 141 -326 132 -80 -64 194 -114 387 35 399 227 195 -133 -55 75 69 137 162 89 38 59 -205 48 -325
4914 -325 236 -318 10 -146 -195 375 170 118 82 285 127 40 -192 -222 -249 321 161 -91 -240 -54 -55 43 -83
4937 -83 -88 -30 15 -246 -166 116 -80 98 114 68 22 -125 13 86 -9 -166 26 14 -98 124 51 39 104 -154 -68
4962 -68 10 230 117 404 327 121 85 71 122 -80 320 47 12 179 -4 -89 -402 295 -263 108 88 23 216
4985 216 93 301 -221 6 142 313 -123 -445 -47 -193 56 73 -181 22 238 82 -70 0 237 16 -87
5006h7m2J68J30m8M7R1m25J10l3K23k19M6J17j87j3J14o1J64j01K90l62K81j47
5029E6r9L38j87j7p9o6Q6j35K4P8J50r9j10o0J86K10l56j16J90p4J35p7K38J01
5053C17k18K70l27k6J42j91J02j38l35K75Q6jj38L0K50j38%J94m88N32k32J31
5075I7k3j55n1K58j91lO5k33K98m0j2L8j35J0K21j04R1j42j73K88l47K05m9K50
5099A63k42J27j4k44L21j06m0M3j51O7K6k6o0K43k94J53M06m39l2j1r5o7L21o5
5123a6M3J08N1l28N67k61l43J46J4p0K30n07L55J77l43K71O6k92K02L12k66K20
5145C36j63j27k96N07j54m17J50K04P4j55k01M5M55l17j74%RK57L9J50k98R0R9
5168A13p8K05k08M3O7J4l70M25j15J7k33Q2Q2J26j97J57r1n7L0P0K52j96K2j35
$$ plain form
5006 -87 -129 39 169 121 168 259 -166 -56 -89 134 -85 -39 78 -109 -122 -8 -69 95 -6 284 -78 203 56
5029 56 -43 295 108 91 12 -54 32 -103 -79 -1 149 50 -60 -120 66 276 -80 -196 -6 -80 55 -22 216 317
5053 317 99 369 42 16 158 -33 69 -69 -404 -129 -43 -44 -182 -152 98 -40 -40 154 -334 198 -34 97
5075 97 74 -81 -132 126 -65 -68 -3 -236 62 22 10 48 -87 -77 144 40 131 -11 -184 104 -243 -38 -87 163
5099 163 -79 48 34 -210 111 5 -35 8 -143 -76 -50 -76 -136 107 -187 -34 372 -67 -99 -110 -205 -272 49 -16
5123 -16 27 135 186 -142 425 164 -179 -33 -19 -89 141 -366 -11 166 -177 94 160 -132 70 382 116 336
5145 336 173 46 -250 257 103 -314 -164 40 114 -41 -242 -197 258 -59 -233 -233 -224 33 72 222 -76 14 113
5168 113 35 240 32 75 142 156 -214 211 96 113 -120 -38 44 170 -27 130 39 -18 12 82 334 138 160 25
5192B5q3J91J81n31J76k0J20m20K74j24K52J81j06l9J25m3n43L44J58Rj89P7j0
5215Ek46J03K39k7j65k12K63k91L05k15K25P2K15l53O6Q8m8Q2n0K78l77J72ok7
5239I6k87J00J92L4k75r4J32L72k54j53J17pL14j70l25M46k0n2O9k58q6lK34j69
5263d7m4k10L01L3j37O8j13L6K91j28j79L63j23k13O2N3o5Jj05L15O2q2N9m30
5287b32M26l23J99j95L27j91m2N4j69q1J48j89L10j6J2l2j01K25J20j15P8k12
5309AL30q6j29l60K79j60n4J62J40k94K73k04j12M7L23k99p8K32j07q5J65J17
5331A01P2M4j99O5j22O1P2l02K04P3k40J41m8k18L78j59M0K28l7k68L29m7km62
5355b96L64l71L26j14j70J87M7J13q3K1J88O3p1k25J91l00K18N1l8l55K88J84
$$ plain form
5192 25 -58 133 314 -217 -41 -61 59 -361 -87 -211 41 222 116 77 202 159 -384 -40 118 127 -62 15 5
5215 5 -241 -138 101 74 -91 -303 -40 -331 -26 -241 -16 56 271 -82 -16 72 24 106 56 334 -43 129 123 96
5239 96 -191 -91 101 135 -140 -234 -102 270 16 -137 -20 -27 287 117 -208 238 218 166 235 -23 -109 -112 122 -47
5263 -47 -91 -301 0 33 -104 -36 -149 -113 178 50 -129 234 111 -102 -40 13 -52 -51 -156 159 221 139 198 -232
5287 -232 194 -129 70 -125 202 11 -31 23 -146 -227 -79 -268 42 26 38 6 -95 130 250 135 213 1
5309 1 331 245 116 -244 35 -125 -179 -17 123 -171 102 -102 -214 -167 156 -143 -221 11 -96 -181 -16 101
5331 101 173 217 18 83 -39 22 94 -208 -4 69 -171 -30 -78 -296 82 -77 -37 191 154 -114 215 168 166 -296
5355 -296 68 -303 23 -91 -261 -74 -27 86 3 24 212 275 204 -21 170 -130 88 139 101 -254 34 218
5377B18l82L09j69O7j7L8j78K36ok87K35j02R6l10J16K90rq0j9l31J63n1N94l85
5401C6J40k75j04N31k14j31j8P3K0k92M13J36k99k1n5N0P2p5J13k43J52J08k21
5424a04K03n8n2j26K79p9J88k96j26J04j41K03J9j99R0k52K72LL0r6L3Q9j95J23
5448h8J3J9k69Q1M28j88L21m86J65J7j33J71j29J50j89M7Q2J80m64M03k47K10
5470I4j11j13J66r5J35j70J30P1m7j53J82j46J20J40k53m8K4j46J97j60M7M3O0
5493c3j1L00j58M5l96K64N7L55k90j87L5R1p2J44k72J29J22L3m02M22l41J54q
5516a9J76k44J15N3l47J36K09J73k69k51K48j09M60m50K13rj08l3n1J54k2j03
5538g8r6L38k43K51k85J48L3j70K57l15K40k27J07J17N9k55p0M69m40K73J5k62
$$ plain form
5377 218 -164 145 -24 43 26 64 -114 122 116 -171 64 -38 58 -252 -136 154 145 65 46 -285 -122 -173 421 36
5401 36 176 -99 -203 328 114 -17 -35 38 58 -234 179 315 16 -5 -60 -10 62 -13 100 -143 9 117 -104
5424 -104 99 41 -11 -137 142 63 251 -45 -171 -67 -208 -5 14 -185 -95 -347 -75 -72 -42 -138 -105 -16 -211 -88
5448 -88 -75 -56 -325 -244 184 -4 317 -169 -4 13 -120 51 -78 72 -117 -70 12 192 -272 131 -116 94
5470 94 -17 -130 36 -59 76 -94 36 107 60 -93 89 -57 63 203 -50 -98 -74 -220 -23 -183 -136 -93 -33
5493 -33 -44 256 98 143 -253 11 68 423 133 -54 -19 72 0 144 -128 1 123 156 -246 176 -165 -11 -19
5516 -19 157 -87 28 81 -266 -130 79 252 -17 -268 -20 -129 331 -119 94 85 -23 -56 -107 47 25 -78
5538 -78 -174 164 -79 172 -113 35 68 -102 155 -160 80 -147 -40 77 136 -119 -189 280 -160 113 128 -134
5560a34q8J60O5k18M62J01l91Q6Q9l25J42J71P0K0j50r6j15L3K0l16L23o9J93
5583C3O8k8L4j00j9M5j45R9j2K33j54k41M7J11J30n4o5p1L4J95k44L71j37O3j66
5608B7k08L19j71L30p16M29J5k25K12OP9j72K80j84k84J09o6L88J65l96K86m49
5630b26M55j89j77K09j37l0K16k32L80l75K24j10l5Q5k9J6L8m33J37K80l90K26
5652i7m6Q7n6J05j53J60J30k5L4J77l06Ql5K0o1l4K16O5l84M20k73nL00j33O1
5677A75q7j45JL10j38l42K63j42J3J77l22L08M1K3l65P7O6p6K63j72L3L6KO3J55
5702B17l93Q0J53R9l60K76j90J99j82q4L76k21P3J2j5j32J00L1J08n6r2n1QL34
5726B90L1l16r8K12m36K32K29r7l26J56J69K6J01k13J40o1k1k73L71l01J27q4
$$ plain form
5560 -134 -222 -62 3 -215 247 348 -43 43 132 -193 -51 120 190 210 60 -36 -151 -118 -98 -414 -91 -160 33
5583 33 101 73 107 7 -12 33 -112 -13 -25 208 54 -187 -140 -29 101 47 -18 -89 -55 140 -104 267 130 193 27
5608 27 -181 138 -33 297 -419 10 25 -200 12 18 97 -75 205 21 -263 -154 -220 168 333 -63 223 -226
5630 -226 229 40 -137 72 -65 -95 121 -111 269 -106 118 8 -27 58 29 45 83 -350 -213 67 -323 -97
5652 -97 -143 -56 -112 -7 -160 0 130 105 139 316 10 18 -17 3 -58 -92 124 189 -195 225 -48 -53 247 114 175
5677 175 88 -57 -56 254 116 -226 37 -105 -92 85 -237 71 112 135 -230 -153 -87 -163 100 -72 -39 -3 -1 62 217
5702 217 -176 -96 57 156 -204 72 -118 81 -101 -185 191 -30 43 55 40 -92 8 39 147 91 -1 -52 -44 290
5726 290 321 5 -93 119 -317 -85 144 47 -279 -123 46 72 173 -40 100 39 18 -255 116 -185 -58 -142
5748a42R5l7P2K56j14J24l42P0J36q1J69l27J5L96l23O5l72M20J4m6J21r3r0J4
5772@J17k95J16k17K69N8L27k24j14J02m5P5J04n16J54J12k29M34k08L5l0p1K52
5795B06k23j23J53K46j26k53j12K44K32k95N20l14Q4n67L25M9M7j4k93N7K0L15
5817A78m15K75k03L35j78J20kk16J02k06J3M75l32N0J87r1n0P7Qn8k04j22N15
5840B58J26n68L34j79j92L82o0K6M5k4j1j72J91l94K90J12p2l98K10K49j11j87
5862a45q3M34j80j80M55m26j42L90j33k56Q3K18J85j28l7j1M7n0k1l7p1Q2o8j05
5886a79L43l87L53K2j59%K31o2j31R5j66K25j75l9n2K72n6j43j9K46k66N4J47
5909A54l72K33q7q0R8k48j93O57j83j32K64k42L10J8l36K03l20J15J28j8Q3j58
$$ plain form
5748 -142 -47 -84 -12 244 130 254 -88 -18 118 37 206 -121 -106 290 -33 32 -340 80 94 48 169 76 -14 0
5772 0 117 -178 -62 -279 -10 48 375 151 37 139 94 169 273 -243 -89 23 -206 228 20 55 25 -46 206
5795 206 -17 -140 13 259 133 -120 -232 12 244 -51 469 155 239 -328 -3 46 93 79 -214 -157 -137 178
5817 178 -237 38 -165 170 -8 112 110 -106 -4 -210 -197 278 -54 -4 183 92 42 119 127 69 -135 -257 258
5840 258 384 -184 150 -29 -221 161 101 127 172 148 137 -35 156 -238 52 164 92 -306 -96 153 42 -145
5862 -145 -228 206 26 -154 301 -125 -267 123 -10 -266 -183 35 220 92 55 44 91 41 20 -17 -88 -6 -74 -179
5886 -179 164 -223 130 152 -7 -7 224 162 31 126 -40 185 10 -29 -81 191 135 -8 -27 219 -47 7 154
5909 154 -218 15 -72 -152 -54 -302 -495 162 -21 -153 111 -131 179 197 -139 64 -256 -141 -13 -31 52 -106
5931a06J4L63m32j19K27j06J69k25M05l03mj5J8K3L28l91K30J81n35M27l71J11
5953a11J45M0j55R8n8o9K34J35l81K90K9j49O5k61K62k47j30M43k77R5%K05k86
5976h3J34j64K80j10M8J31j99P2l43P4N9J89j80L44l25J24N5K6o3j60j18M41k24
5999Hj30j27J33j14J34j05p3L24R4k22n4K50k29mL35l03l1k3P2K43j10J84nk97
6023e0N4J75k3l31J02K02J97j65k53j58J38q2L78k64%P2j09mJ07Q5l95K86k2o1
6047a21q0L61j34j03K45m40K99j8m9P7M85k15n05K69k93M26l24J02K7J48n8j34
6069c5J02K02k04Q9o8j10L07n32N42L2l82o7J44N0l75M53m09L06J36l16L99j13
6091A51J3K8O5k95J1j7Q3Lj43K23k2k9p9Or6p3J54j63j41L57q6n0R2l02K46R8
$$ plain form
5931 -106 -92 271 -161 -280 -53 -159 10 -215 190 -113 -117 -132 -114 -91 237 -154 76 257 -278 149 -222 -111
5953 -111 34 74 -81 17 -41 -110 124 259 -122 168 197 48 113 -148 114 -133 -263 180 -97 -2 -2 203 -83
5976 -83 51 -113 167 57 105 236 37 109 -234 -160 -101 88 -92 252 -73 51 106 132 69 -91 -209 232 8
5999 8 -122 -249 -116 -230 -96 -201 -274 50 144 -78 -132 118 -111 -115 220 -83 -114 -137 -65 178 68 252 247 -50
6023 -50 4 179 156 -175 -73 129 326 161 -92 -250 -112 -194 184 -80 -80 -8 -117 -121 -14 71 -324 -38 -60 -121
6047 -121 -201 160 26 -77 168 -272 27 9 -40 37 522 307 -198 71 -222 204 -120 -18 9 157 99 -35
6069 -35 67 269 65 154 86 -24 283 -249 293 325 -57 -124 20 70 -305 148 -261 45 181 -135 264 151
6091 151 164 192 257 -38 -27 -44 39 42 -101 122 100 71 -8 -2 -98 -171 -17 -180 -321 36 -50 -100 -8 -310 -64 34
6117C4j61N3L28O8m45J72p5m3j04J21K05k06J72j07p1M1q0K37j12m0Qk13L05k45
6141a58L90k40J5o4J85n3j95L84n53M09j50n7l8j2K25L07m87k12M45j69k69L06
6163Im5K3K70m43K38j91J78j63K3M10k44j01R5J22o9k00K09p4j94K36j6k33L23
6186A63j89j12L81l6l3rk84J77n8O2K86k95k03l69N83J30j91l0m4j6l5J56m0J90
6210A84m9o9J56l11p3QN5L3k05J68L43k07m14L24Q0j80J93J32L9k70j09K23L1
6233H2k72J13J93k44M29k41j73J11j25K53O6m08L00p8j15J81J03Q2J47l66j38
6254a00N7J27J13k16J8o8k06L33p5m76O46k14P3k13K37k42L80l53L0J21J79r4
6276E7j5L3pJ80j99K8m0L5j82K30M7Oq6j20M02m78oL48p4k03j06K89l15q3K91
$$ plain form
6117 34 -127 -74 254 322 -123 49 -26 -69 -173 -52 153 -53 119 12 -59 -18 -98 139 27 -13 -5 -218 87 -158
6141 -158 232 -8 7 -57 128 75 -120 264 -289 120 -30 -87 -125 -137 88 395 -92 -304 141 -28 -297 9
6163 9 -36 -13 257 -186 52 -139 39 -124 -101 309 65 -36 59 181 112 -88 121 47 -147 89 73 -160 163
6186 163 -26 -138 243 207 174 165 -119 58 0 62 348 53 -150 -519 64 194 3 -27 -71 -87 -122 34 -6 184
6210 184 135 66 222 -89 -162 -154 -99 -66 -271 -103 240 33 -381 -57 23 -157 36 168 207 -63 -172 51 82
6233 82 -190 -77 116 -128 301 60 -113 -2 -127 126 192 -216 84 6 -109 72 175 257 404 38 -100
6254 -100 -43 84 197 -19 -1 -69 -275 58 -17 -493 153 -61 12 -201 36 -206 174 -179 -149 -28 151 57
6276 57 42 75 68 248 49 77 37 72 -110 120 167 173 87 -33 369 -109 -115 233 159 -44 -150 139 -176 -259 32
6301C2Q2q8J31k48p1lj35K12L38j45k01pQ3K2k2k97K16K11J82m68K46J10j89M9
6325D0J58l29L45k94J98l56R6o9L47J9m24J25K14k82J25p8l0L61k27LJ42J93k55
6348B2m2J67j51L04n31KK08lm7K54k34L87m29K09m13K09K35Pl35M02k93K69j27
6371G0k01L59m4p1j19M1m3J6j55o0j59J74M10l65J69L08m32K71k79k6K29J91o64
6394c80M97j69J21J16n46M01J19n08K19M21j99l09K55k3l99K86K95km8p2J4%p6
6417A3J72j10M7j15K17j17k90J21K05k75m7K54j77P8K37n72L46J82l74K44MJ84
6439B27l36N43k73l91N2M11r2q2l16M34r1m5L2j05R8l11K39L6n7m6J14k92L56
6462A05J21l75k0K6qM7l7L53l8k56q4P9L5k4K11j96R8o1M23m69J69m8j93L05j71
$$ plain form
6301 32 114 26 157 -91 -162 -165 -300 -88 250 105 -96 -103 -20 2 -20 -317 -101 110 292 -176 70 180 -9 40
6325 40 198 -131 214 -80 118 -238 -142 -211 136 155 -269 -144 70 -212 -87 -165 -195 166 -61 -58 84 277 22
6348 22 -20 147 -4 300 -231 -229 -21 -24 -71 183 -51 336 -93 116 -297 -88 147 154 -181 221 -72 197 70
6371 70 -131 228 184 113 -6 35 -8 8 -147 -207 -366 -192 218 -147 22 330 -102 169 -110 -136 93 284 -380
6394 -380 117 -52 69 185 -361 40 159 -349 -130 291 92 -217 38 15 -384 -98 197 195 147 75 89 89 13
6417 13 185 75 122 7 224 107 -183 -62 143 -132 -179 75 -102 -24 213 -359 -13 169 -205 39 43 227
6439 227 -109 434 161 -230 -178 233 141 59 -257 177 86 41 73 -32 66 -245 -6 30 -27 -73 41 -251 105
6462 105 226 -149 -169 -143 -151 -104 -141 212 174 -82 -166 -87 -52 -76 135 -61 37 -24 399 -70 99 51 -142 163 -8
6487hk32K10M4n7J6L5M8j95q1K1L3K61k12J51j65M35m73Q2j44K77J14m31K96j22
6511i7K14j14J66j50J50%jJ9j49PN2j45L88j04j69k18K59Pj38K59j86j35M19n72
6535b38L19J9J13m14M19k86j21J50K76j53K76n45K84j01Q0j18p3O1J10o1J89k22
6557c6J51j22m7P6j85J08l7K9n4k30K81N4k34M82n29N81n58L0K04P8m9Oj8LM0
6582B4j11O5L03k46M0R3l45K82k25K27j74J3qJ34l1q6n4j33K08k9K10j62j85L19
6606A29l10k40O08k63k5J04O4k59L71m2j08J83j24l30K27q9n5L68j11k09L74j78
6628H5P8N5Q7J46o61k46P1rJ61J57K8n0R1k6O7K10J18k08k10j40L8J29J85k83
6652a27J92k37n2N54m22L89m94P18n63j97O29l66j17K26n06L31L03j69L06m44
$$ plain form
6487 -8 -240 -30 14 -43 -27 8 56 -139 -220 -199 -166 95 -117 34 -131 304 -169 -87 -231 46 160 -271 25 -97
6511 -97 117 3 169 19 169 169 168 187 38 45 97 -48 340 236 67 -151 108 115 -23 236 50 -85 334 -238
6535 -238 81 100 213 -201 218 -68 -189 -39 237 84 360 -185 99 -2 78 -40 -113 -52 58 -3 186 -36
6557 -36 115 -7 -54 22 -163 -55 -92 -63 -117 -347 -66 -12 -246 236 -293 288 -270 -240 -36 42 -7 -1 -19 -16 24
6582 24 -87 -22 281 35 75 168 -177 105 -120 107 -67 -54 -62 72 41 -45 -99 -232 -24 -53 157 -5 -190 129
6606 129 -181 -421 187 -76 -101 3 67 -192 179 137 29 212 88 -242 -15 -104 -159 209 98 -111 263 85
6628 85 163 218 305 451 -210 -456 -385 -394 -233 -76 -48 -98 -7 -33 34 244 362 154 -56 -196 -158 -29 156 -127
6652 -127 65 -172 -224 330 -92 297 -197 521 -42 -239 390 24 -93 133 -373 -42 261 92 398 -46
6672d6K4K9N3o7J81m73K86R8j72J20j14o9M9J43j82k4L28k35j78K70n8L1j62L89
6696B21m6j20J03P5k50K3mR3l03L71k16p3K98m65J70M45l67j12J39l8l12M11j94
6719a51K26k2j37K55l84L28k78K48m52M24j13P8N7j98K49j48J5M53m22l9k11J34
6741h8J02J76l86K10N2k82M07J38k99l10L01ML91l34j39L38j98j09n0J26l17L83
6763A16p2o0O3j20M6M14k61j86j32K38K32j14j33L78l38J6o0J10r2k17K87J13
6785B28l06J08j87K66k04O6L43l08k4j54m9K52K4j43K24j78J28k2q2M5K7n4P1
6808G1j18J8J87m89O00j40L5J91p15K71L09l21n1K55l3J45q4l51j02L97K9j65
6830f1L72m48K08m54L43N28p08M52j98j12J12l71L51j00R8k84O04m90J86l96L58
$$ plain form
6672 -46 -22 7 60 -7 174 -299 -13 85 -87 33 -81 -150 -101 42 -140 -164 164 -71 -249 21 -37 -6 -168 221
6696 221 175 55 158 233 -17 6 2 95 -208 163 -53 -126 172 -293 -123 322 -45 -157 -18 -56 -368 43 -151
6719 -151 75 53 -84 171 -213 115 -163 85 -367 57 -56 22 79 -119 130 -18 -3 450 28 -11 -222 -88
6741 -88 14 190 -196 14 66 -216 191 329 30 -280 21 25 416 82 -57 281 83 -26 -76 50 -267 116
6763 116 44 -16 47 -73 -27 387 126 -60 -192 46 278 164 31 409 71 87 27 137 45 -172 115 228
6785 228 -78 30 -157 109 -95 -29 314 6 -18 -172 -221 31 55 -88 136 -42 86 64 -18 27 54 0 71
6808 71 -47 -29 158 -331 269 129 164 355 -360 -89 220 -101 -152 103 70 215 131 -220 -322 75 104 -61
6830 -61 311 -137 71 -383 -40 488 -220 232 34 -78 34 -337 14 -86 12 -272 332 -158 28 -368 -10
6851a0J14j32RJ69k30J57j60k02K89J77N0j52J57k97L0k13o4O6J88j67J16j9K23
6874I9l84K55J45m0K41k66p9q2K66R7m0j72J98N3n41L9J1L37l17R9mK3J54q8j06
6899a02J56J5q0Ln8N1j23L03j14j32K91j81P0j83j81L53j04l3p7k0L41l12p5J35
6923e7J50m40M76k61K25J52l36O9q5l7N06k44k80K35l20L59n2j61k42M48j27j90
6945b12J86M9k35o2L83r6L04j91P0j18p6j13k7J86j88J43j06m0J84j28L40k74
6967b1J06j76K2Q6k57P9O1J64j91j63K41M68j99r3J31j43j66O2l81K59K5N5Q6
6990E5J8k2m3p1P6n0PJ6q3L05p8M4j76j14O8K13l49M53j51n22N53p8K69l72J36
7015A04k06J24QJ54l36J13JR2k8o9J5m9L0J5Rj43M9n5J61o2K10j70R5n9J12m36
$$ plain form
6851 -10 104 -28 -19 150 -80 77 -83 -285 4 181 231 79 236 -61 -31 -244 -308 -242 -54 -221 -105 -124 99
6874 99 -285 -30 115 75 316 50 -29 -111 155 252 212 40 238 291 -250 -211 -200 137 -180 -81 -85 -62 92 4 -102
6899 -102 54 69 -11 -8 -66 -15 -138 165 51 -81 210 29 99 -84 -265 88 -16 -49 -126 -146 195 -117 -192 -57
6923 -57 93 -347 129 -132 93 245 -91 -22 -107 -144 362 118 -162 73 -247 112 60 -101 -343 105 -22 -212
6945 -212 -26 23 -212 -274 109 13 317 126 196 78 2 -111 -138 48 -140 3 -103 -143 41 -87 253 -21
6967 -21 85 -91 -69 17 -240 -161 -100 64 -127 -290 -49 419 220 127 258 115 -51 11 -370 -111 -86 -31 55
6990 55 73 51 8 -63 13 -37 -30 -14 -97 208 130 174 -2 -116 -48 165 -184 269 118 -404 149 71 340 -32 104
7015 104 -102 22 30 184 -152 -39 -38 54 26 -43 -28 -77 -47 -32 -23 -166 -117 -172 -11 -73 137 -33 62 3 115 -321
7041c21L90k00K18l80L81k53J91n9P1j12K51k92L38l68p0M34j10k63J48J6m03
7062c93M69L5j4k24J63l67N56l06N1J30K51j59l09R7P3m07L20J58r0J00O3j80
7084A7j14J27o3l0L8K93l30K15K9k41j68J26M6JK42j24J06j64R8k45R5J99N1l65
7108a61Q0l4m7M12l32p6K27q1J04l31J9J71K11Q1j10k13K9m3J10J17k39K60k35
7131h1j2j21L18l8l2k8L9K4l42L98l40L32j11l7J87k76K47k02p8L80k88R7J39
7154A75k50K27j47r9J36l68L74o5O6n4k72L24p0L81m65Q2q6K32q7k01N44l10n1
7177A6k37m7L38J39k44Kj78K82l9j57J69R1N0j8m50N19n54N24j49K00k45r7N9
7200b6J80j93J0l9L10n06J06o4OM27M9j42m64P85o26J84K77j23J61l79l16K48
$$ plain form
7041 -321 69 -131 87 -293 88 -165 26 -33 38 -74 177 -115 223 -145 -215 219 109 -154 -6 10 -393
7062 -393 76 111 97 -127 36 -331 225 -81 -30 100 351 192 -117 -20 53 -354 -34 124 34 134 197 17
7084 17 -97 30 -33 -63 -25 268 -62 153 182 -59 -227 -101 -55 -54 188 64 170 6 104 -141 -46 153 204 -161
7108 -161 -81 -115 -162 250 -82 -158 69 -12 92 -239 -220 -49 162 243 133 -80 -51 -94 16 133 -106 154 -81
7131 -81 -93 -214 104 66 34 6 45 69 -273 125 -215 117 6 -31 156 -120 127 -75 -153 227 -61 36 175
7154 175 -75 152 5 -94 42 -326 48 -17 49 -5 -277 47 -23 358 -107 -25 -111 121 34 -167 377 67 16
7177 16 -221 -268 70 209 -35 -33 -211 71 32 -125 44 135 185 167 -283 236 -318 206 57 257 12 -85 -26
7200 -26 154 -39 -29 -68 242 -264 -158 -222 -216 211 260 118 -346 439 -187 -3 274 151 312 -67 -383 -135
7222a35L41m63L27n4O8P2n8K2o6J39k76K03q2L0j95K20p4J89l87L57l39K82k9
7245I2j58N3K92j64r7k18K53k11M12n17L32J35k40m6QK30N3l53K05k44P3J46j0
7268B6J31m6l07J10J32j22Qp5J40q0P0n3K54Pl78j09L47J25J47k81j66P4J22m
7292G2o7k01J87L7j82n8N9P2J76n9j75L30o3k2l50L20q7K01l17J16j81N00j36
7315A72m61L31K06o05O32n17K93k5j6J91m38L05j34N2nj51J18K50j55J17j5q3
7337F2k37K16k61K60j65Nj8L9j73L22JJ02J4k57l8K41k12j52M72k10J66N1k61
7360c3j76J33pK55K33n29Q1P9M4p4l3K46j16J52j40j28q9r9K53J59m58N47l77
7383g7j97K47r1J26J38l43K61N0j67J50p5K18k68K27l45N3J54N3l7n6M9l4l93
$$ plain form
7222 -135 206 -257 70 16 84 156 98 120 54 193 -83 120 38 68 -127 93 19 208 -179 178 -161 121 92
7245 92 -66 -13 279 115 18 -200 53 -158 254 -263 69 204 -36 -82 -74 156 209 -144 61 -183 -110 36 26
7268 26 157 111 -196 -86 46 -76 -68 -143 -3 -83 -13 -66 188 195 -183 -292 55 180 327 46 -120 -46 76 72
7292 72 5 -196 -9 28 -154 -212 -153 -81 95 36 -139 191 128 106 -244 76 -11 190 -127 -11 -192 308 172
7315 172 -289 42 248 -357 275 -242 51 26 10 201 -237 68 -66 -14 -19 -170 -52 198 43 160 145 62
7337 62 -175 41 -220 40 -125 -120 -138 -99 -272 50 51 153 167 -90 -128 113 -99 -251 221 11 177 228 -33
7360 -33 -209 -76 -83 172 405 -124 -43 36 80 6 -27 219 103 255 115 -13 -102 -201 52 211 -247 300 -77
7383 -77 -274 -27 -118 8 146 -197 64 114 -53 97 22 240 -28 199 -146 -93 61 114 77 21 70 36 -357
7406c57M83J57k70K9K65l31j00J10O6o5o2L25j69k60j0L51l53K4L09J1l84N27
7428B96j31OO9k75%j75J13K61J14k75j41K37K05k29m56K09J36q4K35l84J87O4
7450a8J4J21l62R0K94j48k33L01k30J35q1J20j43L51k60K16J8l28K55j52j6J01
7472D5j94J7j31K41K50m95L63k33J35j88j4M4O1Q2j5J2L02p11M84r5R1k51J69
7495c1L5K56k26pM0p6m16M06j6J33j23J79k69l7O1J41j80j21J98jk38K67p2P7
7519b0Q7j60L5rK16r1j05%L1j96L20j39K37p3l6p3K99q6j38l6l72N50l00n1L52
7544B42n35N70j57j46j66J53q0o6K90j01o9J67qk84J30m3L15j91p1J95m43O30
7566C32m57Q4K43j76k19j0L82k20K37Q2l73j06K35J11j18r8J79j26r2R8n8n9J70
$$ plain form
7406 -357 126 283 13 42 307 -24 -124 -14 52 -13 -75 250 81 -179 -189 162 -191 -167 142 153 -231 296
7428 296 165 171 240 -35 -35 -210 -97 164 278 3 -138 99 304 75 -381 -172 -36 -120 115 -269 -82 -18
7450 -18 -4 117 -245 -155 139 -9 -242 59 -171 -36 -117 3 -140 211 -49 167 185 -143 112 -40 -56 45
7472 45 -149 -132 -263 -22 228 -267 96 -137 -2 -190 -204 -160 -99 -17 -32 -20 282 -429 55 -40 51 -200 -31
7495 -31 4 260 34 27 67 -9 -425 -19 -35 98 -25 154 -115 -152 -91 50 -130 -251 -53 -54 -292 -25 -97 -20
7519 -20 67 -93 -58 -67 149 58 -47 -47 -16 -212 108 -31 206 133 97 24 323 237 99 63 -309 241 -59 -110 242
7544 242 -293 277 120 -26 -192 -39 -119 -185 105 4 -65 102 94 -190 -60 -103 212 21 -50 145 -298 332
7566 332 -125 -41 202 26 -193 -203 179 -41 196 278 -95 -201 34 145 27 -71 108 -18 -110 -12 -70 -129 41
7589D1j01O9l93K68K74J7j37r4K31l31j38O36n97R4J27R2k83K98k83J74k8L12
7611B48k88N2K9J02r1k14j5J99P0j37L8J28j00l3k59M08j15l7J11l2j22L07l79
7634a30L8q6p0L02J23l29L66j51j87J89j16o1rK07r2Ol5p1Mq8J44K02J54l26K3
7659GK15j4j31j24j56K58j18K54k17J24o8k14m9J87j23J95J65l61J60P8r6jn76
7682f05P68q0l3j54j74O87j16l99Q9m6Pq6j31K19n9j06M9qK52K52m45J37J64r1
7706I1K86l44rO4k93K73j56QJ98k68l93K72K67O4j1j44m0r1K72J55o9k34M70Q
7730C76l32r9M9r0j47Q1J31J77l95J01N0J57j93J25J49q8L9J78k64J20Lk07Q5
7753FP2nn0j84m1R3J82K8j37k4k2J59k50O6j0J48J5n9j3K11l89J39J5j08L25m28
$$ plain form
7589 41 -60 9 -384 -116 158 175 38 -56 175 -156 -294 342 -255 -161 -34 58 -225 73 -210 -36 -64 248
7611 248 -40 12 41 143 52 -162 -177 22 92 -45 -7 121 21 -12 -271 137 22 -15 96 64 -58 249 -130
7634 -130 -92 -178 -248 54 177 -152 214 63 -124 65 -51 -112 -121 86 -6 0 -35 -106 -102 -190 -46 156 310 -16 7
7659 7 222 208 77 -47 -203 55 -63 191 -26 98 30 -184 -233 -46 -169 26 191 -170 -10 68 -28 -29 -605
7682 -605 163 83 50 -104 -278 409 293 -106 -17 -63 -56 -142 -273 -54 -113 -219 -170 -178 74 326 -119 18 182 91
7706 91 377 33 24 88 -205 68 -88 -80 118 -150 -543 -271 -4 60 49 -95 -135 -226 46 201 132 -102 368 376
7730 376 44 -55 -6 -96 -243 -162 -31 146 -249 -148 -98 59 -134 -9 140 52 91 269 5 125 128 -79 6
7753 6 78 73 23 -161 -202 -109 73 101 -36 -60 -82 77 -173 -107 -117 31 46 -13 -26 185 -204 -65 -50 -158 167 -261
7779b61K36O4r9n2p7K81o4M6J03k17j28N55o24L76l64L68j17l35P5K98K2J45k36
7802ej19K09n8p5K03k55j5j25M19R2k63Q1L4j76J11p2J16j23J56j96J33J27k44
7825d5J31k82L96k78J62k05P8J58Q3J52m22J0q3Q4k9Q3k58L27m0M4ml15N31m28
7849a50J44k35J48j00R1K36r4j91K56j19j8J00Q6k80K61Pq5j48k6K91Q5Q4l48
7872eL09j99n2J71k56N6k47L88j95j06J84j06K35j89j61KK23j67J00o3J14L88
7894D24k01l93PL15l05p1M11j28k89K72Rj47j43N15j28m3j21J45K48p28M58k04
7916i7j49mM35k83K75k09N4k0j31K0L62k89lq7j8N40m40l0PL03m49J51P6k95K89
7941HJ35j52k4M3Q3o6LJ92l59J29P1P3j55J54K6l00J55j9J20j07j50M1J51n1M7
$$ plain form
7779 -261 -25 39 -60 -112 -189 92 28 74 177 -40 -168 387 -237 139 -225 143 26 -309 -234 64 86 231 -5
7802 -5 -124 85 27 -48 155 -100 -115 -240 179 271 8 89 123 -53 58 -14 102 -21 135 -61 72 199 -45
7825 -45 86 -196 200 -78 84 -121 -43 115 198 350 -72 -62 -145 -61 -90 -7 -265 62 22 66 62 -253 278 -150
7849 -150 -6 -241 -93 -193 -102 134 40 -151 105 -14 -32 68 154 -126 135 142 57 -91 -117 174 259 343 -5
7872 -5 304 105 53 224 -32 24 -223 165 -30 -136 48 -58 177 -12 -173 -171 52 -115 -15 -78 36 424
7894 424 223 -170 -163 152 -153 -224 187 59 -230 42 51 -96 -239 276 148 105 -16 129 377 -351 107 -97
7916 -97 -246 -250 185 -98 177 -32 22 2 -129 -109 253 -36 -39 -126 -144 396 -44 -74 -67 236 -213 -62 14 -281 8
7941 8 143 -9 -33 10 93 27 30 222 -137 -8 63 136 -19 135 161 -139 16 -3 117 10 -140 -99 52 1 48
7966D8ok26J82R5l71R2L23j68J92n2j01N6l8J9q9j19N0K17l63M97j02j21L28n35
7990a92L13n5j46q9L69R3j80l7J1Q9k84m5M60k56J2j53L97r7l20J14qM0j72J96
8014F0k56K02k57M62m13K74J34l97M68k59K34k63o0P0R6l58L83k00j33Q8r5p8
8036b98K61K15j3l45O9K45r6j6K2m1K80o6n9j84r7K54m7n9j20R6O9N4J18l05j48
8061b11K40J63q1j77j33K15k38K86K65j92p2o0J85l06J71k61M1M00l91M08m90
8082b38K48Kk20LK31J77k25K76l64J58J7j33m0L25m76J64J88j79K07j35j83K68
8104G1Q9J22j84k50L38j36k29j7L04J18l34l02N91k3l91K29J8l13M61R5k93o1
8126i7j85rM09j28K1jj48K52o9J07o0J0j2o9l9j38J78m6p0L02j32JPn20K95Q1
$$ plain form
7966 48 42 -184 -2 93 -278 -186 137 -31 161 109 8 64 26 45 -44 -163 -113 104 -259 238 136 15 343 -192
7990 -192 121 66 -80 -169 200 293 113 76 87 176 -108 -153 307 51 63 -90 307 210 -110 4 -4 36 -136 60
8014 60 -196 6 -251 211 -202 72 206 -191 277 18 252 -11 -71 -1 95 -263 120 -80 -213 -125 -220 -298
8036 -298 -37 178 165 -180 -111 134 38 22 44 3 283 217 158 -26 -123 131 84 25 -95 1 70 124 242 -63 -211
8061 -211 29 192 111 -66 -199 16 -222 64 329 137 65 5 190 -116 55 -206 -165 235 -156 252 -238
8082 -238 10 12 -208 -205 26 203 -22 254 -110 48 65 -68 -108 217 -259 -95 93 -86 121 -14 -197 71
8104 71 160 282 98 -152 186 50 -179 -196 108 226 -108 -410 181 158 -233 -4 14 -299 162 257 -36 -97
8126 -97 -282 -291 118 -10 11 10 -138 114 45 152 92 102 90 21 -18 -156 22 -24 -94 208 76 77 84 -436 -141 -60
8152f0K48j88J18k07K83l93J44o5m1M75m34J47j72K3Q4j40L05p3J93m38J90J45
8174A44j60O0k33K72j47k09M76k81R4l7L2N4J54j39l71k14P06
$$ plain form
8152 -60 188 0 118 -89 194 -199 -55 -120 -161 314 -120 27 -145 -122 -38 -178 127 54 247 -191 -1 144
8174 144 -16 44 -189 83 -64 -273 203 -78 16 -21 11 65 219 80 -291 -505 201
8191B01
$$ Imaginary data points
##PAGE= N=2
##DATA TABLE= (X++(I..I)), XYDATA
0@%%%%%%%%%%%%%%%j6L2l2L2l2L2m8O4o4Q0r6J12j29J45j76K04k32K64k98L34
35A76l76M22m74N34n96O62p32Q12r04J002j105J218j343J481j633J798j981K186
53A147k411K661k942L262l626M045m538N125n837O721p854R364j1489J4738k0344
68a1978L2680j15816Q7445J38280k18888R436J69604m5093j20730J01411L7408
79F3759q7475J259O0183l2524j4204R276r420J6582J1893n7115R859O5643l8976
92a260n1992P4003K0591p5705J9381O4972n1744m0013N1159Q146l6943J4693J4221
105I509j1081J7475O942k8770N198J8594j8672j1068O493j0114O824J5296k3921
118a7295m236L7023j4275k7819M2171J0915n1113K6359N5002n1615l6282O4882
$$ plain form
0 0 0 0 0 0 0 0 0 0 0 0 0 0 0 0 0 -16 16 -16 16 -16 16 -32 32 -32 48 -48 64 -65 80 -96 108 -124 140 -158 176
35 176 -200 222 -252 282 -314 348 -384 428 -476 526 -579 639 -704 777 -856 942 -1039 1147
53 1147 -1264 1397 -1545 1717 -1909 2136 -2402 2723 -3114 3607 -4247 5117 -6372 8366 -11978
68 -11978 20702 -95114 -7669 130611 -88277 -78841 90763 45670 -75060 26351 63759
79 63759 -23716 -22457 37726 5202 -9002 274 -9146 7436 19329 -37786 -27927 37716 -1260
92 -1260 -53252 20751 41342 -34363 -14982 49990 -1754 -41767 9392 17538 -19405 -4712 9509
105 9509 -1572 15903 22845 -5925 -727 17867 -805 -11873 -5380 -15494 -8670 6626 -17295
118 -17295 -21531 15492 1217 -26602 15569 26484 -24629 1730 56732 5117 -31165 33717
130C3717Q11p3432J8171M6634m5216k5676N2166O778l9686J3834L3874j1151j7834
143g010P140R898k54q132m288Q529K340j0654Q15P108j0577n725J2748l12j0231
158h605N600R414m491m711K585O51n552l970O238O448q730r24K0313J664j9552
173c622R094J6114k2015j0115K3664j0260k8835K3119J8456l5460n398L6861q459
186C144k5871K1886J6907j9253K753J9701o918r914O188o06n288m780p938K784
200g205P503j1459k938J8672m584j4330J9315R200k6168M676K7341j5615j7873
213a3465K3121L470k1660R408J1654j9457j166J7951q706r710J1031j91n574O730
227C436o459q755J4016j89j7463J1897J4136j8954K905K6494j4813j8567K7305
$$ plain form
130 33717 34528 -38904 -20733 25901 -19315 -44991 7175 13953 -25733 -11899 21975 10824 -7010
143 -7010 130 10028 9774 1642 -2646 5883 8223 -2431 -1616 5492 -5085 -10810 1938 1626 -8605
158 -8605 -3005 6409 1918 -2793 -208 443 -5109 -9079 -2841 3607 -5123 -6047 14266 15930 -3622
173 -3622 5472 21586 -429 -10544 13120 2860 -25975 -2856 15600 -19860 -25258 11603 3144
186 3144 -22727 -841 16066 -3187 -434 19267 12349 2435 8623 8017 2729 -2051 -9989 -7205
200 -7205 298 -11161 -14099 4573 -11 -14341 4974 14174 -11994 -7318 20023 4408 -13465
213 -13465 9656 13126 -8534 874 12528 -6929 -8095 9856 1150 -8560 2471 2280 -3294 3436
227 3436 -3023 -11778 2238 2049 -15414 -3517 10619 -8335 -5430 21064 6251 -12316 14989
240A4989O061l1161N924K0777k0547j1147K0843o069j9908J4534J0914j6074K67
253a0597J4586q82k474N107O0N79K038n117J62K661j0296k473J2954p591j5684
268a6967J5171J0846j9597p76K0830p537j3928J5506P343j6757J435J4887n538
281D918j0330N049N705j634m084k144O309K629j0695p6J2009q401j3479J4038
295a86P796k0435J21K1712n981j6312J4995J2600j4878k619J5139k104j2052L538
309A334O625o054r462K775O497n751r002P241J0133j0003m814J6541K358j4129
323e711O244J4014j0555r489J2890J876j4229R21R382n266o530L684K713j279
337a335j469r74L271K794n738j94Q880l869q499R419O419j2519n06J4426m423
$$ plain form
240 14989 21050 -10111 -4187 16590 -3957 -15104 5739 -330 -20238 -5704 5210 -10864 -10597
253 -10597 3989 3107 633 5740 5800 6379 8417 3300 3462 6123 -4173 -6646 6308 -1283 -16967
268 -16967 -1796 9050 -10547 -11323 9507 1970 -11958 3548 10891 -5866 -4431 10456 4918
281 4918 -5412 -363 5342 3708 -376 -2520 3789 6418 -4277 -4353 7656 -745 -14224 -186
295 -186 7610 -12825 -12704 9008 3027 -13285 1710 14310 -568 -3187 11952 9848 -2204 1334
309 1334 7959 1905 -7557 -4782 1715 -4036 -13038 -5797 4336 -5667 -10481 6060 8418 -5711
323 -5711 533 14547 3992 -5497 7393 9269 -4960 -4039 5343 77 -6453 -2769 -56 -1335
337 -1335 -2804 -3778 -507 2287 -3451 -3645 5235 1366 -7133 2286 8705 -3814 -4320 10106 5683
352E683j1616R747N712j2900m49J0410p448r739Q943L781j0140j06R153j888l702
367d559N726L656l365J092L795n7l580r86J781k34m783l419K777J605n255j447
383g253O203K09m876M788O430n432l506R066K343r717M6Q736l395p633L946M350
399D305n989j927N782j261n025J037M015j397l217j32L438J885l595q57N477J07
415B646m188L654M790o095j422Q181k739r700M320M689q565k173O321l625l793
430g699P334J884o340L361P066l880j356M449j530j640M303k497n121K699N04
445A537n071J139J699n509K263O838n599k887Q453P41p576N060L743q397J511
460b055R937n805p262R368L049r573J302N034o364j483O055l232n270N395K116
$$ plain form
352 5683 -5933 3814 9526 -3374 -3823 6587 -861 -10600 -1657 2124 -8016 -8122 1031 -857 -4559
367 -4559 1167 4823 1458 2550 6345 6288 2708 1722 3503 3269 -1514 -4933 -2156 -551 -5806 -7253
383 -7253 -1050 -841 -5717 -929 5501 69 -3437 5629 7972 -1745 -1699 7037 3642 -3991 -45 4305
399 4305 -1684 -3611 2171 910 -4115 -3078 937 -460 -3677 -3809 -371 1514 -2081 -2938 2539 2646
415 2646 -1542 2112 6902 807 -615 7566 4827 -4873 -553 4136 -4429 -6602 -281 -3906 -7699
430 -7699 -365 1519 -4821 -1460 5606 1726 370 4819 3289 1649 5952 3455 -1666 1033 1537
445 1537 -3534 -2395 -696 -6205 -3942 2896 -2703 -5590 2863 3604 -3972 1088 4831 -3566 -2055
460 -2055 7882 2077 -5185 4183 7232 -2341 -1039 3995 -2369 -3852 2203 -1029 -6299 -904 1212
475A212m300J285J087k963L961L841n678J038P717k517m212N255j910p539M934
490A211L384j1153j692J0912l052q127P753L428p842L083P659o422l306R444N76
505E856o048K735K067l614J86Q89m981l20L348k370o81M359m342o98Q049k908
521A527r797O791Q072r814k007J2131k972q749J0240L918j3051k95J1431n524
535A901q746O573L177o282J190K580l372j007K186m03J295J309k691M829O487
550I026o883m877R641J53j2284L145P841r852l583J2159k946j1261P953P771j0376
565d373k780R838q58n408N392L706m280nK532j776j290j066j985K893J719n298
581c039P96N807l629m680O300j395q152O041P617r411l089J3158M39j0294L827
$$ plain form
475 1212 -3088 -1803 -716 -3679 282 4123 -1555 -517 7200 4683 471 5726 3816 -3723 1211
490 1211 4595 -6558 -8250 2662 -390 -8517 -764 2664 -5178 -2095 5564 -858 -4164 5280 5856
505 5856 -192 2543 4610 996 1182 2071 -2910 -3230 118 -2252 -2933 1426 -2916 -3614 4435 1527
521 1527 -8270 -1479 6593 -3221 -5228 6903 3931 -4818 5422 9340 -3711 -4006 7425 1901
535 1901 -6845 -272 2905 -3377 -2187 393 -2979 -3986 -1800 -2203 -908 401 -2290 2539 9026
550 9026 2143 -2734 6907 7060 -5224 -2079 5762 -4090 -7673 4486 1540 -9721 -1768 6003 -4373
565 -4373 -7153 2685 1827 -3581 1811 5517 1237 1232 3764 1988 698 -368 -2353 540 2259 -3039
581 -3039 -2243 3564 -65 -4745 1555 160 -7992 -1951 5666 -3745 -6834 6324 6763 -3531 296
596B96P323o615l781O953j177o348K562M496m211m026K351J854k514k652L180
611b309L166j444j128O250J719o326n68P227k386q798L071O499n380m355N929
626A167P07o369J706N547n014n387P563N430o970k282P658J692o628l52N394k558
642A304m204L861K995m986q82N112N55n736j811L597J47m623M67M470o88k872
658c294M890M039o323k505Q662Q77r166R61Q533m249o447N153J423p861J329N448
674A470m460m072N898L842l679j88L657O16r34r57p9N70j392j185K996k58m817
691b972J625N257m796n574O698K144p019K215O335n543k089P317m81q131M166
706h48N925n282k077N680k57l277K207O62l252q77P02j052q04p63R4K907K38k760
$$ plain form
596 296 7619 1004 -2777 4176 2999 -3349 -787 3709 -502 -4528 -2177 -323 -2837 -5489 -2309
611 -2309 857 -587 -1715 4535 6254 -72 -640 6587 4201 -4597 -1526 4973 -407 -4762 1167
626 1167 1874 -4495 -2789 2758 -2256 -7643 -80 5350 -1620 -3902 3756 5448 -1180 -1532 3862 1304
642 1304 -2900 961 3956 -1030 -1912 3200 3755 -1981 -3792 -195 -48 -4671 -4204 266 -422 -3294
658 -3294 1596 5635 -688 -3193 5469 6346 -2820 -1859 6674 2425 -4022 1131 2554 -5307 -3978 1470
674 1470 -2990 -7062 -1164 2678 -1001 -1189 2468 3084 2150 1193 1114 1684 292 -893 2103 1845 -2972
691 -2972 -1347 3910 -886 -6460 238 2382 -4637 -2422 3913 -1630 -3719 3598 3117 -5014 -848
706 -848 5077 -205 -2282 3398 3141 -136 2071 2733 -519 -1396 -694 -1746 -2550 -3313 -3219 -312 -74 -2834
724b834K368L873l389j065N952j334n133M333L137p111j920O313k022o786L296
739b322L256m236n63M154O21l046J837K714r09k060J61K645j90l424O14M406k699
756I59l886M306J966n953J01N750k807n558M560L749o732p46O243o96n385L213
772i16M799k828k739N021J725m313j316M180j074n116k19M472k653n107L900L795
788A611m557j411O080R39m704K094N037k756l244K894K406m557k266L476R46m631
804b643p11L901p4m048J889M171k936l113M825K018n959M35N871j857n102M075
820G42L403m774r95N117j017m401J961K996l480k822K596J145k906j410L265J022
836D42k360J15M516n99l489K554M782m116l794M669J311o649q18N549k398n361
$$ plain form
724 -2834 -466 3407 18 -1047 4905 3571 -1562 2771 5908 -1203 -3123 3190 1168 -5618 -2322
739 -2322 934 -3302 -3865 289 910 -2136 -299 2415 1506 -554 -393 2252 2062 -1362 -748 3658 959
756 959 -2927 1379 3345 -2608 -2507 3243 436 -5122 -562 3187 -3545 -4291 1952 1256 -4129 -916
772 -916 3883 1055 -1684 3337 5062 749 -567 3613 2539 -2577 -2796 1676 -977 -6084 -2184 1611
788 1611 -2946 -4357 1723 2662 -2042 52 5089 2333 -911 1983 4389 -168 -2434 1042 1988 -2643
804 -2643 -3354 547 473 -3575 -1686 2485 -451 -3564 1261 3279 -2680 -2245 3626 1769 -3333 742
820 742 4145 -629 -1624 3493 2476 -1925 36 3032 -448 -3270 -674 471 -2435 -3845 -580 442
836 442 -1918 -1803 2713 2114 -1375 1179 5961 1845 -1949 2720 4031 -2618 -3436 2113 -285 -5646
852e646M130L007m324j034N421N74l870J356L647j018k858J433K058j953k268
867a345J657J312k578j221K688Q57l514K84L642j709l384L253K083l483r19M062
883A685l9m389L010L344l301j318L787J76l832P77K539k457k726J733J229k371
899b153j311K457J073j535L47K310O59j985Q77K926j256k949J890J849l153l107
915c061L701j7m125J042L640k347k313L731J768l283J60L260n07k294J433J203
931A991j670l01J135p54n66K2M45M45j333l54J091N54j981q96K510p77j671K141
949C1P89k377J202L590k267k192L311J183l418K05K153k284k028K400m84l444
965c630J254K160p54j325J775J144k00Q63n4k80R40n96m99M34j243j085J777N90
$$ plain form
852 -5646 -1516 1491 -2833 -3867 1554 2128 -1742 -386 3261 2243 -615 818 2876 923 -1345
867 -1345 312 1624 -954 -2175 513 1370 -2144 -1860 1782 73 -3311 -58 2025 -1458 -2377 1685
883 1685 1646 -2743 267 3611 310 -1008 2779 2955 -877 -100 2439 -18 -2744 -1011 218 -2153
899 -2153 -3464 -1007 66 -1469 -1122 1188 1847 -138 739 3665 2409 -540 1350 3199 46 -3061
915 -3061 640 623 -3502 -2460 1180 -1167 -3480 251 2019 -1264 -1104 2156 1649 -645 788 1991
931 1991 321 20 1155 401 -165 -143 302 747 -586 -940 151 705 -1276 -2172 338 -439 -2110 31
949 31 820 -1557 -355 3235 968 -1224 2087 3270 -148 57 2210 -74 -2102 298 -186 -3630
965 -3630 -2376 -216 -970 -2295 -520 624 424 1287 1233 953 1893 1297 798 1232 -11 -1096 681 1271
983A271l621o1L463j073k900J855K185k470M78L109j792k033K939J317k876r38
999a147K218j09j129R84L0p74j42K35O5q59o38L33J150j158j428J334K148j377
1017b64j000K300K3j239J732J114k315p09K744j162k894Q69J079j887r24J870
1033f63q21n09J740R62p81K86J020j65L10o90k66J88M98q17j85M63j215r41J548
1052c8rk648J521K742j666j983K936N56k684P96K425k301j343L424K8k122N75
1069B09K384j551j493O60J7q96l26L16l04J43k91L48J235q49j393K027J960k037
1087A59p17L442m96k504J600P64l065p48K251j268k939K159K074j781r1J647k49
1104B38n75J339m46j000J313k41M3P86r61j136J547K5k362K67J969j789o05K394
$$ plain form
983 1271 -2350 -2411 1052 -21 -2921 -1066 1119 -1351 -873 2236 444 -1589 1350 2667 -209 -1147
999 -1147 1071 962 -167 817 847 73 -69 166 231 -628 -1266 -933 217 -941 -2369 -1035 1113 -264
1017 -264 -1264 1036 1059 -180 1552 2666 351 -358 2386 1224 -1670 -801 278 -1609 -2533 -663
1033 -663 -1484 -1993 -253 709 -72 214 1234 1069 1379 689 423 611 1109 292 107 570 -645 -1586 -38
1052 -38 -47 -2695 -1174 1568 -98 -2081 855 1411 -1273 -477 1948 -353 -1696 1728 1756 -366 209
1069 209 2593 1042 -451 209 226 -670 -996 -680 -984 -841 -1132 -784 451 -398 -1791 236 2196 159
1087 159 -558 2884 2388 -116 1484 2248 -817 -1565 686 -582 -3521 -1362 712 -1069 -1160 487 238
1104 238 -337 1002 556 -444 869 628 671 1457 496 -640 907 932 -1430 -1163 806 -983 -1588 806
1122H06k55k577J523K421k850j678L486q8k221J518J643j121o7J402l93j937K58
1139a30R49o60j109r3J4R58r75r57J571J019k061N54K454n90j550K846J072l525
1157b13r6K875k109k064J440L88k256R30J732j498l42J520m4j148R29J13k33J120
1175A044l65m57O14K14j320P73M82j952K04K046j023k084K073R90k263n84K491
1192H83j303j789K279J113k320R12K092l17j512R11N39j297l9K58n90k54l60K78
1210e16P2m19j044R37J025j055q5K336n79r44J911O05j970l91J864j155k214J779
1228A57R15k146l36J669n09j319J006P56p90m11J240J77l90l65R09M85o11n32
1246i5M75L86p74L25P60p95r61J178L79j702r19K152p51j680J123J549j006K1
$$ plain form
1122 806 551 -2026 -503 1918 -932 -2610 876 788 -1433 85 1728 607 540 1942 1549 -388 -130
1139 -130 819 159 -950 -1043 -1029 -71 -1046 -2003 -432 587 -1474 -920 1534 944 -606 2240 3312 -213
1157 -213 -309 2566 457 -1607 -167 221 -2035 -1105 627 -871 -1213 307 263 -885 44 157 -76 1044
1175 1044 679 222 836 1050 -270 503 985 -967 -763 1283 260 -1824 249 1239 -1024 -1608 883
1192 883 -420 -2209 70 1183 -1137 -225 1867 1550 38 949 1488 191 152 410 -180 -434 -794 -516
1210 -516 -444 -863 -1907 -970 55 -1000 -1085 1251 672 -272 1639 2244 274 -117 1747 592 -1622 157
1228 157 1072 -1074 -1410 259 -250 -1569 -563 193 -597 -1008 232 409 19 -346 563 1048 437 -95
1246 -95 380 766 -8 317 1077 282 -679 499 878 -824 -1743 409 -342 -2022 -899 650 -356 -335
1264c35J488l46j047R95J246r63j156O03K51n37j163P80mj005o37J462k0j009
1282a397Q88J376o22l62J210P60j647m38J695m73j536O63N51j332n40J373Q4j677
1300a424L19J629o39j017J026J294j560m83J816L5j298J39K028j373j414J787
1316H65J025j966q32J290L27j748mJ153m01j291O30J272n12r25J595P53j008l18
1334i5K002k42j931M02J315j392j392J552n7j813m9J985p03j235J370J091r77
1351a69j38J181L99j234R7J310p45j116L45J305j224r64O75J354j146j075J364
1368B19K48j961R94R08r61r07J812N36j428J45J891l63j536P46J390j577n66P97
1386C87N32k032K06J285p01j391P04J343p86p29J557Q23r13j88J275m24r26K48
$$ plain form
1264 -335 1153 807 -240 755 2001 1038 -118 485 736 199 -964 -184 -188 -1193 -1830 -368 -388 -1397
1282 -1397 -509 867 245 -117 1093 1853 206 -232 1463 990 -546 117 668 -664 -1204 169 253 -1424
1300 -1424 -1105 524 -115 -1132 -106 1188 -372 -855 961 996 -302 -163 1865 492 -922 865
1316 865 1890 -76 -908 382 709 -1039 -1043 110 -291 -1582 -952 320 -192 -1117 478 1231 223 -95
1334 -95 1907 1665 -266 136 1451 59 -1333 219 162 -1651 -1700 285 -418 -1653 -283 808 -169
1351 -169 -307 874 1273 39 136 1446 701 -415 -70 1235 11 -953 -278 1076 -70 -1145 219
1368 219 467 -1494 -500 408 -553 -1460 352 888 -540 -395 1496 1133 -403 343 1733 156 -410 387
1386 387 919 -1113 -907 378 -323 -1714 -1010 333 -453 -1182 375 1198 285 97 1372 948 22 270
1404B70R54r91j524J125N72j311l52J394O2j187L01J205p67p62J496O92j440k55
1422e18J521Nj321L28J080r30n84J065l87p50j39O69l5j228L50Q22k05r13J156
1441a4M29m25l68J284L78j370L54J566q68k087J320Q60k059k00J555o76j365J617
1459f9K27r80j5J417Q5n13L52K84Rk40l29K41J6o44j20R02o22j400J463L15j354
1480i75j55J592m24j307J421J131k173L72K063o75j655J647M07j367J8J168j063
1497B5p12L79M33q75l82L22N85K01r75M4J277J72j281J221J079j455L0J810r66
1516I32k133J662J042k543j51J681m74j622J468N18j346K33J365m98p80Q88M97
1533G39q5o0m49K68J41k33o35M91j41r36J043N24j593k00J955p31j984J426J332
$$ plain form
1404 270 1224 233 -1291 -166 406 -905 -1257 137 199 -988 -687 518 -249 -1011 485 1177 -263 -518
1422 -518 1003 1008 -313 15 1095 165 -419 646 259 -491 -630 39 4 -1224 -874 -52 -257 -1170 -14
1441 -14 415 -10 -378 906 1284 -86 268 1834 966 -1121 199 1059 -1000 -1200 355 -321 -1686 -69
1459 -69 158 -822 -837 580 665 152 504 788 797 557 228 469 485 -159 -279 623 1 -1399 64 379 -975
1480 -975 -1130 462 38 -1269 152 1283 -890 -518 1545 870 -785 862 1269 -98 -80 1088 25
1497 25 -687 -308 125 -750 -1132 -810 -225 -24 -999 -955 322 494 -787 434 1513 58 88 1898 932
1516 932 -1201 461 1503 -1040 -1191 490 16 -1606 -138 380 -966 -733 632 134 -646 242 739
1533 739 654 594 145 413 554 321 -314 177 36 -900 143 667 -926 -1126 829 98 -1886 -460 872
1552H72j488l77K322r36j343J757O76j680j80J274n16r35L72L72o07j40M48n26
1570f35K04o24N67O45m49j97P34J610j435q29J863m67j498N67J025j328q15J841
1588G79l69j795O71J306j241k94J183n24k26P31J33j14k67Q82l71k42L7n15O25
1607C89K59p21k70R50q09o50R88l60j371J390R47j378n53J999J76j544Q35R30
1625A207r68n79J609q88p30M68N93q96m68J63%L9n91M53J78P79n32K49O36m38
1645B84q77J502j52j124J32J045n61q11P30m4j043K33J018p04p77J334m7n19N6
1664c25N38K36o38N52J32k45Q7j92r4M51o49J43L56m86n50Q6M46o28J48Q14k93
1685a11n65P85N78p69j23J245k39p51L80M86p38n4L10m31n45K66j5k36k42J92
$$ plain form
1552 872 -616 -993 1329 393 -950 807 1483 -197 -377 897 381 -554 -182 190 -417 -557 -109 -635
1570 -635 -431 -1055 -488 157 -292 -489 245 1855 420 -409 1454 987 -511 56 1081 -247 -1062 779
1588 779 410 -1385 -714 592 -649 -943 240 -284 -510 221 354 240 -27 855 484 242 279 -236 389
1607 389 648 -73 -343 607 -202 -852 136 -224 -1595 -205 742 -636 -1189 810 986 -558 277 1207
1625 1207 239 -340 1269 381 -349 119 712 -184 -652 -489 -489 -450 -1041 -588 -410 369 -163 86 722 284
1645 284 -593 909 757 -367 -235 810 249 -562 168 124 -919 -686 332 -372 -1149 185 138 -381 -325
1664 -325 213 449 -189 363 495 250 337 145 51 502 -147 -4 352 -134 -684 -598 -152 -780 -632 182 -111
1685 -111 -676 109 687 -82 -205 1040 801 50 430 916 178 124 434 3 -542 -276 -291 -527 -769 -577
1705e77N21j16N5J67L64j51k13J17O76p24k40O62k63n24K02N37q53n3O78o13k37
1726e85M68L00o03j04N25K62l44L66r3K54k97J35j9N2j78j32L48j82m38j84O37
1747A88q54J02L32K14k89L9J24n0K34O21k89l07J39N96o77j80K45j71j98k20q2
1768d83J66j26O1J19p6k25N54J3J01k92J32N21k64L4M57k42o48M78J54l82l95
1789c43L38Q8m34N6K06j72k42L93q1J27n3n0M74j18k37L78L21l90m55N60l29n49
1811e12L29J37k11k37K78l39j17O98j93K24l46N59J11LN6k1m24jJ25O2o9l41j03
1834c32L95j75m99O52l54j10K55K07P9k38P25j89p05O57L5Lk48J31M57o71l60
1855b85K4K43j30l86J88L37l96l69O93K21n44L41L31J05o50N96P69q60j16K92
$$ plain form
1705 -577 -56 -172 -117 50 414 263 50 167 843 119 -121 541 278 -246 -44 493 -360 -413 265 -348 -585
1726 -585 -117 183 -420 -524 1 263 -81 285 192 446 149 284 265 317 139 7 355 173 -265 -449 188
1747 188 -666 -564 -232 -18 -307 -268 -144 -194 40 661 372 65 204 800 123 -57 188 17 -181 -401 -483
1768 -483 -317 -443 -382 -263 -339 -564 -10 3 104 -188 -56 465 201 235 692 450 -198 280 434 52 -343
1789 -343 -5 83 -351 -295 -89 -261 -503 -110 -191 -64 -117 -167 307 189 -48 330 651 261 -194 366 37 -512
1811 -512 -183 -46 -257 -494 -216 -555 -672 26 -167 57 -289 270 381 384 440 419 -5 -6 119 181 112 -229 -332
1834 -332 63 -112 -611 41 -313 -423 -168 39 118 -120 605 416 -289 368 403 406 158 289 746 75 -285
1855 -285 -261 -18 -148 -534 -346 -9 -405 -774 -81 140 -404 -63 268 373 -277 319 1088 228 112 404
1875D04N4n04k30O98r00k56N48j52k1M5K04M4J15K50l27K06R4q1K11l30k63O03
1897D12Q0l99m28P48o39l59M91M54o24l31N49M27o96L72N02o50J3L07K10n60K86
1918A65L85m76j71O5L43l33l84K01K30k75N5K1K78k81k71P31K92m93J83Q92o82
1939D75n40N87j9r46N62M12q97LK82j14l87L68M51m15q8M85K21k51j0j82K74J89
1961D60k06L1r0k9m96P23j18r56K87Q25o42p36O95M93j255Q59P08p83K42O11j2
1982F11n64L1M86m99L0J79m0k67j0k54PK43n36J47L12j02m82P91N71r29P4R59
2004G58n78k82Q17k84o57R7O23j021m1N23m8m73L6L01J2k8N52k65k12O10l49j5
2026G6K05l28j18O41l59k53L85L9p78K95N96l56o97Q13K76j212O47N36k54o50
$$ plain form
1875 404 458 -46 -276 422 -478 -734 -186 -338 -359 -314 -110 -66 49 299 -28 178 272 191 402 72 -191 412
1897 412 492 93 -335 413 -226 -585 -94 360 -264 -595 -46 381 -315 57 559 -91 -78 229 439 -121 165
1918 165 550 74 -97 -32 311 -22 -406 -205 25 -250 -195 -174 104 -177 -448 283 575 82 265 1157 475
1939 475 -65 522 503 -443 119 531 -366 -363 -81 -195 -582 -214 237 -178 -266 219 440 189 179 -3 271 460
1961 460 254 285 195 166 -330 393 275 -681 -394 431 -211 -947 -252 241 -1014 -155 553 -230 12 623 611
1982 611 47 78 564 65 95 274 234 -33 -43 -297 -290 -47 -583 -436 -124 -226 -708 83 654 -275 -201 758
2004 758 180 -102 715 431 -226 -129 494 -527 -568 -45 -93 -566 -530 -229 -217 -245 307 42 -170 440 91 76
2026 76 281 -47 -165 476 117 -136 249 288 -490 -195 401 45 -652 161 437 -775 -128 408 154 -496
2046d96P68N64q48M70K73m12p89P06N4n14J71j70j33K13m18M01j0Rl30N03L01
2067C13m29k46J079o43o63Q80L20n91l4L56m65m74O22k6m84M5K77J5l09L78L62
2088B83m83K06J3M38l19p3M98m24q1P3J86mn11L6L38l97k59R2K46j11k66N48J45
2111A74o68L54P54j65p50R14No54Q4N21p76j19O53k12o22K98K12j68k12j44N19
2132bj92o1J14N65l95l55O77L63j061J20K36M24o06k24O05l68m81O70k4n28M72
2153e1L38o70j82L09O00k39J83R8k23p0O37o48K44l29j7K78l62j98j4O98n03m70
2175e91M84L58n60K67M44j56m40N79J42n99n6O28l59l55L25l3n94M80K62l20j21
2196b15n2K39j00k49j28N63J20m6K03l2j51l87M53J09n06L4K59l12j79P69k82
$$ plain form
2046 -496 272 836 -12 458 731 319 -470 236 290 -224 -53 -223 -356 -143 -561 -160 -170 -161 -491 12 313
2067 313 -116 -362 717 74 -589 291 611 20 -14 342 -123 -597 25 -1 -485 -440 -163 -148 -457 -79 283
2088 283 -200 6 19 457 138 65 563 139 58 131 317 313 -198 -162 176 -221 -480 -388 -142 -253 -519 29 174
2111 174 -494 -140 614 449 -301 613 618 -36 48 569 -207 -326 327 115 -507 -209 3 -165 -377 -521 -2
2132 -2 -194 -255 -141 424 29 -326 351 714 -347 -227 9 433 -173 -397 208 -160 -641 29 5 -523 -51
2153 -51 287 -383 -565 -256 344 105 288 386 163 93 730 82 326 -3 -20 258 -104 -302 -316 382 -121 -591
2175 -591 -107 251 -309 -42 402 246 -194 385 527 -72 -128 500 141 -214 111 78 -516 -36 226 -94 -215
2196 -215 -267 -28 -128 -377 -505 58 178 132 335 303 152 -235 218 327 -179 -145 114 -198 -377 392 110
2217A10o31L64L91p24k10N70N59n02m6K62Q9P6k08N49j97m70L5k69M35m06K88
2238F5J87m64k43N26q0l85KO10l42MK82N15l33r9K96k31m90K16J20j29j67Q0M5
2261a5j96J34J83k2l50K82j11N7p3M6L57j92J58P4j4j04k9o6K7k44K69k98k43
2284c70M09rk39J00l59M98N6k77M0K24O1Oj5Q0j43P0J11q7n02K37n4k75J81K02
2308e5O7k23K85Q8J04n52K33L62M4k98J26J51m01j29K17J97o47L95K15j99n27
2329e47N20R9k75J63q6n2O1M00N9l23p0L24l56J35O0K44m5l97O1l8m9P3j59J56
2353d2J73m01M43L7j68LJ66n5P8m22O61m00j87J32L19o26rK92m29M0N94l52k15
2376c68L69o2M1m6J34L22l47j4M29j69l30L22j81J12l03j31L79m68K25k72M69
$$ plain form
2217 110 -521 -157 234 -490 -700 -130 429 -73 -119 143 232 308 100 649 452 -18 17 -252 183 -223 65
2238 65 252 -212 -455 71 -9 -394 -392 218 -124 -120 162 677 344 245 541 310 -180 36 156 27 -140 -60 -15
2261 -15 -211 -77 106 84 -266 16 -95 -38 -111 -65 292 100 258 332 318 214 185 119 146 -98 171 -127 -370
2284 -370 39 30 -209 -109 -468 30 86 -191 -151 73 134 140 125 205 62 132 243 156 -346 -109 -163 -438 -257 -55
2308 -55 12 -211 74 162 266 -286 -53 309 353 55 181 332 -69 -198 19 216 -431 -36 179 -20 -547
2329 -547 -27 72 -203 -40 -126 -178 -117 283 342 19 -51 273 -83 52 112 356 311 -86 -25 -63 -112 -39 -198 -42
2353 -42 131 -270 173 210 42 45 211 156 234 -188 473 73 -114 18 337 -289 -298 -6 -435 -395 199 -153 -368
2376 -368 1 -61 -20 -66 68 390 43 29 458 289 -41 281 100 212 -91 -222 157 -311 -86 -358 111
2397A11l64P7K3J17l01N39K34m31K80%j55m31P13k59R5k89pJ16Mk47J5K2j40j
2421b79o2K33J54j52K71L6k41L50j33k43Q6N42m17j56J5n2K0k94K17k0k10J35
2443b00K36j57J21L7L5J2J79j84K22J03k18J57k13K20m38M3j89n8K69j02j83J0
2465b98L31Rj53K12K99n15o6L03mk64j1Q3N48n30M6K78m99L52k25j35J30j56K26
2488c9k18J43J64k29J98jr1K39j74J4rm9j70K56Q3o9l98M22r7k95J07M0J50k4
2512d7k00K89p6O1N4j05K54j78P2J34Jl74J90k9k8j33L91l50k01Q6M28n04o6O17
2536B86k25J22l94K99j60K04j87K89P0j39j79J2j07p3K89j89k46J62kR6K88J21
2558C37l08k21K81n8k7K34k68L05l75L08N9J32k70k34J31k36jJ17l1R5r9K78l56
$$ plain form
2397 111 -253 -176 -153 -36 -337 202 436 5 285 285 130 -301 412 153 248 -41 -48 68 72 -175 -160 -138 -278 -279
2421 -279 -341 -108 46 -106 165 201 -40 310 177 -66 20 562 145 -11 4 -48 -28 -322 -105 -125 -335 -200
2443 -200 36 -121 0 37 72 84 263 79 301 404 186 343 130 350 -88 -45 -234 -292 -23 -125 -308 -298
2465 -298 33 42 -111 101 400 -115 -181 122 118 -146 -157 -74 474 -56 -10 268 -231 121 -104 -239 -109 -265 -39
2488 -39 -257 -114 50 -179 19 18 -73 166 -8 6 -3 -52 -222 34 117 48 -350 72 -25 -320 -213 -173 -23 -47
2512 -47 -247 42 -34 27 81 -24 230 52 124 258 259 -115 75 46 18 -115 276 -74 -275 -189 239 -265 -331 286
2536 286 61 183 -211 88 -72 132 -55 234 304 165 -14 -2 -109 -182 107 -82 -328 -166 -168 -72 216 337
2558 337 29 -192 89 31 4 238 -30 275 -100 208 267 399 129 -105 26 -210 -211 -94 -125 -30 -129 149 -207
2581b07J20J18j4N8k25K02J34j35l9O6K63l42j23l43N07l77J87M15k04l90L07
2602b2R3j2n54N48pO7L21m21N3k15M36j25k09K09j03m63M04l83L20M9N0J76j12
2625A00L11j47Q4m14N3J16o7R9k53K37M1j44j63j12N28p23M58J97j92k28K73R7
2647A51m86K10J12J68l25J16J13R8m2k25K63j05K1r0M69p95K32L3L58l57J61R7
2669A77k37N3L6j13J47j21L99m62R7K14p9k05K26m4q9Q2l63L39j88P7O9k08J19
2692g4O2QK08j96k52K21P5r9K41k68K59n6K25l61j5j31Oj25K79k57K63m69K60
2715a96K27k58M7L12L47n22R4R0j57K44j71q3N1j44N5j5J64j46j0J22m4j38n1
2738a82qL37j49J49m8j40M42k37l9k66J11R5l88J04Q3J40j61K35l2l12L75j10
$$ plain form
2581 -207 -87 31 17 75 -150 52 186 51 12 78 341 -1 -124 -467 40 -337 -150 265 61 -329 -22
2602 -22 71 59 -495 53 46 113 434 13 66 -149 287 162 -47 162 59 -404 0 -383 -63 -14 36 212 100
2625 100 411 264 348 -66 -13 103 36 135 -118 119 160 16 -147 -259 269 -454 4 201 9 -219 54 151
2647 151 -335 -125 -13 155 -170 -54 59 157 115 -110 153 48 69 -21 448 -347 -115 -82 276 -81 80 177
2669 177 -60 -7 29 -84 63 -58 341 -121 -24 190 111 -94 132 88 -1 81 -282 57 -131 -54 15 -193 -74
2692 -74 -12 -4 204 8 -244 -23 52 -47 194 -74 185 129 354 -7 -22 -153 -147 -272 7 -250 13 -456 -196
2715 -196 31 -227 -180 132 479 -43 51 141 -16 228 57 -26 25 -119 -64 -79 85 -61 -71 51 7 -131 -182
2738 -182 -190 147 -2 147 99 -41 401 164 125 -141 -30 65 -323 -219 -136 4 -157 78 46 -266 109 -1
2760aJ91n9j50J12k6q3R1K94k67j55j14K16m7N3k1k3j72M0K76l39o8L51j63L5
2784b9k47L28j15j61N01p1m83K13J04K61m82j86P71n74L19l05K11j24m5LlJ7M8
2807d9j25n1K54j13L66k21J55k70J52J05m63K11j06n7L18k38Mo5M35l40J16Q8
2829A06K15l02N28k89m23L67l63J00J62M3Qk45Q0k07M91j49j51%K15k06J01q3
2851bJ33m41L82J54o5J22k86J52J5k1l10O53m40l6j38KP4q9k59M30J80l04M0j43
2875a97J72L98k85J51m52N10j96k60K14k90K66J64j48j25L5qk9K1j04K88j26K06
2897B05p0K77l14M2j77J40o7k74K41j69K02J81m69J80K42n9k02P4p8J03p8N8K48
2920B36j11k30OK33r0J13j18l8k4J42k46l7k00J48K5k5LJ11K79m3k05j56J96l2
$$ plain form
2760 -1 190 131 -19 93 67 -16 75 369 102 -53 -167 49 2 55 34 11 -161 -121 155 -184 -252 99 -64 -29
2784 -29 -276 52 -63 -224 277 206 -277 -64 40 301 -181 -367 404 -170 149 -156 55 -69 -114 -111 -114 -97 -49
2807 -49 -174 -225 29 -84 282 61 216 -54 98 203 -260 -49 -155 -212 106 -132 -128 -193 242 -98 18 106
2829 106 321 19 547 258 -165 202 -161 -61 101 144 152 -93 -13 -220 271 122 -29 -29 186 -20 81 -2
2851 -2 131 -310 72 226 161 283 -3 149 164 143 -167 486 46 10 -128 -126 -52 -141 -400 30 210 -94 -54 -197
2875 -197 -25 373 88 239 -213 297 101 -159 55 -235 31 195 47 -78 -43 -51 -80 -59 -163 125 -1 205
2897 205 135 412 98 140 -37 103 36 -238 3 -166 36 217 -252 -72 170 111 -91 -17 -95 8 -70 -12 236
2920 236 125 -105 -99 134 44 157 39 1 -23 119 -127 -164 -364 -216 -191 -216 -213 -102 177 134 -71 -227 -31 -63
2944f3J03j62L14j24M0j32J26l52K34J8J2K3j66J55l4L8k57K40k6k48J90K89k18
2967@K51j81J45j32L94n26Q2J86j76K8j17r3K44k67R6M1k9K38l36K96k69P1J86
2990A32j39J26j92O9l2j25p3L58N2l56kL70l67J30K08l35M13k80p2L48j59O7J68
3013C09k39o8N5r0K18k32M4K7k68Q1K08R7j14l4k32K23j2q3M5N9K2l2K71j47K5
3038A33N7M3k36L68k49j33J3q7j8K07k91K52l68M25n2l40L41J04J08l92K08k35
3060a42L92k55k0K48k75k1m03M01J42j12q4J24M1j33P9J8m4P2K6j93J22k9J48
3083A02j28l1L50m79J48N1j38n0K46Q8k39K72l7k64L55o5R2l88J53J81m31K47
3105C5n9J13j49NJ3k22M20nq9j82K02mm11J09N24k30O8j34K22j22p2j07K74l03
$$ plain form
2944 -63 40 -122 192 68 108 -24 102 -250 -16 2 14 37 -129 26 -8 30 -227 13 -13 -261 -71 218 0
2967 0 251 70 215 83 477 -49 33 219 43 71 -46 -139 105 -162 -66 -25 -54 184 -152 144 -125 -54 132
2990 132 -7 119 -73 -4 -36 -161 -234 124 176 -180 -182 188 -179 -49 159 -176 237 -43 -115 233 74 141 309
3013 309 70 2 57 -33 185 -47 -3 24 -244 -163 45 142 28 -6 -238 -15 -27 -110 -65 -6 16 -16 255 108 133
3038 133 190 233 -3 365 116 -17 -4 -91 -109 98 -193 59 -309 116 64 -276 65 169 277 -115 93 -142
3060 -142 250 -5 -25 223 -52 -73 -476 -75 67 -45 -129 -5 36 -97 -18 0 -44 28 54 -139 -17 -46 102
3083 102 -26 -57 293 -186 -38 13 -125 -175 71 159 -80 192 155 -109 246 181 273 -115 38 219 -212 35
3105 35 -24 89 -60 -55 -42 -264 156 151 62 -120 82 78 -333 -224 300 70 138 4 226 104 32 -75 199 -104
3129a04k27L33l03R1q1M54k17j28o8p6M21j96L19j13O6l64K92J63k03J53j25j3
3151G4j35k76N13N2k84O6K1j57J53K24k84o7j33o3Q92m63N7k7n9k29J13O8O4k61
3175a41Q4J09k53J47j31K65J01j99K7J4k85K35L89m64L35j24n7J88k20l1k63K69
3197eM33m57J92k5k6k54j74K50j22J53p5K68k27rK85l45K13j41o5J2P1l7r8M1
3221a42J05R9r8J31r4J31O0k10j75M2K31m4Nl22K89j19l9O21n11m0J89j79M7L04
3245B81k15L6j6j92j46N7K70nk2Nj53L15r4j96J05J55j84O5J61j65J33j4k51k0
3269i0L62m14Q8K6P6k1k27K31J13k88JJ15L0j10j33K76J07l52J86rL07l84K74
3292A64k94k8L46p2R0l32P2Q6J47q5LJ22l67J04J31Q9k42L64k77k09K76k29J60
$$ plain form
3129 -104 -331 2 -301 -210 -291 163 -54 -182 -250 -326 95 -101 218 105 171 -193 99 262 59 212 87 74
3151 74 -61 -337 176 228 -56 10 31 -126 27 251 -33 -100 -233 -296 596 133 190 163 104 -125 -12 56 120 -141
3175 -141 -57 52 -201 -54 -185 80 181 -18 9 23 -262 -27 362 -102 233 109 52 240 20 -11 -274 -5
3197 -5 428 -29 163 138 112 -142 -316 -66 -188 -35 -110 158 -69 -78 207 -138 75 -66 -131 -119 -48 -85 -183 -142
3221 -142 -37 62 -36 95 1 132 192 -18 -193 -151 80 36 41 -281 8 -111 -150 471 -40 -80 109 -70 -23 281
3245 281 66 102 86 -106 -252 -195 75 70 48 53 -100 215 121 -75 30 185 1 66 227 62 195 181 -70 -90
3269 -90 272 -142 -54 -28 48 27 -200 31 144 -144 -143 -28 2 -108 -241 35 142 -210 -24 -33 274 -110 164
3292 164 -130 -158 188 116 206 -126 -54 32 179 94 97 219 -148 -44 87 176 -66 298 21 -188 88 -141 19
3315A9J88j84k30L14j51P7k33N23k98j63K04J22o9j44k2J76jj39K73j12L7K01
3337C88o59J5K40M2o5m0L04m00P1O3O3k85J58L27j02k41K23j64J35k50J89n0k0
3360e8j34K28Q6j86J01%N3n8k58L98K06n21K54K30j92m97L30J24j38J08j88o5
3382a77M21k91j24K79j32o4J23J25l4k93J54J63q7J3M5m74L03j9O7j74K70k5k58
3405a89P7n6O8K1K4OO9k3R3M9k83M30m44K08l20J06p8K40m39K64O51m71J05j39
3429c1J7j7o2q7L24j75k5J22J80r38R13m39J69p7K67o0K6J90m73L97n08l2K42
3452g7J18M5r4l2K50k07m2j39J2K99R9n8J33m34J22o3K72p6k0j39r1Q3L3p2m6
3477a24K88j49J06J72j59k66oJ97N5l73K59P3k46J48n7J33k40L19j24J11k47K76
$$ plain form
3315 19 207 23 -207 107 -44 33 -200 323 25 -138 66 188 119 -25 -47 129 128 -11 262 150 187 388
3337 388 -271 -256 -16 26 -39 -79 225 -175 -104 -41 22 -263 -105 222 120 -121 102 -62 73 -177 12 -38 -58
3360 -58 -192 36 122 -64 37 37 90 32 -226 172 378 -143 111 341 149 -348 -18 106 -32 76 -112 -177
3382 -177 244 -47 -171 108 -24 -88 35 160 126 -167 -13 150 63 76 121 -353 -50 -69 -2 -176 94 69 -189
3405 -189 -112 -168 -100 -79 -55 -49 20 -3 90 139 -144 286 -158 50 -270 -164 -242 -2 -441 -177 474 3 108 -31
3429 -31 -14 -31 -93 -180 144 -31 -56 66 246 -692 221 -218 -49 -126 141 81 107 297 -176 221 -287 -319 -77
3452 -77 41 86 -8 -40 210 3 -39 -178 -166 133 232 174 307 -127 -5 -68 204 128 108 -31 -122 -39 -6 -78 -124
3477 -124 164 15 121 293 134 -132 -138 59 114 -259 0 73 -173 -25 -82 51 -189 130 6 117 -130 146
3499A46Jk4j1L12k87j23J64k37N8P2k17m0K45j91J09Q6j24m9j19L13K8l8J12L7
3523B23j02N4m05K73O4j93J58J3j78N1J77m15L57q1l8j50L1j93L85j09OK31l13
3546a54J34J19l36J37l7R4j46N1K53j20j13Q1j51L18j97j78K8J3K07k3r1N05l74
3569B0m0j80M99K7l75K86j57M8k75J85k14j3M13k09k47M35j90J17L4m38J89J45
3591F0k50R0n1m9K88m57K41Q7%q2j27K1N5K74k36O2J95m72J79K13J43m04L5K46
3615F1J39j96O9j11k04Q6j55N17m47L07m6j65J58P4j12M6j87M55m6l15k7rpj51
3639b66J67J64l87N55k91m0q1pK53J31l03J39J42k65K14l10K98k6l55L83j83k75
3661c43K56j6m9J81R9l54K93n0o7J39k46L7K74m57N50n82N60J43k71j12j19L83
$$ plain form
3499 146 147 123 112 424 137 14 178 -59 -1 71 -146 -186 59 -132 -23 63 -61 -110 -229 84 112 74 186 223
3523 223 121 175 -230 43 107 -86 72 85 -93 -42 135 -280 77 -4 -42 -192 -161 -354 31 -78 -72 159 -154
3546 -154 -20 99 -237 -100 -137 -43 -189 -138 115 -5 -118 -37 -188 130 -67 -245 -217 -204 3 -20 -111 394 20
3569 20 -20 -200 299 326 -49 237 80 128 -147 38 -176 -189 224 15 -232 203 13 130 164 -274 -85 60
3591 60 -190 -100 -151 -200 88 -369 -128 -41 -41 -123 -250 -229 -174 100 -136 -74 121 -351 -172 41 184 -220 -185 61
3615 61 200 4 73 -38 -242 -156 -311 206 -241 66 20 -145 13 87 -25 21 -166 289 243 -72 -99 -108 -115 -266
3639 -266 -99 65 -322 233 -58 -98 -179 -186 67 198 -105 34 176 -89 125 -185 113 87 -268 115 -68 -343
3661 -343 -87 -103 -152 29 128 -226 67 17 -50 89 -157 -120 154 -303 247 -335 225 368 97 -15 -134 249
3683B49j04k5j26l15L49K37m1j19o04K93NK21K99m96P0K60k22k8L53k75j3K90
3705B58J55l96Q9R5l06K70l24l09N72j34k00K97l15N57j52j26l8K46l96J17j26
3726a66R5k4O6j70N21k97L00k84K0j81K99J40j76j23k25M18j92K59m34J38j78
3747a94K07p9j85L88j12q2k39L65k47K95jj67L1k18K57j45K05J27j09k54J88N4
3769H5l7J99K6m25J33L3Rr7J76k17m2O3k5L27m43j27K16K01K93l59k6K46j15m6
3793D8N3j40j50Kq8K73l1j09j97L84O0j24n9M1j24L09m8J71k90J11J48j79l24
3816b63n5L53J6j25j0j2K67l06L35l56L00J32j27m04K40J7M3J83O5j89k78o1K31
3839dj06j2K13l32J64P9L23n91K47O4L4n0M2K5K12Jm60P1r2J92K43j75j2j64N1
$$ plain form
3683 249 145 120 -6 -321 28 265 224 105 -499 -206 -201 20 319 -177 -107 153 -69 -97 256 -19 -32 258
3705 258 413 17 106 201 -105 165 -159 -468 104 -30 -230 67 -248 309 157 31 -7 239 -157 -40 -166
3726 -166 -71 -95 -29 -199 322 25 325 41 61 -120 179 319 143 20 -205 213 21 280 -154 -16 -194
3747 -194 13 -66 -251 137 25 -57 -296 69 -178 117 116 -51 -20 -238 19 -126 79 206 97 -157 31 85
3769 85 48 247 273 -152 -19 14 23 -74 102 -115 -157 -94 -119 208 -235 -362 -146 55 348 -11 -37 209 94 48
3793 48 101 -39 -189 -187 -275 -2 -33 -142 -339 45 105 -19 -78 -37 -161 148 100 271 -19 92 240 61 -263
3816 -263 -318 35 51 -74 -84 -96 171 -135 200 -156 144 276 149 -255 -15 2 45 228 293 104 -174 -235 -4
3839 -4 -110 -122 91 -241 -77 2 325 -266 -19 45 79 29 71 96 308 309 -151 -80 -172 20 263 88 76 -88 -37
3864c7p5j86J31K58m4l6r2K02j99J64j59J81k63n2N85l26K03o4j53J40o7J97k53
3887E5l78K89k93M10j04o1J95k38Q1j76KM51j44K6QK00m37K18q6Nj65n1R4k4M64
3912C41m55K07J2k24J15J57L0j50j97K42j3P8k08k3p8NO4J04j06j08J89k38K85
3935B9k20J28j19K2J45j4j00K76P1j50j08j9k45L37r6K5j49K30n20K65K31J36
3957A55n05L60K57L8k45j7j31mk8J30m30L67j34J94j16LK01k56M61j93j84kj8
3980i7K85q8k48J73K7r0j6L8m06K77O9J65l67M07j54L72l47K59j37j66K20q9j92
4003a05R9N0j85Qm6J52q2M05l52j87N02j80j22K17l00K03L0l07L88m33J63p1L80
4026B27m89J83J01J43L3J42l93m7K54k02MJ40J43k60J63k78K8k47N4L91Q5o2j32
$$ plain form
3864 -37 -112 -298 -167 91 47 11 -81 121 -78 86 -73 108 -155 -207 378 52 255 191 38 178 111 308 55
3887 55 -323 -34 -327 83 -21 -82 113 -125 -44 -220 -218 233 89 115 123 323 -114 104 18 23 -142 -193 -99 -123 341
3912 341 -114 93 105 -119 -4 153 183 33 -164 78 65 143 -65 -88 -166 -161 -97 7 -99 -207 -18 -256 29
3935 29 -191 -63 -182 -160 -15 -29 -129 147 218 68 -40 -59 -304 33 -63 -38 -187 43 -477 -212 19 155
3957 155 -350 10 267 305 60 43 -88 -92 -120 10 -420 -53 -187 7 -109 -106 95 -161 300 107 -77 -79 -97
3980 -97 188 100 -148 25 52 -38 -54 -16 -422 -145 -76 89 -278 129 -25 347 0 259 122 -44 176 87 -105
4003 -105 -6 44 -141 -133 -179 -27 -109 296 -56 -243 259 79 -43 174 -126 77 107 -200 188 -245 -82 -153 227
4026 227 -262 -79 22 165 198 340 -53 -100 154 -48 -44 96 239 -21 142 -136 -108 -355 -301 90 175 113 -19
4049a9K44j94o0K06l29K85n1J17j07N3j49P4k1Pj04n5MM8l3J1K18j6n2m11L48
4074A4m06Q3M24J80j67j44r3O5K39kq6k0q6l3J57j63K63l17J45LJ22j44j8p8R0
4099B8J31o8R8j53N0o6N8k9J31j2k34K11k96L9q3L35Rn5k15K23j45J74l4l7J79
4124B39j71J13L1j15j7k30J69K4m7P7J24Q7l94J53o4M4N0J17l87J04k53N22k4
4147A52j60n5J11K41j03N5k28l65M27l11J81k84K01J45k80J00j22J74J98j44l3
4168a00N60m09n9Q5q8j90J90j4K03k50K81l20J20Rl95N77m17J75j1J03j24K60
4190A86K07k54k95K61l04K54m5M8k87k2J91j45J30j33J46oj29L08j31NO2J86m52
4213b19K70J05nk29K4m9l9M23n56J30l05L53L17k02O3k98P8J81j30j46N0M52K1
$$ plain form
4049 -19 225 31 -29 177 -152 133 82 199 92 145 -4 70 49 56 -48 -103 -99 -51 -84 -73 145 129 77 -334 14
4074 14 -392 -309 115 295 128 -16 -109 -44 195 193 107 87 1 -32 125 -38 225 -92 53 56 178 34 16 -62 28
4099 28 159 91 189 36 86 20 78 49 180 168 -66 145 -151 -112 -195 140 149 94 -121 102 -43 131 97 60 239
4124 239 68 181 212 97 80 -150 19 43 -4 73 197 284 -110 43 -21 23 73 190 -197 -93 -346 176 152
4147 152 -8 -63 48 289 186 241 13 -352 75 -236 -55 -339 -138 7 -273 -173 -295 -121 77 -67 -100
4168 -100 460 51 -8 77 -11 -201 -11 -25 178 -72 209 -111 9 18 -377 200 -217 -42 -53 50 -74 186
4190 186 393 139 -156 105 -199 55 10 58 -229 -251 -60 -205 -75 -208 -62 -68 -197 111 -20 -15 47 233 -219
4213 -219 51 156 151 -78 -54 -103 -142 281 -275 -145 -450 -97 220 18 81 -217 -139 42 -88 -234 -184 268 289
4236B89n94M34k04J66q0l73J88Q9q0M07j18l8J12m24K61K2k42L43J4j05j29K66
4258B04j36k43L13%l28J49n4Mj14M53l73P4j88L39m09K90Q0j37j19J62K3m2J62
4281A10k70J64o4K87m41K12j11J50n2l51N92m57K03j34j1L94k83J60o2R1l3k7
4303F7O1j56L19m33J25L0J5p7J96K40n13J06N0J46p7k7P9k98K65l80L09J17lj74
4327a3q8P5M6J05l3p5J0k09J40K76k90q6n5N5k13K34K15K09k22j43J92k70R3L66
4351C19k49K40k71j98K07J01l71M19n52M66j44l83L32L19m0m75N88O1o36L45K5
4372A03j36k87L48l08J5K84j86P5j27L48N3L6j39K6k28L84j31j66k5l1R6m5J29
4395H8J41k77j28R9K9L14j35J7O3r2P4j71p4J9j29m0N35n84M34l05N7K37k95N5
$$ plain form
4236 289 -305 129 -75 91 11 -362 -174 -85 -165 242 124 86 198 -226 35 57 -185 158 172 67 -62 204
4258 204 68 -175 138 138 -190 -41 -95 -91 -205 248 -125 -51 -239 100 -309 -19 61 -76 -195 -33 -10 -52 110
4281 110 -160 4 -60 227 -214 -2 -113 37 -15 -366 226 -231 -28 -162 -173 221 -62 98 36 127 94 67
4303 67 128 -28 291 -142 -17 13 28 -49 147 387 -126 -20 30 176 99 72 151 -147 118 -262 47 164 161 -13
4327 -13 -101 -26 20 125 92 17 27 -182 -42 234 -56 -142 -197 -142 -355 -121 94 303 81 -62 130 -140 -47 319
4351 319 70 310 39 -159 48 149 -222 197 -355 111 -33 -416 -84 235 195 -280 308 369 -267 78 103
4372 103 -33 -320 28 -280 -265 19 -167 -92 -219 129 182 218 79 105 -123 261 130 -36 -61 -92 4 -41 88
4395 88 229 -48 -176 -77 -48 266 131 148 211 119 193 22 -52 -33 -162 -202 333 -251 183 -122 -65 172 -123 -68
4419f8j4o0R3o2Q4P7Q5%j69L33m59K31p3Q7j07m8L71l8m11J89k3J81j75r9M8j10
4445a37K67j34k2k16J63K20N2j49N7j16L56k05j67m0N6L00l27K37k17L3l9J43
4467A15k7m88L46q2K9O4J9K15k7J7j60L12l44j9J05k69L85p6n4o1k43L16J50k46
4491b3k8J87k87j86L71p0J06j6j56oooM95n80L42P9Oj99J12l02Q3M11k50r3n9
4516g5M3K32k20J26j90L1nj06L46k8l16J02J32l39J14L25k94J47o2P6J69k21J23
4539A10j71K7K52j06j29k7J81l0l3j44K95j16k80M31j32k48J95j62q4n0j20L50
4561IL2j1j83L06l48J10m1R6K01m5q0j09l2J4J48J62k74N8o5j23J20j08J21KK8
4586a2k1K85p6k52J00l38K88J64L7l4j70K43k46O6r2j10P2J25L0l13K75M3K36
$$ plain form
4419 -68 -82 -142 -49 -111 -27 50 135 135 -34 299 -160 71 -2 85 -22 -70 301 263 -148 41 18 199 24 -75 -27 -137
4445 -137 130 -4 -26 -242 -79 141 193 44 101 -15 341 136 -31 -71 -15 285 -42 195 -22 11 -28 115
4467 115 88 -400 -54 -136 -107 -43 -24 191 164 181 21 333 -11 -30 75 -194 191 115 61 0 -243 73 223 -23
4491 -23 -51 136 -151 -337 34 -36 70 54 -102 -108 -114 -120 375 -205 137 216 222 23 135 -167 -84 327 77 -16 -75
4516 -75 -32 200 -20 106 -84 -53 -58 -164 182 154 -162 -60 72 -267 -153 172 -122 25 -37 39 208 -13 110
4539 110 -61 -34 218 112 -17 -44 137 107 74 -70 225 109 -171 260 128 -120 75 -87 -171 -221 -341 9
4561 9 41 30 -153 153 -195 -85 -126 -30 171 126 46 -63 -95 -81 67 229 -45 13 -52 -175 -55 -163 -42 -40 -12
4586 -12 -33 252 176 -76 24 -314 -26 138 175 141 -29 214 -32 34 -58 -168 -96 29 59 -254 21 64 300
4609C00Ll48j97K79p1K90o7j83j82j38K88j47J3Q0Lk48J72J32k13K77r1p3L18
4632A97l37Q2K43P9k61j60N9j33J21L01p4q5k67m9L95l3J41l09MJ40q5K1K31k83
4656f2j9q2K98l64K58j18k7Q4J55k57K16k7m4q7J35J46k85j96Q00n22k06L29k55
4679a30Q6R3Q4j82K09J84k52K78n47L08j90j02K28j17L22o84P87o72J54L16j05
4700F8l8k41M21m07J76J70j54m22O09j38k02J74j35J31q4K62j53m49M40N9j71
4721h4J61j8M2Q8p7l45J96J17M4J19k81%K47j47j65j8rr1j00M2M16P2m18L46j51
4746a4M05o4k70l19K95o2K21l48K13q6k07N53m05j6l8J86k86K71J3j40K37m67
4768c28M45Pq6k30K73m39N28l20J55P8l70J46Q4M7J76k52K04k86J72J76l3j45
$$ plain form
4609 300 303 -45 -242 37 -34 256 189 6 -176 -314 -26 -173 -160 -80 -77 -325 -153 -21 -234 43 -48 -121 197
4632 197 -140 -58 185 264 3 -157 -98 -231 -110 191 117 32 -235 -284 111 78 219 -90 -86 54 -31 -10 221 -62
4656 -62 -81 -163 135 -229 29 -89 -116 -32 123 -134 82 55 11 -76 59 205 -80 -276 524 2 -204 125 -130
4679 -130 -44 49 133 -49 160 344 92 370 -177 131 -59 -161 67 -50 272 -412 375 -297 -143 173 68
4700 68 30 -211 210 -197 -21 149 -5 -427 182 44 -158 16 -119 12 -72 190 37 -412 28 87 -84
4721 -84 77 59 101 189 112 -233 -37 80 124 243 -38 -38 209 62 -103 -121 -130 -221 -321 -279 137 209 -209 137 -14
4746 -14 391 327 57 -262 33 -29 192 -156 57 -29 -236 317 -88 -104 -142 44 -242 29 42 -98 139 -328
4768 -328 117 124 38 -192 81 -358 170 -150 5 83 -287 -141 -57 -10 166 -86 118 -168 4 180 147 2
4790BJ7m1q6j9L28k56q1J15k6J48m19L49o5P1k8M1L2j92L41j10j13j14O8J96r3
4815F5j29j5J31M5k98M42k36J68k58KJ5k42o9J39J47L08o87L74o4j0K29j1Q9J8
4839A53k82Q1J3p6J82l6j42L66m8q2m41J63J23k27K98j24K11k97J51j75m6k6m
4862b65L40j79P4l1K18m2R0j53L04j72j51j74M27j50j54k75K82J02J2L7L7l53
4884a76K54j3jK92m70L10k66r8L3J92Q3m63L11J1J29k85L50k55K91m10J25O6J82
4907A92o6j51l19M10k44J44j24R9R4P6j13j59L16j17K25l00k15O1K49R1k25J87
4929A11j77l03R4L31m85N04k01N9J85k26J8J11l08M41j72J73l01L16M5l23N1L35
4951B78l19k41k08N98P0l27M3K11l90P5N9K94mk39K07j40J09k32K98Mj0m15M49
$$ plain form
4790 2 19 -22 -108 -127 201 -55 -136 -21 -47 101 -318 31 -34 37 9 50 82 -110 231 121 8 -106 -38 158 65
4815 65 -64 -79 52 97 -201 241 5 173 -85 -83 -68 -310 -379 -240 -93 215 -472 -98 -162 -172 57 46 135 153
4839 153 -129 -48 -35 -111 71 35 -107 259 211 129 -312 -149 -26 -253 45 -79 132 -165 -14 -189 -235 -261 -265
4862 -265 75 -104 -30 -61 157 115 205 52 356 184 33 -141 286 136 -18 -293 -11 91 103 140 177 -176
4884 -176 78 65 64 356 -114 196 -70 -168 -135 57 140 -323 -12 -1 128 -157 193 -62 229 -181 -56 10 192
4907 192 126 -25 -344 66 -178 -34 -158 -59 35 111 -2 -161 155 38 263 -37 -252 -191 58 149 -76 111
4929 111 -66 -369 -275 56 -429 75 -126 -67 118 -108 -90 21 -287 154 -18 155 -146 170 215 -108 -57 278
4951 278 -41 -282 -490 108 178 -149 -106 105 -285 -210 -151 143 139 -100 107 -33 76 -156 142 146 136 -279 170
4974A70j56Q4l59J39k94K24M04l73K22j38K10j39M4L6N2k21R1M72k90j18q6j3
4996c9k21L82J00q6n10L79k11kkk6J80K54Q1o48N58K3m58K28J09r7L3r9Q0J02
5020A10J11k65K36k09k22K26j53K23k14J62j51M7O0J36m8j8J23ll49J86k1k32
5042b65N40n06K48l30L53o6j90L29l78J52l9k21M00j91P5L83l45K93j63k30K94
5063A43L03p8l94j61J18R7N1k83J74J73P1O8j27m80L35M04j03m0j0l54L55j63
5085I9J30j11j38K52m77L30j67L12k50j05J93J87k88K53l73L66r3k6R3p8k50J13
5107b8qK66k40K4r9J49l85M24Q2k72p2j94M54j0k39O7P3j93K72J15j47m1L0j08
5131h0J80k16N6j08l5J38r0L18l34mJ69J37J50k71K51L3l5j95l42L76k13l6m3
$$ plain form
4974 170 14 98 -261 -122 -416 -192 212 -161 61 -77 133 -6 38 74 126 -95 -4 468 178 60 -26 -39
4996 -39 -260 122 222 136 -374 5 -206 -208 -210 -236 -56 198 279 -369 189 212 -246 -18 91 -6 27 -72 8 110
5020 110 221 -44 192 -17 -239 -13 -166 57 -157 5 -146 -99 -39 97 49 31 154 151 -198 -12 -33 -265
5042 -265 275 -231 17 -313 40 -26 -216 113 -265 -113 -152 -373 27 -164 -89 294 -51 242 79 -151 143
5063 143 446 368 -26 -187 -69 28 79 -204 -30 143 214 282 155 -325 10 414 311 271 261 -93 262 99
5085 99 229 118 -20 232 -245 85 -82 230 -20 -125 68 255 -33 220 -153 213 120 94 187 109 -141 -28
5107 -28 -36 230 -10 14 -85 64 -321 103 185 -87 -159 -353 101 91 -148 -81 -8 -201 71 186 39 -2 28 -80
5131 -80 100 -116 -60 -168 -203 -65 -155 163 -171 -175 -6 131 281 10 261 294 259 64 -278 98 -115 -151 -194
5154a94M16Q6l14QJ97Kk01k9l4Kj17q4K96L10j43j55m3L25l87K16j00j2j16J27
5178E6n7J24J93j31j33j84J29J96J47j81j92j67K71j08j17r5M06l22J45j20K12
5199G2j88L75k03J68k00j87o5K89q6N4J99n44J36K47K0j15P8p6k85M77l15K73
5221A24n5m39M3J97k7J32k13p3K34J00k43K44j11K78j00k6m0o8J46k25k04L29
5243Ck2m68N19k0k03j1Q5j97J38K47k11M0J76K3j4j99L04m87L42l44K96N6K17
5266B70k3k87PL4k09L54m51K21q1J34J15j98K97j0n3k94J33J34j10k25O51l68
5288D1J94m28K43k30q3L26j93K79k19JN2n6L9J42j32K15m65P5K16rj30J64k63
5311b21J55j64K90j33L6j78J62J98Mo5k32J96k11O98l44k01l18K52J52J4j9k10
$$ plain form
5154 -194 222 308 -6 2 199 201 0 -29 -63 -61 -178 -262 34 344 201 46 3 328 -59 157 57 45 -71 56
5178 56 -1 123 316 185 52 -132 -3 193 340 159 -33 -200 71 -37 -154 -249 157 -165 -20 -140 72
5199 72 -116 259 56 224 24 -163 -228 61 -25 29 228 -316 -180 67 87 -28 50 -26 -311 166 -149 124
5221 124 69 -370 -327 -130 -157 -25 -238 -311 -77 23 -220 24 -87 191 91 65 25 -43 103 -122 -326 3
5243 3 -19 -487 32 12 -191 -202 -117 -314 -176 71 -140 -100 76 99 85 -114 190 -297 45 -299 -3 53 270
5266 270 247 -40 -33 1 -208 146 -305 -84 -165 -31 84 -114 183 173 120 -174 -41 93 -17 -242 409 41
5288 41 235 -193 50 -180 -263 63 -130 149 -70 -69 -17 -73 -34 108 -24 191 -274 -199 17 8 -122 42 -221
5311 -221 -66 -230 60 -73 -37 -215 -53 145 149 84 -148 48 -163 535 191 -10 -328 -76 76 90 71 -139
5333a39K11j95K18K08j48J89k85Q9k01K0J66m03L85l0l03n6K06P0J44J94l06%
5355C4r7K9J34J33n56K71J15J36q0k34j0K9J59J25N1p5l22L48k36j49J10m7L17
5378A85k19J50n7k42L52r2J23l79P7J56N8r0J44l41J14j85K54J32J16j62k53P6
5400h3j29K62k8R0j20K5J13k39q0J1J11m1J35l3K70j15J73m86J05j7p6M1J82j75
5424a04j17L49k14pk98K17K00J46l22L55l05K39j06j0jQ0N4o1k27M17k86j03K75
5447A71l62j3Q1l6K29j2L7r7J29j31J24pl04J23m0J96%j13J2m8qJ13j00j07J64
5472Aj11Q7j20kL2K54p9j22J46Nr4p3j08K54J0L71l18k58K47J13l46K24k14p8
5496a79R6K24l06K46k52L2L16j60rL54n30M55o10M47j01m9k4K3k14L92L4k40O1
$$ plain form
5333 -139 72 -123 95 303 155 344 59 148 -53 -33 133 -270 115 85 -218 -274 -68 2 146 340 34 34
5355 34 -63 -34 100 233 -323 -52 63 199 119 -115 -125 -96 63 188 239 164 -158 190 -46 -195 -85 -132 185
5378 185 -34 116 59 -183 169 77 200 -179 -102 54 112 22 166 -175 -61 -246 8 140 256 94 -159 -83
5400 -83 -212 50 22 112 -8 17 130 -109 -189 -178 -67 -108 27 -6 264 149 322 -164 -59 -76 -152 -111 71 -104
5424 -104 -221 128 -86 -93 -391 -174 26 172 -150 205 -100 139 33 23 22 102 156 95 -132 285 -1 -104 171
5447 171 -191 -204 -123 -159 70 58 95 -2 127 -4 120 113 -191 -68 -108 88 88 -25 -13 -61 -69 44 -56 -163 1
5472 1 -110 -23 -143 -145 -113 141 62 -60 86 91 -3 -76 -184 70 80 451 133 -125 122 235 -111 113 -101 -179
5496 -179 -83 141 -165 81 -171 -139 177 17 8 362 -168 287 -323 124 23 -26 -50 -27 -241 151 185 -55 6
5519Fj93J67J06k2J32k28l3QK74N9k82j76K26K6Q5m54N38j51k21J30l28L05j97
5542b23J51L8J62l89M92j88M4o4l00O2L0J12K70j94k88K24L74k90N3j13M55o93
5564b75L50L7P7j72lMn6j64J36L3j67M85j97r1j83L3K16j37K43K3l49J10M5L70
5588C68l17mMp9J98j34l6K05n9m15L11j5M25n32J56q2K12k53L79m91J64j00j7
5611a12J80k01J37L26l73M8j50M6K13q1J76j99nj71J4N1K72j35L9R9m31L4o0K43
5635d0q4l8r8N91k01m1m0K00k98N8kL02o4l8j29J80k62j13K71k77mJ2L28k82J13
5660D4j53j61L56n7P6m28K73k52O1J27L86k94j54JJ04r7k7M59k28k4j19J95j23
5683c5j08P1N5K60l5j91N7J44m48J39K5J16J74k44K27m06K98l3k15K30j97L81
$$ plain form
5519 6 -187 -20 86 64 196 -32 -65 -57 217 276 -6 -182 44 70 155 -299 239 88 -133 -3 -331 -26 -223
5542 -223 -72 -34 128 -261 231 43 87 23 -277 -215 -185 -73 197 3 -285 -61 313 23 76 -37 418 -275
5564 -275 75 112 189 17 14 18 -38 -202 -66 -33 -200 285 88 -3 -186 -153 63 -74 169 192 -157 -47 -2 368
5588 368 51 47 51 -28 170 36 0 205 146 -269 42 27 452 -80 76 -6 206 -47 332 -159 5 -95 -112
5611 -112 68 -133 4 330 -43 5 -145 -99 114 33 209 10 5 -166 -152 -101 171 36 75 174 -257 -223 -283 -40
5635 -40 -124 -162 -260 331 130 89 49 249 -49 9 7 309 245 207 78 258 -4 -117 154 -123 -127 -115 213 -69 44
5660 44 -109 -270 86 29 105 -323 -50 -302 -241 -114 272 -22 -176 -175 -71 -168 -195 264 36 12 -107 88 -35
5683 -35 -143 -72 -17 243 208 17 74 218 -230 -91 -66 50 224 -20 207 -199 99 66 -149 81 -116 265
5705B65j65K11m8k20m0k17K27j14J32K5j31L1J81m41J49J78j07K24l05J04J74
5726A13m60L33J71N0k6j1M0l70M35l98L44l01K4o7m1J54p5kN2k56L29k8k26K57
5750D1K12k38M9q8j06N9O9N7K47l67K58m31Q9K44Qk69K8J79j53N3j00J94J6k52
5774b01K49k24K53M6k72M6Jl2m7r5K68j6j18j26j3J21P1J56j80P5J8J94k85J05
5798fm1J6J15l15K35j52J11Q4q7o2J2j32K80j14M74m67L61l12J11K5j8l17K29
5821C0p1J45j15l11k1N49R9j78o2k44Q3j45N19j30o8k33L40j22j20k52K60K30
5843A83j73K33l87J47kj70K09k34M10m2l11J96J10j61J16l66K79K9j18J62J36
5864B46m20j32L51k13R7K98n26K70j24L11r7L9l24J55L37k28l0J05p4qk75K42
$$ plain form
5705 265 100 311 263 43 3 -214 13 -101 31 56 -75 -44 137 -304 -155 23 -84 140 -165 -61 113
5726 113 -347 -14 157 207 181 170 210 -160 275 -123 221 -80 -56 -123 -164 -10 -85 -87 -35 -291 38 10 -216 41
5750 41 253 15 64 -24 -130 -71 -2 55 302 -65 193 -238 -149 95 103 -166 -138 41 -112 -59 -159 35 51 -201
5774 -201 48 -176 77 123 -149 -103 -102 -134 -181 -276 -8 -24 -142 -268 -281 -160 -89 67 -113 -38 -20 174 -111 -6
5798 -6 -47 -31 84 -231 4 -148 -37 47 -40 -102 -90 -222 58 -56 418 -49 312 0 111 136 118 -199 30
5821 30 -41 104 -11 -322 -343 206 305 127 65 -179 -96 -241 278 148 80 -153 187 65 -55 -307 -47 183
5843 183 10 243 -144 3 1 -169 40 -194 216 174 -137 59 169 8 124 -242 37 66 -52 110 246
5864 246 -174 -306 45 -168 -71 227 -299 -29 -153 158 61 100 -224 -69 268 40 10 115 41 33 -242 0
$$ [...]
8191A28
##END NTUPLES=NMR FID
##END=
