##TITLE=1H_DE-80H_X3
 200.13MHz, d2o
 8 sc
 
 19ns.26.2.2025
##JCAMPDX= 6.0         $$ Bruker NMR JCAMP-DX V2.0
##DATA TYPE= NMR FID
##DATA CLASS= NTUPLES
##ORIGIN= UXNMR, Bruker Analytische Messtechnik GmbH
##OWNER= pz
$$ XWIN-NMR		Version 3.5
$$ Wed Mar 19 16:13:21 2025 Russian Standard Time (UT+4h)  Yarkov@DPX200
##.OBSERVE FREQUENCY= 200.1313
##.OBSERVE NUCLEUS= ^1H
##.DELAY= (6, 6)
##.ACQUISITION MODE= SIMULTANEOUS
##.ACQUISITION SCHEME= undefined
##.AVERAGES= 16
##.DIGITISER RES= 18
##SPECTROMETER/DATA SYSTEM= spect
##.PULSE SEQUENCE= zg30
##.SOLVENT NAME= CDCl3
##.SHIFT REFERENCE= (INTERNAL, CDCl3, 0, 14.3821)
##AUDIT TRAIL= $$ (NUMBER, WHEN, WHO, WHERE, WHAT)
$$ ##TITLE= Audit trail, XWIN-NMR		Version 3.5
$$ ##JCAMPDX= 5.01
$$ ##ORIGIN= Bruker BioSpin GmbH
$$ ##OWNER= Yarkov
$$ C:/Bruker/XWIN-NMR/data/yarkov2/nmr/H-C/1/audita.txt
$$ ##AUDIT TRAIL=  $$ (NUMBER, WHEN, WHO, WHERE, WHAT)
(   1,<2025-03-19 16:12:08.85 +0400>,<Yarkov>,<DPX200>,
      <created by zg, POWCHK disabled, PULCHK disabled
       configuration hash MD5:
       00 E9 B6 7A A2 85 ED C7 34 08 36 98 17 FE 4E 26
       data hash MD5: 16K
       73 17 CC 36 1D E7 BC E9 7D FC CA D5 16 DE 13 4F>)
$$ ##END=
$$ 
$$ hash MD5
$$ 5E 55 19 42 8B E9 2D 09 F2 09 D0 03 6C 27 E1 C7
##$RELAX= 
##$RELAX= 
##$RELAX= 
##$RELAX= 
##$RELAX= 
##$RELAX= 
$$ Bruker specific parameters
$$ --------------------------
##$DU= <C:/Bruker/XWIN-NMR>
##$EXPNO= 1
##$NAME= <H-C>
##$PROCNO= 1
##$TYPE= <nmr>
##$USER= <yarkov2>
##$AMP= (0..31)
100 100 100 100 100 100 100 100 100 100 100 100 100 100 100 100 100 100 
100 100 100 100 100 100 100 100 100 100 100 100 100 100 
##$AQSEQ= 0
##$AQ_mod= 1
##$AUNM= <au_zg>
##$AUTOPOS= <>
##$BF1= 200.13
##$BF2= 200.13
##$BF3= 200.13
##$BF4= 200.13
##$BF5= 200.13
##$BF6= 200.13
##$BF7= 200.13
##$BF8= 200.13
##$BYTORDA= 1
##$CFDGTYP= 0
##$CFRGTYP= 5
##$CHEMSTR= <none>
##$CNST= (0..31)
1 1 145 1 1 1 1 1 1 1 1 1 1 1 1 1 1 1 1 1 1 1 1 1 1 1 1 1 1 1 1 1 
##$CPDPRG= <>
##$CPDPRG1= <>
##$CPDPRG2= <>
##$CPDPRG3= <>
##$CPDPRG4= <mlev>
##$CPDPRG5= <mlev>
##$CPDPRG6= <mlev>
##$CPDPRG7= <mlev>
##$CPDPRG8= <mlev>
##$CPDPRGB= <>
##$CPDPRGT= <>
##$D= (0..31)
0 0.7 0 0 0 0 0 0 0 0 0 0.03 0 0 0 0 0 0 0 0 0 0 0 0 0 0 0 0 0 0 0 0 
##$DATE= 1742386328
##$DBL= (0..7)
120 120 120 120 120 120 120 120 
##$DBP= (0..7)
150 150 150 150 150 150 150 150 
##$DBP07= 0
##$DBPNAM0= <>
##$DBPNAM1= <>
##$DBPNAM2= <>
##$DBPNAM3= <>
##$DBPNAM4= <>
##$DBPNAM5= <>
##$DBPNAM6= <>
##$DBPNAM7= <>
##$DBPOAL= (0..7)
0.5 0.5 0.5 0.5 0.5 0.5 0.5 0.5 
##$DBPOFFS= (0..7)
0 0 0 0 0 0 0 0 
##$DE= 6
##$DECBNUC= <off>
##$DECIM= 32
##$DECNUC= <off>
##$DECSTAT= 4
##$DIGMOD= 1
##$DIGTYP= 9
##$DL= (0..7)
0 120 120 120 120 120 120 120 
##$DP= (0..7)
150 150 150 150 150 150 150 150 
##$DP07= 0
##$DPNAME0= <>
##$DPNAME1= <>
##$DPNAME2= <>
##$DPNAME3= <>
##$DPNAME4= <>
##$DPNAME5= <>
##$DPNAME6= <>
##$DPNAME7= <>
##$DPOAL= (0..7)
0.5 0.5 0.5 0.5 0.5 0.5 0.5 0.5 
##$DPOFFS= (0..7)
0 0 0 0 0 0 0 0 
##$DQDMODE= 0
##$DR= 18
##$DS= 0
$$ [...]
##$SUBNAM0= <"">
##$SUBNAM1= <"">
##$SUBNAM2= <"">
##$SUBNAM3= <"">
##$SUBNAM4= <"">
##$SUBNAM5= <"">
##$SUBNAM6= <"">
##$SUBNAM7= <"">
##$SUBNAM8= <"">
##$SUBNAM9= <"">
##$SW= 18.0517328524113
##$SWIBOX= (0..15)
0 0 2 0 0 0 0 0 0 0 0 0 0 0 0 0 
##$SW_h= 3612.71676300578
##$TD= 16384
##$TD0= 1
##$TE= 0
##$TE2= 300
##$TE3= 300
##$TEG= 300
##$TL= (0..7)
0 120 120 120 120 120 120 120 
##$TP= (0..7)
150 150 150 150 150 150 150 150 
##$TP07= 0
##$TPNAME0= <>
##$TPNAME1= <>
##$TPNAME2= <>
##$TPNAME3= <>
##$TPNAME4= <>
##$TPNAME5= <>
##$TPNAME6= <>
##$TPNAME7= <>
##$TPOAL= (0..7)
0.5 0.5 0.5 0.5 0.5 0.5 0.5 0.5 
##$TPOFFS= (0..7)
0 0 0 0 0 0 0 0 
##$TUNHIN= 0
##$TUNHOUT= 0
##$TUNXOUT= 0
##$USERA1= <user>
##$USERA2= <user>
##$USERA3= <user>
##$USERA4= <user>
##$USERA5= <user>
##$V9= 5
##$VALIST= <valist>
##$VCLIST= <CCCCCCCCCCCCCCC>
##$VD= 0
##$VDLIST= <DDDDDDDDDDDDDDD>
##$VPLIST= <PPPPPPPPPPPPPPP>
##$VTLIST= <TTTTTTTTTTTTTTT>
##$WBST= 1024
##$WBSW= 4
##$XGAIN= (0..3)
0 0 0 0 
##$XL= 0
##$YL= 0
##$YMAX_a= 371217
##$YMIN_a= -417123
##$ZGOPTNS= <>
##$ZL1= 120
##$ZL2= 120
##$ZL3= 120
##$ZL4= 120
##$ABSF1= 10
##$ABSF2= 0
##$ABSG= 5
##$ABSL= 3
##$ALPHA= 0
##$AQORDER= 0
##$ASSFAC= 0
##$ASSFACI= 0
##$ASSFACX= 0
##$ASSWID= 0
##$AUNMP= <proc_1d>
##$AZFE= 0.1
##$AZFW= 0.1
##$BCFW= 1
##$BC_mod= 2
##$BYTORDP= 1
##$COROFFS= 0
##$CY= -3
##$DATMOD= 1
##$DC= 2
##$DFILT= <>
##$DTYPP= 0
##$F1P= 0
##$F2P= 0
##$FCOR= 0.5
##$FTSIZE= 0
##$FT_mod= 4
##$GAMMA= 1
##$GB= 0.15
##$INTBC= 1
##$INTSCL= 1
##$ISEN= 128
##$LB= 0.25
##$LEV0= 0
##$LPBIN= 0
##$MAXI= 10000
##$MC2= 0
##$MEAN= 0
##$ME_mod= 0
##$MI= 1.114404
##$NCOEF= 0
##$NC_proc= 0
##$NLEV= 6
##$NOISF1= 3.799351
##$NOISF2= 2.8
##$NSP= 1
##$NTH_PI= 0
##$NZP= 0
##$OFFSET= 14.38212
##$PC= 1
##$PHC0= -1194.944
##$PHC1= 26.39223
##$PH_mod= 1
##$PKNL= yes
##$PPARMOD= 0
##$PSCAL= 0
##$PSIGN= 0
##$REVERSE= no
##$SF= 200.129724274929
##$SI= 16384
##$SIGF1= 3
##$SIGF2= 2
##$SINO= 400
##$SIOLD= 16384
##$SREGLST= <1H.CDCl3>
##$SSB= 0
##$STSI= 0
##$STSR= 0
##$SW_p= 3205.1282051282
##$SYMM= 0
##$S_DEV= 0
##$TDeff= 0
##$TDoff= 0
##$TI= <>
##$TILT= no
##$TM1= 0
##$TM2= 0
##$TOPLEV= 0
##$USERP1= <user>
##$USERP2= <user>
##$USERP3= <user>
##$USERP4= <user>
##$USERP5= <user>
##$WDW= 1
##$XDIM= 8192
##$YMAX_p= 0
##$YMIN_p= 0
$$ End of Bruker specific parameters
$$ ---------------------------------
##NTUPLES= NMR FID
##VAR_NAME=  TIME,          FID/REAL,        FID/IMAG
##SYMBOL=    X,             R,               I
##VAR_TYPE=  INDEPENDENT,   DEPENDENT,       DEPENDENT
##VAR_FORM=  AFFN,          ASDF,            ASDF
##VAR_DIM=   8192,          8192,            8192
##UNITS=     SECONDS,       ARBITRARY UNITS, ARBITRARY UNITS
##FACTOR=    0.0002768,     1,               1
##FIRST=     0,             0,               0
##LAST=      2.2672688,     0,               0
##MIN=       0,             -417123,         0
##MAX=       2.2672688,     371217,          0
$$ Real data points
##PAGE= N=1
##DATA TABLE= (X++(R..R)), XYDATA
0@%%%%%%%%%%%%%%%%%%%qK4l2L2l2L2l2L8m9N9o4O9p8Q9j02J11j26J42j56J72
39H9j90K11k31K55k80L08l39L75m14M54m98N48o05O68p39Q21r18J027j155J311
59F98j501J740k047K458l030L865n187P506j2265K5341j19821l14880N41668J53303
73B77848n41491R3958M19845k29385k00989K88638L2742k21854N7622Q2931o7867
84h002J9937j7400p6052J09703L7652j75268N2260J62761j58804q2708K41193
95A05272K569k19709J02155J70735j27986q1829Q0139l2385m1414N0633m1657
106c3477m5896Q2216J5236n1669N2196K1451o4471K9502M3171n4611K031K8834
118B4513n4013K8650P2732j02526n4807J38859j8279j38471J02588R3399j57809
$$ plain form
0 0 0 0 0 0 0 0 0 0 0 0 0 0 0 0 0 0 0 0 0 -8 16 -16 16 -16 16 -16 22 -27 32 -32 37 -41 48 -54 57 -69 73 -83 89
39 89 -101 110 -121 134 -146 162 -177 198 -216 238 -260 288 -317 351 -388 433 -485 542 -613 698
59 698 -803 937 -1110 1348 -1682 2183 -3004 4502 -7763 17578 -102243 -417123 124545 277848
73 277848 -263643 -169685 250160 20775 -180214 108424 141166 -80688 -23066 59865 -8002
84 -8002 11935 -5465 -81517 28186 65838 -109430 -57170 105591 -53213 -135921 105272
95 105272 107841 -111868 -9713 161022 33036 -48793 31346 -1039 -42453 8180 -33477
106 -33477 -79373 2843 18079 -33590 18606 40057 -24414 5088 48259 -6352 -4321 24513
118 24513 -29500 -850 71882 -30644 -85451 53408 35129 -103342 -754 92645 -65164
129f5164P768J95689q7825j72049J35700R3957j67564l4546J31247l1756p9272
140g3815P8489N4071o1861j4955N0006J2601k8820k7083L521K1777q741k1216
152a6026J1231m754k7337K3530K8038l9958j9387N4068K4940k7715K161K5574
164C4365n075k2320J54J1131k6376m2177K8888N0156m6747m0428P6914K4272q0231
177c7474K7538P7926q0058n5678J18715J5362j31079K5237J09058o0214o9498
188f0165P0017J8205o3977J7647N2452j9705k7158J3929K3298L822l7647k4553
200c3835L9406L536n6969K4520N6650n5563k4340R7118N38r4036L8898P0299o3753
213B469l1741O0464j8887m9215L9876J5864m7239J514K2834q947J0409N175k1519
$$ plain form
129 -65164 -57396 138293 50468 -121581 14119 108076 -59488 -94034 37213 5457 -73815
140 -73815 4674 58745 -3116 -18071 31935 44536 15716 -11367 -7846 13931 5190 -16026
152 -16026 -4795 -9549 -36886 -13356 14682 -25276 -44663 9405 34345 6630 8791 34365
164 34365 29290 6970 7124 18255 -8121 -50298 -21410 28746 -18001 -58429 18485 42757 -37474
177 -37474 -9936 67990 -12068 -67746 50969 66331 -64748 -39511 69547 9333 -60165
188 -60165 9852 28057 -35920 -18273 34179 14474 -12684 1245 24543 28365 -9282 -33835
200 -33835 5571 9107 -47862 -23342 33308 -22255 -46595 50523 51061 -42975 -4077 66222 2469
213 2469 -29272 31192 12305 -36910 2966 18830 -28409 -26895 -4061 -13008 -2599 2576 -18943
226a8943K8597K9589m1948R60M8110m5403m0948P0937j697r0467L7110P2545o5123
239a6681k8278P8680j5864o0767N4427L1251o7166J725N2698k5379k4813K9629
251I462p427k1220K3010M583j8798R846O937o536J7166j981k5987J5595J4864
264A9514l4806r05K8104k9957j7380M9190j257m6579K9168L9912l5006j0813L8970
277B8155j1358k8720K1299J1538k6631o762Q665N75r7j1211o532K4342M369k6145
291a8513J8565K9418l3975j2952M9184q571n3172K5149L7363m1405j9973M2329
303A3447j897l4658J7796K6026k0952j5634J8988J2243j4677j3836J0776J3930
315A1552j7212j3778K5406O208l1577Q969L7707j9787k7989L3539J5697l7073
$$ plain form
226 -18943 9654 39243 -2705 -1745 46365 962 -39986 30951 29254 -61213 -24103 48442 -16681
239 -16681 -44959 33721 17857 -42910 11517 42768 -24398 -22673 30025 4646 -20167 9462
251 9462 2035 -19185 3825 8408 -10390 -544 6393 -143 17023 15042 -10945 4650 19514
264 19514 -15292 -16197 11907 -18050 -35430 13760 12503 -34076 -4908 35004 -2 -10815 28155
277 28155 16797 -11923 9376 20914 -5717 -12479 -3814 -3239 -3336 -14547 -21079 3263 7632 -18513
291 -18513 52 29470 -4505 -17457 31727 23156 -30016 -4867 32496 -8909 -28882 13447
303 13447 11550 -23108 -5312 20714 -238 -15872 3116 15359 682 -13154 -2378 11552
315 11552 -5660 -19438 5968 12176 -19401 -10432 27275 7488 -20501 13038 28735 -8338
327h338m45K7375j6851k0501J6839M633j6541J541P654J114N619l612l574J7317
341A2230L288k0498R129J8989k3755j3110K8312o184l2771J7537K1246k8361n163
354a9111L1332q468k1184K3205J1512k5778K861K2352j4095j4532J7600K351j8271
367a0226N448J4148q945p833J0639M250p047k093M322M2l986m327K063M345n764
382d964o244R467Q154j1036j584J7093Q51j6271P628J5195j4900j3283J5787L999
396I892k2721l49J8070q038j3300J3377R104j1198m67J3031L07p004J111M126
410E941J388n316n497N486K963j1814l54J3524p174j3465J6662R776k1142Q43
424h179K2126j1937j6572K0307M251k4951Q269K1470j6319j0766K1401J296j6842
$$ plain form
327 -8338 -8783 18592 1741 -18760 -1921 2712 -13829 -12288 -4634 -3520 2099 -1513 -5087 12230
341 12230 15518 -4980 4149 23138 -617 -13727 14585 8401 -24370 -6833 14413 -13948 -19111
354 -19111 12221 3753 -17431 5774 17286 -8492 -5631 16721 2626 -11906 5694 8045 -10226
367 -10226 -4778 9370 425 -7408 3231 7481 434 -1659 2663 2705 -1281 -5608 -3545 800 -4964
382 -4964 -11208 -1741 6413 -4623 -6207 10886 11737 -4534 3094 18289 3389 -9894 5893 9892
396 9892 -12829 -13178 4892 -3146 -16446 -3069 6035 -5163 -5630 7401 7708 704 1815 5941
410 5941 7329 2013 -3484 2002 4965 -6849 -7203 6321 -853 -14318 2344 12120 -9022 -8179
424 -8179 13947 2010 -14562 5745 9996 -14955 -6686 14784 -1535 -12301 9100 10396 -6446
437f446R602Q112j3615m73P790o528k238K644o848K447R872j1624n155K0511k337
452E714j7610J8425J3736k6969R70K9653j7266k6320K4952R168l1121M907K4293
465A2532j7439j2736K4195K088j9493P937J1080q742O49M471o944L915O385j1487
479c589P64J2385j2612q463K2198k629k4200J5502J8613k4619n837K6397j2154
492A756k3480K3673J1670k9273L683K7310j1359j2845J8263O63j5381R006O797
505A0483j4163J88Q132p786j71N979j0680l40J3366q952q484J9015m68j9242J8695
520E572J6917k9237m612L2484j2235k9281K3003J2050l0897N444K9525j8931j8724
533a8922K6059N844k3941M901J2995r936k054Q610l548o2L831q109M555J1435
$$ plain form
437 -6446 3156 11268 -2347 -2820 4970 -1558 -3796 -1152 -8000 -5553 4319 -7305 -12460 8051 5714
452 5714 -11896 6529 20265 -6704 -5734 23919 6653 -19667 5285 14453 -16668 -11761 12532
465 12532 -4907 -17643 6552 8640 -10853 -2916 8164 -578 71 4542 -2402 1513 7898 -3589
479 -3589 -2825 9560 -3052 -11515 10683 8054 -16146 -644 17969 -6650 -12487 13910 1756
492 1756 -21724 1949 13619 -15654 -11971 15339 3980 -8865 9398 10061 -5320 3686 10483
505 10483 -3680 -3492 4640 -3146 -3317 2662 -8018 -8358 5008 -3944 -12428 6587 6119 -13123 5572
520 5572 22489 -6748 -11360 21124 8889 -20392 2611 14661 -16236 -10792 18733 -198 -18922
533 -18922 7137 12981 -10960 -6059 6936 -3000 -5054 3556 8 -54 3777 -4332 223 11658
547A1658j5972q370K6026r59k7413J4888K0349k8360p303L0945j3173k9721K5520
560a885J8329k9479k8K8503r645j5403J8158M176j7788L263R266o654r88M00n768
575e543O471M426j4238J32J4295r455p211J9275j878j9498J7431J6690k6611o066
589a1780K6347q729k3180J9167J2253k3505J32K3154p904j5933J1097M909j1765
602e737J209P776n512m371N972N229j904p375r5J1557R12j4268L126J5991p244
617E266j2320J3097M769j8819r86J6457q830j5291J3393J0391j4279L50J7437
630A0635m346j5170J0036J3934j3143j2628J3437Q793j3191n573J0691R08j1669
643g286K598Q596o177p326R860Q234r281m872J0316L449j2286j929J2315k955
$$ plain form
547 11658 -4314 -12684 13342 12383 -15030 -142 20207 -8153 -15456 15489 2316 -27405 -1885
560 -1885 16444 -13035 -13063 15440 5795 -9608 8550 12726 -5062 -1799 7467 813 -175 225 -5543
575 -5543 928 5354 -8884 -8752 5543 -3912 -11123 8152 6274 -13224 4207 20897 -5714 -11780
589 -11780 14567 5838 -17342 1825 14078 -9427 -9295 13859 5955 -9978 1119 6028 -5737
602 -5737 -4528 3248 -2264 -6635 -663 4566 2662 -4713 -4808 6749 7661 -6607 -3481 12510 5266
617 5266 -7054 6043 10812 -8007 -8993 7464 -1366 -16657 -3264 7127 -7152 -6802 10635
630 10635 6289 -8881 1155 15089 1946 -10682 2755 11548 -1643 -7216 3475 4383 -7286
643 -7286 -4688 3908 -2269 -9595 265 8499 -782 -5654 4662 8111 -4175 -6104 6211 3256
657C256j4313Q117J6695j2032j3714J7494R904k1164l534J9476p755j6866J4607
670A71J0283j9416k753K0358l805j5695P993J1276p868m030Q868K163o065k432
684i52M638L440r778p952J0353M353j4383O39J7131p130j2007J7688P258k2228
698h930K443K2458j1570j6806J6953P346j9483J978J5344j0334j0251J1850M300
711E298r202K68O003k97j459j259O30K200m478l463Q705K04j2051O138J5021j0486
727A772j0153J6295K925j8481M899J4597j4279j0412J6733K243j6749K905J2545
740D840n950o605Q641M410n593j169P089L388o416o215P042M509j3093m268J3094
755C704k563j3740R983J2201j4643n007J8969j93j7476P051J3520j2162p635J3307
$$ plain form
657 3256 -11057 -2940 13755 1723 -11991 5503 15407 -5757 -9291 10185 2430 -14436 171
670 171 10454 -8962 -11715 8643 4838 -10857 -2864 8412 544 -3486 5382 7545 1480 -952
684 -952 3686 7126 -2652 -10604 -251 4102 -10281 -9642 7489 359 -11648 6040 13298 -8930
698 -8930 -6487 15971 4401 -12405 4548 11894 -7589 -5611 9733 -601 -10852 998 5298
711 5298 -3904 -3636 2367 2070 611 -648 -18 2182 -2296 -5759 2946 3150 -8901 -2763 12258 1772
727 1772 -8381 7914 10839 -7642 -2743 11854 -2425 -12837 3896 6139 -10610 -7705 4840
740 4840 -1110 -7715 926 5336 -257 -1426 5663 9051 2635 -3580 3462 7971 -5122 -9390 3704
755 3704 1141 -12599 -2616 9585 -5058 -10065 8904 8711 -8765 -1714 11806 -356 -7991 5316
769E316J424j4305K530J2214n298j0014O812Q927o637o543Q591M133j1066k585
783f501J1630j639j4190N354J2838p898r727J2869O919j1987o23J2737k936j1669
797d823M315Q760p446r687O140O638q691n062J0086L425r890J630J3478l854j1252
812f233R633Q937j3127n361J2417j980j3157N600Q890r849m677J1695J476r170
826d906K273Q150l430n167L658L866m863m465N396L676p433l210R735K074j0427
841e073K961J1158o165r471R968N090j4384k276J3862m373j2636P568R327q694
855c138l342J1243J868q276J770Q117l092o959J231N271m028o591K869M683n731
870d105l658P941L465q313J249J0897l216q833P132N606r725k757R322k371j0553
$$ plain form
769 5316 6740 -7565 -5035 7179 1881 -8133 -1321 7606 969 -5574 3017 7150 -3916 -6501
783 -6501 5129 3490 -10700 -5346 7492 -406 -10133 2736 9655 -2332 -2955 9782 6846 -4823
797 -4823 -508 8252 806 -8881 -2741 3897 -4794 -9856 230 3655 -6235 -4605 8873 5019 -6233
812 -6233 3400 12337 -790 -6151 6266 4286 -8871 -3271 5619 -4230 -8907 2788 4264 -4906
826 -4906 -2633 5517 2087 -3080 578 4444 -419 -4884 512 4188 -3245 -6455 3280 5354 -5073
841 -5073 -2112 9046 2881 -6590 3378 8468 -5916 -8192 5670 1297 -11339 -3771 5556 -3138
855 -3138 -6480 4763 6631 -1645 125 8242 5150 -1809 -578 4693 665 -5926 -3057 1626 -4105
870 -4105 -7763 178 3643 -4670 -3421 7476 4260 -4573 2559 8165 -1560 -4317 5005 2634 -7919
885g919N853P544q134l530R745L96q259L153O597n113m655N459J770o010j746
900d849N111J560m509k43N913Q52n204J305P251l877p643N727N392j0413m644
915h271J0709j014j0939N229R777p684m469J1099L058r731J914Q324m636n742
929b376L700J627n105j601K965Q0k143j092L025K641k337j510N551Q69o728K295
945a39N742n954n267Q450R49j0219L562Q894o547m695R320O60r044L727O253p043
961a351l566O034l02n073J777L113k421M29K088M94J023m61r08K730R07o139P31
978h95M767n009n558O761J588q702K515R336n188n383R088K592q041K340O003
993F214m858m576N670M41o221K97L962j141k466R03J877P29j278p10L016O99m535
$$ plain form
885 -7919 -2066 5478 -2656 -6186 3559 3955 -4304 -1151 5446 333 -4322 1137 2907 -3103 -4849
900 -4849 262 1822 -2687 -2930 2983 3835 -1369 -64 7187 3310 -4333 1394 6786 -3627 -8271
915 -8271 2438 1424 -9515 -4286 5491 -2193 -6662 4437 7495 -2236 -322 8002 3366 -2376
929 -2376 1324 2951 -2154 -3755 -790 -710 -2853 -3945 -920 1721 -616 -2126 3425 4294 -2434 -139
945 -139 5603 -351 -5618 2832 3781 -6438 -2876 6018 -529 -5224 4096 4756 -4288 -561 5692 -1351
961 -1351 -4917 1117 815 -4258 -2481 632 -1789 -1360 728 1222 2245 1784 876 3606 4513 -1626 -895
978 -895 3872 -1137 -6695 66 1654 -7048 -4533 4803 -385 -5768 3320 5912 -2129 211 6214
993 6214 1356 -3220 2450 2891 -3330 -3033 929 -212 -2678 -1775 102 831 -447 -1157 1859 2558 -1977
1010a977L39M721k863m842N008K942o410P35O927l475m257O246J832p197K34N541
1026C504l129m244L092P74l145J107J968j422O02J981J91L87J341j108l52J330
1042B877j885k014K085j445m151K971L063n164q75P062q97n414M606M051n722
1057h52m31O035k838n521M459K628n800q48N194k015l269L087K037k553j20J409
1073F02Q2j04j586r35K182O14l717R59M638k522k847N936Q07o579K477N445n126
1090C26m185O187K31o948J477M720l633k465M289Q47k629J919J671m77Q77J50
1106B357j474K12N76k420P6J206k863o91M200j550l609M437K550n428R02N828
1122D309l732m138N852J702o702J530M983l954l271M832K56l947J404L482k380
$$ plain form
1010 -1977 -1638 3083 220 -4622 386 3328 -3082 -2347 4580 1105 -3152 3094 4926 -2271 -2037 3504
1026 3504 375 -3869 -777 -3 -3148 -2041 -73 -1495 -893 1088 1279 1666 3007 1899 1547 2877
1042 2877 992 -1022 1063 -382 -4533 -1562 1501 -3663 -4538 2524 1627 -3787 819 4870 -852
1057 -852 -1283 4752 1914 -3607 852 3480 -2320 -3168 2026 11 -3258 -171 1866 -687 -807 602
1073 602 684 580 -1006 -1941 241 855 -2862 -1903 2735 213 -2634 3302 4109 -2470 7 5452 326
1090 326 -3859 2328 2559 -4389 -2912 1808 -1825 -4290 -1 846 -1783 136 1807 1330 2207 2357
1106 2357 883 1095 1671 -749 -673 533 -2330 -3021 1179 -371 -3980 457 3007 -2421 -1519 4309
1122 4309 577 -3561 2291 3993 -2709 -1179 3804 -150 -3421 1411 1667 -2280 -876 2606 226
1137B26j161J452k83k48q90j549J494J514l177K67N543j941m521N081M071o659
1153g81j198O984k886o050M507K836p082J84N480k840l594M058J544k655J188
1168c05K342p34m32J410j300k29M41k028J50J742k465j830M140K17m534L210L281
1185C076n057j055O340j428n883M423L488n583q07N491k129m028L810K060l468
1200g50l32L148n69j821QM37n50j088o04J148J410k369O5M054m79m163L398L832
1218D775m789j560N203j522n749L790L004n550j878N752q77m717K729L523k902
1233g68r32L349N51k352j17J722K29k018q43K047M27k640k0L612j793l163L099
1250C90K291m521j310N440o55n080K638L236l383j504M302P53m142O01L832j463
$$ plain form
1137 226 -935 517 234 -14 -904 -2453 -959 555 -2622 -2355 3188 1247 -3274 1807 5878 -781
1153 -781 -1979 5005 2119 -3931 576 3412 -3670 -3486 1994 -846 -4440 -382 1162 -1493 -305
1168 -305 2037 1303 871 2281 981 752 1193 -835 -685 1057 -1408 -3238 902 1119 -3415 -205 3076
1185 3076 -1981 -3036 3304 1876 -4007 416 3904 -1679 -2486 3005 876 -3152 658 2718 -750
1200 -750 -1082 2066 1497 -324 -316 121 -429 -1517 -2121 -973 437 -1932 -1867 2187 1708 -2455 943 4775
1218 4775 -14 -1574 3629 2107 -3642 148 3152 -2398 -4276 1476 599 -4118 -1389 2134 -768
1233 -768 -1700 1649 2200 -152 -269 1453 1682 -336 -1179 868 1295 -1345 -1365 2247 454 -2709 390
1250 390 2681 -1840 -3150 2290 1635 -3445 -807 2429 -954 -2458 1844 2597 -1545 -944 2888 1425
1266A425k473J543J401j721k443J955R92k621o17K932K13k942J041L526j727k173
1282a689K802K138l935j25L860j468m051J993K758l207k382L589J100l840O38
1297a819L221q96k856K382K939k927k284L839K54l562J68L814r94l497K660K742
1313C184l699j888L476L43l621P49K831j291k321J645K462k238j950K862K456
1328C000l298j313M202O7m185R40M011l535l088L653J462m807k83N040j369l553
1344c056K852K361k780q19L377J79l095O32K181p26k122M96J679p84k255J360
1360e20J948k553j515L627N02l908P85M312k702l102M130J449m422P36M086k165
1376F88l038L120K224l688o37K788m63l405R24K766j676k044J532K197j838j467
$$ plain form
1266 1425 -1048 495 1896 175 -2268 -313 679 -1942 -2559 373 586 -2356 -1315 2211 484 -1689
1282 -1689 1113 3251 -684 -809 3051 1583 -2468 -475 2283 -924 -3306 283 1383 -2457 -1819
1297 -1819 1402 506 -2350 32 2971 44 -2240 1599 1853 -1709 -1541 2273 1279 -2218 442 3184
1313 3184 -515 -2403 1073 1416 -2205 -1456 1375 84 -2237 -592 1870 -368 -2318 544 3000
1328 3000 -298 -1611 2591 2658 -1527 -587 3424 -111 -3199 454 1916 -2891 -3174 1866 497 -3056
1344 -3056 -204 2157 -623 -1442 1935 2114 -981 -349 1832 1106 -1016 -520 1159 375 -1880 -520
1360 -520 1428 -1125 -2640 987 1489 -2419 -1634 2678 -24 -3126 1004 2453 -1969 -1233 2853 688
1376 688 -2350 770 2994 -694 -1331 1457 994 -2411 -1487 1279 -397 -2441 -909 1288 -550 -2017
1392b017K566J683k721j18L112o69l850K014L126l122k472L063J272m251J53L623
1408A392r07l281K427K560k615j455L217P37k971j93K870m88l059K085J592k333
1424d22j053K238P25k770l45K348l88k298J255K030j896j357K463J272k863k65
1440a326L442p32k989J777K794l113j744L125N11m065J005K789j966k224K129
1455e87J824k902M06K901o89k035R59J746p61j381O70J308j018j808J057J573
1471A263k014j363K887J78l488J319L806l080k436M222J020m466J071L641k450
1486A10k378L778N37l259N07K338j351j662J727K42j266k60M01O25m40j072N19
1503i04J951j394r67K785N45l149R49L458l077k550L804P47n071J211M115l223
$$ plain form
1392 -2017 549 2232 -489 -607 2505 1836 -2014 0 3126 4 -2468 595 1867 -2384 -2231 1392
1408 1392 485 -2796 -369 2191 -424 -1879 1338 2075 -896 -1089 1781 1293 -1766 319 1911 -422
1424 -422 -1475 763 1488 -1282 -1627 721 333 -1965 -710 1320 -576 -1933 530 1802 -1061 -1326
1440 -1326 2116 1384 -1605 172 2966 -147 -1891 1234 1745 -2320 -1315 1474 -492 -2716 -587
1455 -587 1237 -1665 -1259 1642 953 -1082 -123 1623 862 -519 151 1459 441 -1367 -310 1263
1471 1263 -751 -2114 773 951 -2537 -1218 2588 -492 -2928 1294 2314 -2152 -1081 2560 110
1486 110 -2268 1510 2047 -1212 -705 1633 282 -1380 347 589 -677 -937 -536 89 -351 -1423 -904
1503 -904 1047 -347 -1314 1471 2016 -1133 -184 3274 197 -2353 1451 2198 -2873 -1662 2453 -770
1519g70k279L624P20l049Q74K790j360j651J633M17o97k76K18M37k80j008M8J792
1537A183j463j297K250N78l097M09L744k611k228L323R67m033J289L517k579k096
1553b144L754M35l566J271K358k068q97J885m22j888M36P85l68k55m49O07J137
1570F11k06j374K010Q67k869M13L040j744k828L088Q17l976K33L753k113k611
1586b889L037J267l010O56K703j254j491J295P05j142J75K72m16J31K22l62Q55
1603G54k01j414J173Q82k187O5K464j691j811K256J055l020M44L207j598j972
1619a594K649P69k581P63K139k059j008K020n41j958Q16Q69j070j76J78N61M46
1636B23m44m20J586M34k052N65J736o49k351J815J064k472m80K852j625j858K205
$$ plain form
1519 -770 -3049 575 1295 -1754 -880 1910 550 -1101 532 949 252 -24 194 631 351 -657 -609 1183
1537 1183 -280 -1577 673 1251 -1846 -1437 2307 -304 -2532 791 1758 -2275 -986 2531 -48 -2144
1553 -2144 1610 2045 -1521 -250 2108 40 -857 1028 606 -1282 -846 -61 -429 -684 -1133 -526 611
1570 611 405 -969 1041 1908 -961 -548 2492 748 -2080 1008 1825 -2151 -1918 1835 -278 -2889
1586 -2889 148 1415 -1595 -939 1764 510 -981 314 1019 -123 52 324 -92 39 261 -101 754
1603 754 553 -861 312 1194 -993 -928 1536 -155 -1966 290 1345 -1675 -1231 1976 378 -1594
1619 -1594 1055 1824 -757 6 2145 86 -922 1098 557 -1401 -585 284 -786 -962 -784 -223 223
1636 223 -221 -641 945 1379 -673 -108 1628 979 -1372 443 1507 -965 -1445 1407 -218 -2076 129
1653A29J229k377n1K170p90j335J463N52j624M9O93J09j61J73kQ6K90j041N90
1672A52P95j291m36J456r10j614J784J047k330L22K221j096j669K293J102k251
1688d25M89J609j089j303R71K61j137k37J157n30r89L63R30Nk85j04Q55M68p35
1707B74p12J523j79j541R51Q05j506n35J862o98j399J053J230j834j74J450p0
1724E00j141J9J045q74j86N67O65m95j49J63Q93j18q98K13N11p29l29N51O5j722
1744a449Q02Q34r83M6J327K4j173M53J233o43o03R03m5r03L00M6l07m42O81mq85
1765g88N00K96N0l05nO10j32j63r3L76M3p65M04N57n47m82J021j51q98M31R17
1786H76o33r28O72Q6n62k64P55j49j17j40Q56j57m38L79N99n58o95R38L58j243
$$ plain form
1653 129 1358 -1019 -1070 1100 310 -1025 438 990 -634 -585 108 217 56 229 227 313 603 -438 152
1672 152 947 -344 -780 676 -234 -1848 -64 983 -1347 -1025 1196 100 -1569 724 1826 -425
1688 -425 64 1673 584 -719 252 513 -624 -861 296 -234 -1223 -860 70 75 -210 -314 541 1009 274
1707 274 -438 1085 906 -635 316 1121 -385 -920 942 244 -1155 -102 1128 -706 -880 570 500
1724 500 -641 -622 423 -451 -637 -70 595 100 -49 114 1007 889 -9 204 715 -14 -343 208 273 -1449
1744 -1449 -647 187 -796 -750 577 601 -572 -119 1114 471 -132 771 726 -177 123 169 -138 -580 101 97 -788
1765 -788 -288 8 58 -247 -252 358 226 63 -30 346 389 -376 28 585 38 -444 577 426 -472 -41 876
1786 876 243 -685 -13 73 -489 -753 2 -147 -264 -404 452 295 -143 236 835 277 -418 520 878 -365
1806c65k44R50p56m75M13P66r45K44M75J25l85J27Q73n31o00O02N86l85p65L66
1826G6Q6o12l8O65j19o71N49O09p78m89R33l8o44L76P69p85j57N77R4l12mL23
1848D10n1o09L63L57m94l76K30J81j54o89J00R87r23k21J468J03r86J97J289j176
1868Fl26J076R7j047n0M78j64j291O57O53o99r8P97K65m05k07N13K75p76K87N19
1889E60m5q25J50O59m89m83M39K14n87k80J260n03j087R36P27r94m73J358m87
1908E0r15P40Q39p43j66R06k83l94K66K19n00n9K37k63l4q03O96R7K79j169R80
1929b0Q82j238J47J349o29p89N47P12j201m12J237o33j106Q16J112j297j8R88
1947D47k00o78N50Q3l37J15K24J29k9k29l47Q02l15m95J54J172j217m23J535o05
$$ plain form
1806 -365 -609 341 -415 -890 -477 289 -656 -412 63 188 -197 -70 803 272 -328 274 860 475 -290 76
1826 76 162 -450 -488 177 58 -613 -64 545 -233 -722 211 173 -471 -95 674 -111 -268 309 403 91 87 410
1848 410 359 -250 113 470 -24 -400 -170 11 -143 -832 -732 255 -668 -889 579 682 -304 -107 1182 6
1868 6 -320 756 853 -194 -244 234 70 -1221 -564 89 -610 -708 89 354 -51 -258 255 530 -246 41 560
1889 560 515 -310 -160 499 10 -473 -34 180 -407 -687 573 70 -1017 -81 646 -348 -821 537 50
1908 50 -865 -125 714 -29 -195 711 428 34 300 519 19 -40 197 -66 -100 -903 -207 -110 169 -1000 -20
1929 -20 862 -376 -229 1120 491 -298 249 961 -240 -652 585 -48 -1154 -338 774 -523 -541 447
1947 447 247 -431 119 202 -135 -20 204 333 304 75 -272 530 215 -280 -126 1046 -171 -594 941 336
1967C36j815J373J092j803k71J838n37j314J345N80j162J6J411j043l90P07K37
1984F00o39l6O9J10pn97j06R96K11j577P25J143q73j071K323o22j682J364J177
2003A508j888o76K225n46j869J073R09j620J97J628q11o18M35L72o02K58m6M2
2021b9M43k61o19Q76Q8j106P17Q51j397k00J659q58j530J121R37j321J0J550p87
2040A44j298J323M83j338O90P61k70p06M42k31L0l48L4J83K03n64j01P66l43l54
2060d94K04O43p59l41J700p87j119J296N64j186n62J840l18j509J146K29r07l01
2078f61J023j15q06N07M94l45o13L40N85n54N4K04J13K4j07K01J26p87n4Q53n89
2099a07p36P76N54j029m45J406k70r39J027O58p88o08J193j27j056M34P04n74
$$ plain form
1967 336 -1479 -106 986 -817 -1088 750 213 -1101 244 824 -338 -322 1089 46 -344 363 600
1984 600 -39 -75 -6 104 97 -500 -606 390 601 -976 -251 892 19 -1052 1271 649 -1033 331 1508
2003 1508 -380 -1056 1169 623 -1246 -173 736 -884 -687 941 130 -488 -53 319 -283 -25 -71 -29
2021 -29 414 153 -466 410 498 -608 109 960 -437 -637 1022 164 -1366 -245 692 -629 -619 931 144
2040 144 -1154 169 652 -686 4 765 495 -211 231 0 30 -318 -284 -101 102 -462 -563 203 -140 -494
2060 -494 -290 353 -406 -747 953 166 -953 343 907 -279 -841 999 681 -828 318 547 -360 -661
2078 -661 362 247 -559 -52 442 97 -516 -176 409 -145 -91 113 226 250 143 344 470 -317 -371 482 -107
2099 -107 -843 -67 487 -542 -987 419 149 -790 237 895 107 -501 692 565 -491 -57 647 73
2117G3k55L99J04o41J4K56j36J30l68L54L69p20M2P45Oj163Q67M64n28o31J392
2138G73k88j153O22J003j274l12J032k99r88O98L68m17k84M64K57p33M33J10J06
2157A18j86M46l13L60n34J55K70l52n75L16O10q58l93J523m61q49O68N93n85n54
2177f01J060K7p30K29P94n55n75Q89p0q45M06K49M9r08L17L86j44k71jN90l53
2198e7k01K35N38q62K74M64J05p65J54P98n04o33O32O7r67L11P93o08l82N64L07
2219B63m47N1L30j49k51K98K29k5n75L83K39m35l36l5O20n91kQ51j83j055O52
2240a68Q65j463M15P06J15q96L07Q78o58n74O71N19r54K45J48j62l49J53J03K9
2260g0n29N85L48p16r1O96K05q06L43P02n04k36N42km69m22Q43j86q18K56N56
$$ plain form
2117 73 -182 217 321 -320 -306 -50 -186 -56 -424 -70 299 -421 -379 366 372 -791 76 540 12 -619 773
2138 773 485 -668 -46 957 -317 -629 403 104 -884 -186 182 -235 -519 -55 202 -531 -98 12 118
2157 118 -68 378 65 425 -109 46 316 -36 -611 -295 315 -543 -936 587 126 -723 -55 538 -47 -601
2177 -601 459 486 -244 -15 779 224 -351 538 468 -377 29 278 327 -581 -264 122 -22 -293 -294 296 -57
2198 -57 -258 -23 515 -347 -73 391 496 -269 -115 683 179 -454 178 245 -722 -411 382 -226 -608 -44 263
2219 263 -184 -133 197 48 -203 95 324 299 -276 107 346 -89 -425 -460 160 -431 -433 418 235 -820 -168
2240 -168 697 -766 -351 355 470 -426 -119 759 101 -473 198 717 -237 8 156 -6 -355 -202 -99 -70
2260 -70 -599 -14 334 -382 -473 223 428 -378 -35 667 163 -73 469 467 -2 -424 419 233 -585 -329 227
2281B27m68k08N41N4l32R4K62M20o66K42N94q34k43L96O32n76n17N87K43o44l7
2302b33N01l29k60M85L31o45j45L64j7m30M09J89p3%L18N0m98k36L83N3m18L7
2324a64J0K37p69K41Q07p01j0O00jn17K68O80p75j90O36R4n56J11M47m49J33K70
2346D02k85k40k10M0J27P7j87L79p2j77L58N8l09O5J46N69p21j82K31J3o19N98
2368F1J11l77j12K76N3m25J17J44O5M2J49r9K7Q1j13J16L94n37P3K47m60J06J31
2391G0J28o79L47M52m01n60R00J77o51L15J62K6n22N21K38o50J39k6R3m98J69
2412b50K15k58K38Mk40L73m58M48M52o50n1K26L83n03L80m1k82k71M53O31j064
2433b65N4O15m67k30K55L41n72Q1K33k81R7J63j91L03j59Q4j59N48k64k97N05
$$ plain form
2281 227 -241 -449 92 146 -186 -92 170 590 -76 166 760 -74 -317 79 711 135 -382 205 448 -196 -233
2302 -233 268 -61 -321 164 495 -150 -295 69 52 -378 31 220 147 147 465 515 17 -219 164 217 -201 -164
2324 -164 -154 83 -686 -445 362 -339 -349 251 250 -267 1 681 -94 -284 352 446 -110 1 448 -1 132 402
2346 402 117 -123 -333 -293 -166 -89 -276 103 31 -146 212 270 -39 26 172 741 20 -162 69 82 -537 61
2368 61 172 -205 -317 -41 12 -413 -296 -152 -87 -45 104 5 32 113 0 116 510 -27 46 293 -167 -61 70
2391 70 198 -481 -134 318 -83 -643 257 434 -217 98 260 286 -236 285 523 -127 12 -14 79 -419 -250
2412 -250 -35 -293 -55 -51 -291 82 -376 72 524 -126 -177 49 432 -71 309 268 -14 -285 168 799 -265
2433 -265 -211 404 -63 -293 -38 303 -269 -188 45 -236 -139 24 -167 136 -23 61 -98 450 186 -111 394
2454C94k19n60L20L33l76l32L53K36o53M64L78o77P4Q05m09k35%O60p90J50M96
2475D12n23K00L8j29p0K74n05M8K24m6j41J11Q02j400L12O96m17l0N26j09n58
2496b85M97K65n41MP19o44l09L17l8l51J51j87K45k93M18R1j65O7K52k19L66j63
2518A97j39L58l16j36M6K51o24k93R99j88n04O10J0k87o0M22po41K51M74m01K9
2540E1K79l72J31j2q4p8k66j04M29K72j74l27N20k29l82M06j4K4l24L10J75n16
2562b85Q8O04k35k02M35j64n12K39J38k48m85N35K72k14P0p1J64O0j0J81j27l87
2584a54K79l8K16j89J8J04m38l17L82J70l80j55P57l30k53L00L19m52J44N6j31
2605i2k96N89M0k04j71K26L00m11p2NJ11K81n69L36j47o3Q1R6J58m06J78K28k04
$$ plain form
2454 394 175 -385 -65 268 -108 -440 -87 149 -504 -40 338 -339 -265 540 131 -104 -104 556 -234 -84 412
2475 412 -111 89 127 -2 -72 202 -303 -255 -31 -77 -218 -107 695 -705 -393 303 -114 -144 382 273 -285
2496 -285 212 477 -64 -60 659 15 -294 23 -15 -366 -215 -402 -157 -450 -32 59 -106 -39 213 -6 360 197
2518 197 58 416 100 -36 10 261 -363 -656 343 155 -349 261 271 -16 -76 346 339 -302 -51 423 22 51
2540 51 330 -42 89 77 -7 -85 -351 -455 -26 246 72 -255 265 36 -346 60 46 70 -254 56 231 -285
2562 -285 -197 407 172 -30 405 241 -271 -32 106 -142 -627 -92 180 -34 36 -35 129 189 179 360 233 -154
2584 -154 125 87 303 114 132 236 -202 -519 -137 33 -347 -502 255 -75 -328 -28 291 -161 -17 39 -92
2605 -92 -388 201 241 37 -134 92 392 -19 -91 -86 25 306 -263 73 -74 -137 -56 40 198 -208 -30 198 -6
2628fl8M48j10l47J10J96j51O4P1j82j88K2r1J71l4P4N1k49K78l2j00J31o3m3
2652a8K75k95OJ29j43l16M61r7k26k77O34M4p61O78Q8m28L21K79j92o08N71J91
2674C16k39%J00N0k26L00l96K20l00k82M11O4l54M94K23k58j94j04M48m30J44
2695a3O2K36l89K34L37o25j57M72P9m40k9L85l33J04K0j41K11p0L18M2m41j32
2717b70M73J54m04K5Q7q3N7j02K96l06k8k4R8j70M46J10o08k05L34K78k35K33
2739A56p4N0m49N19m7k66M23J29l50j48P6L31o61J60K05Jj94j4L59k56j0j80M65
2762B25k52j08K19K28m59k86P50j35k93j24J83K3Nk13J07k3K91j71j06k0P0M16
2784C27k43l35M64k77k34J92K84K51r17M31J08k79J71M8k54K16k98N04k6k85m6
$$ plain form
2628 -6 -44 404 294 -53 57 253 102 166 237 55 -133 -111 -202 -31 -65 9 60 -189 89 57 -43 88 25 -18
2652 -18 257 -38 -32 97 -46 -362 99 2 -224 -501 133 177 -584 94 182 -246 75 354 162 -446 125 316
2674 316 77 77 177 227 1 301 -95 125 -175 -457 -46 18 -336 158 381 123 -71 -175 273 -157 -13
2695 -13 49 285 -104 130 467 -158 -315 157 236 -204 -233 152 -181 -77 -57 -198 13 -57 261 303 -138 -270
2717 -270 203 357 -47 -22 65 -18 39 -63 233 -73 -101 -125 -27 -197 249 359 -249 -454 -120 158 -77 156
2739 156 82 132 -317 202 155 -111 312 441 91 -57 19 350 -311 -151 54 55 -139 -153 206 -50 -60 -240 225
2762 225 -27 -135 84 312 -147 -433 317 182 -111 -235 -52 -29 -24 -237 -130 -153 138 -33 -139 -159 -89 327
2784 327 84 -251 213 -64 -298 -106 178 429 -488 -57 51 -228 -57 -9 -263 -47 -345 159 133 -152 -198
2805a98N53j16k89OL08k76q2K40l37K02J36n7q4l83N83j66m54K70M37k83j40K91
2827A61j14j80J89J20p6p9p1L67n55J63N6J13K4l85LJ51j17j39N91j75j97K05
2849E5OO8J53n7J20m54P6K98J22o42O0K95l1k07L4J96j55j90K98l98K82j21K95
2872A03K08j88j31R2J91k39J31j13J23n76P37k34j94L07j7l58J48J42R5j77J62
2893B12l3l35J32K67J55m97M36j80j92K3j87K81k78k9J95J84k06o5M10k69m99
2914d75K80J55J82k6Q8K85n9l54L57m23j75L75M4j19k56K26j52m9P9K07l46K09
2936E3p8O1l3O5J03K5j51j24K9n9l1k97O96n14j58K67k76J43K04K68k39j90J94
2959d2M21l07j29K68j96k2m2J82k5K0n5j3k18K82l13M6k69J67J61J16k06M00j59
$$ plain form
2805 -198 355 239 -50 -44 264 -12 -94 146 -191 11 147 90 6 -377 206 40 -414 -144 293 10 -130 161
2827 161 47 -133 56 176 100 21 -50 317 -238 -75 -19 94 118 -267 -264 -113 -230 -369 222 47 -150 55
2849 55 61 129 282 225 345 -109 -33 265 387 -255 -195 100 69 -138 -104 92 -63 -253 45 -353 -71 -192 103
2872 103 311 123 -8 84 275 36 167 54 177 -399 338 104 -90 217 200 -158 -10 132 227 50 212
2893 212 179 -156 -24 243 398 -99 337 157 -35 -12 -199 82 -196 -225 -30 154 -52 -117 293 24 -475
2914 -475 -195 -40 142 116 204 489 430 76 433 10 -165 210 254 135 -121 105 -47 -96 -17 190 -156 53
2936 53 -25 36 3 68 171 196 45 -79 -50 -109 -140 -437 259 -255 -413 -146 -422 -279 -75 193 -46 -236 -42
2959 -42 379 72 -57 211 15 -7 -49 133 108 128 73 60 -158 124 -189 -143 -412 -245 -84 32 -174 226 67
2982F7J8P1p9J3k44M64l65L83k83J4O2k37K88J34n11PK1K20Q0j70K24j23P2m1
3006H5j21J56p5j80%J29j4qJ4K33l13J28j66R0j53N02l07J03J26J24l84P6j98
3029a53L06j99J21r8J69j24K94o5j19l10J5K48m3j44j19L41k14R7L92l40l98K00
3051a43M10o2n55O22p9K6o86N86l2k78M93j56K2k86J95j28l3o1j11J69J00Pr6
3074g6L20j29o8r8K42k63O4P4O4j22k56K86k69L08J2k85j31N72k70j42J96k64
3096b35K86p2M58m8j71l1j86p5k43L22q3J26j53R7k47j33N82m29N51m81K00J40
3118A75m5r3J17Qj23k5J18j55K27j81j1j99K33R0k02k89K76Q2j36qJ63j55J42
3141Il2M51k88r7rl5J27JL5j25J8J93l80p3MR2L03p9j76J98k9j0P2L08k51l44
$$ plain form
2982 67 85 156 77 90 -154 310 -55 328 45 59 121 -116 172 306 -205 -198 -177 43 123 -47 177 54 126 85
3006 85 -36 120 45 -135 -135 -6 -20 -28 -14 219 -94 34 -132 -42 -195 307 0 103 229 353 -31 45 -153
3029 -153 153 -46 75 -23 146 22 316 251 132 -178 -163 85 42 -102 -221 120 -94 3 395 55 -343 -143
3051 -143 267 205 -350 272 193 219 -467 119 87 -191 302 146 168 -118 77 -51 -84 -145 -256 -87 13 20 -76
3074 -76 244 115 47 -51 191 -72 -8 66 130 8 -248 38 -231 77 89 -196 -327 245 -25 -167 29 -235
3096 -235 51 -21 437 389 218 187 1 -74 -317 5 -78 48 -105 -8 -255 -388 194 -235 316 -165 35 175
3118 175 130 37 154 162 39 14 132 -23 204 23 12 -187 46 136 -66 -355 -79 3 -133 -141 22 -133 9
3141 9 -23 428 140 43 34 -1 126 127 162 37 55 248 -132 -205 -201 -109 194 115 -61 137 108 98 170 478 227 -117
3167a17K60q2Q6k13R9K4r0L59k45o8J9J27r6J77j70K90k07l02K66j09K88j87j44
3190c5j0O1k9MM9j77J93q9K2P6j0k25K72j40N07n11o7J38r6j30K17K06k69J02
3214E9L2K81k98O9K12m95K94l85Q0R0NO8j75J16J48k05K74r8K7k07K91M9l84L88
3238B36o8M9l59m3O6P0m8R5l13N5K8K80J18j85j04J94J93k54J80J28m45N6K91
3261B20l78J69K30j99l25K86j71L63l17J26k77R3L89m8k45k61L75j80J70J35j34
3282B1p6KN4k13L22l88M41j34M3n6o8R4J45K34l84M03o77R4K50J04m97M21J97
3305C32m02k5J36N7r0k05J03j69L84l86M57j17l97N99k02j20j9N2m5K06K97k18
3327B28j83M6O7k04n9K0NJ55k8j36j30L5QK75j44n4L94k51L5j59L61j01j02j15
$$ plain form
3167 -117 143 61 147 -66 33 57 -33 326 81 13 32 159 63 240 70 360 153 -149 117 8 296 109 -35
3190 -35 -45 16 -13 -9 40 -137 56 -33 -11 65 55 -170 102 -38 469 -42 -109 29 -67 -197 20 226 -43 59
3214 59 91 372 74 143 355 -140 154 -231 -151 -61 -56 12 -163 -47 101 -104 170 72 99 -108 183 232 -152 236
3238 236 168 217 -142 -185 -119 -49 -97 -2 -315 -260 -232 48 166 -19 -123 71 264 10 190 318 -127 -71 220
3261 220 -158 11 241 42 -283 3 -168 195 -122 4 -273 -180 209 161 -84 -345 30 -150 20 155 21
3282 21 -55 -53 1 -212 110 -278 163 29 72 16 -52 42 187 421 37 440 -237 -143 107 211 -286 135 332
3305 332 -70 -95 41 98 8 -197 -94 -263 121 -265 192 75 -322 277 75 -45 -64 -12 -57 149 446 228
3327 228 45 91 158 -46 -105 -85 -80 75 47 -89 -219 -184 -176 99 -45 -99 295 44 79 -80 281 180 78 -37
3351c7J10k2J85n48K68P0j09L0K33k07rJ56ro1L20k17o0j50r3J69K4r0P4j17O1
3376b9k93M54l23L81k71Q0rL4l16K53R5j93L05l16K31P3j44k30J69K76l65J13
3398b5l3k27M89%j76j60P7j64K1K36j39J8J82K2k63k5K99N2j06j78M6j3K7J70
3422A30k48J39K64k92J76k39n5J31j79K51j98J76J56o8J0n3J31k04p2k13J78l5
3444a14L78m79K58J86k20p8k17L32k42J38p6M43l81L52n6n76M48m1j70K52l77
3465b40O6J1K35o2j57J02J53k57K89j42l5j73L68n10L93l7J62j84J15j42J25j11
3487c1K56j0k12ql31K96m0J49l78KL39m1K34l55J57L9k3o2K00k27j8K11k81M88
3511C54o09l50P02j65p3j70M37j40j75K33o1j43K69l38J59n4J29k4J13o4j26R5
$$ plain form
3351 -37 73 51 236 -312 -44 26 -83 -53 180 -27 -36 120 111 50 370 153 93 -57 -150 19 43 -47 27 -90 -29
3376 -29 -322 132 -191 190 -81 -1 -10 24 -292 -39 56 -137 168 -148 83 156 12 -218 -49 227 -138 -25
3398 -25 -58 -285 204 204 28 -132 -55 -219 -198 38 -101 -83 99 121 -142 -167 132 184 78 -100 -54 -67 -40 130
3422 130 -118 21 285 -7 169 -70 -125 6 -173 78 -120 56 212 144 154 101 232 28 -44 -257 -79 -114
3444 -114 264 -215 43 229 9 -69 -286 46 -196 -58 -134 309 -72 280 224 -352 96 55 -115 137 -240
3465 -240 -174 -163 72 10 -147 -45 108 -149 140 -2 -37 -210 158 -352 41 4 166 -18 97 -45 80 -31
3487 -31 225 215 3 -5 -336 -40 -80 69 -309 -307 32 -9 225 -130 27 66 43 -19 181 -46 -64 147 -134 354
3511 354 -255 -605 97 -68 -141 -311 126 -14 -189 44 -17 -160 109 -229 -70 -124 5 -19 94 30 -96 -1
3533ak38lK31p9m3J32m0R2o2q2K81Q8k25J81Q7m92M90k53mj80L21pk67P7l2j66
3559a94J74J4j62L2J89n4Nm3rJ77K54n40K0J77q4j55J40J47j75p4J26J38k04L55
3583B54o45M25Qp5R1k27J44J54k40j6M38j51l45J01L67r4n07K83M6r5l6k2J22
3606b0J91m81J58L15j55K04o4j86K17l61O0K45oj83N43o77L28J21l08K02l84L65
3628A24k74K86j2N7j59Q5J81k00j80N6R7J18j17J69p7k67L28k57K30k28o2N73
3650D71q83L29P3R8j33k95L53J00r1k48L88l39M93n03P0J06J10k38K34J09l28
3671a24L31k16q0J38O3j83L2l0J61Q7j15J56l60M20j86j58K43j48jj04J64j32
3693d2j3l62J25J12N49l90n0K90m97N49k16j03P6N9j1k92L82M8l41L39k47j65
$$ plain form
3533 -1 -239 -242 -11 -90 -133 -1 -41 51 -11 -93 188 276 51 232 319 -173 317 64 60 -120 201 194 -73 4 -28 -194
3559 -194 -20 -6 -168 -136 53 -1 4 -39 -48 129 383 -157 -137 40 -44 -199 -59 88 -87 -161 -35 103 -101 254
3583 254 -391 34 42 -33 58 -169 -25 129 -111 -127 311 160 -185 -84 283 189 -318 -35 11 -84 -120 -142 -20
3606 -20 171 -310 -152 163 8 212 148 -38 179 -182 -122 123 117 -66 477 -200 128 249 -59 143 -241 124
3628 124 -150 136 124 181 22 107 288 88 -92 -36 61 179 62 231 154 -113 215 -42 188 -40 -102 471
3650 471 -412 -83 -10 88 -45 -340 13 113 22 -226 162 -177 316 -187 -117 -11 99 -139 95 204 -124
3671 -124 207 -9 -89 49 112 -71 -39 -69 92 179 64 220 -140 280 94 -64 179 31 30 -74 90 -42
3693 -42 -55 -417 -292 -180 369 -21 -71 219 -278 271 55 -48 28 87 76 -216 166 214 -127 212 -35 -200
3715b00K94p6k52L8M0m9K56j18K18k92L37m02K61k41K11M1n2J31l39J28J7O4K77
3738B92j71j74J82j97J99l83J86L02j01j92k59M45J5k57J39l5k84J77j70P2o2
3759b76K40n13N33p7jk20J74K10j91OQ5Q8k22l6K86r8j14L05k96J01j5J29o37
3782e39N18J26k83K70j38J56m42M41J93m82Q9J76o6k0o9r0K03L3M8m52M32m97
3804c93O11j69m5N9p2k11J74K02o1k20J68K42k4k97J58k08k02R0J23m7l2J06J46
3827I8k00L00j56j07j15M91r4m73J04L82l08j90L44k9k07K71j3j85J04N9l11L59
3849A24j28l4j53K32K95m09j16r9L15J14k61K09L21m38J29j05J5J0k73J97n8K89
3871A76j48K92l70k17N37j49n19J06M50k31L45j55J12n50N43n40N3K28J60K7r5
$$ plain form
3715 -200 94 18 -234 -196 -156 -205 51 -67 151 -141 196 -206 55 -186 25 66 14 145 -194 -66 -49 15 292
3738 292 121 -53 129 -68 131 -252 -66 236 135 -57 -316 129 144 -113 26 -9 -293 -116 -286 -214 -276
3759 -276 -36 -549 -16 -93 -94 -314 -140 70 -121 -115 -30 58 -164 -200 86 -12 -126 179 -117 -16 -31 98 -539
3782 -539 -21 105 -178 92 -46 110 -332 109 302 -180 -91 85 19 -1 -70 -160 43 76 124 -328 104 -393
3804 -393 218 49 4 63 -9 -220 -46 156 95 -125 43 285 261 -36 122 -86 -288 -198 -75 -122 -154 -48 98
3827 98 -102 198 42 -65 -180 311 217 -256 -152 230 -78 -268 76 47 -160 111 98 -87 17 76 -235 124
3849 124 -4 -38 -191 41 336 -73 -189 -288 27 141 -120 89 410 -28 101 -4 11 21 -252 -55 -113 176
3871 176 28 320 -50 -267 270 121 -398 -292 158 -73 272 117 229 -321 222 -318 -265 -37 123 150 55
3892E5l54L5N20l50K68k0J23o21N65M5j10K4l15P6r0M14j67k64K85k15l0J42Q9
3915A05j05l4j04q6L2R8K06j2J80l26j95O1J37l7K32l9l07L12l79j00M93k98K29
3938F3j02Q1J0L0oL22j16j83k01j96K29R1k2K38n48K19j0L89m02j14L41ql8l70
3962c03N20n70K74R1j43q8M97l56JN6J14r5J30k6l59J82J78l09Q8M1J57J84m13
3985a49rM54l14j29N14m14o5J35K22m93N04l61N3j5n7L21j27j58N8Q8k38k5J16
4008h9J46l22K17J13j33J47R0k84K12l17L91l52Q8k97L40j7Q2K5o2j52K45j01
4030c0J00L0o2j53L5J52p5l1l7j81L42r6N48m87O2j30J06k21N7k7N08l28k39k
4054a59J94j50j90K58j84L21j98L3k59O55l35R7l24l8J46J96k45L32m71K28L8
$$ plain form
3892 55 -299 -264 256 -94 174 154 277 -344 221 266 156 180 -135 -59 -149 265 98 -166 119 -96 -126 16 105
3915 105 0 -34 -138 -224 -192 -94 112 100 280 -46 -241 -180 -43 -80 152 113 -194 118 -261 -361 132 -166 63
3938 63 -39 42 52 82 76 398 282 99 -102 -298 -69 22 0 238 -310 -91 -101 288 -114 -228 113 105 67 -303
3962 -303 217 -353 -79 12 -131 -219 278 -78 -77 -21 93 -2 128 102 -257 -75 103 -206 -118 -77 80 264 -149
3985 -149 -158 296 -18 -147 367 -47 -112 23 245 -248 256 -105 -52 -67 -124 197 70 -88 -30 58 -180 -205 -89
4008 -89 57 -265 -48 65 -68 79 169 -115 97 -220 171 -181 -93 -390 -50 -67 15 40 -22 -174 71 -30
4030 -30 70 100 38 -115 -80 72 -3 -34 -71 -252 90 -6 542 55 117 -13 93 -128 -71 -98 410 82 -157 -159
4054 -159 35 -115 -305 -47 -231 90 -108 -75 -334 321 -14 83 -241 -279 -133 63 -182 150 -321 -93 -55
4075e5MJ41k53K48P7L4j51k66K05J09K2k2l2k01L55j92j88j14M22J26n24K27l2
4098f0M2k8L0n5o6K72K2j52K84m88L55o2q0K1k86K39j44K76n00K02k1R8M2K97
4122B38l36L02n15M70j91K28M6j83j12O7N4k78K67J0%l5L49k20k58J34k43N21
4144C15k00J6Ok21K81l29J32oPp2j18N7J24O8k90L23m1j65R5L2J35k65L9Q5J35
4169A43p8l09N07m19K62L7l11L39m63J29J05L83l22m1r0K80j56qj36L59k74j81
4191b44J87J98l8p2J37k05q2L70m52K01k26L87o6rJ5R6k14J0n9P9n2o3J20O9j07
4216b0j11J22O8k05Q9O2J60m90K25K97l56J85j4K50k15m48R4M54j19J09j42J62
4238A57L88m79j58N8J26L26l84l5Q9J04l56J78J96k18l57K51o3J23KK31j03k1
$$ plain form
4075 -55 -51 90 -163 85 162 196 45 -221 -16 93 115 93 61 -140 215 23 -165 -279 143 269 -255 -28 -60
4098 -60 -18 -46 -16 -71 -137 135 157 5 289 -199 156 94 14 35 -251 -12 -156 120 -380 -178 -199 -101 -59 238
4122 238 -98 204 -311 159 -32 196 242 59 -53 14 68 -210 57 67 67 32 381 161 -97 37 -206 315
4144 315 115 131 137 -84 197 -132 0 -6 1 -71 -189 -132 -8 60 -230 93 52 -113 -18 14 149 -116 -77 8 143
4169 143 65 -244 263 -156 106 143 -168 171 -292 -163 -58 325 3 -38 -128 152 -4 -12 -148 211 -63 -244
4191 -244 -57 141 103 31 168 -37 -119 251 -201 0 -226 161 95 86 101 197 -17 -7 -66 13 -39 -102 18 87 -20
4216 -20 -131 -9 59 -146 -57 5 165 -325 -100 197 -159 26 12 262 47 -401 -307 147 28 137 -5 157
4238 157 545 66 -92 -34 92 418 34 -1 88 192 -164 14 210 -8 -365 -114 -177 -54 -52 179 76 55
4260E5r1M2j19pL54j43k6QL0j36j71K20r5jQ7m1J15j22m0L30k97R5l99L30j15
4285a37J48L05l34j41O0n6P5K94ql4k48J5J18j33P6J37n15K98K62k42j50P6J04
4308c0j71L49j79j85M67l07J8L87m09k5J66l67j1L60J71r6j09k07J45J4p9J94
4330I6l13M26n2n18O16m3P2k13jK02l57J08O5j85OK89k04k8M0j94PK56K16k69
4354B2k05J02K14k45L17r0n8k51J89r4l98L54J84K08k04j21o4K53l40J46p2L03
4376A50k91K17L18m15R3j64J76k84J64J15l46J36J75j54N7j55J76r6J09k1O6J16
4398A42l71J95q9J64K54k89o1J30j70J89j4l88L3J73p3J39K73P2l98R2k86J32
4420a51K10j43J51k57J83J26l13J4k66M73j92NQ5L2j98L07L3P5k80J21p9q2J21
$$ plain form
4260 55 -36 6 -113 -120 234 91 65 73 103 -33 -204 16 -79 -80 7 -34 81 -41 -81 249 -48 47 -352 -22 -137
4285 -137 11 316 -18 -159 -99 -155 -80 214 206 172 -76 -61 57 -76 0 137 -378 -80 182 -60 -210 -134 -30
4308 -30 -201 148 -31 -216 251 -56 -38 349 -60 -85 81 -286 -297 63 234 138 29 -178 -33 -19 -98 96
4330 96 -217 209 157 -361 255 212 284 71 70 272 -85 23 88 -97 -91 198 -6 -34 6 -188 -181 75 291 22
4354 22 -183 -81 133 -112 205 115 57 -194 -5 -99 -497 -143 41 249 45 -76 -140 113 -227 -81 -153 150
4376 150 -141 76 394 -21 72 -92 84 -200 -36 79 -267 -131 44 -110 -53 -208 -32 -128 -19 -40 26 142
4398 142 -229 -34 -123 41 295 6 -55 75 -95 94 80 -308 -275 -102 -175 -36 237 309 -89 3 -283 -151
4420 -151 59 -84 67 -190 -7 119 -194 -180 -446 27 -165 -160 -75 -43 -241 66 99 174 -106 15 -64 -146 -25
4443b5J13L7j9K41o47M53m4J95j13l32K25j20j13J75j97O4J49k14K93J25n77M98
4465A67k5j30J15M8j40l75O32r8j14q5l69N08r9Qj46r3j26M77j82p1K40j38K85
4488B89k16j20K28j21j34j22K72j51J08j10p7J08J16p7k09p3J71k6kQ4o4M2K25
4511A41j11K28k06R7j00m5k28K26R6j28Q9k85J28J4K62J04j70k98K36j49K33j71
4533c7l0k39L72J39n3j36j56J03J65q5jj61J31J82q1K33L5k79o2j16Q7J21K8j67
4557gj76J20j20K37j37j35K9R2K87j21j77J24j28rJ88r3L23m94K40j22N2k86M58
4580A45l41J72J52l86L88k88P0l2K5O25o38rj47J61j0k07R7K11L0J45p9k61J84
4603GJ59j29k79J99m1O1J70j31K5k1K5Qm0q3m8j48J32p2J82N2k1K46j57m0p9j69
$$ plain form
4443 -25 88 125 106 347 -300 153 109 304 191 -141 84 -36 -149 26 -171 -107 42 -172 121 246 -331 167
4465 167 142 12 127 175 35 -340 292 194 80 -5 -374 134 35 43 -103 -196 -322 155 -27 -98 142 4 289
4488 289 73 -47 181 60 -74 -196 76 -75 33 -77 -154 -46 70 -7 -216 -289 -118 -144 -146 -62 -126 -84 141
4511 141 30 258 52 149 49 4 -224 2 98 -30 59 -226 -98 -84 178 282 112 -186 50 -99 134 -37
4533 -37 -67 -306 66 205 152 16 -140 -37 128 43 42 -119 12 194 113 346 381 102 40 -76 11 132 160 -7
4557 -7 -183 -63 -183 54 -83 -218 -189 -97 190 69 -108 16 -112 -121 67 -26 297 -197 43 -79 -27 -313 145
4580 145 -196 -24 128 -258 130 -158 -88 -120 -95 530 -108 -117 -264 -103 -113 -320 -223 -12 18 163 84 -177 7
4603 7 166 37 -242 -43 -84 -23 147 16 41 20 45 53 13 -70 -118 -266 -134 -206 -24 28 7 253 96 56 -23 -192
4629a92P9K15k97L22m3j0K11m4l88J25J83j32q4J16j46L91l56j55o0L70j28m9
4651g2m1N5J61k35J26j09Q1j41J04O0M1j96N7J4R9K12l05J6J84j89j31O53o78
4674b34M24k11o8K19j77K81m73J63M1K7m2J19j27n1Q2Q4R8J73q2qj57p5j05K12
4698A13k35O5j12j0K81k70J00qj89L53j07PJ26k22J04n4o6K64J80o94K31P3m3
4721a13K70P1j02j67p7N19l24l87K09N9q9nP06o79J16J8P5j0Q1k35O6j82k31M01
4745a0K82j15P2L2n3p7k53M23l19L24p3o52N94k70L62l83j12l0J51K08j67k1K83
4768A96j36J48m01J47l48N86k35k92N90n27L45j35J33J08j76J10l87K50J89l06
4788a41P4K65k18j37K96k0j50o3j78K94l3J94j29j3m33O77m05K6J96N1L4r9k43
$$ plain form
4629 -192 -113 102 -195 127 84 74 285 241 -147 -22 161 29 -55 61 -85 306 -50 -205 -265 105 -23 -72
4651 -72 -113 -58 103 -132 -6 -115 -34 -175 -71 -11 30 -166 -109 -95 4 216 -89 -73 111 -78 -209 444 -234
4674 -234 190 -21 -89 130 -47 234 -239 -76 -35 -8 -50 69 -58 -109 -27 57 155 328 246 238 81 6 -99 113
4698 113 -122 -57 -169 -179 102 -168 -68 -76 -265 88 -19 -12 114 -108 -4 -58 -124 140 320 -374 -143 -70 -113
4721 -113 157 228 126 -41 -118 401 77 -310 -101 -42 -131 -136 570 -109 7 25 100 90 171 -64 2 -180 -411 -10
4745 -10 272 157 229 261 208 131 -122 301 -18 306 233 -419 175 -95 267 -116 -228 -258 -107 101 -66 -87 196
4768 196 60 208 -193 -46 -394 192 -43 -335 255 -272 73 -62 71 179 3 113 -274 -24 165 -141
4788 -141 -67 198 -20 -157 139 119 -31 -94 -272 22 -11 183 54 41 -392 285 -120 -94 102 153 187 88 -155
4811a55J53k24K34j69J62J1PP1J58l57K02k18L29j21m4R7j9j62Q1k13j18K30M93
4834D28m28J36m26K77P5J10k55J0N05l15m4M7k45n7J80r2j60J09l5j9J21J28k1
4857B9j19m5q1N31m89J14J75j80N3k84K7L86N9j80Q8j90K42j41j73J42L84m16
4879f8j56M70k43j3J23J98j24N0o0j30j31K65j65j59M83l32J64m31M11J09m2J8
4901B37k90K62k09J31k10l6K53k85M16k99K02k91q5O0M35j44k43J67J2n3n7k3
4923e0O0j97K03K9Q0k13m9K96j45K31l18K14l05J68%JO5k98J44J77j89J53qj77
4947a28K46N0j83M1k3K37j25j4n0j43J58j64M78m39j5j51J57n2K24j52q0O5L54
4970B91k53R4j00j77N3j62L72j34j52J65P4k37j43M23K7m06J53o2M59k87QJ69
$$ plain form
4811 -155 -2 -226 8 -161 1 12 19 90 248 -109 93 -125 204 83 39 136 117 -45 36 -177 -295 -65 428
4834 428 0 136 -290 -13 62 172 -83 -73 432 117 73 120 -125 -182 -2 -94 -254 -145 -180 -199 -78 50 29
4857 29 -90 -135 -216 315 -174 -60 115 -65 -12 -296 -269 117 176 -4 84 -106 136 -5 -178 -36 348 -68
4879 -68 -224 246 3 -10 113 311 187 237 177 47 -84 181 16 -143 340 8 172 -259 152 261 219 237
4901 237 -53 209 0 131 -79 -115 138 -147 269 -30 172 -119 -204 -144 291 147 -96 71 83 30 -27 -50
4923 -50 10 -187 16 45 125 -88 -137 159 14 245 -73 141 -164 4 4 5 70 -228 -84 93 -96 57 49 -128
4947 -128 118 168 -15 26 3 240 115 101 51 -92 66 -98 380 -59 -74 -225 -68 -120 104 -48 -128 -63 291
4970 291 38 132 32 -145 -92 -254 118 -16 -168 -3 71 -166 -309 114 141 -265 -112 -174 285 -2 6 175
4992A75k99J40k87M72j16m9L37m78K65J4l43Q9J76j47K04m8l20L11P3k16J00j11
5014e8j4n3R8J50j02o9K18k44M6O7k41K53k80J29M7k18K40R7j7JK10k74j50J50
5038a4J14k84J58l5J98m4o07O65j71o6L1j4J71j99K34k08Q7K43oj56J44J04n23
5061a78M6k10K79l43M53l8j74L53j12j29j0L7j90J60J2R9k59K74Q3n34M77k22
5083a26K54j92J44mM07l02p4j60n2P6J00RJ9Pj62R8p6j28K47j91r4n2J84J80j77
5108f5J79l49L36j68r4K62J82l0K80p69K24o1J67k69K04M7nk49J16J5j08R7J51
5131I3l7k71L76n1J0j71L7J52j0J5q5J13k59K72jl85J17J04n8J24n7M34n89J97
5155G0K93k58P3j60j16M08k42o4P6k16K24J5K32k23j21m2Q0j88K08j54j57O6K37
$$ plain form
4992 175 -124 16 -271 201 85 36 373 -105 160 174 -169 -80 96 -51 153 105 -215 96 169 -47 53 -58
5014 -58 -72 -125 -27 123 21 -48 170 -74 -28 39 -202 51 -229 -100 -53 -271 -31 66 49 50 260 -14 -164 -14
5038 -14 100 -184 -26 -61 137 93 -514 151 -20 -86 -55 -69 102 -97 137 -71 16 259 253 97 241 345 -178
5061 -178 -132 -342 -63 -406 47 9 -165 188 76 -53 -63 -26 -216 -56 -44 55 -204 70 153 -381 96 -126
5083 -126 128 -64 80 76 483 181 107 -53 -105 -29 71 80 99 106 -56 42 -34 -162 85 -106 -200 -252 -68 112 -65
5108 -65 114 -235 101 -67 -161 101 283 253 533 -236 -12 -73 94 -175 29 76 71 -178 -62 -47 -155 -58 93
5131 93 56 -215 161 110 120 -51 -14 138 128 143 58 171 -88 184 183 -202 -85 19 -39 85 28 462 -127 70
5155 70 363 105 178 18 -98 310 68 4 80 -136 88 103 335 112 -9 -51 29 -159 49 -105 -262 -196 41
5178D1K1K07l09q8J62M3jl65L28N0l62M04k93J16J56K5m11L51R0l17L78j59l5
5201C2j04r8k03J97K90m28K48L73k73o3l38N39Q0m27K19J27j43j90M88Q9k31k2
5223A62k53J63pl18R1j59K54R9p2L49j77k00K9k50J61M2n9L80l89J65K22J23k36
5246A20j59j86L48j80j9r4K73J9k11K45M7j88R8k40J04J73m80M55Nq2l3J60K9
5269B04p0j38r9J99j03l27L84j25J03o0r5K39k26L62l07J99j1k63K36m03K65j65
5291b01K15j13J70N7j39n7J90k63M66l44j2j86K66k75R3K15p7M56n10l26K15J25
5313c5J56K38k86l84L96j59p2N2K46k9l29M03k04J95k55n4O1J01k1J07j67o8j0
5336a18J92Q6J44k12qM9j00n1l15M69k85k7L84k69J5JR7M7j86K89j22j79J59o3
$$ plain form
5178 41 62 269 -40 -128 34 77 76 -289 39 89 -273 131 -162 -46 110 135 -276 75 165 -152 226 67 32
5201 32 -72 -170 -373 -176 114 -314 -66 307 34 -29 -367 172 252 -175 44 171 28 -162 326 415 184 162
5223 162 -91 72 65 -253 -162 -321 -67 32 -40 309 132 -68 -39 -289 -128 -86 -145 235 -154 11 233 356 120
5246 120 -39 -225 123 -57 -76 -170 103 122 -89 156 203 15 113 -127 -23 150 -330 125 130 48 15 175 204
5269 204 134 -4 -103 96 -7 -334 50 -75 28 -32 -127 112 -114 248 -59 140 129 -134 102 -301 -36 -201
5291 -201 14 -99 71 128 -11 -68 122 -141 325 -19 -31 -217 49 -226 -133 82 5 461 -49 -375 -160 -35
5313 -35 121 359 73 -311 85 -74 -146 -94 152 123 -206 197 -7 188 -67 -121 -60 41 20 127 -40 -108 -118
5336 -118 74 160 304 92 84 133 33 -18 -333 136 -149 -176 208 -61 -46 -45 52 99 -87 202 80 -99 60 -3
5360cO7lm7l98N91k92L01l78K97j83K77l17J33J17J6l91j60N26k09m0N7Q0k21
5383a80L39m82K49O8K4L64k39l93Q3J29K9j69M54k63j22j9j04J95l3n4k7L74m35
5406b12M61j27k79J64Q7R1l97M17n19K53J30l9j60L7K28j75Q6R3j71L0j6k42K22
5429c8j7R6O4k02qnK94k64j17N57l77J0O7j57o1K54P0k2j04k5J03k90J48j32k40
5454c96N32l45L88j0l87k13N56l71j48K65J14r9J43j03j09K36K7J60l86k3j49
5475c18L42L28l73J90k16R5O3N3j22o3J21j83K52J20k41q3j44J37J31l52J57N39
5497D33k72j40K10l1j0j18j88L66j27j91J42j83J97j70q3Q2p8K43J01n26O51k36
5519G2j06j20J1k25M44L0J4l39K52j12LK77n45K53L19j95Q8M58p04K53o9j67J49
$$ plain form
5360 -3 64 61 14 -384 207 -85 216 -162 135 -48 229 -88 45 162 178 -213 -373 153 -56 -96 -39 41 -180
5383 -180 159 -323 -74 -6 18 382 143 -250 -167 -38 -9 -178 276 13 -109 -128 -232 -37 -70 -124 -151 223 -212
5406 -212 249 122 -157 7 94 185 -212 205 -314 -61 69 30 -130 -93 135 -40 46 139 -32 -2 -18 -260 -38
5429 -38 -55 41 105 -97 -105 -110 184 -80 -197 360 -17 -7 60 -97 -158 96 166 144 40 15 118 -172 -24 -156 -396
5454 -396 136 -209 179 169 -218 -431 125 -246 -394 -129 -15 -114 29 -74 -183 53 80 240 -146 -169 -318
5475 -318 24 352 -21 169 -47 48 111 164 42 -21 100 -83 169 289 48 -35 -179 -42 89 -263 -106 433
5497 433 161 21 231 200 190 72 -116 250 123 -68 74 -109 88 -82 -165 -83 -161 82 183 -343 308 72
5519 72 -34 -154 -143 -368 76 106 120 -219 33 -79 -76 201 -344 -91 228 33 121 579 -125 128 59 -108 41
5542D1J73l60L07j52j76L25k09R2m0j1n23N58NL3j25Q3L07j57n6J30j91M5k4j00
5566b5L5K3k62J94J05n1j10K38l82j4L40J77k33n0k3l70L14k23L88Q0k83Q1K22
5589A71l21K58R7k80J67j01p0J88j04j5j40J67K29l15P2rJ73k94L37m77O63n29
5611a33Q3k1K69K83p91K45j20K07j59N71m50K8L43j78j8P8k56R2k2K20k93K37
5633B15l15L6K40l15J24j74K00o8K45J28k83P0om7j62o8M56J70m44J4L0j21Q7
5656A2K42j33j39K60m20K19J60k94j30J22K1K3L51l86L27k32L86m50K33j65o3
5677e6L3J45j09P3j23j30M21J7k4m07J99j09k1L05k27k02K19j22N8j25O8N9J79
5700A21k18J30O4k46R7O8j53K1L66l36K95j34m82K96J67k27J30K07o6J7m0j72
$$ plain form
5542 41 214 -146 161 9 -167 158 -51 41 1 -10 -533 25 30 63 -62 21 328 171 115 245 54 99 75 -25
5566 -25 10 33 -229 -35 70 19 -91 147 -235 -249 91 268 35 -15 -38 -408 -94 -317 71 151 -132 -51 171
5589 171 -150 108 205 -75 92 -9 -79 109 5 -10 -150 17 246 -69 3 -6 167 -127 210 -267 396 -133
5611 -133 -50 -71 198 481 -310 -65 -185 22 -137 434 -16 12 355 177 159 237 -19 73 51 271 -22 215
5633 215 -100 -64 176 -139 -15 -189 11 -57 188 316 33 103 97 50 -112 -180 276 446 2 16 46 -75 12
5656 12 254 121 -18 242 -178 41 201 -93 -223 -101 -80 -57 294 -92 235 3 389 -61 172 7 -56
5677 -56 -23 122 13 86 -37 -167 254 271 247 -160 39 -70 -91 214 -13 -215 4 -118 -60 -185 -117 -58 121
5700 121 -97 33 97 -149 -52 16 -137 -116 250 -86 209 75 -407 -111 56 -171 -41 166 100 117 77 -95
5722i5q5L98j38r4k38K07J4R9l6r7N5L2j13n7J49j89j1N76k92n3q5J76K7j70J95
5747A75n06K64J73k66K67K7k24k3Q2Q4j55J63n13N00L1q9J16L50m20j44J74j06
5769d0N9r9p4N2R5j02q9M01m19K16Q5l01j48K81j43O32m82L98k19n0j97K86l88
5792b46k04M88l8o7J05J40k92K47j60%j9J10l8p2R1J35j51rj45K00Q1j41k15L04
5816A04j30Q5o1J8n3l16J12L22k33K19Q5k36J27p3J60l82N60k64%K17j39J65m05
5839a18R2J92k77L01k41K64r3l00P1l9L60Q9l56J38J22j95J10j61k5K22j06j18
5861f8J44q9r0K46k35J53q0p6KP3k6K91o2k08J17j69J54n1J1Q6k6J43m42j83K44
5886a41K11K77l52j94q9K81q0N2O3l28M50l38K77l4M4k23k9k8N7M83m34j42L02
$$ plain form
5722 -95 -180 218 80 -14 -252 -45 -31 68 32 -65 -10 22 -91 -148 1 -188 -199 377 85 32 -53 123 150 -20 175
5747 175 -331 -67 106 -160 107 134 -90 -113 -31 53 -102 61 -452 48 79 -10 106 456 36 -108 66 -40
5769 -40 19 -80 -154 -102 -7 -109 -198 203 -216 0 85 -216 -364 -83 -226 406 -76 322 103 53 -144 142 -246
5792 -246 -450 38 0 -67 38 178 -114 133 -27 -27 -46 64 26 -46 45 180 29 20 -125 75 156 15 -200 104
5816 104 -26 59 -2 16 -37 -353 -241 81 -152 67 152 -84 43 -30 130 -252 308 44 44 261 122 287 -118
5839 -118 -26 166 -111 190 -51 213 120 -180 -109 -148 212 301 -55 83 205 10 120 -41 -66 156 50 -68
5861 -68 76 -13 -103 143 -92 61 -19 -95 -93 -20 -46 245 183 -25 92 -77 77 26 37 123 97 240 -202 -385 -141
5886 -141 70 347 -5 -199 -288 -7 -87 -35 28 -300 150 -188 89 55 99 -124 -153 -181 -124 359 -75 -217 85
5909H5o8k01L7J86K15k01J3m2j83n8K85P7J43o0q3k8j55j51K48p9l94M07j62J92
5933B3L9o2j02oL2J76k00l4K00j89J48k39J78j68K65j7J0l8O2j03J1j57L49j07
5957G1J85p7n7q8N8q2J10r9K27k45jk12K6L87k82L67k40k11N94m63p8pk70J75
5981b12L42k70n6K20r2L58k79Qn9l53L46J46j85K53l93K31q3L3J6L93m70JJ0k18
6005c13K71j82M29k21l32L07M7j29J85j54N6K30l5j08j42P9l03K89J70l04L04
6026A44l78J72K27n0l28j15K85P6r7Q8p3j1M07k97l45J23J35j85J09P7j38J89
6048A5p3J84J3l83J64K46N4k44J99M9q3l21J6J44K50n06L36j19J34M6j04m35K7
6071c91M06J61j75r4o7J63J4J4K03l78K96k30K69j88j11M09o5k20j1K79o32J24
$$ plain form
5909 85 17 -184 -147 39 254 53 66 24 -159 -217 68 145 288 228 145 117 -38 -189 59 -20 -414 -7 -169 23
5933 23 62 0 -102 -108 -76 100 -100 -134 66 -123 25 -214 -36 -204 61 44 54 16 78 -25 -14 -171 178 71
5957 71 256 179 122 34 92 10 120 21 248 3 2 -210 -184 203 -79 288 48 -163 431 -32 -110 -117 -387 -212
5981 -212 130 -140 -196 24 -68 290 11 19 -40 -393 -47 99 -86 167 -226 5 -78 -45 -29 364 -106 -105 -95 -313
6005 -313 -42 -224 205 -16 -348 -41 6 -123 62 -92 -36 194 159 51 -91 -12 -315 -26 144 -160 144
6026 144 -234 -62 165 115 -213 -328 -43 33 -64 24 -49 -60 347 50 -295 -172 -37 -222 -113 -36 -174 15
6048 15 -58 126 139 -244 -80 166 220 -24 175 224 141 -180 -164 -20 230 -276 60 -59 75 121 17 -418 -391
6071 -391 15 176 1 -93 -160 3 17 31 234 -144 152 -78 191 3 -108 301 236 16 5 284 -348 -224
6093b24J54P6j60P8r7r5K80k78J37K32j94M2q4K64j59J07R9j23k75K07N0j98R3
6116f8J3k06K49O6J43j16L3Q0m54k7K52J30r0j36L8K79p7Q8j21j75K87k76J25
6139C7K75l40j64J76J5O5K16kk32J86j32L9j01M4j02K14K9k70j71M23j71j23R
6162h0O3K88m08o3L37KJ28m4k12p2l8M0m7K99m08K11q5J06K80n22K91qJ42j32
6186F8j76L63Jl12J5k31L19j7m35M64j7L94l46j62L8k66O53m48k1J29Q9J09n32
6209c21K68P1j07K04L0k05j0j79M94j03j50kj87O6M4J93j31m9L30l57O6o0n1K45
6233I9K05k58o4J89Q1k97k1K89l06K45k70r7K41J34M7nl91L5K85j45k7K03k98
6256a26M41l46j42K54j0j32L31m99p7k2N66k55kl7l7J4j9J62j87M2m0M32J17m13
$$ plain form
6093 -224 -70 6 -154 -76 -173 -268 12 -266 -129 103 -91 -49 -133 131 -28 79 178 55 -220 -13 37 -161 -68
6116 -68 -55 -261 -12 54 197 81 114 194 -260 -287 -35 95 5 -131 -93 186 109 197 76 -99 188 -88 37
6139 37 312 -28 -192 -16 -1 64 280 278 46 232 100 139 38 82 -20 194 223 -47 -218 205 34 -89 -80
6162 -80 -17 271 -137 -200 137 139 267 223 11 -61 -99 -59 -106 193 -215 -4 -89 17 297 -225 66 58 200 68
6186 68 -108 255 256 -56 -41 -272 47 30 -405 59 42 436 90 -72 -34 -300 353 -95 -116 13 102 211 -321
6209 -321 -53 18 -89 115 145 -60 -70 -249 245 142 -8 -10 -197 -131 -87 106 -25 -74 256 -101 -35 -95 -146 99
6233 99 304 46 -18 171 252 -45 -66 223 -83 162 -108 -205 36 170 217 212 -179 -144 141 -4 -31 172 -126
6256 -126 315 -31 -173 81 71 -61 270 -229 -306 -328 238 -17 -19 -56 -93 -79 -98 64 -123 -81 -121 311 428 15
6280A5m8j6J31j77P0k3k49M25Nj66J02m79M67k26J94K6j19M26m41m6K10k03K97
6303A75k0k42J94q0J61j98l2J1j24J78j6J38k59J38P2k81P1k30M05p6J55k47K87
6326A80l60L17j76R5Q6j78K95m66K16K9k17K48J01L3l67J31m6K30l27K10j7j76
6348a59N4J26J08j16J88j98J4K8j37K39j50j65P5J77R6k06n9J1J61p1P5k9r6l
6372c7k46L27j68J77K7k22K34k4j50J07k05J24r1J21J17K42l32K36Q5l03l20M07
6394A06j32M54m17p7J57J30n85J57L90k8k76L7j29J32J53k1O1m77M26J40j40M
6416F5m8K79j41j34j06J31%o0P1j42J36j2j3j2q9J43k61N58l91J1N6j05L6J24
6440I6j17J28L1l82J62J17l64L11j1K29j42K9j47m6J55j67L75j29k55Q4K22j18
$$ plain form
6280 15 -33 -49 82 -95 -25 -48 -297 128 133 -33 69 -410 57 -169 25 51 -68 358 -83 -129 81 -122 175
6303 175 155 -87 107 27 188 -10 -42 -31 -155 23 7 145 -114 24 96 -185 -114 -344 61 -15 140 -107 180
6326 180 -180 137 -39 56 142 -36 259 -207 9 38 -179 69 170 203 -164 -33 -79 151 -176 34 17 -159
6348 -159 -105 21 129 13 201 3 17 45 -92 147 -3 -168 -93 84 180 -26 -85 -74 87 16 91 62 -34 -37
6372 -37 -283 44 -124 53 80 -142 92 68 -82 25 -180 -56 -147 -26 91 333 1 237 322 19 -301 106
6394 106 -26 428 11 -66 91 221 -364 -207 183 155 -121 -84 -213 -81 72 51 112 -365 61 201 61 65
6416 65 17 296 155 21 -85 46 46 -14 57 -85 51 39 26 14 -75 68 -193 365 -26 -15 41 -64 -28 96
6440 96 -21 107 138 -244 -82 35 -329 -18 -29 200 58 87 -60 -106 49 -118 257 128 -127 -43 179 61
6462F1k42R4N5j87O2P1K69j11j01j38P4k2L82j97j65N4j77K40k6l0J68n1O4j89
6486d2j12M62k57n48M29K33k68r7J01K05j72M00k80K33k87q3J30j10o9j81L57
6507D4M2k18J67R0K81m55K89m8o7j87j56N9K31OP8nn50P59k6l58n6j41J20J14
6531A3Q0l84K59n8j5L46m39L39j7l43L52J2j92J24j12m1K77j85K05%k18q3J56
6554G6L8k79q1L71jP2l22K03j61J11K58pj98J00N4m75K53pM00k95j19j19L10r7
6578H5M7j31K58j23j88J37m19K00K42J11m64K66j14J42J90j32k27J35j98K09N9
6599H5L8k36j2L32O8m17j08L97r1j2k62n6K80j86L30p8J37j79O4m18J75J17k07
6622b39L09j61M1p6N5J81j31J32l68J46N4j22Q4n1P1M73m43k11M90n53L44J18
$$ plain form
6462 61 -181 -87 -32 -219 -157 -86 183 72 -29 -167 -93 -115 267 70 -95 -41 -218 22 -4 -34 134 83 147 -42
6486 -42 -154 308 51 -497 -68 165 -103 -200 -99 106 -66 334 54 287 0 -83 47 -63 -132 -313 44
6507 44 86 -132 35 125 406 -49 240 192 125 -62 -218 -159 72 78 156 151 -399 360 334 -24 -80 -221 -101 13
6531 13 93 -291 -32 -90 -105 241 -198 141 124 -219 133 145 -47 77 -35 -76 201 16 221 221 3 -80 76
6554 76 114 -165 -246 125 124 196 -126 77 -84 27 285 278 80 180 234 -241 12 5 405 110 -9 -128 182 85
6578 85 132 1 259 136 -52 85 -334 -134 108 219 -245 21 -93 49 239 107 -120 15 -183 26 85
6599 85 123 -113 -125 207 275 -142 -250 147 56 44 -218 -274 6 -180 150 72 209 30 94 -324 -149 -32 -239
6622 -239 70 -91 -50 -126 -71 110 -21 111 -257 -111 -57 -179 -95 -146 -75 398 -45 -256 234 -319 25 143
6644A43M7k05N1j12M6J45l00Q7M20m35M07k26j67K3K18l31J49l9l76P54l19q1
6666a01j72M86j3m26O3q1KJ15k96K76K22O1k48J69k0O7j39j47M08k18K12n01L02
6689B1O7k06L49k53P4j07J9J13J3O5l46K94k36J65l06M29k44J43j71k02M95j4
6711A62j03j86k98K54K82l54L02k38J22j37j01K99l17K87L62k13q8J37M5Ol74
6732a51lJ89j2L9j62J91k88j16N74k04k42K33k09J44J68J60j0j83j54J63k22M66
6754C71k03Q1m22m3K46Pl6r9K19k09K77k03k0J26J9l22K69n1K01Mj91J87O7n3
6778B22l02J9l26N21j53j18J3J43J2J02o0k66J45j21L23k89J34R9l5j5mJ95r6
6801A43K45l22Q0m17P2K10k29O6J81q2k27L98r4k8J47K08j38j02j8k6j85J59n7
$$ plain form
6644 143 190 -15 36 -76 -30 115 -185 -98 322 -113 294 68 -99 -76 142 -189 -40 -79 -455 299 -20 -101
6666 -101 -273 213 200 -226 -163 -244 -242 -127 -423 -147 75 136 -112 57 37 104 -35 -182 226 8 220 -281 21
6689 21 88 -118 231 -22 52 -55 -36 77 90 155 -191 103 -133 32 -274 155 -89 54 -117 -319 176 162
6711 162 59 -127 -425 -171 111 -243 59 -179 -57 -194 -295 4 -313 -26 336 123 35 172 217 223 -151
6732 -151 -154 35 23 62 -100 91 -197 -313 261 57 -185 48 -161 -17 151 311 301 118 -36 127 -95 371
6754 371 168 249 -173 -216 30 37 1 -98 121 -88 189 -14 -34 92 111 -211 58 7 208 212 21 208 275 222
6778 222 -80 -61 -387 134 -19 -137 -124 19 31 133 73 -193 -48 -169 154 -135 -1 98 63 48 44 239 143
6801 143 388 66 146 -271 -199 11 -218 -152 29 -53 -280 118 24 -4 143 351 213 111 93 67 -118 41 -16
6824a6j31K94l0k87l0K88l98L05oK85k23j07J04J41j30j40K36j79K21k72j02J36
6846d1J26l51L43j25j19M52l17O6o9K26j62P3n6m0p6m1O5r4M07l62j70M55m6K8
6870A72k57R9o2L36l98O3k51L58j91N8L00k44L2j6K31n75j7P32k86j99L91m47
6892a71J43l47N08l0k7l9K9o0K3j67K39N4k64K7J76j5r2R1l06K66J00m05K88N4
6916G5oJ52l85J20K27k33j57J49Qk2K14J75k15J00k43Op0J97k5qN5j33K57k23
6940A5O2p7k02K7J49N2K82k43k37R1l49K53K1L86m54Q8Q9k58l2N86k16l8J16p5
6964C6K7l54J87J19j15K81Ok90M8J68Nk71K24j42J60l0k9K82j09n28J2M65k03
6987e1J26n7j4j52L02k16J52j13j11O2R7k6kk09N77m35J71J81j20k60L32J3n63
$$ plain form
6824 -16 -147 147 117 -170 -200 88 -310 -5 -11 274 51 -56 48 189 59 -81 155 -24 197 -75 -177 -41
6846 -41 85 -266 77 -48 -167 285 -32 34 -35 191 29 102 46 6 -70 -111 -46 -140 267 -95 -265 190 144 172
6870 172 -85 14 -48 288 -110 -47 -298 60 -131 -73 227 -17 15 -1 230 -345 -362 370 84 -115 276 -171
6892 -171 -28 -375 133 103 76 37 66 6 29 -138 101 155 -109 -82 94 79 -13 78 -228 38 138 -267 21 75
6916 75 69 221 -164 -44 183 -50 -207 -58 -50 -72 142 317 102 202 -41 -35 -105 92 67 59 114 -19 238 15
6940 15 77 0 -202 -175 -26 26 308 65 -172 -81 -430 -177 -156 230 -224 -136 -47 -305 -337 249 33 -5 111 36
6964 36 63 -291 -104 15 -100 181 187 -103 -55 113 118 -153 71 -71 89 59 30 312 203 -325 -313 152 -51
6987 -51 75 18 4 -148 154 -62 90 -23 -134 -72 25 -1 -3 -212 365 -70 101 282 162 -98 234 247 -316
7010c16K13K87j11k24M17j51j62N63m17l5o8P7j15K9K4j22J15j96L57l35J62m6
7032e4K86k25n6j55J06m5L47k94k10L71n53O96k27K3J72l73L16K2r6j16K5J31
7054I1k35n1M32J75n42J49r7r8K20J24j59J26q3q3j12L88l01l2l1rJ41K18k1P5
7078B85n46M09ql20K93l35M1K23k22O0L09j64MK30k61j72K09J3J29l74J60J2M5
7101B0l92M81j69Q0Q2j94o8J41k28M42m55K80j9p9j00K32n4K47j42o5l48M80N6
7124B28n2k44M3n7J05O6m22L03J07l23M3J44j77L47K70n69K0K72M1j73N1JJ73
7147A97p3m7O7P0k33J34k38r9K82j14j10J55k01K86n6j02k5Q2k8O1M7j36J20K31
7171B70j72l51L17n6j46L4K49k47M44l99J1M0J39l2Q2j64j26J23j03O8n8J12k9
$$ plain form
7010 -316 -103 184 73 -151 266 115 -47 516 99 64 -4 73 -42 -13 11 -111 4 -192 165 -170 -8 -54
7032 -54 232 7 -49 -204 -98 -143 204 -90 -300 71 -482 214 -13 10 182 -191 125 147 51 -65 -40 91
7054 91 -144 -195 237 412 -130 19 -78 -176 44 168 9 135 52 -31 -143 245 -56 -88 -119 -128 13 231 210 285
7078 285 -261 148 140 -180 113 -222 -181 42 -180 -120 189 25 29 259 -2 -174 35 48 177 -197 -37 -25 20
7101 20 -372 109 -60 20 102 -92 -160 -19 -247 195 -260 20 1 -78 -178 54 0 247 105 40 -308 172 228
7124 228 176 -68 -25 -82 23 89 -333 -30 77 -246 -203 -59 -236 111 381 -188 -168 104 145 -28 23 24 197
7147 197 124 77 144 214 -19 115 -123 -222 60 -54 -164 -9 -210 76 20 -82 -107 -25 -53 8 55 -81 39 270
7171 270 98 -253 64 8 -138 -104 145 -102 342 -57 -46 -6 133 101 183 19 -107 16 -87 -19 -77 35 6
7194FPo4j19L90j57m6J82N0m23K8K61j12J85L7k98J42K0n6k75L61k24j25K17K08
7218A95l91O3P8J30k6K40rm28J55qj08J6J20M9o9N4j94L47l69K82j90N75m21M1
7242A32k49J89j25nK03r3J8j12J4M1k25O6K07j09j71j99L36j46J57j63M42j09
7264I9k88K23K5l32K24k4j9L44l00q0r7L49k38K58l6r4j82K77l9j89R1j57L8L53
7288B06J5k17R7k2j57L84n57K73J58J31n96J76K56j13P5K8q9k51M85j45k92K69
7310A14J44l82N3j27M89l87N0K85k18m1O1j30J70j79J98k50K08kJ59j73J18j77
7332a7j41J88j56N5o3q5P5M30k59Q1K27m32o7K00L00l74J1P2j5l63K28K27k50
7355a28L88m24K43j52J20j45j8K9K68l32L89k63M7j69K9K04PJ32m33M54j68o3
$$ plain form
7194 6 13 -51 -170 220 63 17 199 249 -174 -146 115 3 188 225 -73 69 89 33 -242 119 -105 -230 -13 195
7218 195 -196 -133 -55 75 49 289 280 -148 7 -1 -109 -93 27 76 7 61 -133 214 -155 127 -63 512 91 132
7242 132 -117 72 -53 -58 145 52 70 -42 -28 13 -212 -146 61 -48 -219 -418 -82 -228 -71 -234 208 99
7264 99 -189 34 59 -273 -49 -73 -92 252 -48 -128 -225 124 -114 144 108 14 -168 109 70 -119 -28 -185 -147 206
7288 206 221 4 101 79 -78 306 -251 22 180 311 -285 -109 147 34 109 137 48 -203 282 137 -155 114
7310 114 258 -124 -71 -198 291 -96 -46 239 21 -20 41 -89 81 -98 100 -150 58 56 215 42 160 -17
7332 -17 -158 30 -126 -71 -134 -219 -144 286 27 108 335 -97 -164 36 336 -38 -27 45 30 -333 -105 122 -128
7355 -128 260 -164 79 -73 47 -98 -116 -87 181 -151 238 -25 22 -147 -118 86 93 225 -208 246 78 15
7377A5k02K05j88K24K61o60L73l33K25j00J41J52k87L39l6j35m06L90L96l99n
7398c0K7J28J33m43J85K55k07j3j1J20m7m9j12L1J7J67j63R7j78k14L72n2j26
7421a13Q6R3p6K0k0j4J4J89k37lO9QL86k99l05K89P4J4j17rJ28l0j3o6J50r8k28
7448a08OJ47K72l53Np3J9J16p9J95k81K3K83l63J89K5L00k43J2J84j22m8n9o2
7472a5K64k86nK19j71K84n07J16L28k30J61Q4j17k76j3P8R3K6j7J03p2K4k09J63
7496B5k96J74J07j03L41k12l44L80q7O7r0j13j15L57k25J54k12J63N1j77L0K6
7518i9K91J51k89N8o4J31j54m7M8L4R3l79K78k52J12M70k16l88R6J4K1K80j15
7541G4j7m1j1P5J71l62n7P3J73R0O8o3j72J06Jl00M4M2J56j86J36j74L61J42m4
$$ plain form
7377 15 -187 18 -170 54 315 -345 28 -305 -80 -180 -39 113 -174 165 129 -6 -412 -22 374 -25 -30
7398 -30 -3 125 258 -185 0 255 48 35 24 144 97 48 -64 -33 -16 151 -12 85 -93 -307 65 13 -113
7421 -113 -27 66 -10 10 -10 -24 -10 179 -58 -61 8 16 402 103 -202 87 161 175 58 49 177 147 134 68 218 120 -108
7448 -108 -102 45 317 -36 -31 -104 -85 31 -48 147 -134 -111 172 -191 -2 23 323 80 92 276 154 106 47 -15
7472 -15 249 -37 -42 177 6 290 -217 -101 227 -3 158 242 125 -151 -164 -86 7 33 16 119 47 71 -138 25
7496 25 -271 -97 10 -93 248 36 -308 72 -15 52 -38 -151 -266 91 -134 20 -192 -29 22 -155 -125 -99
7518 -99 192 343 54 112 48 179 25 -22 26 60 153 -226 52 -200 -88 382 166 -222 -126 -112 -91 189 74
7541 74 57 16 5 80 251 -111 -168 -95 78 168 236 173 1 107 108 -192 -148 -106 50 -136 0 -174 187 329 285
7566B85j7l96K85k15kK31k6j50L78p01M54j40k58J44J72j22k27J49J34k06M12
7587A84l35K3J31P0l2O4j62j99M51l11P5K00k79L58j15N4l75K83K96o27R4K2M1
7610h9J69m14J34r9J79K01j82j7k30J93K53j45L33k84j27K20J93k23k75M55j46
7631I9l0J45j54op7M4k0o2K07k22J7L23o59M66J75k03J8n4L27l91M80l61J2o9
7655Ek75J84j34L80l90L00k11M76m8l39L37l92k02K67K2N0J55K52l13r0l8r9J1
7678i2j2M9Lj59M38j93p0L11j53l2J3k1J21K03K8l59j90r5k59M64P0k22K01Q3
7702A27j66L0j04K4K21j82j7m5p2n8Q0J94Qk28K29j2j34J06k97j49K83K1J59J56
7726A74l77L78j34j85O6K11o8j39O4MN2j40MJ73L2N2J33k60K16k80Q1Q6M6r7k11
$$ plain form
7566 285 268 -128 157 -58 -60 171 145 -5 373 -328 126 -14 -272 -128 44 -78 -305 -156 -22 -228 184
7587 184 -151 -128 3 73 41 105 -57 -256 195 -116 -41 159 -120 238 123 177 -198 85 381 -246 -152 -130 -89
7610 -89 80 -334 -200 -299 -120 81 -101 -118 -348 -155 98 -47 286 2 -125 95 288 65 -210 245 99
7631 99 69 214 60 54 -23 21 1 -61 146 -76 -59 264 -395 71 246 43 61 7 334 -57 423 62 74 5
7655 5 -270 -86 -220 160 -230 70 -141 335 287 -52 285 -107 -309 -42 -20 30 185 437 124 34 -4 -103 -92
7678 -92 -104 -55 -52 -211 227 34 -36 275 122 90 103 82 203 406 434 75 -115 -210 -469 -5 65 -157 44 127
7702 127 -39 -9 -113 -89 132 -50 -67 -112 -184 -242 -162 32 40 -188 41 29 -105 1 -296 -445 -162 -141 18 174
7726 174 -203 175 41 -144 -78 133 65 -74 -10 -6 46 -94 -90 83 115 167 300 40 256 -24 57 143 189 92 -119
7751a19O18p24M38r6l27L52k43L09l02k13K39L56l67q8R8J1k03J61m2K65j96J42
7773F9J29k10L48l97j26M36k16qO8r0j14J88l54L56k1p5m0Q0L34n15KJ16Q4J65
7797B09k92M30m54K12l29N46j83p2Q9j04m3qJ44k02J14k02J10K15j80j13N1k53
7819c15L12k4K5J24L8j62q6J77L2j98k33P27m59J77j81k58P3K3N9p4K30k36K02
7842b7M35n93O0J90j05J10k51J28l6J91j9q3r9Qp7R9K0L0r6M40m02J35k42L36
7866A52r6m8j05L45j17j05Ol0L07l73K19j89R0k8K9k06L54m02M8M08k48J74k94
7889a09J05L76Rp7m44QJ47L00k91k6L48m3l54L23k62Q3J66j97k51lL46j14K29
7912B69J9n29L43j3m0k95M65m21J40qK27r6j12L72l01p3o6n1L30L9n1l82K88j50
$$ plain form
7751 -119 499 -225 213 117 -210 142 -101 208 -94 -307 -68 288 -79 -167 -69 -58 -261 -100 -142 123 -73 69
7773 69 198 -12 336 -61 -187 249 33 25 93 3 -111 77 -277 79 58 -17 -57 23 357 -158 -156 -40 44 209
7797 209 -83 347 -107 105 -224 322 139 67 156 52 9 1 145 -57 57 -145 -35 180 0 -113 -62 -315
7819 -315 -3 -27 -2 122 160 -2 -88 89 121 -77 -310 417 -42 135 -46 -304 -231 -208 -149 -223 7 -229 -27
7842 -27 408 -185 -125 65 -40 70 -181 -53 -89 102 83 0 -99 -91 -168 -69 -49 -19 -115 325 -77 58 -184 152
7866 152 56 8 -97 248 131 26 32 2 309 -64 155 -34 56 28 57 -149 205 -197 -149 259 11 185 -109
7889 -109 -4 372 381 304 -140 -132 15 315 24 -2 346 303 -51 272 10 93 259 62 -189 -192 154 40 269
7912 269 288 -241 102 89 49 -246 219 -202 -62 -70 157 61 -51 321 20 -53 -119 -170 160 199 148 -234 54 -96
7936i6J84j5m46L14N3K47Q7l76J57j65J0r2lJ90l02M79j66j49J91Q5j45j84j32
7959b74N20l34J07K03l89J44k10R8jJ15K00k49K06j05J43j20J46j51l22K31o2
7980a04qJ9r9L1K12n5j34k6J45n7R8J91l13o6K85l3j20O6j70j48J89K31m19K69
8004a6J99j02q1j7KK74o9l28L93k01k64K4n2J75J10M5O5j52p8k13K49J11%m22
8028c48K96n8Pj10K58k24J96k93J28r5L53j25J00k89J32k89L43j05j89O75n49
8049a86K15m78J51L6k36P02j92k00QJ39j68Q6K50J5%j20j9k24N1J28q9N4J34j21
8073f4L47k22J32n08M18j7J32l38L11k07j04J88J02p5M8l8l74J70J61m3j6j28
8095a25J11k85M74J06k65j11J30O5j84o6K55Q5p0j97K96j43k03l6J86R3j80P9
$$ plain form
7936 -96 88 73 -373 -59 -6 241 328 -48 109 -56 -46 -138 -141 49 -253 226 60 -89 102 187 42 -142 -274
7959 -274 246 -88 19 222 -167 -23 -233 -135 -136 -21 179 -70 136 31 174 54 200 49 -273 -42 -104
7980 -104 -112 -93 -192 -161 51 -4 -138 -164 -19 -76 22 213 -100 -166 119 86 -34 32 -138 -286 -97 134 -285 -16
8004 -16 183 81 0 -17 -15 259 190 -138 255 54 -210 -186 -238 -63 47 92 157 5 -73 -286 -37 74 74 -348
8028 -348 -52 -110 -103 -213 45 -179 17 -276 -148 -243 110 -15 85 -204 -72 -361 -18 -123 -312 363 -186
8049 -186 29 -449 -298 -262 -498 204 12 -188 -180 -41 -209 -123 127 142 142 22 3 -221 -170 -42 -131 -77 57 -64
8073 -64 283 61 193 -315 103 86 218 -120 191 -16 -120 68 170 95 143 105 -269 -99 62 19 3 -125
8095 -125 -14 -299 175 281 16 -95 35 100 -84 -150 105 190 120 -77 219 76 -127 -163 23 116 -64 15
8117A5l0O0j68J44K59m43M2L73j95K54m30K59j86K53L7j35j40K20r7J11l85M32
8139B50l77N9L33j43M5l55K69p0J3j98K46k17J12j5J21J36l37J41mL32l43J77
8161A75M0k93J17k38J23M12m67Q2j43L69l14j61L7N5L39k81K44j42K01p8K04j77
8183A04j94K80l4J20k28n4Q1J99
$$ plain form
8117 15 -15 45 -123 21 280 -163 -121 252 57 311 -119 140 -46 207 244 109 -31 189 92 203 -182 250
8139 250 -127 -68 265 122 167 -188 81 11 24 -174 72 -145 -33 -48 73 209 -128 13 9 341 -2 175
8161 175 215 -78 39 -199 -76 336 -131 -49 -192 177 -137 -298 -261 -206 133 -148 96 -46 155 77 281 104
8183 104 -90 190 156 276 48 -6 75 274
8191B74
$$ Imaginary data points
##PAGE= N=2
##DATA TABLE= (X++(I..I)), XYDATA
0@%%%%%%%%%%%j6L2l2L2l2M8o4P1q7J12j28J44j76K08k40K88l36L84m48N12n76
32c04O56p52Q48r54J075j206J349j506J679j867K072k296K540k809L102l421L772
49A978m154M574n042N557o127O764p482Q294r220J0292j1547J3039j4846J7091
63I171j9968K3807k9216L7438n1590Q2501k73451K20727L71798o06722K5503M71331
75B61329j43163l30493K92246R2536k57257R050J62016q6676k0161K1428n3473
86e2618N6477P0437j56379P013J75554r9806j28986K14862M4133k35792N1984
97e3121K00182j29601j30359J05720K1523o2307N3392K511m6963P1711L6223p3597
109d686J7548L3095o9631o30N4470n1108k3534M7523k8397j091P1229o3510o5814
$$ plain form
0 0 0 0 0 0 0 0 0 0 0 0 0 -16 16 -16 16 -16 32 -32 39 -48 64 -64 80 -96 112 -128 160 -176 208 -240 272 -304
32 -304 352 -400 448 -506 569 -637 712 -794 885 -982 1090 -1206 1334 -1475 1627 -1794 1978
49 1978 -2176 2398 -2644 2913 -3214 3550 -3932 4362 -4858 5434 -6113 6926 -7920 9171
63 9171 -10797 13010 -16206 21232 -30358 52143 -221308 -581 371217 -235505 -210002 261329
75 261329 118166 -212327 79919 172455 -84802 -75752 86264 -412 -20573 855 -52618
86 -52618 3859 74296 -82083 -75070 100484 678 -128308 86554 130687 -105105 -53121
97 -53121 147061 17460 -112899 -7179 14344 -47963 5429 7940 -39023 32688 68911 -4686
109 -4686 12862 45957 -23674 -24304 30166 -20942 -44476 3047 -25350 -26441 44788 -18722 -84536
122h4536J30075K7622j40728O4847J23889j34184m7484J76983n7899j97956J08898
133c0473J30784j60042o3538J57271M106r9688O5397O9967p1097l0992N7116J0106
145C8917m0821k0973J2978K4366n335k4463P754P929k0545J3831K9299l1761k2691
158c1515N0946K4070m2178j2439K3442o725k5320Q04J5125j0758k2492L2693N1769
171D7422l3162m5555O2162L3968q3706n014P6832n8736p2120R9483L5515j29346
183g2257O215J25270m2720q7151P0846M7906o4848O145O1662k0941m0485J5785
195E427J8680j0041l4394k0693L5589J6448m8214J0553O2775l7248m0354Q0639
207C9167J4337r8729J9684Q5471n3928n2640O4402N407n7679L1812L2908m7999
$$ plain form
122 -84536 45539 73161 -67567 -2720 121169 -13015 -60499 116484 58585 -139371 -30473
133 -30473 100311 -59731 -123269 34002 38108 -61580 3817 73784 2687 -28305 28811 38917
145 38917 -1904 -22877 -9899 14467 9132 -15331 -7577 352 -20193 -6362 22937 -8824 -31515
158 -31515 19431 43501 1323 -11116 12326 5601 -19719 -18915 -3790 -14548 -37040 -4347 47422
171 47422 14260 -31295 30867 64835 -18871 -23885 52947 -5789 -77909 21574 57089 -72257
183 -72257 -66042 59228 16508 -70643 203 48109 -16739 -10594 51068 30127 -10358 5427
195 5427 24107 14066 -20328 -41021 -5432 11016 -37198 -26645 36130 -1118 -41472 39167
207 39167 53504 -45225 -25541 59930 6002 -46638 17764 23171 -34508 -2696 30212 -17787
219a7787n810L8104p448n748R158j7688R851K7194l8723j8771M5920k3993m6941
232e2682O1659K4388q0630K2789Q8635n0541n1390P4730M444p4595L4137M4177
244D5121o7603j6755O0213j6858m0484L0153Q714k4553K0310J6067j9996O836
256A165J6620q838N703K177k5181O319J9556k9150j1147L1915j5271k3777M1817
269A1908R927m9010J6670M5428l3116k5464L8985p45l4852J7739K0317k5553p595
282a5361J8878L300m188m406m302J7827O134k6890N154K6999k8377k3966M1431
295A2233J774n2698J7745M8857l2135k6435M5641J0915l7683J1938L0481k1169
307I464k1788J8600J0413j9029j5091J0080J2383j3625j4207K1403J2649k6660
$$ plain form
219 -17787 -23597 14507 7059 1311 10469 -7219 2632 29826 -8897 -27668 18252 -5741 -52682
232 -52682 8977 33365 -47265 -24476 64159 13618 -37772 36958 41402 -33193 944 45121
244 45121 -22482 -39237 20976 4118 -36366 -6213 2501 -22052 -1742 14325 -5671 1165
256 1165 17785 8947 14650 16827 -8354 -2035 17521 -11629 -22776 9139 -6132 -29909 11908
269 11908 21835 -27175 -10505 34923 1807 -23657 15328 14583 -20269 -2530 17787 -7766 -15361
282 -15361 3517 6817 2629 -1777 -6079 11748 17882 -9008 -3854 23145 -5232 -29198 12233
295 12233 14007 -38691 -20946 27911 -4224 -30659 14982 25897 -11786 152 30633 9464
307 9464 -12324 6276 16689 -2340 -17431 -7351 5032 -8593 -22800 -1397 11252 -15408
319a5408L009L7735j3045l2500K8467K2196l6575q873L1890j0413k5651J7479
331a689J1633j8397o61J2483q27j123j390n241J0089M573j9820K328K0821j6632
345c853j5929K7850M398l0459J3185K9345k3228j3896L0376k505k8582J5270J4316
358A6288k7002n864K3828r697j8714J7623R758j6609L721J8422n418r241J0811
371G906N481r571k904L878j436n723m013J719L686m214n340P622Q318r324l942
386g857J5617K367j6302L562J6148j1088j4591J5087R033j9927k334K0669m081
399F303j6100J0289J1586j3238n728J1684p41j0817M00N452N31m353k308O031
413a009N908o750j121J3784k207j4024J1294J1633k1260n976K0639q667k1202
$$ plain form
319 -15408 -12399 25336 12291 -20209 8258 30454 -6121 -14994 16896 6483 -19168 -1689
331 -1689 9944 -8453 -9114 3369 2542 1419 29 -5212 4877 9450 -10370 -8042 12779 -3853
345 -3853 -19782 8068 12466 -17993 -4808 24537 1309 -12587 17789 15284 -13298 1972 16288
358 16288 -10714 -16578 7250 -2447 -21161 -3538 6220 -10389 -6668 11754 6336 -2905 7906
371 7906 13387 3816 912 4790 3354 -2369 -6382 -4663 -977 -5191 -10531 -2909 5409 -3915 -7857
386 -7857 7760 10127 -6175 -2613 13535 2447 -12144 2943 11976 -7951 -10285 10384 6303
399 6303 -9797 492 12078 -1160 -6888 4796 4055 -6762 -6362 -910 -379 -4732 -7040 -1009
413 -1009 4899 -1851 -2972 10812 8605 -5419 5875 17508 -3752 -9728 10911 2244 -18958
426a8958J5819J0345k3179K874K5636j1742j5271K1184P408j8825N168J2643j2431
439F71m537J0891m468o843M527l253j427R139p615q580J6785K592j9496J0493
453a121J6623k3014o266K9460r021k8842K2257J9112k8179j782K9409j2081j9419
466a2864K1394O774k4530K475J4327r862n446O990m594k01Q220o827k575J4339
480G620n575j0125J8985L944k3672Q380K1686k1890j4252K4865m764k6976J8315
493c459J7979k7602l399L0431p045j9980J5971P736j7539N321J1677j2470l051
506e430J2411m247m991P081o174m518J2739m841j2655J4830M162k0266R492J8809
520A6402k5166j1590L2419l194l0932J9290K2429k6709k733L2000j2997k5404
$$ plain form
426 -18958 -3139 7206 -15973 -13099 12537 795 -14476 6708 14116 -4709 459 13102 671
439 671 -3866 7025 2557 -4286 241 -3012 -4439 4700 -2915 -11495 5290 7882 -11614 -1121
453 -1121 15502 -7512 -13778 15682 6661 -22181 76 19188 -8991 -10773 18636 6555 -12864
466 -12864 8530 15304 -9226 -6751 7576 -2286 -7732 -742 -5336 -5537 2683 -4144 -6719 7620
480 7620 2045 -8080 10905 14849 -8823 -443 21243 -647 -14899 9966 5202 -21774 -3459
493 -3459 14520 -13082 -16481 13950 6905 -13075 2896 10632 -6907 -1586 10091 -2379 -5430
506 -5430 6981 2734 -2257 4824 -1350 -5868 6871 2030 -10625 4205 8367 -11899 -2407 16402
520 16402 -8764 -20354 12065 8871 -22061 -2771 19658 -7051 -9784 22216 9219 -16185
532a6185K2802J1475k7161j641J8361r226p707R654j437m403M940l264M5J1542
546G795q728j0093K2746N011k7354P565K4248k3166j5832K9605l636l2237J9691
559d385K5156k7853r905L0135m565k3170J5139R632j9128J019J4931n075m629
572b698N167k893K611O313j1519l481J4993n031j2166J4584K538k1533R287J8585
586A4757k3292j2163K8079n12k4483J5832J9672k0925n001K4236m792k0526R340
599B22R545j3337j943R034m503o317N668M614m708n580J411R713J709j1998K105
614d365J5892m554j4313J0028Q285j6753l411J7693m734j6043J1546J2419j3628
627a938n501J5563l212j7012P248J4663j1685j2539J3827J1931j2426p240J2602
$$ plain form
532 -16185 6617 18092 -9069 -10710 7651 -1575 -9282 372 -1065 -5468 -528 -3792 -3747 7795
546 7795 -933 -11026 11720 16731 -10623 -3058 21190 -1976 -17808 11797 8161 -24076 -4385
559 -4385 20771 -7082 -16987 13148 8583 -14587 552 10184 -8944 -7925 7006 1931 -2698
572 -2698 2469 -424 2187 8500 -3019 -6500 8493 3462 -8704 5880 8418 -13115 -3828 14757
586 14757 -8535 -20698 7381 6869 -17614 -1782 17890 -3035 -8036 16200 11408 -9118 222
599 222 9767 -3570 -5513 3521 -982 -7299 -1631 2983 -1725 -7305 -5894 3819 5528 -6470 -4365
614 -4365 11527 6973 -7340 2688 10973 -5780 -9191 8502 3768 -12275 -729 11690 -1938
627 -1938 -7439 8124 4912 -12100 -4852 9811 -1874 -14413 -586 11345 -1081 -8321 4281
640D281L363j0822J013R965m694q488Q475O565j0728p356Q957L125j1946k642
654a0932J2410Q11j2197O679J6921r172j4688J5214J2098k0111p359J9742k506
667F910j9026J0603J3538j8197o867K0177j265j7958O597J3738p609o325Q998
680C314K957p113k421N291K683p308n866J0483O913j2453k496J6016m036j5351
694i387J1585R617k1070l515K2845o925j9942J5109J3487j8297k014J8707o094
707D106j2367J1635Q314j1353k356P082j294m411j793p36J061k247l106O405L592
722B532r789L833J5266p422j3109J4146O900j8432J123J6533j0614j3011J5217
735C173O122j7559j33J5178n058r190P760N338p006k048N930K213o163n388O726
$$ plain form
640 4281 7644 -3178 -2165 7800 3106 -5382 3093 9658 -1070 -8426 531 3656 -8290 -10932
654 -10932 1478 2289 -9908 -3229 13692 4520 -10168 5046 17144 -2967 -10326 9416 6910
667 6910 -12116 -1513 12025 -6172 -13039 7138 5873 -12085 -5488 8250 641 -5684 3314
680 3314 6271 -842 -3263 2028 4711 -2597 -8463 2020 8933 -3520 -6016 10000 5964 -9387
694 -9387 2198 11815 -9255 -12770 10075 3150 -16792 -1683 11804 -6493 -8507 10200 4106
707 4106 -8261 3374 11688 335 -2021 5061 3767 -644 -2437 -3173 -2112 -4359 -7465 -1060 2532
722 2532 -7257 -3424 11842 4420 -8689 5457 12357 -6075 -4952 11581 967 -12044 3173
735 3173 9295 -8264 -8397 6781 1723 -7467 293 5631 -1375 -3423 2507 4720 -1443 -6831 -105
750a05O061j0048l744J3512J376j3319O286J3030j2588r636J6198J779j9436L203
764g431J5483j0165j0835J3321N227j3396J946J4022l029j0426O567R861o900
777D245q258O830M678j1059m765J0644J74j3630L916J4482o151j1157J1516Q839
791A0304j1955l462J2521q78j2739L870J0063o635r669P418P911p851n940R122
805B080M715j0282p70J1865l338j2547O183J0121j1227p573J3267J923j1973M705
819b851J1912p622o513J1335K833j0880l93Q067m408p259L199L817m746l936N345
834b100M487n113k626R472L485r621N98J1020m443j1299P836O634j3460m443J4196
849D623j662j3558O440J1400p628o548J0597K990r759M61Q115k454p888K218N945
$$ plain form
750 -105 5956 -4092 -7836 5676 7052 -6267 19 13049 461 -9175 7023 8802 -10634 -7431
764 -7431 8052 -2113 -12948 373 5600 -7796 -5850 8172 5143 -5283 1284 11145 4245
777 4245 -4013 2817 7495 -3564 -8329 2315 2489 -11141 -7225 7257 1106 -10051 1465 10304
791 10304 -1651 -5113 7408 6530 -6209 -2339 7724 1089 -8580 -1162 6749 -1102 -7042 2080
805 2080 6795 -3487 -4257 7608 4270 -8277 -2094 8027 -3200 -10773 2494 4417 -7556 -2851
819 -2851 9061 1439 -5074 6261 9094 -1786 -2179 5888 1480 -5779 -2580 1237 -3509 -7445 -2100
834 -2100 2387 -2726 -5352 4120 7605 -2016 -1418 9602 5159 -6140 1696 8330 -5130 -9573 4623
849 4623 2961 -10597 -4157 7243 -385 -6933 3664 6654 -3105 -2644 5471 3017 -4871 -2653 3292
864C292k640n471L030N835l625l698O223L791q630j524R141k777r862L981P302
879D368q475m162J0321M80r257N470R514o317n038Q857J924r251M41O872n901
894a54o105M663L098n981k191O196K200m043m3O023J191n470M60O435k860p978
910d559M286O257q405n296J0044J828j0862L063J0800o294p272R455M092j1137
924d000o6Q647l139p372M549M086m682n91M250Q67k031k78K242J875l130l111
940a884L611N35o559j33N951m069n239Q101L684r003K437J0303m773o557Q368
955D773K359r930Q69P591o122n979N986J606n888J577M015j896n61K813P25p99
971A139j09q52J396J109m102j008N265k960n068O037L526p604K15R271m157p375
$$ plain form
864 3292 652 -4819 -1789 4046 421 -3277 2946 6737 -1893 -3417 5724 2947 -6915 -2934 4368
879 4368 -4107 -8269 2052 2532 -6725 -1255 8259 1942 -3096 5761 7685 -1566 -1125 5747 -154
894 -154 -6259 -1596 1502 -4479 -6670 -474 1726 -2317 -2360 3663 4854 -616 -156 6279 3419 -4559
910 -4559 -273 5984 -2421 -7717 2327 4155 -6707 -3644 7156 862 -6410 3045 7137 -4000
924 -4000 -4066 4581 1442 -5930 -1381 2705 -1977 -2568 1682 2549 518 240 2482 4357 1227 -1884
940 -1884 1727 2262 -4297 -4430 1521 -2548 -7787 314 3998 -5005 -2568 7735 2962 -3595 4773
955 4773 7132 -2798 -1929 5662 -460 -6439 -453 1153 -4735 -3158 857 -1039 -1600 1213 1938 1139
971 1139 1030 178 1574 2683 -1419 -2427 2838 -122 -5190 847 4373 -3231 -3016 6255 2098 -5277
987e277P162L471q773r01P520l797n151N815K469n423M56N650m53k577R56K009
1003C156j37j941j702J515N69m723p69M743j701n189M736M885n465j31P213j815
1019C244n666N133L234p206j242O345k712n587L264K146l385p5K847p59o35J988
1035I34l43l51J103j085n61J397r38j997K647N7l435K645L669m356j682O003m42
1052C265o546K543M611o135k560O368r68o101L961M807m890j190O002J47m625
1067a311K829L272l510j852J958o61j469j438p00J521J025k927O78M463j338k903
1083b363M405K084n856P38O423m672m725N660K146p007M21N946l370l956M607
1098D81J831m120J022K337j566k43J133j756L4R69j487K8K296j042q83L898l28
$$ plain form
987 -5277 1885 5356 -3417 -4318 3202 -595 -5746 69 2538 -2885 -2429 3221 2768 191 1147 3156
1003 3156 3019 1078 -624 891 1460 -3263 -4032 711 -990 -6179 -1443 3442 -2023 -2154 5059 3244
1019 3244 -2422 2711 5945 -1261 -2503 3842 1130 -4457 -1193 953 -2432 -2507 340 -419 -1054 934
1035 934 591 240 1343 258 -303 1094 156 -1841 806 863 -2572 73 3742 -614 -2296 3707 3265
1052 3265 -3281 -738 3873 -2262 -4822 1546 578 -5523 -1562 3245 -1645 -2835 3167 3314 -1311
1067 -1311 1518 4790 1280 -572 1386 725 -744 -2182 -2882 -1361 -336 -3263 -2585 1878 540 -2363
1083 -2363 2042 4126 -1730 -992 5431 759 -3966 1694 3840 -3167 -2746 3200 -170 -4126 481
1098 481 2312 -1808 -786 1551 -15 -258 875 -881 -847 122 -1365 -1337 959 -83 -966 2932 2604
1115B604m293L226K517n686r32N374k477n699M908K906o466L00O170k233l795
1130c576N180K237m553J458L575k300k786J116L75j717n82p87Q66J995k076r07
1146b482M482l96m516L310M495n877k217O992p83o975L870M266o045j526O216
1161B814j656m657L430K828l712k13K677j802j224J412o52m95P43m65J11K422
1177A561n69j863L475R12m612J374L702m361l055N502o98o117K788M865n219j632
1193c947N477J42m621L277L630l713j132L774o09k814N84O68j004q37k54P15J158
1210D94j581m87K865o1m119K541M003m436k394N420L23n843K772M548m623k628
1226c206N548L36m902J850L674k871k604K873L48l255j72K325j2j687K42K421
$$ plain form
1115 2604 -1689 1537 4054 -1632 -2564 2810 333 -5366 -458 2448 -4018 -3718 2452 219 -3576
1130 -3576 1604 3841 -712 746 4321 2021 -765 351 726 -991 -1573 -2360 -1494 501 -1575 -2482
1146 -2482 2000 1604 -2912 398 4893 -984 -3201 3791 3008 -3967 -97 4169 -1876 -3402 2814
1161 2814 1158 -3499 -69 2759 -953 -1166 1511 -291 -1515 -103 -755 -1250 -507 -972 -861 1561
1177 1561 992 -871 2604 3516 -1096 278 3980 -381 -3436 2066 1368 -4749 -1961 2904 -2315 -3947
1193 -3947 1530 1672 -2949 328 3958 245 -887 2887 2278 -536 48 716 -288 -1125 -1379 -664 494
1210 494 -1087 -1574 1291 1230 -2889 -348 3655 -781 -3175 2245 2568 -3275 -503 4045 -578 -3206
1226 -3206 2342 2678 -2224 -374 3300 429 -2175 698 1046 -2209 -2381 -56 -68 -1755 -1513 908
1242I08P21j683M7K925p60l378J780K993m135k301M405ln273J394M325k949k653
1259c637L998J740l850M74M031j037k915J915J875k190j863J854J623k814r62
1274a758K702L13l110L26L583j672l339K554K550l526j375M432l27l716J725L243
1290B605k103k512L420J430l377o84L366p76l723J467K513k950j970L338J303
1305A347l403R0M139r46l106K509K982l302k127L675N04l610r1K921j144l015
1321b577J366K431j825k532K935K260k906j202L632R88m111J51M474k367l483
1336b766L420K495m602p90M753q97l918J599L373l382j509K799K88k914O44K371
1352I64j01j964O40K104n04k062J214K113k026j896K780N76l758J4L796k024l498
$$ plain form
1242 908 1629 -54 -7 2918 2158 -1220 560 3553 -582 -2883 1522 1519 -3754 -2360 1965 -984 -3637
1259 -3637 361 2101 -1749 -1275 2756 1719 -1196 719 2594 404 -1459 395 2018 -796 -1758
1274 -1758 944 1257 -1853 -1527 2056 384 -2955 -401 2149 -1377 -2752 1680 1353 -2363 -638 2605
1290 2605 502 -2010 1410 2840 -537 -1221 2145 1369 -2354 -887 1626 -1324 -3294 44 1347
1305 1347 -2056 -1966 2173 1227 -1879 630 3612 310 -1817 1858 2362 -1248 -1339 1582 438 -2577
1321 -2577 -1211 1220 -605 -3137 -202 2058 -848 -2050 1582 2570 -1541 -1390 3084 717 -2766
1336 -2766 654 3149 -1453 -2243 2510 1613 -2305 -706 2667 -715 -2224 575 863 -2051 -1407 964
1352 964 863 -1101 -461 1643 1139 -923 291 2404 378 -1518 1262 1838 -1920 -1906 1890 -134 -3632
1369c632L193K469m399J50M655j170l739K797K712l115r42K915j55l101N36K649
1385A823j255k734J641J972j656j876K006J812k797q90L208k9l152J387L141k203
1401C98k612L200J541l428m59L672q69l436J480K384k485j961K819J065l429q2
1417b202L440o34k414J475K292j753j015J928J022k362p90K588m96k697Q76K037
1433A295j833j748J731J854k876n36L665r9l411J568L245k601k361L126J367l665
1449a279L2L679j774l143K596J778k771q70K710o33j777O36J769j021j241J042
1465b67J446q35j213Q63J957j451j787K233J376m175P09L535k338l144L095K090
1481B094m537J82M027j669l227L834J766l385J63L234j732j908J762M87j317k79
$$ plain form
1369 -3632 -439 2030 -2369 -2219 2436 1266 -2473 324 3036 -79 -1021 1894 1739 -1362 -826 1823
1385 1823 568 -2166 -525 1447 -209 -2085 -79 1733 -1064 -1954 1254 1225 -1927 -540 2601 398
1401 398 -2214 986 2527 -901 -1360 2312 1443 -1993 -513 1871 -614 -2575 244 1309 -2120 -2202
1417 -2202 1238 604 -1810 -335 1957 204 -811 1117 2139 -223 -1013 1575 1079 -1618 -742 1295
1433 1295 -538 -2286 -555 1299 -1577 -2113 1552 1453 -1958 -390 2855 254 -2107 1019 2386 -1279
1449 -1279 -1247 2432 658 -2485 111 1889 -882 -1752 958 325 -1452 -816 953 -68 -1309 -267
1465 -267 1179 344 -869 -6 1951 500 -1287 946 2322 -1853 -1144 2391 53 -3091 4 2094
1481 2094 -2443 -2261 1766 97 -3130 704 2470 -915 -752 2482 750 -1158 604 1091 -226 -505
1497e05M38l2n31l51j9J635o48k197K709J141l124K97L632j946k995L470J955
1514B929m875O02M292k051l068K893J731l959O2L042j690j996J545J192j425n1
1530h27N63M89j1l66M0J248j84j805K048J030l121o5K986j873k896K767J870m463
1548b570J55M090j518k922L437J590l714O88K850j839j185J960M31k340J63J653
1564I29o50p80j44M70Q01m04j649J765R68k333n96L255q43l284K742J857l067
1581i63n48M097j544k764K326J740l435l08L048j059k732J591J032j542k3R73
1597a11q9J17J95J02N74L02j135M58J208j690q70J931r73k118J723J916l114m14
1615a988L323q96k653K613J339k729L74K260j015j805K028O81k125K97J071n39
$$ plain form
1497 -505 -67 -99 -630 -981 -1000 635 -13 -2210 499 1640 -1484 -1187 2445 499 -2496 974 2929
1514 2929 -1946 -1344 2948 897 -2171 722 2453 -1506 -1444 1598 -92 -2088 -543 649 -776 -827
1530 -827 -264 225 214 -152 -112 1136 952 -853 1195 2225 -896 -961 2025 152 -2744 23 1893 -2570
1548 -2570 -2415 1675 157 -2765 672 2262 -1452 -764 2086 247 -938 1022 1453 -887 -724 929
1564 929 279 -501 -645 -175 626 222 -1427 338 1306 -1027 -1623 1632 789 -2495 247 2104 -963
1581 -963 -1511 2586 1042 -1722 604 2344 -1091 -1399 1649 590 -2142 -551 481 -1061 -1084 -111
1597 -111 -200 -83 112 214 788 1090 -45 413 1621 -69 -939 992 19 -2099 -376 1540 -1574 -1988
1615 -1988 1335 439 -2214 399 1738 -991 -617 1643 628 -1177 851 1532 -593 -296 775 236
1631B36o95M39J59M6j3q75N85P58j347p78K412n51k011J466J931k113o89K908
1649A868q34k391K309J248k872m66K898j593j766J085R62j550J8J258j91l45N43
1666A81o3L79L03q04M74L48p62r39J596m38j397R55J186j683o39K327m71j961
1684a408J370J645j745q63J939m63j672J078J319j366n62J600k2j168M13O42m34
1701C03k29n03K29r1n78l25J291p6q20K90J542j193m93J780K4j830P83J455j342
1720B17j110R00M65j601L11J063q21q61J115Q05r44J81O77J12k61k24N24m4m87
1739A7k52L95K73r90N52O22p41o76O31Q18j321Q6J337q62n64P62P46j396J04Q13
1759C54m11j56O00M49m87k88L15N0m37j62J25Q6n35K7L68Lp93M53P87n12k88J177
$$ plain form
1631 236 -459 -20 139 185 172 -703 -118 640 -707 -1485 927 376 -1635 -169 1762 -351 -1040 1868
1649 1868 1034 -1357 952 2200 -672 -1138 1760 167 -1599 -514 448 -1102 -1084 174 -17 -362 181
1666 181 118 497 800 -4 470 818 56 -883 713 275 -1122 -167 1019 -664 -1303 1024 553 -1408
1684 -1408 -38 1607 -138 -1001 938 475 -1197 -119 1200 -166 -728 872 850 -318 95 737 303
1701 303 74 -429 -200 -291 -869 -1194 97 21 -799 -509 1033 -160 -653 1127 1151 -679 104 1559 217
1720 217 -893 7 472 -1129 -818 245 -576 -1437 -322 483 -461 -280 397 509 248 24 548 504 17
1739 17 -235 160 433 -557 -5 617 -124 -800 -169 649 -672 -586 751 -111 -675 87 833 -563 -459 354
1759 354 -57 -213 387 836 349 61 376 426 -11 -173 -48 38 -497 -470 -102 -99 -892 -439 348 -164 -452 725
1781G25J43j245L94J163r24n76P08J06j147l21N34M72m43K0O13j89l31N27N18
1800G47p67l77J107j02p22l51J310o28q15O95O37p13m66O15Q2r94M85L95l70l56
1820e88J0N59l22l45Q19M05n46NP66J49j172L68P43n68q74Q99k20r29K33N80l35
1841c63o51Q51L70m67L84R9M94n94M4N39j46r58K1P50o90l93K42Q36q75l43J113
1862B63L36j412N35R53n05j198J264L98j087k08J595k00j018L79P07l92o49J85
1880e4P02j091m71P33N81q40j48M48K71o74K79Q96m79m76P70O50q49n37J375p22
1900C64q98L19O44q25n52J206l29j016N02Q95m97m47J213j00q38K77P23n04p22
1919e85P28K77m5o03J31M29j97q68P01K47p39l08J165k40j044O28J322j186m20
$$ plain form
1781 725 868 -377 17 1180 256 -320 388 494 -653 -974 -440 32 -411 -391 222 33 -298 229 747
1800 747 -20 -397 710 608 -114 -465 845 217 -598 97 734 21 -445 170 252 -742 -257 138 -232 -588
1820 -588 -578 -19 -341 -686 133 538 -8 -3 763 912 -260 108 851 283 -591 308 88 -841 -608 -28 -363
1841 -363 -1014 -163 207 -260 124 223 717 123 167 706 560 -398 -377 373 -317 -710 -468 368 -507 -850 263
1862 263 599 -813 -278 675 170 -1028 236 634 -453 -661 934 734 -284 95 802 410 -239 -54
1880 -54 648 -443 -914 -181 400 -440 -588 -140 131 -543 -264 632 153 -323 447 1097 248 -289 1086 364
1900 364 -534 -215 429 -396 -948 258 -71 -1087 -585 310 -187 -634 579 479 -359 -82 641 137 -585
1919 -585 143 420 375 -228 -97 332 135 -733 -32 215 -524 -832 333 93 -951 -323 999 -187 -607
1938f07J056J27j308Q12J072r81q65J305k29q18J24Q00q79j24K63k30K96j74%
1957c60O07K06o45N49O82p33n93J292l24j814R73J339j693m82J534l47j649J406
1975e2J015j493k01J182k00j009Q80L70k45k58J67k88L4K22j78M03J1j049J45
1994e44J374j259n07J684J62k524J160J918j794q64K148k14j387R29J083j342
2010B3o11J279k17r79O90k08o67L03J28r1L80j33l25P08M33j012K48J138j153
2029f6p14J329o5j597J046R72j350n58J825l37j799J310P65j392j49J343o02m27
2047d66L88N30n01j57M28k10N08q89K45O39k72n69M00L86n76o27J169m26j033
2066a033N55J267j146m07J195Q3j051O03R73r42p61J139Nj010K86R28q56p22Q40
$$ plain form
1938 -607 449 576 -732 80 1152 171 -694 611 382 -436 -312 488 -391 -515 -252 -482 -186 -360 -360
1957 -360 247 453 -192 357 1039 306 -287 1005 681 -1133 -160 1179 -514 -996 538 191 -1458 -52
1975 -52 963 -530 -731 451 251 -758 122 492 247 -11 156 -132 -98 124 -54 349 360 -689 -544
1994 -544 830 -429 -936 748 910 -1614 -454 1464 -330 -1194 954 740 -647 282 1365 23
2010 23 -588 691 474 -505 185 -23 -690 -387 -259 -350 30 -103 -428 280 713 -299 -51 1087 -66
2029 -66 -780 549 484 -1113 -67 905 -445 -1003 822 485 -1314 -4 761 -631 -780 563 -39 -466
2047 -466 -78 452 -49 -206 222 12 520 -369 -124 515 243 -326 74 460 -116 -743 426 0 -1033
2066 -1033 -478 789 -357 -764 431 514 -537 66 1039 97 -664 475 480 -530 -244 684 -172 -894 -54
2085e4R0L9m55N54ql30j04L08N58p38j56J176k29j184K45R88r08n29J263k5j305
2106h04L31J433j388l12J085P7j263N11J000p83k21N06K48p16K82L25M8l41k78
2125b60N09N0o48m67J076qj189J65J217o83j15Q13K69j159M07J266j179o59P75
2144A80M96j136O8P94l26p49M24M75o50k09P19k4l28K51L71l24n38N89L44k31
2164A96m12M27M41o51o55J367k89r29K20J040j149m63R41K12j040K85J143p74
2182i0l81O07N20p55l0P75j87q26K20O28m56m58L70J90l02l37L31O33q06k6P23
2203C43K57j057K45P98k68m83M68L20r72J25Q51o65k67M40kl84L0J86r6l81K08
2224c04O82o03k20L80K61k51nP9K91n45K06M62N7p16j10Q17j088j87J040l22n82
$$ plain form
2085 -54 36 75 -380 174 166 -164 -268 40 598 -140 -296 880 651 -533 -288 700 -208 -737 526 501 -804
2106 -804 -473 960 -428 -740 345 422 -841 -330 670 -113 -334 172 420 -296 -14 311 359 18 -260
2125 -260 249 299 -349 -816 260 252 -937 -772 445 -238 -353 460 729 -430 -23 1243 64 -595 180
2144 180 676 -460 -392 402 76 -673 -249 226 -424 -633 86 62 -266 -15 356 32 -506 83 427 196
2164 196 -216 211 652 1 -654 713 424 -505 -285 755 -394 -857 84 296 -744 -459 684 -90
2182 -90 -471 136 656 -99 -129 646 459 -367 -147 481 25 -433 -63 127 -175 -512 -181 452 -354 -380 343
2203 343 600 -457 -212 586 318 -165 303 623 -349 -224 627 -38 -305 135 133 -251 -221 -35 -131 -512 -304
2224 -304 378 -225 -445 -65 196 -55 -60 19 310 -235 -29 433 490 -226 -336 481 -607 -794 246 -76 -658
2245f58J66R14m73j27K18L88o33m4Q31l1o86K0M83J42r00J65N10m96k2j21M77
2266A23k81m13P38J10m53M49K18m48j24K80K7j93p8Q24n76m75K21L54m76l85N44
2287a4J87p10L68M18l87k30J69L77k53J34J21J58l37K71M8J06n98M21K95q89k57
2308f02N37n5l00L31K67k54k54M37K74k60K2K04J66m90j53N29k15m60M20J70j86
2329A28m88K70N77j052L96K77p5k71K14K29k19j6K48l38j38M86J23j52j05j18
2349b4m6L95o39L41k4r1j73M76j3o36L51N33n72k12N43L73q99K54N81k39l50K92
2371B21J16o53J33J01k41n3J36J77mq7J48J78Kl48N82j52m33J96L05qo18K6Q19
2394E43q36o4O06J72o79N9L45m18j61J79M22j56N2N1J40o07M9N70K3l27R5N5R
$$ plain form
2245 -658 -492 422 -51 -178 40 428 -205 -249 582 551 -135 -115 368 510 -390 -225 285 -211 -233 -354 123
2266 123 -158 -571 167 277 -176 273 491 43 -81 199 226 33 -45 779 203 -272 -51 303 -173 -558 -14
2287 -14 173 -537 -169 249 -138 -368 -199 178 -75 59 180 338 1 272 320 426 -172 249 544 -345 -602
2308 -602 -65 -120 -420 -89 178 -76 -330 107 381 121 143 347 513 23 -130 399 184 -276 144 314 128
2329 128 -360 -90 487 -565 -169 108 33 -238 -24 205 -14 -30 218 -120 -258 228 351 199 94 -24
2349 -24 -70 325 -314 27 3 -88 -261 215 202 -434 -83 450 -122 -334 209 582 -317 -63 518 279 -71 221
2371 221 337 -316 -183 -82 -323 -376 -240 -63 -67 -154 -6 172 174 -174 408 256 -177 19 324 316 -302 -276 543
2394 543 -293 -357 249 421 -258 -199 146 -272 -433 -254 168 12 64 115 255 -352 -303 267 290 -37 58 113 122
2417A22k7J24j66j49k07L16J12o78K60O69l61m58N15K73o02L69N44m26m01M25
2437B54J06o03k38P37n20k42L19k24L89Q6k76p8M64j74j69K88K21m74J69K85l48
2458b8k58Q79k74p58N39L56q34J42O99m40l96M71L3l66J02K89k86O1L47m8n9J14
2480B85k77K8J29K78n80J72K28o69K96J51n8l71M99J76o57L58N58n58k86R14m58
2501A58k3j6K17o70J6M97j13k21P6k66K76m6j9J20m7j7l70R26m7o40L16K39j33
2524B13m26L09N9k83M42J57m74j88L91N6q76K58P74q35K27M08k62n8lN95j83j75
2546A26P3M5L0K79o15J98o9n30L63M14m23l71O14j37%N6L50j59l86M13l6m00J50
2569a5P48q19k30M13j45mj61L72k25k54M00k38r0J79M7N7m9J85l65N28q7m90L85
$$ plain form
2417 122 95 219 53 -96 -303 13 125 -553 -293 376 15 -443 72 345 -257 112 656 230 -171 254
2437 254 360 -243 -481 256 -264 -506 -187 -411 -22 64 -212 -290 174 0 -169 119 340 -134 35 320 -28
2458 -28 -286 593 319 -439 100 456 -378 -236 463 23 -373 98 131 -235 -133 156 -130 -69 278 230 171 285
2480 285 8 36 165 443 -137 35 263 -406 -110 41 -17 -388 111 287 -370 -12 546 -12 -298 616 158
2501 158 135 119 336 -334 -318 179 66 -155 -79 -345 -69 -115 -134 -14 -61 -78 -448 478 431 -209 107 346 213
2524 213 -213 96 155 -128 314 471 -3 -191 200 256 -620 -362 412 -423 -196 212 -50 -108 -111 484 301 126
2546 126 199 244 274 553 -62 136 67 -463 -100 314 -109 -480 134 -3 -3 53 403 244 -142 271 235 -165 -15
2569 -15 733 -86 -316 97 -48 -52 -213 159 -66 -320 80 -158 -248 -69 -22 35 -14 171 -194 334 247 -243 142
2592A42J08k06p7L96j69o49M57K50m65Q7%L30o10M99j55K32k77L2O78o53K27M5
2614B22j69j15j73L03Rj85k83K23m6m02N45L87k08m60N47n0k76l0L02j95p1M72
2636C47p2o51K47j4N7P1N9J15l91J76J01J0k05J74j58J65J91l53N35m56l06N00
2658A42Qp1l28N17mo52J71M78l37m11N50qk58O1N11k49k63K72L12q80O08l5j07
2681B7J11o3j69L49n25l37P67j69k98K04K00k66R1J53L50q51N12L86o77J15L36
2702B46J00r44P43J67l55j43M01p5m13Q0K49l34L42k33L2r3K22J0L27j08k30R5
2724H6J34j15N2j14K61p47K33O99o97m44R15q0o78P27j24k04j74O28m78K30k80
2745a70L91r3n97K90L80j79l37j11L58k59M34k73K16p2m6K74j32l47J53M03k16
$$ plain form
2592 142 250 44 -33 363 194 -455 2 252 -213 -126 -126 204 -406 93 -62 170 -107 -75 603 -50 177 222
2614 222 53 -62 -235 68 77 -108 -391 -168 -214 -616 -71 316 108 -352 195 145 -131 -161 141 -54 -125 347
2636 347 275 -376 -129 -143 -86 -15 44 159 -232 -56 45 55 -150 24 -134 31 222 -131 404 -52 -358 142
2658 142 150 79 -249 268 264 -388 -217 261 -76 -487 63 55 -203 -142 369 120 -143 129 441 -439 169 134 27
2681 27 138 75 -94 255 -270 -607 160 -9 -307 -103 97 -169 -78 75 425 -426 86 472 -205 -90 246
2702 246 346 -598 145 312 -43 -186 215 140 -273 -193 56 -278 64 -169 -137 -230 -8 2 329 221 -9 86
2724 86 220 105 157 43 304 -443 -210 489 -208 -652 263 183 -495 232 108 -96 -270 358 -120 110 -170
2745 -170 221 128 -469 -179 201 22 -315 -426 -68 -327 107 -166 50 -22 -68 206 74 -273 -120 283 67
2766F7L5K23Jl50J71J99k89j23J42J89k52n9J43p3k04K39q0Q2k7q3L65o72M59
2789A03J41q0J9k16J89N1n45L00M0j42K29K6j13k51K03M7k10Q7J45J90k62q5K62
2812A28J79o35L92L39k85l90K09L32m71n9L11P7n48N68p8j15k67L21r5K56k05
$$ plain form
2766 67 102 325 326 -24 147 346 57 -66 76 265 13 -46 97 24 -180 59 -21 61 34 -49 316 -356 103
2789 103 244 164 183 -33 156 207 -338 -38 2 -140 89 115 2 -249 -46 1 -209 -122 23 213 -49 -134 128
2812 128 307 -328 64 403 118 -272 -63 269 -202 -261 50 127 -421 147 69 -46 -313 8 -87 169 -36
$$ [...]
8191g1
##END NTUPLES=NMR FID
##END=
