##TITLE=1H_DE-80H_X3
 200.13MHz, d2o
 8 sc
 
 19ns.26.2.2025
##JCAMPDX= 6.0         $$ Bruker NMR JCAMP-DX V2.0
##DATA TYPE= NMR FID
##DATA CLASS= NTUPLES
##ORIGIN= UXNMR, Bruker Analytische Messtechnik GmbH
##OWNER= pz
$$ XWIN-NMR		Version 3.5
$$ Wed Mar 19 16:20:09 2025 Russian Standard Time (UT+4h)  Yarkov@DPX200
##.OBSERVE FREQUENCY= 200.1313
##.OBSERVE NUCLEUS= ^1H
##.DELAY= (6, 6)
##.ACQUISITION MODE= SIMULTANEOUS
##.ACQUISITION SCHEME= undefined
##.AVERAGES= 16
##.DIGITISER RES= 18
##SPECTROMETER/DATA SYSTEM= spect
##.PULSE SEQUENCE= zg30
##.SOLVENT NAME= CDCl3
##.SHIFT REFERENCE= (INTERNAL, CDCl3, 0, 14.3821)
##AUDIT TRAIL= $$ (NUMBER, WHEN, WHO, WHERE, WHAT)
$$ ##TITLE= Audit trail, XWIN-NMR		Version 3.5
$$ ##JCAMPDX= 5.01
$$ ##ORIGIN= Bruker BioSpin GmbH
$$ ##OWNER= Yarkov
$$ C:/Bruker/XWIN-NMR/data/yarkov2/nmr/H-C/1/audita.txt
$$ ##AUDIT TRAIL=  $$ (NUMBER, WHEN, WHO, WHERE, WHAT)
(   1,<2025-03-19 16:18:30.78 +0400>,<Yarkov>,<DPX200>,
      <created by zg, POWCHK disabled, PULCHK disabled
       configuration hash MD5:
       00 E9 B6 7A A2 85 ED C7 34 08 36 98 17 FE 4E 26
       data hash MD5: 16K
       FF A2 3D D3 BC 7C 41 CA F6 3B 0E 1D C3 14 4B 97>)
$$ ##END=
$$ 
$$ hash MD5
$$ C1 43 35 E5 53 54 27 18 42 AD 3D 81 39 BD 8A F6
##$RELAX= 
##$RELAX= 
##$RELAX= 
##$RELAX= 
##$RELAX= 
##$RELAX= 
$$ Bruker specific parameters
$$ --------------------------
##$DU= <C:/Bruker/XWIN-NMR>
##$EXPNO= 1
##$NAME= <H-C>
##$PROCNO= 1
##$TYPE= <nmr>
##$USER= <yarkov2>
##$AMP= (0..31)
100 100 100 100 100 100 100 100 100 100 100 100 100 100 100 100 100 100 
100 100 100 100 100 100 100 100 100 100 100 100 100 100 
##$AQSEQ= 0
##$AQ_mod= 1
##$AUNM= <au_zg>
##$AUTOPOS= <>
##$BF1= 200.13
##$BF2= 200.13
##$BF3= 200.13
##$BF4= 200.13
##$BF5= 200.13
##$BF6= 200.13
##$BF7= 200.13
##$BF8= 200.13
##$BYTORDA= 1
##$CFDGTYP= 0
##$CFRGTYP= 5
##$CHEMSTR= <none>
##$CNST= (0..31)
1 1 145 1 1 1 1 1 1 1 1 1 1 1 1 1 1 1 1 1 1 1 1 1 1 1 1 1 1 1 1 1 
##$CPDPRG= <>
##$CPDPRG1= <>
##$CPDPRG2= <>
##$CPDPRG3= <>
##$CPDPRG4= <mlev>
##$CPDPRG5= <mlev>
##$CPDPRG6= <mlev>
##$CPDPRG7= <mlev>
##$CPDPRG8= <mlev>
##$CPDPRGB= <>
##$CPDPRGT= <>
##$D= (0..31)
0 0.7 0 0 0 0 0 0 0 0 0 0.03 0 0 0 0 0 0 0 0 0 0 0 0 0 0 0 0 0 0 0 0 
##$DATE= 1742386710
##$DBL= (0..7)
120 120 120 120 120 120 120 120 
##$DBP= (0..7)
150 150 150 150 150 150 150 150 
##$DBP07= 0
##$DBPNAM0= <>
##$DBPNAM1= <>
##$DBPNAM2= <>
##$DBPNAM3= <>
##$DBPNAM4= <>
##$DBPNAM5= <>
##$DBPNAM6= <>
##$DBPNAM7= <>
##$DBPOAL= (0..7)
0.5 0.5 0.5 0.5 0.5 0.5 0.5 0.5 
##$DBPOFFS= (0..7)
0 0 0 0 0 0 0 0 
##$DE= 6
##$DECBNUC= <off>
##$DECIM= 32
##$DECNUC= <off>
##$DECSTAT= 4
##$DIGMOD= 1
##$DIGTYP= 9
##$DL= (0..7)
0 120 120 120 120 120 120 120 
##$DP= (0..7)
150 150 150 150 150 150 150 150 
##$DP07= 0
##$DPNAME0= <>
##$DPNAME1= <>
##$DPNAME2= <>
##$DPNAME3= <>
##$DPNAME4= <>
##$DPNAME5= <>
##$DPNAME6= <>
##$DPNAME7= <>
##$DPOAL= (0..7)
0.5 0.5 0.5 0.5 0.5 0.5 0.5 0.5 
##$DPOFFS= (0..7)
0 0 0 0 0 0 0 0 
##$DQDMODE= 0
##$DR= 18
##$DS= 0
$$ [...]
##$SUBNAM0= <"">
##$SUBNAM1= <"">
##$SUBNAM2= <"">
##$SUBNAM3= <"">
##$SUBNAM4= <"">
##$SUBNAM5= <"">
##$SUBNAM6= <"">
##$SUBNAM7= <"">
##$SUBNAM8= <"">
##$SUBNAM9= <"">
##$SW= 18.0517328524113
##$SWIBOX= (0..15)
0 0 2 0 0 0 0 0 0 0 0 0 0 0 0 0 
##$SW_h= 3612.71676300578
##$TD= 16384
##$TD0= 1
##$TE= 0
##$TE2= 300
##$TE3= 300
##$TEG= 300
##$TL= (0..7)
0 120 120 120 120 120 120 120 
##$TP= (0..7)
150 150 150 150 150 150 150 150 
##$TP07= 0
##$TPNAME0= <>
##$TPNAME1= <>
##$TPNAME2= <>
##$TPNAME3= <>
##$TPNAME4= <>
##$TPNAME5= <>
##$TPNAME6= <>
##$TPNAME7= <>
##$TPOAL= (0..7)
0.5 0.5 0.5 0.5 0.5 0.5 0.5 0.5 
##$TPOFFS= (0..7)
0 0 0 0 0 0 0 0 
##$TUNHIN= 0
##$TUNHOUT= 0
##$TUNXOUT= 0
##$USERA1= <user>
##$USERA2= <user>
##$USERA3= <user>
##$USERA4= <user>
##$USERA5= <user>
##$V9= 5
##$VALIST= <valist>
##$VCLIST= <CCCCCCCCCCCCCCC>
##$VD= 0
##$VDLIST= <DDDDDDDDDDDDDDD>
##$VPLIST= <PPPPPPPPPPPPPPP>
##$VTLIST= <TTTTTTTTTTTTTTT>
##$WBST= 1024
##$WBSW= 4
##$XGAIN= (0..3)
0 0 0 0 
##$XL= 0
##$YL= 0
##$YMAX_a= 282169
##$YMIN_a= -317446
##$ZGOPTNS= <>
##$ZL1= 120
##$ZL2= 120
##$ZL3= 120
##$ZL4= 120
##$ABSF1= 10
##$ABSF2= 0
##$ABSG= 5
##$ABSL= 3
##$ALPHA= 0
##$AQORDER= 0
##$ASSFAC= 0
##$ASSFACI= 0
##$ASSFACX= 0
##$ASSWID= 0
##$AUNMP= <proc_1d>
##$AZFE= 0.1
##$AZFW= 0.1
##$BCFW= 1
##$BC_mod= 2
##$BYTORDP= 1
##$COROFFS= 0
##$CY= -3
##$DATMOD= 1
##$DC= 2
##$DFILT= <>
##$DTYPP= 0
##$F1P= 0
##$F2P= 0
##$FCOR= 0.5
##$FTSIZE= 0
##$FT_mod= 4
##$GAMMA= 1
##$GB= 0.15
##$INTBC= 1
##$INTSCL= 1
##$ISEN= 128
##$LB= 0.25
##$LEV0= 0
##$LPBIN= 0
##$MAXI= 10000
##$MC2= 0
##$MEAN= 0
##$ME_mod= 0
##$MI= 1.114404
##$NCOEF= 0
##$NC_proc= 0
##$NLEV= 6
##$NOISF1= 3.799351
##$NOISF2= 2.8
##$NSP= 1
##$NTH_PI= 0
##$NZP= 0
##$OFFSET= 14.38212
##$PC= 1
##$PHC0= -1190.181
##$PHC1= 16.59223
##$PH_mod= 1
##$PKNL= yes
##$PPARMOD= 0
##$PSCAL= 0
##$PSIGN= 0
##$REVERSE= no
##$SF= 200.129724274929
##$SI= 16384
##$SIGF1= 3
##$SIGF2= 2
##$SINO= 400
##$SIOLD= 16384
##$SREGLST= <1H.CDCl3>
##$SSB= 0
##$STSI= 0
##$STSR= 0
##$SW_p= 3205.1282051282
##$SYMM= 0
##$S_DEV= 0
##$TDeff= 0
##$TDoff= 0
##$TI= <>
##$TILT= no
##$TM1= 0
##$TM2= 0
##$TOPLEV= 0
##$USERP1= <user>
##$USERP2= <user>
##$USERP3= <user>
##$USERP4= <user>
##$USERP5= <user>
##$WDW= 1
##$XDIM= 8192
##$YMAX_p= 0
##$YMIN_p= 0
$$ End of Bruker specific parameters
$$ ---------------------------------
##NTUPLES= NMR FID
##VAR_NAME=  TIME,          FID/REAL,        FID/IMAG
##SYMBOL=    X,             R,               I
##VAR_TYPE=  INDEPENDENT,   DEPENDENT,       DEPENDENT
##VAR_FORM=  AFFN,          ASDF,            ASDF
##VAR_DIM=   8192,          8192,            8192
##UNITS=     SECONDS,       ARBITRARY UNITS, ARBITRARY UNITS
##FACTOR=    0.0002768,     1,               1
##FIRST=     0,             0,               0
##LAST=      2.2672688,     0,               0
##MIN=       0,             -317446,         0
##MAX=       2.2672688,     282169,          0
$$ Real data points
##PAGE= N=1
##DATA TABLE= (X++(R..R)), XYDATA
0@%%%%%%%%%%%%%%%%%%%%Jj2K7l2L2l2L2l2L8m8N8o4O9p9Q8j00J12j20J34j47
40g5J63j84K01k20K43k70K97l24L54l90M32m76N25n81O44p18Q05r10J030j177
60f31J364j601J920k361L009m033N817r473J9510r1853k39114M13103J15831m12474
74b00986P1915L21093j75174j54016K19806K5316j70089M4077O4875n2263J2008
85F562j3493n5025Q5414K6975j37139M0663J28224j21096o5328J84253J364j67963
97h6589Q2093J32235j03155o5521O4834k1228l3541L5378l3387l4059O6831J3091
109A6982m3443L6261J8025m4154K4765K8730m7041M567K7974m1576J8866N4013
121E3969q0562m0078J12721j4190j16716P7999Q0696j18110N65J47095o8198j30618
$$ y = [0, 0, 0, 0, 0, 0, 0, 0, 0, 0, 0, 0, 0, 0, 0, 0, 0, 0, 0, 0, 0, 1, -11, 16, -16, 16, -16, 16, -16, 22, -26, 32, -32, 37, -42, 46, -54, 58, -62, 72, -75, 88, -96, 105, -115, 128, -142, 155, -169, 185, -205, 227, -249, 276, -305, 339, -379, 426, -484, 546, -631, 733, -868, 1052, -1309, 1700, -2333, 3484, -5989, 13521, -78332, -317446, 95657, 211488, -200986, -129071, 192022, 16848, -137168, 82638, 107954, -62135, -18058, 46817, -5446, 6562, -6931, -61956, 23458, 50433, -86706, -46043, 82181, -38915, -104243, 80010, 81374, -86589, -4496, 127739, 24584, -40937, 23897, 2669, -30872, 4506, -28881, -62940, 3891, 16982, -26461, 9800, 27825, -16329, 8436, 37166, -9875, -5308, 22666, -18910, -44, 53969, -26593, -66671, 46050, 31860, -84856, -6857, 73839, -44271, -43706, 103389, 35191, -95427]
133i5427J09628P3362j36413l1035J07097j7499o1955N4326L7937m3756m734L8460
145B9991L499k6429j7961P677J9134j0732k3028Q071L813j5773J2117J3684k9731
158b5668o095M5893J3962k7269K386K5016L29j8346p098M487j4877k5141K0735
171a1686K9893l9437k5581O6352J8123o9644J7750O4966n6410m1866Q8010N798
183D6268j02090K9396Q9882n6337o2751O0191K2538n0508R198L7538j6369j6760
195i804J7521J6159p307l1938j0404L7797k245n3958J9679N2435m0099k1851P2311
208C8296l035p2625L9369N8762o0506l2323N6094o522m3096K4720J1247l6378
220b5997N204K2761j0642N7M607q289K7860J7696m2326K880M8028l4197l9718
$$ y = [-95427, 14201, 87563, -48850, -79885, 27212, 9713, -52242, 2084, 40021, -3735, -8469, 29991, 33490, 7061, -10900, -3223, 15911, 5179, -17849, -9778, -5965, -21738, -9621, 4063, -25668, -31763, 14130, 28092, 823, 3209, 28225, 28554, 10208, 3110, 7597, -7280, -32421, -11686, 18207, -21230, -46811, 19541, 37664, -31980, -14230, 50736, -5674, -47540, 40470, 46268, -55822, -26426, 63456, 7119, -55632, 4559, 27097, -23411, -14213, 23325, 6956, -9804, 7717, 23876, 16569, -15369, -25773, 12024, 9779, -44179, -24500, 27935, -12164, -34015, 38296, 35261, -37364, 2005, 60767, 261, -32062, 24032, 17510, -25586, -866, 10381, -25997, -20793, 1968, -8674, -8617, -4010, -12299, 15561, 33257, -9069, -6189, 41839, 7642, -32076]
233c2076N3602M42p1164L2733O0707n9737k9929P0708k611n4161L4209K7056m7713
246a7934L000M2313k3254k4567K4592J297j4514J1963k291j1984J6321N741j2906
259b223J0490L126j8248J2664J1782l1852m229K8459j7273j9316L1527J032l1242
272b5303K4951K9780l2272r199L5152m986k4658J3714O064j9189k80P452p108
285e882k616k964k199J6953J840k2299J3827K7995k3705j4347L4951l923l8377
298b0746K0459K7299l6824j5478L8077q42l1482J2682K1823j5579j0529J5926
310D786N910j3691p137J1699Q549j6971j0724K2574O537k6387N418L0274j5445
323E392k1305K8967J0887l3540R85K7281j5186k1311J4715O667j5131K98Q535
$$ y = [-32076, 21526, 21968, -49196, -16463, 44244, -15493, -45422, 25286, 22675, -31486, 2723, 29779, -17934, -14934, 27379, 4125, -20442, 4150, 5447, -9067, 2896, 605, -11379, 4942, 10683, -2223, 8267, 11393, -6855, 5809, 17591, -14261, -18490, 9969, -7304, -26620, 4907, 5939, -25303, -352, 29428, -2844, -12043, 23109, 18123, -6535, 7179, 13243, -5946, -6226, 1226, -5882, -8498, -11462, -13661, 3292, 5132, -17167, -3340, 24655, 950, -13397, 21554, 17631, -20746, -287, 27012, -9812, -25290, 12787, 11945, -19537, -6855, 14968, -611, -11140, 4786, 10696, -2995, -10132, 1567, 10116, -6855, -17579, 4995, 11532, -14855, -9437, 20837, 5392, -15913, 13054, 23941, -9599, -8614, 18667, 3481, -17830, -3115, 3552, -11579, -11281, -2746]
336b746r33J985L21k45J1575O81j4893R542J5178k1092j1311K4450m434k8876
350b0798J4919J8523k5162n840K9246o110k2205K0176J4462k2931j545K1653q657
363E731j6136J3237N918j5322K88J2995m130q475N853N734l351l716L80K803j031
378G78n292n51N594l103p307P297R247r651n547J6071N657j5565J252J5642q056
393F466j3891J0710N332j8193l611J6242l127j3910O967J1141m527k597O474J122
407D598k602J246J876Q26l326n688M291O246j1366o770J2120J012j2129Q055Q778
422G167j3471K36J8413q183j6784J4234P251j7577L557J4838j2706o102K0474
435A1347j563j7491Q035R544j0413j576O163p550k299Q355m446m882O213m654
$$ y = [-2746, -3679, -1694, -1373, -1618, 9957, 10638, -4255, 5287, 20465, -627, -11938, 12512, 8078, -20798, -5879, 12644, -12518, -18358, 10888, 4778, -17427, 2749, 17211, -5720, -7265, 14388, 5731, -10405, 2832, 8750, -6572, -6284, 6711, 2581, -5894, -41, 5693, 2342, -1374, -994, 1809, 778, -4514, -5065, 529, -2574, -9881, -2584, 6663, -2988, -8535, 7536, 13193, -2372, -1120, 14522, 6466, -7425, 3285, 8617, -9576, -13187, 3055, -72, -13982, -7015, 4126, -401, -2998, 3476, 4598, 1996, 3242, 5118, 5944, 2618, -3070, 1221, 7467, -3899, -10669, 1451, 2463, -9666, -1611, 7167, -6304, -6068, 12345, 4162, -12622, 1612, 8863, -8714, -5157, 9681, -3025, -9127, 11347, 9784, -7707, 328, 9872, -541, -2117, 4046, -3504, -5803, 2552, -1894, -6776, -563, -5217]
449e217k932J4405k474j6198J5448J6444j9995l997K2077j1976k0238K0851O879
462A3077l0972L147K7587j2528j6502J8253N054j5673O876J1261j2141l301J0342
475D480k60p30O05q161K719J2349j1745j1919J6415J928j7264J2334J5096k3734
489g887n173K8751p835k9164J6481J6798k1836p38K4018r451j4618J8848P351
502A5545j7844j174Q857n592m2L935p989j11Q498o725l201P930r619o354K1606
517G720J747k3550J2409K4111j9969j1525K3984o773k6968J8952J6639k8970m478
530a6671K9053n461j8650J4128N064j7033M230J3088j0003m909Q164J486K769
543E255J865j2135j23J6577r565j4891J7013O006k0555J0682K0085k4166j4210
$$ y = [-5217, -8149, 6256, 3782, -12416, 3032, 19476, -519, -4516, 17561, 5585, -14653, 6198, 13077, -17895, -14748, 12839, 311, -16191, 2062, 7116, -8557, -1681, 9580, -2561, -5862, 4480, 4220, 3490, 4095, -4066, -1347, 11002, -743, -12662, 3753, 5681, -11583, 751, 15847, -7887, -13060, 15691, 7856, -21308, -4827, 11971, -9865, -10603, 13415, 3964, -10654, 8194, 15545, -2299, -3473, 5384, -208, -250, 3685, -4304, -4415, 4083, -2642, -5843, 2087, -7532, -13886, 7720, 9467, -14083, -1674, 22437, 2468, -9057, 14927, 8154, -18814, 138, 16777, -12193, -16671, 12382, 6921, -11729, 2399, 7463, -9570, -5340, 7748, -2255, -7164, 1000, 2486, 5255, 7120, -5015, -5138, 11439, 1874, -13017, 3996, 10002, -10553, 129, 20214, -3952, -18162]
556a8162K7878j409k8336J1629J7997j8510oK4166q963j7209J6429Q809j5873
569a560j712N650m309L564M601r435o74Q329p709l279Q835q188p906J8543M969
584I719j7878Q082J6056j6138o669K0018r361k2499J7742J6977k1042o399K0555
597I163k001j3810Q727K674j4200J653J3149l084r409L463Q990J257p768l512
611d708P074J318r139L827J2075p737j1029J4930Q569k0303o908J6047k841j4695
625a3520R147R686j2269q38J9493q64k0008M016J8376o465j6152P343J1598q078
639A465o679J0233M54j3761j31J2132l321j1292N277J1943k859o500O532M512
653H005r894l966J1449j9j6231K658K0348m599j8224R866J3921j4790p955J5790
$$ y = [-18162, 9716, 8307, -20029, -8400, 9597, -8913, -8919, 15247, 6284, -10925, 5504, 14313, -1560, -3272, 2378, -1931, 1633, 6234, -3201, -3875, 4454, -3255, -6534, 2301, -5887, -13793, 4750, 9719, -8159, -77, 15979, -159, -6828, 13190, 3829, -18670, -928, 16049, -4993, -11392, 9163, 7162, -6648, 2079, 4753, -9447, -7794, 5355, 2271, -7138, -3675, 5315, 6572, -1196, -4708, 2366, 3684, -5455, -1628, 10447, 2710, -8319, 6611, 15180, -5123, -12031, 4016, 1175, -13520, -4373, 5313, -6956, -7794, 11699, 10835, -9173, -5157, 13219, 6754, -9398, -2055, 9543, 1465, -5214, 5019, 5473, -8288, -8419, 3713, 392, -10900, -5623, 6320, 3461, -3039, 3493, 8005, -1889, -5855, 5594, 5575, -10656, -7998, 12350, 7751, -10473, -607, 13314, -1476, -9431, 6359]
667F359k759j7139J0270J5089j4350r111J5619L096j3387K425Q170m770l124Q097
681D485L639m710m498L329N244n822j1215M131Q723r639l457J3726k041j1935
695a0040J2802J0789j8641l917K0135l834j6148J1647Q453j6177k23J4796q349
708A293j3171R650O750q283j119O484k62n41J258k18q98l005k563O898J492j1347
724g582L214J4390o138j1671J2889M994j6744K823J5331j1406j3467J4915P570
737I118j6701j148J2664l522q485P375O030n694k459P667N271o242p155N800N957
752H476j1394p294J1812J098j4147O028J4196j1654r074J7995M670j7532J983
765d837J5723o677j1915J0931N581j3578j953J1866j440j1679L117J0969k911
$$ y = [6359, 3600, -13539, -3269, 11820, -2530, -11641, 3978, 7074, -6313, -3888, 4282, -488, -3612, 4485, 8124, 3414, -1084, 2245, 7489, 1667, -9548, -5417, 3306, -6333, -9790, 3936, 1895, -10040, 2762, 13551, -5090, -9007, 11128, 7294, -8854, 2793, 11246, -4931, -5154, 9642, 1293, -11878, -2228, 4522, -3761, -4880, 1604, 1342, 801, 2059, 1841, 943, -2062, -4625, 2273, 3765, -7582, -4368, 10022, 3884, -7787, 5102, 10096, -6648, -3825, 11506, 100, -13367, 1548, 9118, -7583, -8731, 3933, 411, -8074, -699, 5331, -363, -2822, 4845, 10116, 3874, -3281, 2519, 8476, -2918, -10212, 1600, 2698, -11449, -5421, 8775, -2879, -11953, 6042, 10712, -6820, -4837, 10886, 4209, -7706, 3225, 8806, -4772, -6725, 5141, 3701, -7978, -4861, 6108, 3197]
778C197q879N569Q187q297o207R647K337j3409O35J3729m454j1868Q557J0772
792I516q980n057J0623J682j0374O88Q532m033r798L132P903n685q258O860P243
807C994p686k204J1609O93j0201N202J0384r446q151J0427J696j2448P84R016
821C669o512n165Q674K403p638J265Q504k006n499K506M285k886m475K480L723
836C328n342l399P478K748r185P02J1377l251j0508P046P372j1331m361J1561
850D235j557j2924N455J0960p592o342J0107M664p415l74P438j300o228J151M632
865D910m271o586K376N467m877n450O636N451o555j006R646r56q643N890P690
880I722r689n763J0013Q33j1556K093Q731n781n728Q912K975q641Q84Q924k423
$$ y = [3197, -5682, -113, 8074, -223, -6430, 3217, 5554, -7855, -7220, 6509, 2055, -9813, -1256, 9516, 536, -4521, 6102, 7784, -2590, -1902, 6630, 2597, -7201, -4069, 3834, -1851, -10109, -3249, 3994, -3692, -5896, 5713, 6406, -3795, 1407, 11791, 2345, -5806, 4621, 6317, -6131, -5347, 3669, -2843, -8008, 666, 3069, -4569, -3304, 5200, 3194, -2305, 201, 4486, 1600, -2875, -395, 3328, -2014, -5413, 2065, 4813, -4372, -3670, 7707, 4456, -6052, 994, 8366, -2965, -7326, 4235, 2678, -10246, -4791, 6169, -1423, -7765, 2342, 7006, -409, -783, 6655, 5355, -873, 278, 4910, 639, -5947, -3571, 1896, -2981, -8431, -1795, 3656, -2899, -3905, 5741, 4785, -3858, 2032, 9722, 33, -5730, 4283, 5116, -6440, -4347, 4384, -1397, -7125, 1787, 4762, -3879, -2995, 5929, 3506]
895C506p863L407M768m196l917M025J927l938j439O030K329o438m77Q695q40r089
911c510J681Q108o721p012Q029K093j1066J828J1642m115q347Q272O643o832j706
926a013P049k076n438K788K394m830l090K364J433j305k543Q07M342k35k345L206
942A508K492m745j03O941m231p391N743M691q667n62P924l455n541Q304K602r447
958c937J183Q354m227n847M684J090m490J892K718l330q26L573J127k40k96j237
974A91K850K021m308k416M208k788n247M542K290q159P47J0179k655p222O341
989E74N467o492l16O812l811n844N940K694o878k520M604J9k654m99J244J334
1005c26J35j66K387P31m285L70N017k336o843L749N090m804j518O229j299n664
$$ y = [3506, -4357, -950, 3818, -378, -4295, -270, 1657, -2281, -3720, 2310, 4639, -1799, -2276, 6419, 5579, -3510, -1829, 6279, -442, -7454, 575, 2668, -8398, -6570, 5072, 957, -7390, 882, 7525, 693, -1013, 6036, 3960, -1478, 1310, 3704, -1126, -4216, -1852, -419, -1724, -4267, -3460, 882, 647, -1698, 1508, 4000, -745, -848, 6093, 1862, -5529, 214, 4905, -3762, -4324, 3600, 145, -5396, 2908, 5510, -3937, -2754, 5600, 1373, -4474, 210, 1300, -3190, -1298, 1420, -1910, -2736, 837, 1964, 1724, 1428, 191, 3041, 5062, 754, -1662, 2546, -242, -5489, -947, 1343, -6816, -6069, 4110, 1455, -5767, 574, 6041, -451, -767, 6045, 2234, -3610, 2330, 5024, -1854, -4374, 230, 249, -2405, -2904, -1660, -326, -191, -357, 2030, 2761, -1524, -1154, 3863, 1527, -5316, -1567, 3523, -1281, -2799, 3430, 2131, -3533]
1021c533N257L975p733k628P061M5n309Q86K557k589l6K481j492j662K360J374
1037A014Q22N34j453O40K441j527l560R95j54m138J872M149m719k883P587K420
1053D040o603N94N818l106k722N876p25n869L142M998n215m145L535P62l435J425
1069a630K364k082N21K383L88q11j535j563K053J763m685r92N504O62m034L090
1085A396K505n387O5O174l408o362M903L594n141r91M284l057l161M370Q38l855
1101c233J307L745M20P7P71k093M74J430k601k726J608j090q55L310k13m375L066
1118i78M993m969k193N405q63m436M876L118o629l77O501k367n984L237J867l344
1134b143J130L339j549k222K272R35r85k157j558J601K465k302k091M597J553
$$ y = [-3533, 1724, 5699, -2034, -4662, 2399, 2444, -2865, -1979, 578, -2011, -2047, 434, -1058, -2720, -360, 1014, 1836, 2370, 917, 1557, 3998, 2471, -1089, -94, -248, -4386, -2514, 1635, -3084, -5967, 1620, 4040, -2563, -1969, 3849, 743, -1979, 3897, 3172, -2697, 445, 5443, 228, -3917, -382, 380, -3055, -1630, 734, -1348, -827, 1556, 1944, 1133, -402, -1965, 88, 1851, -2834, -3826, 1678, 2340, -1694, 1396, 3901, -1486, -1421, 4753, 1345, -5017, -114, 3480, -1661, -2652, 1632, -1425, -4586, -216, 622, -3233, -1926, 1819, 2239, 2316, 3087, 994, 1468, 2898, 297, -2429, -821, -1911, -2766, 544, 331, -4044, -978, 4015, -954, -3147, 2258, 1395, -3041, 1835, 4953, -1676, -2053, 4448, 2081, -3903, -666, 1201, -2143, -1013, 2326, 777, -1445, 827, 1762, 777, -1380, -2938, -1337, 1128, -1174, -3265, 1332, 2885]
1149B885m311K627L685n716k748P291K08q025K575N887m986l178M897j456m738
1164e103L180L755l337p02M187M24m89L68j256l16M83j517r62J331j280j837M334
1181A263J245n834N55N982l439l805N483J343n825K823N542n414l538N492Q91
1196B764n256R59L362j726j190L035j11k699M88N69k01j150j717Q42K847j206
1212c90j669L254J214l418J041M422m258l162N187J669o126M40N384l987l711
1227d110M175O65n302J710N118j869k339K777J855j469p47O61J97j352j029J340
1243B81Q70k243r83L748j21m133J013L635l014k535M545J252m841J543M608l002
1259F23l500L430J992l606m98L723o78k730J757J763j789k490J650J275k497j752
$$ y = [2885, -1426, 1201, 4886, -830, -3578, 3713, 3921, -4104, -1529, 4358, -628, -3806, 1091, -365, -5103, -1923, 1832, -1505, -2207, 1980, 2404, 1915, 2283, 1027, 711, 1194, -323, -1285, 46, -1234, -3071, 1263, 2508, -3326, -2771, 3211, -228, -4033, 1450, 2793, -3032, -209, 5333, -81, -3619, 1873, 2764, -2492, -1533, 1829, 103, -1087, 1948, 1837, -862, -374, 195, -6, -1156, -2873, -2031, 816, -390, -2059, 1195, 2409, -1009, 32, 4454, 196, -2966, 2221, 3890, -2236, -1796, 3588, -399, -4110, 65, 730, -4572, -2862, 2256, 387, -1952, 825, 2680, 1211, 464, 1125, 1322, -30, -1059, 281, 1151, -1092, -2075, 1673, 1552, -2581, -1568, 2067, -947, -3482, 1063, 2315, -2526, -983, 3625, 623, -2877, 553, 2545, -1061, -1559, 2164, 1486, -1244, 513, 2276, 487, -2003, -353, 922, -1575, -3327]
1275c327K927J573k802q6L879j001l028K541K788l386k083M480N84m635L85L530
1291B339k368l211K595J951l396q57M185K73l604R52M201k270k900K983J627l004
1307e04j455M379n21m002R15M052k546l334L121J761l557p78L172N45l262L95
1323a619L636j359k930K098L195k263l032L880J993m594o19M153q95m817K558
1338f15L168m508j763M794P56m688J357L723j931k137K884J491k798l76K300J88
1354A845k658l50K500l51k710J32K360r72k836K937J690l576k83M838r20m117
1370b471K552K994l374j640M465p64l795J752L334l122k398L070J023k840q08
1385b022K309Pk257J133K316j693k071K257K860k425k034L306J076l587L0K993
$$ y = [-3327, -400, 1173, -1629, -1715, 2164, 1163, -1865, 676, 3464, 78, -2005, 2475, 3059, -1576, -1191, 2339, -29, -3240, -645, 1306, -2090, -2947, 1238, 1511, -2093, -1141, 3060, 790, -2110, 873, 2500, -504, -1959, 2420, 1899, -2103, -1188, 2864, 318, -3016, 105, 1866, -1691, -2469, 703, 1248, -2014, -1619, 2017, 658, -2272, -174, 3021, 758, -2274, 1606, 3599, -995, -1614, 2539, 1644, -3173, -615, 2553, -1955, -3718, 1076, 1832, -2856, -1499, 2224, 293, -1844, 1040, 2531, -267, -643, 1657, 1845, -813, -1163, 1337, 986, -1724, -1592, 768, -204, -3040, -103, 1587, -1989, -2272, 2566, 1646, -2471, 81, 3075, -299, -1939, 2526, 1762, -2033, -281, 3053, -69, -2467, 603, 1626, -1214, -2022, 287, 294, -1963, -830, 1486, -207, -2278, -21, 2839, 414, -1620, 1686, 2762, -825, -795, 2198]
1401B198j414l207K442K430m321j817M513P98m061O39L590j780j942K979J663
1416B710l849R1L475j31l644L71L055j277k640J651J058k038p14K783l13k955
1432b367M88L679p04l056J593K536j851j658K764N25m020J098M455k107m480L290
1448A85L033m440j433L851o14l788K534K859l214j843L681J493k977J7J879l08
1464I15n66J12P19p17j856J005K153j432l727K461L208l607j436M326q28l848
1480c118L742L173n204j392N888m25m711J981K292l095n03L134j422k348J530
1495d78J865j348j325L26R24P80j420p26J912j20j609J855K213l959o50M742n76
1512B406m631K039L379m726q55M603j840m640L750L048l870j462L914J69j817
$$ y = [2198, 784, -2423, 19, 2449, -1872, -3689, 824, 1622, -2439, -1800, 1790, 10, -1932, 1047, 2710, -1139, -1048, 2427, 2296, -1348, -977, 2078, 801, -1839, -188, 870, -1168, -1882, 901, 588, -2367, -1879, 1800, 1096, -1960, -367, 2169, 318, -1340, 1424, 1949, -2071, -973, 3482, 1375, -3105, 185, 3218, -1222, -2655, 1196, 582, -3206, -672, 2187, -1027, -2870, 811, 2304, -673, -656, 1223, 915, 349, 461, 1180, 463, -1393, -388, 1765, 333, -3394, -933, 2275, -1332, -2768, 1558, 730, -3118, 624, 3797, -1407, -2799, 3089, 2664, -2047, -66, 2226, -869, -1372, 1762, 340, -2008, -478, 1387, 39, -1286, -960, -36, 744, -676, -1402, 510, 390, -1219, 636, 2849, -1110, -1760, 2982, 2406, -2225, -186, 3193, -1533, -2388, 2215, 375, -4265, -515, 2533, -1337, -2799, 1115, 1284, -533]
1527e33J378N78j218l6J072n20o06j258NK255l87l037J489K236k268r93L760j350
1545E67m140L930L447n020j404N486q37m528K672K038l792J1M209j814k968K198
1561E5J673j787j029L82l68Q7L86j40J234k26j611K047K437l509j935M624j7m209
1579a906J521L111l953j031M438j232m949K477L933l053k201L738N46k223J223
1594D39J140j476n96R62K06l95p85k96J384R87k149m72J632q25j280K371Q6l958
1612c025K262L784k878k612L541N41l366J802J832k457p84L508m5l257J444J125
1628A415j996m26Q02p31n36Q47Q83K2n28k79P03J788j562j769K437J079k639N24
1646C4K191k628j724L234j68l994R81L789k317j150K650K86k017J141J638k102
$$ y = [-533, 845, 1423, 205, 169, 1241, 721, 115, -1143, -1138, 1117, 730, -2307, -818, 1418, -850, -1843, 1917, 567, -3573, 357, 3804, -1216, -2620, 2866, 2029, -2499, 173, 2211, -1581, -1570, 2639, 825, -2143, 55, 1728, -59, -1088, -706, -1074, -987, -601, -741, 493, 267, -1344, 703, 3140, -369, -2304, 2320, 2303, -1906, -385, 2726, -1227, -2258, 2180, 948, -4001, -1524, 2409, -644, -2845, 893, 1439, -784, 439, 1579, 103, -493, 469, 675, 280, -505, -801, 583, 1570, -579, -1051, 581, -244, -1524, 847, 933, -3025, -763, 3021, 143, -2469, 1072, 1613, -1753, 49, 1881, -576, -1360, 2148, 2103, -1154, 290, 1415, -581, -1007, -205, -936, -1472, -625, 258, 280, -248, -527, 176, 1964, 402, -1367, 1070, 2149, -490, 34, 2225, -403, -2127, 1107, 939, -3055, -2074, 1715, -602, -1752, 898, 1184, -833, 308, 1946, -156]
1662a56j046J283O15n32Q9n16Q60N78j088l33K26o93o34J966J25k612J254K236
1680A622j685j632J868N21k067J416K113k079j154K805L60k415k47J378j174j142
1696a512J243K47j486N07J315J45p98j96M05J430j250l99P76Q43j199K90J564
1713A925j995k094K187J010k698M0K036K59j821J673P39k077l9J968p61j400L37
1730g11J691m71l68L04N2R0l43q6o4k6j269J290N34j503n19J619j37j339P69R78
1750D91j276L74K195n05j678J177R90j446q21M88j26p16K22N58p04J88K89M59
1768A59l95n06M03P22L80q09N28Q8n92Q9O32m74j363Q37R50j022l69P62J78q02
1788f04N43N83j201o3P16K82m97l14O73P92n99k62J179o74o38K66K97r55k08Q23
$$ y = [-156, -1202, 81, 696, 164, 253, -263, 597, 1175, 87, -246, -20, -713, -1347, 619, 744, -1868, -614, 1622, -63, -1695, 173, 694, -1373, 43, 2156, 77, -1077, 1728, 2088, -327, -574, 804, -370, -1512, -269, -22, -1508, -1001, 314, 459, -339, -535, -130, 1300, 50, -349, 427, 1270, 71, 361, 1925, -70, -2164, 23, 1033, -1665, -1625, 411, 670, -1151, 522, 1261, -816, -855, 1113, 352, -1048, -711, 980, 509, 141, 445, 497, 587, 244, 158, 94, 68, -1201, 89, 623, -880, -1399, 220, 83, -1256, -487, 491, -785, -411, 1784, 1279, -399, 778, 1768, 322, -499, -11, -137, -853, -631, -73, -777, -589, -300, 159, -236, -742, -339, 383, 763, -46, 482, 570, -22, 67, 699, 225, -1138, -301, 649, -373, -742, 20, 198, -604, -61, 522, -679, -742, -26, 256, -241, -555, 118, 910, 311, 49, 1228, 554, -84, 182, 479, -476, -684, 139]
1808A39J45j141m88J448n19n44O24N83m52R7Q53J09m07k20Q39l36j070K05M34
1827B99m53q99J142L70j307l03J488j30r49M91R36p82p7J186n01o79j01J102j077
1846b44j23L32N38p82L00N9K77p32k32P10M6r79k6J227n00j016Q90J369j156o07
1866f49J770K18j793P82P16p67j186J196L09j512j93Q00M3q30K48R90K1k94L41
1885B10N13m18k65L64N79r70o26J247n4j233J16O85n55p31J437M14j146m45J980
1904A102o82j575J133O84j019O9J072m41p98R09K54m01o82P64p0p99j31L59Q0
1923a72j76k19L61K48n74J51J120n89p19J170Q65j588k79J628q33j479J306M84
1941G05j941L0K255j344j222J317P08q83k74J383p05j95N52J22j83Mo51L67M77
$$ y = [139, 284, -857, -1345, 103, -416, -960, -336, 247, -205, -108, 745, 854, 447, 227, 1066, 730, -340, -135, 299, -154, -1053, 89, 459, -848, -1151, 337, 207, -742, -251, 685, -97, -174, 1012, 511, -168, -269, 833, -244, -367, -35, 503, -279, 21, 80, 357, -375, -607, 103, 149, -830, -856, 371, -129, -1145, -255, 1114, -42, -649, 1121, 1339, -454, 328, 1044, 277, -909, 287, 596, -916, -1109, -309, -266, -1096, -848, 142, 163, -131, 210, 723, 305, 40, 404, 983, 13, -613, 634, 580, -653, -537, 148, -407, -1138, 299, 713, -433, -878, 1102, 420, -1155, -22, 662, -357, -288, 784, 343, -455, 454, 708, 307, -375, 389, 319, -480, -611, -252, -172, -348, -567, -206, 42, -532, -381, 739, 150, -569, 601, 1466, -122, -401, 1227, 394, -1085, 221, 705, -1236, -1206, 1049, -295, -1517, -200, 508, -375, -649, 734, 29, -166, 386, 508, 325, 329, -322, 45, 522]
1960E22r73m92J551l77j496J671O16k139J50K506j360k148K390R65k081p1K392
1977A626j220j496J979K23j902M86J166p59o1J80o70J56k28l60M71O36r75l05
1995a053K525p52j942J725J345k309l62K653j120k568K403R96k902p0K003o18
2011d6j389J547N96j547O18Q97n93n80M57L56J85o7r73O73P04j002o21J791l67
2030F39j739J232J087k637p3K789j016k016J539J066k074Q65J939j312j467J890
2046G12K47j015oM92m58j86J03O3l28J03l29O66L19j214L32J388j22j869J167
2065F5J173j728j81J864o67j645J689O74j880m44J864m82j317Q31Q43j386J12
2082f15J241k68j140L57O05j09m9KK82J21l71J78N00p09r27J174O25j559n01J428
$$ y = [522, -451, -943, 608, 231, -1265, 406, 1022, -1117, -967, 1539, 179, -1969, 421, 1386, -695, -766, 1626, 406, -1090, 889, 1112, -790, -304, 862, 103, 42, 222, -448, -292, -520, -880, -409, 227, -748, -1053, 1472, 720, -1222, 503, 1848, -461, -823, 1830, 710, -1858, 545, 1541, -1361, -1431, 572, -46, -1435, 112, 708, -839, -221, 676, 83, -497, -40, 316, 501, 434, -539, 134, 838, -164, -785, 1006, 639, -1100, 132, 1219, -1418, -1491, 1298, 282, -1734, -195, 871, -1203, -338, 1601, 289, -1178, 712, 959, -56, -62, 430, -28, -214, -111, -48, -376, -273, -602, 64, 383, -831, -499, 889, 767, -1102, 65, 1238, -490, -671, 1193, 526, -1119, 570, 1244, -636, -1080, 784, 302, -1015, -184, 659, -727, -615, 626, 358, -782, -425, 180, 71, 22, 24, 306, 427, 56, 234, 734, 25, -902, 272, 897, -662, -1163, 265]
2102B65L3j379P93J069j551N6J640k58j445P85J253r20m85P18j12j040L38O57
2120D17o00p35M16P85k66q67N11P89n01m76M01J020j388j01K118q52j547P15J596
2139A435j791o90J744O5j775R20J232j289j096J641p0j234N37R65o31q9N08rj45
2158B28k53O23J8m84m51N27N71r36n99J122j24j121O30P47j101n11J753L43j615
2177f33N58J464j274o11J093j26j048K19J117j033k30M12L84k11p08L50J26k45
2195c96j06O93M18o08j27Q94l6j370N94Q70r57j91O71j67q97M07R06r85n41Q39
2215h9M76r25J07O96r1l58N00K21o00J52L60J54q81K43L99j61m32L05J61k68o89
2236g20K54Q64q94j93J243J10j079L10Q78o42n41Q23O0j017N11P10l05r49Q1Q69
$$ y = [265, 298, -1081, -288, 781, -770, -714, 926, 668, -777, 8, 1261, 341, -144, 574, 462, -578, -240, 417, -183, -918, -502, 283, 17, -850, -339, 450, -51, -527, -126, 894, -494, -595, 1523, 671, -876, -161, 1435, -356, -1046, 698, 763, -1012, -92, 1140, -149, -1245, 396, 326, -908, -371, 594, -37, -126, 382, 373, 228, -25, 598, 616, 132, -319, 208, 779, -157, -756, 366, 242, -879, -249, 498, -603, -1114, 639, 982, -633, -75, 1389, 115, -496, 597, 471, -577, -358, 759, -274, -504, -92, 292, 81, -627, -277, -151, -396, -502, 191, 609, 1, -126, 768, 732, -638, -44, 826, -131, -322, 349, 182, -715, -308, 598, -387, -928, -89, 387, -538, -431, 265, 174, -184, 316, 537, -63, 89, 449, 603, -278, -35, 364, 203, -229, 76, 237, -31, -720, -466, 398, -496, -689, 554, 664, -415, -105, 773, 131, -410, 413, 473, -544, -33, 677, 372, -577, -496, 373]
2256C73m53q50J117o4l45l36R79K37j043K31J118o12p54M03O31m97k63P03l32
2275B43l21j79O13o22n43N52L38m98j17Q33K86j063N88N46m65n56O97N48q53p2
2295d5P35l82n89J45N10l76p46M25M59p97K48J026m11n40M68K07p5q4r7K73n68
2316b14O0M69L3m71j1M17o12j70M88J96l16k11N48j25n65L25P76m59l01M38K74
2337E69o87L22N25p25L6j12L83l46m13M69M7n38j13O84J28m09j84M64kj71L35
2358B62M33o67m02Q44J9r45J99P78m11o46M74K4n91K62N93j91l56O13j38r7J95
2379B52Mm01J50L85n42J80L7l19O54o3o12M15J60k10n58M78r9l83M7Q10m19n33
2401e67Q86L6m79K68P23r49O2J73P3p60K46L08j7o3Q2l00J61j92K63R2N4q9m6
$$ y = [373, -80, -930, 187, 123, -222, -558, 421, 658, -385, -154, 964, 352, -402, 1, 632, 135, -128, 575, 243, -78, -257, 356, -266, -809, -257, 81, -417, -534, 299, 585, -478, 110, 656, 191, -365, 332, 880, 27, -45, 690, 308, -281, -136, 374, -2, -748, -323, 136, -661, -413, 613, 202, -338, 130, 337, 262, 178, 81, 354, -214, -154, 315, 348, -123, -134, 283, -329, -499, -11, 185, -131, -342, 206, 81, -484, -159, 617, 158, -143, 295, 569, -118, 204, 729, 4, 40, -72, 311, -35, -448, 21, 68, -470, -583, 101, 229, -180, -364, 100, 98, -73, 262, 695, 28, -374, 470, 489, -456, -257, 521, 110, -536, -62, -38, -629, -367, 226, 35, -321, 292, 154, 57, 252, 256, -145, 5, 390, -152, 28, 65, -254, 400, 337, -275, 140, 300, 90, -468, 10, -89, -472, -425, 385, -34, -567, 319, 355, -124, 144, 867, -82, -20, 153, 226, -534, -288, 20, 3, -60, 22, -278, -117, -309, -46, 46, 100, 11, -35]
2424c5M33p1n66O15Qn30rN37n98l36O21K11r40K16M29L6n88N77R9o8L69j11l53
2447e4Q1L01m09J98L14p69M86O3n43J2K96j98j12n7L33j73j81P49j21q47J078
2468D47K36p48L37K95n53L28q4j81k25k6J0o6L04q1l92K46J97k50M77M9l79k11
2490b70P03l53l19N26K45l80m00N10r8l40N56j33o56N0M77j76m30N50n82J53N03
2511A36n8k21L14K82k99N18j70n59J70M19m64m26L39Oo36N77K70r56L94M97J02
2532B35o88P47l20k03J96O69m64j59K31o4j82j92J80r5o2kj65L41J3m27J09P02
2554D00m18j1L28k36l4j28L78k18k51K42L44n80M31J46l96m47L76l7j73K88n3
2575d9j22j23N88m35K28m0J36J07J05k77J11Q4l51k7L9J52m36J65L62l40l25M74
$$ y = [-35, 398, 327, -239, 376, 384, -146, -155, 382, -216, -552, 69, 280, -660, -444, -15, 21, -567, 10, 109, 41, 410, 299, -54, 27, 328, -81, 117, 431, -338, 148, 211, -332, -320, -24, -222, -334, -391, -58, -231, -412, 337, 216, -631, 447, 683, -65, 272, 567, 14, 342, 258, 77, -148, -174, -164, -230, 74, -7, -399, -153, 44, -206, 271, 320, -59, -270, 433, 80, -239, 287, 532, 152, -248, 262, 164, -176, 380, 247, -409, -359, 118, -58, -488, 62, -520, -367, 136, 78, -143, 171, 453, 154, 672, 502, -57, 113, 532, 68, -358, -19, -13, -649, -72, 198, -758, -364, 133, 235, -453, 294, -26, -229, -33, 636, 172, 13, 244, 180, -2, -194, -14, -109, -171, -173, -338, 3, 16, -411, -302, 400, -18, -29, 299, 63, 29, -99, 279, 61, -190, 52, 396, -184, 247, 393, -3, -450, -74, -111, -284, 4, -49, -171, -294, 294, -141, 87, 47, 183, 290, 395, 118, 229, 313, -38, -65, -26, 126, -310, -145, 217, -123, -448, 26]
2597B6K80m08m03P20M24p54K25M56n85k57N50J44n86J54J34o0n19L12k26K98Q1
2618Fl7J44m90p9O33J77l83k03L82q7m2M70l10m12O6R99p32l58m1M93o91O1N35
2641A01k84j49N76k64j07K73J41q9K2j68o5L06j89Q4M0k92n1j8R2k08m36O48K39
2664B02m78m0P08n79l51J010J85q07k13J065l96k77K4J81l40P0L77m44K19l83
2684b67K57j22k53M58K8j46k12K85M75m03n85Q30J47j82o62P88k47o09K82K83
2704A45o97L08L56k18l19L14M05m62q4K30L86l02l7j2P7L8l99N13k80m15J44N38
2726B29m60J73j11K95k89o7M80k21l26J57K84k05k53K74N72q70J52O55o16J94
2746D7n5K59m92r8N71k34k64j12L92q7k73N06K28l31K17J2o9l51L77R4k61m37
$$ y = [26, 306, -102, -505, 215, 639, -115, 110, 566, -19, -276, 274, 418, -168, -14, 120, 60, -459, -147, -373, -75, 6, -31, 113, -377, -456, 177, 354, -29, -232, 150, 63, 21, 491, 181, -231, -165, 834, 102, -256, -297, 196, -495, -434, 101, -183, -332, 244, -20, -127, 146, 287, 198, 220, 52, -13, 293, 104, 188, 228, -64, -115, -133, -41, -249, -685, -37, 202, -276, -316, 392, -187, -538, 472, 657, -150, -363, 702, 306, 29, 53, 234, -106, -36, 341, -103, 116, -267, -10, -132, -385, 73, 101, -45, -257, 28, 503, 100, -485, 345, 492, 310, -352, 436, 189, -420, -138, 145, -552, -244, 112, -106, -425, -111, 294, -168, -252, -22, 364, 62, 25, 13, 90, 128, -271, 242, -38, -453, -309, 229, -231, -58, -169, 126, -163, -230, 250, 29, -297, -140, 144, -61, -314, -40, 532, -338, -186, 469, -147, 47, -8, 251, -241, -339, 232, -2, -266, -378, 14, -73, -346, 160, 388, 57, 274, 286, 217, -134, 243, 337, 76, -361]
2768c61O10l14Qj08K49K85n50j48N18k54q0L80J81j68m66N68l56KQ7K25m19j81
2790b92J84L76k99j91N15j63k97k8L53j53l75L11J7K00k86K14M5n7J29k07J76
2811A72m13K6M82k28n9J85n48m1Q1M12k54J03K71n7l8n15O61k07m08M86k8J0k63
2834a70N06j07k82l01K40r6l22M3O02L9o06L14K03k28j0N71N2n13j48P79m09l31
2856a74K64J10l31L35P0l31N5L1l32L72k85P2Q4l2J65J80j75j74J65k0K0j25l2
2879h8O28m97l55N43q7l47J28J33%o08P54m0k43K7J62Jj47J72K36l4k44p6K39
2902B57n41L16J76K66p65N7K58J8k24K70R4m23J04J09K82m04L76Q8j2m48J63O70
2924F87o93k41J93j28N9L68l5l69k78L24jP5l3J59j61J92j8J83Rk62K05p8k58
$$ y = [-361, 249, -65, -57, -165, 84, 369, -181, -329, 189, -65, -145, 235, 416, 248, -218, 350, -6, -4, 83, 308, -111, -292, -108, 268, -31, -222, 293, 130, -167, -195, 158, 5, -370, -59, -42, 158, -128, 86, 131, 74, 203, -4, 172, -241, -215, 267, 39, -20, 165, -383, -424, -343, 69, -185, -82, 189, 132, 94, -421, 240, 33, -375, 111, 83, 93, -170, 336, 229, -53, -354, -114, -210, -532, -489, 113, 152, -454, -140, 63, -165, -175, 396, 448, -65, -213, 566, 157, -174, 90, 200, -131, 204, 274, -57, -2, 29, -303, 69, -216, -144, -60, -92, 73, 253, 78, -96, 69, 49, 69, -56, -88, 540, 43, -312, 231, 144, -203, -75, 58, 58, -550, 204, 164, -79, -52, 110, 111, -36, 136, 372, 338, 94, 18, 257, -284, 32, 208, 474, -291, -234, 24, 42, -182, 88, 182, -241, -137, -28, 254, -150, 226, 314, 302, -146, 17, 687, -6, -247, -54, -182, -123, 245, 210, -159, -437, -113, -114, -39, -72, 87, -74, 118, 100, 283, 292, 30, 235, 157, -101]
2947a01j99M47l39K89n71N99j71r4L2M10m02m55P57j84m50N00K54k08k18L50j06
2968A40k58L14J46m48K27k35L8l45K63M2K87M7m00m0M26j53l40M80J20l09J4L94
2990D10n78J10K08k62O8j57K95k11j49J76O4j88k1L69N4j40p5R3n2J94k58L0N9
3013C9j21J54K02k65l21J23K4P7k88M64l81K75L41j25m50L43N4l53J78N4L45l52
3035A7m5J64k50j78J48L0P2J72j89q7J14J02k31K49l51M15j38P0j38N4K70j22
3057A48m24K52L13l63kJ12j85k66L53j92q4L29K45l67RL01r7k02OK51o0K30j24
3080A83m4J37l34p2N7K28j76l37J14RJ78L9J9P9l68N17J12j61J72k64k07J51M24
3103D56q06M5L78k47k76K63K81l92P92n14j03K88k23Q9l06L73J26l47L71l65K03
$$ y = [-101, -300, 147, -192, 97, -474, 125, -46, -140, -108, 302, -100, -555, 202, 18, -432, 68, 322, 114, -104, 246, 140, -118, 196, 342, -106, 121, -114, -76, -421, -158, -116, 171, 218, -182, -222, 204, 51, -289, 191, 311, 2, 16, 410, -168, -58, 150, -112, -44, -201, 94, -117, -266, -90, -26, -214, -235, 134, 188, 48, -27, 66, 14, 208, -50, -20, 39, -82, 72, 274, 9, -312, -189, -165, -88, -376, 88, -293, -18, 323, 198, -252, 91, 145, -208, -30, 24, 369, 17, -28, 136, -114, -292, -144, -114, -42, 130, -59, -146, -32, 70, -161, 88, -263, 152, 14, 84, -54, 0, 270, 148, -276, -24, 289, -74, -76, 36, -149, -415, -62, -254, -338, -9, 236, -131, -122, 179, 82, -120, -114, 137, 77, 307, 183, 139, 276, -58, -130, -73, 155, -21, -358, -244, -235, -57, -18, 1, 80, -288, 229, 341, 180, 352, 88, -119, 32, 456, -350, -305, 73, -174, -450, -187, 94, -298, 494, -20, -123, 165, -58, 31, -275, 98, 224, -123, 248, -117, 86]
3124H6K89M1o39J79K16j26k43L9K74l00N9J32J40k40K93k80J92j34J04MP8O5k06
3147B3j51M35k68m23P17k88k02L34l83J24J2j5n8j26K67o2P9j29K25l02L57o4
3169A02j41oN3o4J17j2J49l42K09j61j1K30n5j75N0J90J33j48j40M27l67P4j14
3192bn6j39L05q4k47M9N2J67k07N3p5J03k9L12j47L2M3j44J21j93J62l6R1o8P5
3217A38L3l64J21J52M23r39K68J84kN8m8Pj44K13k6K73m27L46j37k02J75j08J78
3240A72l03J02K87l90J49p1j01j0m1M62k9j61k69M76J22o03K89K15k83k50o3P16
3262D16m00L31l08j40J22K58n49lK02K09j13NO8j50M03m45M28j43L01m42j08K60
3284B02j12k55L01k06J0O6j81L42j57J58k85J84o4K50Q4m19j10K98J3l03M49j01
$$ y = [86, 375, 416, -223, -44, 172, 46, -197, -158, 116, -184, -125, 7, 147, -93, 200, -80, 112, -22, 82, 86, 164, 229, 23, -128, 307, 39, -384, 333, 45, -157, 177, -206, -82, -70, -85, -143, -269, -2, -64, 15, -114, 111, -191, 166, 102, -39, -45, 8, -56, 61, 49, 198, -144, 65, -96, -107, 123, 68, -107, -57, 133, 266, 118, -22, 405, 38, 112, -2, -58, -197, 108, 24, -223, -174, -122, 45, -162, -109, -184, -81, -110, 202, 55, 87, 130, -14, 107, -86, 76, 40, 131, 63, 138, 171, -193, -72, 80, 503, -436, -168, 16, 14, 72, 24, 31, -113, 100, 74, 347, -80, 266, 129, -73, 102, -6, 172, -131, -29, 258, -132, 17, -54, -155, -165, -206, 256, 227, 66, -203, 273, 395, -208, 81, 296, 13, -237, -300, 416, 16, 347, 39, -101, 21, 279, -270, -273, -71, 138, 25, 30, 98, -52, 351, -94, 334, 191, 492, 50, -58, 202, 90, -165, 136, -70, -60, 6, -175, 167, 10, 168, -117, 67, 3, 253, 337, -82, -192, 106, 119, -184, 265, 164]
3306A64M0j07k35M5l39L38n1p6k6M2N13k46j08J28J73j36J30j95Q7l57L41k19
3328i4P9p8k13P1j32K62kp6J84m3L5pJ51j47P7k36K52K76m9m26K50j46m68Q15
3352C35l15J74j29k61j9K80k18J13J62k04L2j4jJ6P18m98J06j37l41M11J13l24
3374aJ12l25J72j30O2j23r8L73R2l62L27R9Oj86K14Ml6j65k17q2N8m6M62k38m6
3399g4M1J02k32J65m11J81M60l46J24K38K1m50L3K00l21J86j23M12l01r3l5Q6
3421a37K41J89k76k18K18K63l66k4O9j6o7q3K32K60k12j52J40j69J61p8L40k43
3443G2k31M13m36J44O5R5j74k34L23j27O3O2K0K25j7k47L3k59O52j55o16J26R5
3466a08P0J01J81o2l48M30n41J45J96l25K85k17L25r9J7j66L26k13k44J98j59
$$ y = [164, 204, 97, -138, -93, -432, -94, -145, -221, -247, -205, 308, 62, -46, 82, 255, 119, 249, 54, 141, -216, 125, -94, -15, -93, -306, -235, -367, -105, -107, -183, 1, -42, -7, -14, 137, -10, 67, -169, 83, 359, 310, -116, 134, -12, -480, 335, 20, 194, 65, -196, -215, 65, -153, -40, 122, -82, -50, -64, -65, -49, 669, 171, 277, 140, -201, 210, 323, -1, 111, -214, -42, -172, -110, -233, -331, 42, 134, -228, 99, 198, 204, 18, 232, 236, 200, 35, -182, -264, -206, -252, 210, -28, -74, -33, 69, -163, 2, -409, -228, 232, -114, 10, 248, 269, -181, -148, 52, -269, -83, -206, 206, -95, -188, -223, -137, 104, 293, 17, -201, 17, 280, -86, -110, -41, -57, -124, -207, 25, 285, 73, -79, 61, -108, 53, -25, 315, 72, -159, 254, -182, -38, 27, 122, -52, -286, 37, -90, -27, 35, 55, 280, 263, 16, 49, -210, 442, 287, -329, -203, -108, -38, 63, 244, 182, -166, 264, -277, -132, 64, -261, 24, -193, 132, 33, 50, -116, 210, -3, -247, -49, -208]
3487b08J88J12k12J38j25K38k22J07J1J21j9m5l36K61K68j80J98n32J98n1P9%
3509a1m20P80m45q1J05j7K7o0K17k25L02P2o3l58K9J04k4L83l59K17l05j21m9
3532c02L24K52l82k7K68k54j50K93q8J89k21J73r3o0N6n5L73k89j41J24J52J2
3554A54k37J59j71N1J19l34L06k01J19J63O6l66k2L89m40L75j37K5j00j18J00
3575a00j46N35l26J59J53j97j91k07P9J88K13r7j60j38J54L6K19J62l24R3K5j62
3597c2m0J47l82J69K96l37J51j60L13k33J34k89L92J13l84J59k62M66n20M17j17
3618AL5k18O24o18QK58k48P5J75J19j35q6j20J79J9p9K63k96J9k71L57J56k79
3641f2j60K70n5j07K69o6J10m81N25j59l58P2L57l35L53L5o0k40K91j32j63J98
$$ y = [-208, -20, 92, -120, 18, -107, 131, -91, 16, 27, 148, 129, 84, -252, 9, 277, 97, 295, -237, -39, -90, -11, -11, -431, 349, -96, -177, -72, -89, -62, -122, 95, -130, 172, 244, 181, -177, -148, -44, -68, 315, -44, 173, -132, -253, -302, 22, 274, -108, -135, 133, -121, -271, 22, -66, 123, -98, 75, -18, -78, -22, -77, 296, 7, -134, -10, 142, 154, -83, 76, -95, -44, 75, -259, 47, -154, -35, 128, 194, -172, -194, 195, -245, 130, -7, 18, -82, -200, -100, -246, 289, -37, 122, 275, 78, -113, -320, -241, -53, 160, 63, -97, -235, -81, -45, 174, 336, 12, 105, 130, -32, -72, 75, -307, -138, 158, -179, -28, -188, 125, -108, 26, -263, 129, 242, -142, 17, -245, 221, -299, 118, 1, 36, -182, 442, -176, -168, 90, -158, -83, 92, 211, 76, -10, -130, 49, 68, -11, 252, -44, -25, -296, 61, 217, -62, -222, 48, -7, -114, 155, 89, 199, -282, 243, 84, -274, -202, 155, -180, 173, 208, 148, -92, 199, 67, -96, 102]
3663A02j00l19K18J92j50J62k26j58J83l8L4r6L88k85Q1Prl5k37m4J64k9J78J65
3687A48m75LN58k48P5j27k7m7R6l07K90qJ81p4k19R8k38K17J48j99J3L73j75j2
3711D4j26Q9j83J94L46m98j17L55k68O29m76k9J83l28K14k11J16j78J96O9K09
3732B30k94L42k51J99l00J47K13k85j3L7j33R2RR1j14k38K40L04m43L07j28J24
3754A36k85J02r6J65N8j03l06M67k14L82m34K57j30J42m2j12o3J47M1m6jK7J1
3777A03j27R6K80j57j76L47k29n6j3k14N69m48J96l63K80n9j44OP5r2R7M81m22
3800C0kK16k29j73j2K73j35j49J73l5k7n4J21j14K99j32j89L77k26o5M6L13m25
3823a19K83j18q9m7K11k73j30M27j34o4m0M7O0j78L11J4k33J55m5L0l06J75M9
$$ y = [102, 2, -317, -99, 93, -57, 105, -121, -279, -96, -134, -100, -196, 192, -93, -12, -5, -14, -49, -286, -330, -166, -195, -17, 148, -327, -324, 234, -14, 61, -66, -93, -140, -44, -351, -61, -69, 112, 38, -181, -83, -321, -104, 44, -155, -142, 231, 56, 44, -82, 7, -176, 18, 364, -134, -251, 104, -164, 465, -11, -40, 143, -185, 29, -182, -66, -244, -48, 21, 230, -64, 278, 27, 226, -74, 73, 286, 1, -12, 25, -108, -16, -7, 84, -30, -268, -28, 276, -167, 140, 12, 136, -149, -47, -143, 22, 80, -23, -329, 138, -76, 306, -128, 129, -1, 141, 99, -13, -76, 71, 112, 66, 65, 92, 103, -24, 72, 352, 195, 19, 366, 137, 81, 68, -146, 423, -25, 171, -192, 88, 29, -115, -109, -34, -126, -29, 452, 30, 28, 244, 15, -158, -170, 103, -32, -181, -8, -43, -70, -124, -3, -117, 182, 50, -139, 238, 12, -53, -7, 306, -119, 164, 46, -43, -90, 121, -152, -282, 145, 11, -53, -93, -46, 14, -164, 147, 161, -72, 83, 38, 68, -238, -63, -14]
3846a4j74M7M58n08k56L09M3LP5m5K82k77K34l70o1Q1L05j98J28k81K27K04k71
3869e9J06l2j22K2N05n70J07k4j6l6K22k06k9J31K58j49K09p63K25N59l73J80
3891A45r7O1k57L07l48L51j77J27j52l7N1j80J52M2J06q1K62l77K43j37J02J7
3913A23Kk34j6J52l4Q4k65K38J36k68J10j51j47K10j47M51j39p8lk23M4L23O7
3936B35n5m68K99J77k61K01ql1o4j45p5NJL04J55k29r3Q6J70k53p6J59P0q7j16
3961i9r7J49K4n3J39j39j9K73k70J19qj59L89k82Pj32J49p7k29K80O4j0j64M00
3985B55j95R6k8j50j28L02M7m15K12Q5ql59N25o0k08L30n48K44M6k62K88k75L08
4008A02j30m5K21j93j9j92K53l20J91QK02j87k12J62J93J50l07K28k47J63O7k03
$$ y = [-14, -188, -141, 317, -191, -447, -138, -95, -92, -17, -62, 220, -57, 177, -193, -254, -173, 132, -66, 62, -219, 8, 212, -59, 47, 15, -107, -85, 420, -150, -43, -67, -83, -119, 103, -103, -132, -1, 257, 108, 317, -446, -221, 338, -35, 145, 48, 109, -148, 159, -189, 162, -15, 112, -40, -77, -26, -206, -54, -12, 94, 13, 275, -102, 141, 4, 106, 123, 125, -109, -125, 27, -7, 77, -188, 50, 186, -82, 28, -123, -270, -60, -207, 244, 105, 27, 24, -199, -155, 168, 235, 180, -288, 11, 188, -73, 128, 120, 89, 25, -120, -195, -190, -189, 115, 270, 41, -52, 34, 204, -49, -125, 34, 104, 17, -99, -196, -47, -23, -76, 63, -76, -95, 178, -92, 27, 19, -140, 249, -33, -26, -158, -9, -86, -315, -35, 29, 19, -145, 255, 60, 156, 128, -22, -150, 152, 199, -216, -4, 81, 73, -286, 239, 179, -29, 301, -247, -3, 43, -219, 69, -206, 102, -28, -73, 148, -45, -64, -256, -3, -323, -132, -124, 78, -109, -321, -159, 34, 184, -123, 105, -142, 21, 88, -115]
4030a15p4j4L53m6j60J36mj33N3j18K01m91O19j76p6L76l25Qk93J05K69%j95j27
4054b27K73J70n9n0q5J82k85K21p2J49q7O4o4J73J7m00L0J28Q1p8J38k82m4M14
4078C07j97j50J50J36k51K38j89j21p7L08J44l49j60K79J6K7j65j39Q4j54K86
4099B3L07m39k6k85M95l72K81k83P13n30j04J09j18O03l71J2J75j78m1m4J39j72
4121a06o7L26k00j58k61J10L05p8l03N90l11o4M9K07P8o3r3K7J04K52k67k46M26
4144B57j23j28K6j08j19j1P97n09N5k3l86J81J81K3L5k61m9K94j59j22J72J95
4166B18k45J44k07m7r0K34j31K05lk16J01J7J54o6j65J97R4Kl54L52j86j47L51
4189B12l25J43o4K72n1k12j07L35l34R1j40K19j13N6O6j00k31K72p1N4j45L66
$$ y = [-115, -189, -203, 150, 104, -56, 80, 76, -57, -4, -122, 79, -412, 207, 31, -45, 331, 6, 14, -279, -174, 95, 95, -100, -227, 46, 216, 157, 107, 22, 204, -81, 140, 68, 217, 130, 194, 130, 303, 320, -80, -50, 78, 159, 81, 219, -63, -107, 307, 110, -40, 110, 246, -5, 233, 44, -77, -154, 154, 298, -51, -211, 68, 84, 111, -54, -193, -109, -263, 23, 330, -109, -135, -420, 75, -297, -16, -299, 414, -116, -220, -111, -229, 374, 3, 15, 190, 12, -29, -73, 66, -106, -173, 153, -47, -205, -466, -356, -51, -129, -432, 158, -153, -217, -168, 39, 117, 54, -39, -12, 92, 344, 77, -169, 257, 134, 6, 32, -76, -195, -206, 591, 82, 137, 114, -272, -91, 90, 113, 148, -113, -162, 132, -27, -149, 23, 218, -27, 117, -90, -137, -227, 7, -124, 81, 78, -138, -37, -20, 134, 68, -97, 100, 194, 196, -158, 194, 8, -139, 212, -113, 30, -34, 238, 187, -25, -132, 203, -131, -40, -180, 39, -74, -18, 48, -52, -283, -11, -82, -28, -173, 193]
4211A93n11L32j98j80O60m81M21m88L13k41M25j67j32R3k17J33K77m97q1M25m6
4232C3J25J57l56j03Ql3N1k57K03K04P9K0j93O0q0K26j8Lk08N0k19L59k27k00
4256c16M98l89M3ML07j93J55m19J73L17J06j98k73K14r0N8J91j44j96K40l59L30
4278E9J81j14R5k93R7L0j63K66k05q7k59P4K12J38J74l29J12N4j81K95l24L96
4300B28p5m11N44k06r5K6P5Lk5J01j25j9k63J23L0J70M69m20j41J18m30K32jJ28
4324C6J03M4j48J88p7l34K67J98l45J01R5lj82K17l40M3K36j71n5N7n3P0NrJ66
4349A09L5K9k58k19N02m0l60L75r5k36J61l90O20j73K01m76QJ64n0M12m19R8k23
4372b25R4n8j58K60J57O4k13Q5j98k5J18J14P7k31q2M86l94q5L49J9l59M26k53
$$ y = [193, -318, 14, -184, -364, 296, -185, 236, -252, 61, -180, 245, 78, -54, 39, -178, -45, 232, -265, -346, 79, 33, 158, 315, -41, -144, -136, -169, -118, -375, -172, 32, 111, 131, -62, -2, -82, 144, 126, 129, -79, -29, -248, 111, -116, -316, 182, -207, -164, -160, 147, -46, 109, -310, -137, 180, 286, 88, -185, 29, -61, -3, 188, 44, -152, 88, -271, 59, 240, 126, 221, -72, 25, 55, -108, 158, -47, -134, -393, -319, -107, 31, 205, -124, -12, 42, -139, 156, -168, 228, 153, -258, 286, 80, -15, 11, 86, 89, 64, 165, 40, 21, -242, -119, -89, 81, 550, 130, -11, 107, -323, -91, -92, 36, 139, 183, 35, 223, 146, -188, 79, 277, -68, 33, 128, 125, -57, 160, -180, -137, 99, -72, -127, -70, -123, -53, -48, -57, 109, 144, 173, -85, -304, 198, 158, -202, 173, 78, -158, 3, -387, 233, 60, 261, -215, -207, -43, -93, 319, -100, -2, -225, -131, -189, -347, -87, 70, 134, -79, 6, -192, -217, -99, 15, 92, -139, -221, 265, -129, -214, 135, 154, -205, 221, -32]
4395c2j16J35k95L33r2K0J3K52l20j37K77j27L26j52J09K40p53O8L11M6k33k0
4417a47P3J92L42r7l58K9J52k01K74L2j92p0M3K16k43k11L01J35l52K01k58K73
4439A34j32j77K39O1l8p8J18J1l20M07k85K7K89l96K10M4l17L28k03j80K76M2
4461F0j64pJ30l69M25k70K02k03L10m27L23K06j62j58Q8j02j87J36J26J79l01
4482a65J01P9J19Q4K13j51k6k73j09O8M3k48L09J86n62L23k36M84J6l61j1J37
4504B0Pl6L07l50k61L83j25P4j69O15m14j07lp1n7K26k79N01n51J56K61k86k31
4527c90J31M86m64mL70n1r9L7j58J66J12k25J06O7l41M58m0j76J42M8J50l39J78
4550A64j33j57N3m4K36L87o41j04J93K66m00L79l02l96M94J89l28L65j70k09l
$$ y = [-32, -148, -13, -308, 25, -67, -47, -34, 218, -102, -239, 38, -89, 237, 85, 194, 434, -319, -251, 60, 106, -127, -147, -74, 118, 460, 363, 5, 34, 186, -15, 259, 291, 99, 29, 72, 288, 45, -166, 135, 270, -82, 119, -139, 134, 2, -175, 64, 125, 87, 9, 127, 138, -182, 225, -60, -33, 256, -140, 70, 114, -203, 125, -78, -258, 18, 60, -104, -111, 19, -350, 75, -195, 7, -196, 114, -313, 10, 216, 54, -104, -16, -118, -305, -169, -43, 136, -165, -64, 15, 134, 218, 431, 280, 254, -19, -128, -60, -17, -265, 44, 230, -332, -9, -245, 239, 255, -106, -117, 20, 27, -9, 298, -52, -313, 70, -55, 19, -150, 465, 51, -56, -59, -130, -187, 39, -240, 261, -290, -134, 127, -159, -390, -259, 227, -237, -241, 129, 78, -21, 16, -142, 24, 136, -89, 17, 84, -257, 201, 161, -15, 127, 175, 325, -14, 164, 31, -126, -73, -117, 119, 506, -135, -239, -46, 220, -180, 199, -103, -499, -5, 184, -144, 221, 51, -158, -161]
4571a61J29jl3K39k55L7J30j49p4j8L25k90K44l43K02m8K06l24P8P6l5r4Q2J49
4595G2o17P40q6j7M9j43K1R5R2k87J09k92L09p9N9j21p7M7j73M61j87j82k6NK55
4620B7k55K50m36O12k03m5J01M6o6j65J79o2k3J14j79p3K52m4j6l05O70k65Lj65
4644d8J1p2j9J80n9k8J17N9k69J76j4l88K58K4R4n7P3k20K9N53k43q3J32k01R3
4669I8k05K9L50m22k4K72o2K4L6j91J65K10l95J20k9k9l50M03k21J80K12k26j3
4692f8p9L52o6k22J05O6Kj40J93j29j99J97P4m1j52K18j59J99n68N89j08j47K01
4715A18qk85L73J8j22j79L49l62M7N7k3j56K29j65J79k18K95j90m0L32l52L21
4737B18l22J61n0p6NK12k04R2J86Lj06p1r4j81k5K76J80n1k50K6j72N27l55o0
$$ y = [-161, -32, -33, -66, 173, -82, -45, 85, -64, -138, -156, 169, -121, 123, -220, -18, -66, 140, -184, -106, -30, -65, -159, -77, 72, -545, 195, 109, 92, 141, -2, 19, 114, 206, -81, 28, -264, 45, -34, 25, -96, -173, -126, -299, 162, -25, -207, -233, -228, 27, -228, 22, -414, 198, -5, -50, 51, 97, 31, -134, 45, -17, -40, 74, -105, -178, 74, 30, 14, -291, 379, 114, 117, -48, -37, -109, -128, 52, -7, -35, 82, 141, -128, 48, 34, -354, -96, -72, 22, -35, 38, -182, -153, 400, 157, 74, 206, 5, 98, -107, -78, 272, -150, -174, 98, 36, 60, 96, -95, 70, 280, -115, 5, -24, -53, -403, 0, -221, -41, 171, -55, -68, -147, 205, 139, -83, 22, 88, 90, -50, 143, 14, -185, 12, 86, 45, -107, 111, -48, 151, -417, 172, 64, -83, 118, 110, -175, 198, 216, 94, -85, 264, -98, -51, 6, -17, -173, 56, -109, 70, -148, 147, -43, -83, 249, -103, 218, -104, 57, 7, -69, -64, 148, -56, 36, 222, 225, 119, 48, -46, -227, -252, 24, 204, 153, -97, -71, -243, 284, -71, -131]
4761a31J03K59j37r0pj94L49k59K2P8Q8Q4l96J29J50L8k3lJ4l8k14J22j48K58
4785E4m1p0j08J58N5l0PK74k18j51L8k03J61J71J4k15J13ql2Q8N0j54k8K0J84
4810A29K16m01K24k8r6P8O1j76O5l9l49K03K39k06l0J21j12k41K64J67J29j99
4832A9K1j01rK82l45K10m6R5k09P3k09O2m0L62j82Q6l22M07j33j74M5J41j09j1
4856h7K10Nk5m27L2M67j28k67L7k01M83L2K3l29L24k01k98M02o9l9J4L83n00K30
4880G1l93J27M39j67J06k44J94O3m7p1j65K73k36K85j09j44j88J50k4J22Q5j9
4902A08l7k3K84l76p2K99j79J79r1l74K59Pj54j5K96j14K1q6k39N85k51O5j28
4925c6j02k2R9k1K41m02K89j08j76J68K50k14r5K94k37j37L11j26k53M75l35j49
$$ y = [-131, -28, 231, 94, 4, -3, -197, 152, -107, -85, -7, 81, 165, -231, -102, 48, 86, 63, 60, 74, 36, -178, -56, -204, 54, 13, -57, -165, -7, 48, 18, 25, 299, 81, -70, -32, -235, -74, 97, 111, -104, 9, 1, -31, 57, 107, -47, -75, -55, 129, 345, -56, 168, 140, 44, 122, 183, 7, 72, 33, -316, -113, 126, -80, -110, 11, -101, -342, -78, 89, 218, 19, 40, -61, -70, 212, -133, 77, 31, 126, -83, -10, -219, -157, -197, 165, -17, 69, -253, 154, 21, -153, -108, 33, -76, -87, 123, 128, 103, -324, -292, 175, 47, -220, -183, -384, 99, 131, 154, -175, 149, -52, -350, 52, -17, -56, -42, 341, -159, 71, -322, -195, 244, 77, 183, -61, 133, 196, 149, 78, -87, 186, -50, 235, 126, -18, -206, -56, -80, 42, 127, 108, 71, 48, 332, -44, -116, 183, 4, 183, 92, -282, -23, -16, -170, -185, 111, -3, 18, -68, -307, 278, 27, 92, -36, -138, -160, -61, -82, 159, -243, 46, -62, -238, -70, 180, -34, -129, 165, -72, -209, 102, -24, -277, 198, -137, -286]
4947b86M54J17j09m12L30J54j37n8L44m94k4J26k46M34l84M98l40k03J91K67l26
4968a04J09J81l18Q6nP4J05j69q2J13j64J76K32k85J20k53M20j70j56K00l16K9
4990a77L17j93j98K71j58K52J89j01k91L29l41P7J45J22o4j82q9N2N6j61L04k57
5012i8J40k34J99K6M3k59J60k42J44J05K10j25L4N6l39Q8J66j12o8j15K88j22
5034e5J70r1J51j8k4m23L28j95j84L49l0q6L18l51K17L33m27K7j94K90Q1l79k9
5057b22M44j15J60k26m3l25M69j29j56L43l59K33k22k7J30j09L11k6j17L30l42
5078Bp1L32l55K18j64j56pM75l33L5j29K13j40m5Q2K35k7k77J21k0L11k81J94
5101B13j11j58L5M9N2m7j77L00k98K6L06K2l7k82J04J26L0l05M23m12L54j70m17
$$ y = [-286, 168, 285, 176, -236, 94, 248, 111, 53, 397, -97, -121, 5, -241, 193, -191, 307, -33, -236, -45, 222, -104, 5, 186, -132, -46, -51, 23, 128, -41, -123, -10, -174, 2, 234, -51, 69, -184, 236, 66, -90, 110, -206, -177, 140, -53, -251, 20, -138, 114, 303, 202, -89, 240, -101, -24, 121, 243, 179, -3, -92, -40, 16, -145, 159, -98, 42, -192, 7, 33, 76, -183, -23, -265, -121, -16, 194, 69, 103, 159, -180, -92, 74, -38, -106, -221, 67, -55, 115, 24, 175, 157, 133, -290, 38, -157, -341, 8, -22, -108, 210, -141, 76, 409, -18, 9, -185, 105, 186, -193, -222, 222, 107, 267, 41, -2, -327, 142, 13, -143, 200, -159, 74, -148, -175, -45, -154, 157, 131, 14, 344, 2, -69, 263, -92, 126, -38, -194, -201, 274, -59, -24, -153, 60, -80, -125, -43, 192, 165, -112, 9, -11, 300, 19, 213, 102, -56, -21, 28, 80, 33, -144, 156, -142, -116, 190, 212, 175, -107, -3, 123, 153, -152, 271, -141, 213, 43, -374]
5124c74N01J62m85K58r7j13L29j79l20N1K05j0j8M3J57k73K99q2k19J89J40j84
5146b0K97k31J67k74L30j76j32K24j68K14j26m8m1l27L36J71m18J52mM3N9k79
5168b51K5K27l2j08n2J26K20L7j05j24j27j9Q9r4O7K94n40M19r8N07n23M15l38
5191A5l56J45R6k36K68L32j73K6m89K23K45j68L22k44k52M60k7k31j21J40o2J82
5213I5L7j82K65k14J37k28L30j41k01J34L8p4r5l32N19l15M4Q0J18J52q5j01M1
5236B2J63J14k18QM9o8j57MK18R4m86K32N8oQ4l98J54n4L82j77k52L30m38J90
5260a52J73M28o72L75P1k26J7j57K23l22K33n3N6q7K3K50k05K23J46k02k05J09
5282D6o7J45k57L17r4k21K17J62l76K08P5l26K40j44K52j85j3j14L75m04Q4j8
$$ y = [-374, 127, 289, -196, 62, -35, -148, 181, 2, -318, -267, -62, -72, -90, -47, 110, -163, 136, 54, -165, 24, 164, -20, 277, 46, 213, -61, 269, 93, -39, 185, 17, 231, 105, 57, 16, -311, 25, 196, -222, -70, -74, -31, 28, -251, -226, 1, -31, -139, -191, -65, 155, 192, 87, -37, -164, -183, -94, -188, -121, 173, -367, 52, -46, 461, -62, 353, 15, -341, -196, -100, -336, -68, 264, 91, 117, -372, -149, 96, -72, 250, 6, -246, 214, 187, -44, -165, -25, -87, 95, 132, -50, 215, 1, 138, -90, 240, 99, -102, 32, 70, -4, -99, -431, 88, -227, -183, -103, 15, 167, 82, -19, 22, 185, 299, 81, 89, 138, 70, -87, -83, 135, 229, -257, -25, 33, 27, 111, -287, -133, -187, 195, 18, -234, 96, -342, -152, 21, 449, -223, 152, 223, -3, 14, -143, 80, -242, -9, -62, -6, -93, -70, 180, -25, 198, 344, 142, -63, 46, -21, 124, -133, 184, 90, -131, 86, 248, -128, 80, 155, -171, 69, -75, 177, -8, -21, -135, 240, -164, -80, -98]
5304i8j81L91q1Q0j79J11j14K05m16l8K33J01l33M44k1j09J36r7J72m71L63k70
5326a72J12L42k07M1K30m39j10J59r5J38K38n74L74P6k88J71k92J41J63J93q0
5347A21l0k79j39L32j16M8J0q7L3K27J18j65J66m68K83l54J87j67M83p1k33J46
5369D5l1K51k98J13k76K57k5R4k06L5J75k48J55j54N2M24m63k3K34j94n1P4n8
5392a18J32J80k82J53j67L4K3N1J31j26l7k2j1K23j36N2N5m21M75k8j13r5l19
5415c66O86m16P6K73k93P3l7k27K45J13r0j8j27K23k33J7J68Q5Q1l55L84l16p8
5438a32M32l50m7m0J77o6N6l00J75o1L55j49m7j48M8M0l1L39l0l49K25k31R5P3
5462C4J7m4j71N3j00L20k50R7K28k64m8L09k13k0K84k03k30J90k3J31k01Q6J7
$$ y = [-98, -279, 112, 31, 111, -68, 43, -71, 134, -282, -320, -87, 14, -319, 125, 104, -5, 131, 34, 206, -265, 98, -172, -60, 282, 75, 116, 346, -93, -203, -44, -139, -1, 237, -337, 37, 113, -175, -4, -296, -155, 8, 201, 121, 91, -188, -327, 5, -111, -63, -53, -140, -107, 120, 238, 73, 239, -229, 54, -300, -113, -280, 203, 132, -101, 45, 14, 265, -33, 80, -196, 61, 36, 130, -76, -41, 134, -114, 41, -113, -61, 363, -100, -123, 111, -83, -134, -60, -118, 14, 194, -88, 65, -102, -68, -45, 6, 137, 11, -26, -48, -59, 164, 28, 80, 135, -286, 189, 161, 48, -47, -366, 320, -96, -20, 253, -40, 33, -4, -231, 14, 127, 37, 19, -108, 115, -118, -101, 67, 152, 233, -122, 262, -54, -132, 300, -50, -97, -137, 40, -26, 30, -270, -95, -156, 199, 50, 3, -145, -97, -57, -88, 251, 221, -128, 97, -134, -39, 34, 51, 7, -164, -111, -211, 109, -141, -44, 184, -80, -128, 181, -32, -52, 232, 29, -201, -11, -34, 97, -104, -18, -1]
5485aL7J75j92m0j17J78k68J59Q7q7j99L43J18L6j37P4o8pj24M02l18l5k46M9
5509a81L11j15k3o2j84K50k61K39m9k4L26k36oK70j28k25j85M40M1k58j21J5K7
5532a39k36J59K11p0K94k48o9J23l8L20l60J98j65mj5K48lk35J55O2j54N1L6j34
5556a3j20J27J05k27L83n32K73P5j5k7K80k52k44J32J0o9k40M64j83k6j30L13
5578H4j25L41l89k12O63l37j73K66r9J88k65K24o7k2Q3K14m64J11M9rp4K09l50
5601a54J14J04j25K77l82J05K29J81l68j99J54k04L51k80K99j35L08o29K97q4
5621a41K21K48o32L14P9l07Q7k06K52R2M83l81j55M04k01j32k39O4P7Q1J73j9
5643A62j93j38rQ0M3J56p7n5j97J0K9J38L3K4j9J86k54J11k2k18M76m18K42k74
$$ y = [-1, 36, 211, 19, -21, -138, 40, -228, -69, 18, -69, -268, 75, 193, 229, 92, 166, 98, 91, -33, 369, 51, 16, -230, -181, 130, 15, -8, -70, -254, -4, -265, -26, -75, -99, 227, -9, -15, 255, 127, -98, -283, 157, 198, -60, -181, -166, -139, -375, -216, -5, -75, 219, -29, -98, 25, -13, 307, -53, 145, -20, -24, -39, 209, 206, -29, 126, 188, 34, 85, 121, -13, -133, -6, 99, -128, 255, -277, -4, 71, 56, 29, 309, 57, -187, -55, -45, -114, -354, 110, -73, -99, -229, 84, -41, 300, -89, -301, 362, 25, -148, 118, 19, 207, -58, 166, 99, 77, 160, 374, -90, 21, 70, 61, -13, 196, -154, -40, 64, -61, 216, -166, -61, 168, 349, -19, -218, -64, -268, 83, -197, 102, -33, 275, -354, -57, -141, 80, 328, -304, 10, 89, -218, -131, -337, -85, 7, 490, 109, -46, 358, 157, 25, -214, -150, -73, 8, 181, 162, -31, -169, -178, -98, -55, 101, 24, -31, -228, -218, -189, -51, -18, 6, -13, 173, -81, 30, 8, -210, 266, -152, 90, -184]
5667a84QL68l3j38m5J23n1M5J1L1Q5m03K34j38k9K76K00o01J77mL62k85J63l84
5691b12K13P0m9K8j86l6k4J96J10j83J43r3j32N60l18j42j51M2k6L13j38j94K55
5714D6J31k70j4L8J60k25K46j10k97L21J3m2k16J31K90j56m57K94o2L76j88Kj77
5737a66k47J42J57J90l7j11j23K70j72J44j6J1l7J06j89P9j12K22jp7l9j22M4
5760h4L0J64j05L77m75J46K48k37j28o2P1j39K05J24j06R9j54K07q6K7k3k88J4
5783a75K68m6l42N13m26J85K38p7l60K41J08j13K7L7l22K53k11L46j76k70O69
5804C67k18Pj86R9n36L39M7K1j3K41k89Q9J55j70M41p40K62l9K3J82n9j32j05
5827b14K72n1j7k92J94K51m1j48J69l35M29k32J12k0k86R2n1K08Jn1k26J17O6
$$ y = [-184, -176, 192, 159, 21, -24, 99, 48, 93, 104, 135, 220, -183, 51, -87, -116, 160, 360, -241, -64, -68, 294, 9, 172, -212, 1, 71, 22, 50, -136, -172, -196, 0, 110, -73, 70, -23, -155, 405, 87, -55, -206, -164, -190, 123, -15, -209, 46, 177, -93, -107, -69, 91, -134, 112, 2, -295, 26, 39, -3, -219, -88, 202, 46, -411, -117, -179, 197, 9, 11, -166, -413, -271, -114, 76, 39, -72, -195, 75, -97, 47, 31, 42, 5, 111, -78, 1, -111, 111, 110, 33, -6, -128, -84, -54, 110, 5, 382, -93, 53, 301, 64, -64, -126, -55, -194, 11, 135, 29, 128, -26, 181, 95, 122, 99, -189, -175, 93, 47, -295, 218, -208, -23, 215, 138, -222, 19, 127, 14, 41, 78, -244, 9, -202, 144, -32, -302, 367, 149, 156, -30, 69, -467, -128, -81, -60, -73, 168, -121, -32, 123, -47, 394, -346, -84, -123, -100, 82, 23, -109, -214, 58, 7, -10, -302, -108, 143, 102, -46, 123, -212, 217, -15, 97, 77, -209, -117, -168, 40, 41, -10, -236, -119, -53]
5850e3K7JKJ01k09L36k7p4k27K61l03L60j03j43J79l12L4K73l48L18l2l7r8K56
5874A82l5k33J18Nj22R6J50o11N07l8k72L74p0l1m3j81Q8J50m1n2JJ30j27j4q
5899g7J34j11J3q3J73J1Q8m2m66L52k40L10j34M4oM8M2k19K37K2k76r9N2L52j4
5924A11J60l34J20r2k10J84N3j63j01L67L3Q3k94M01k37J36k18k18Q2p8l9N29
5946B75j99p6K37j83k85M2j46K25J28j98Q4J8K9j29K14k24J55m9J69k86l35N58
5968B4rJ7j25p0J64j94L74k51L25j32l79L28p2L7n3k74K27J09j62K23j89n6o8
5991b06K61k73J96M62p30Oj99N02Lj69L6M92k98n7o6J26n8J20m29K66J78m08L60
6014A15k53J11j97K47j58K57J67j89j5l17J42K47J42j92N6m37K77K17k14J11q4
$$ y = [-53, -26, -25, -23, 78, -131, 205, 178, 104, -123, 138, -165, 195, 92, -51, 128, -184, -150, 123, -225, 93, 61, 24, -74, 182, 147, -86, 32, 37, -85, 11, 161, -450, 57, 19, -253, 121, 51, 20, -23, -204, -116, 34, -7, -59, -58, 72, -55, -69, -77, 57, -54, -41, -124, 49, 60, 148, 106, -360, -8, -248, 62, -72, -28, -34, 14, 56, -163, 74, 96, -180, -279, -227, 125, 111, 271, -63, 57, -35, -245, -61, -8, -171, -272, 95, 128, 211, -83, 318, 81, 217, -1, -219, -137, -215, -254, 275, 76, 0, 237, 54, -231, -189, -335, -110, 18, -180, -96, -78, -49, -178, 36, -188, -33, -82, 87, -199, -534, 24, 15, 32, -93, -163, 1, -193, 181, -70, 255, 123, -256, 72, 0, 37, -16, -290, -63, 46, -116, 107, -82, -138, -206, 55, -218, -22, 440, -290, -284, -483, 19, 22, -147, -111, 381, 83, 26, -40, 86, 28, 148, -281, -15, 163, -245, 115, -138, -27, -224, 23, -135, 122, 289, 100, 85, -232, -90, 157, 299, 107, 163, -274, 3, 220, 6, 117, 33]
6035C3j55R7lj51K80k5l3l2J58k95J5k06M64r4q0m7L8L1p5j0R3P7L1k34j02J40
6061h5J75ll5O9R4j34J11k11R3k39J41k25L08n6k10M83m58J89N0k6k8J43k69J83
6085F0q3l0P6O6k09N1K14j55K04j9k93O9M7k5r9N5J50K51k39n5J3r5p8J64K34
6110B74O2m26k72J68J50j93L03k5J53J87n26L39j88j57J87P3j21J58j2l28K22
6131B8l15M96r3J35j50k24l45M64J32j59J52j13j02J92M2n1O7j34N4j91P9L6Q
6154Hl03L41K0J86p9l05j48N33j64l40M43j66J20jQ0l21J55J13j59L5j69J61O7
6177A07l05n0J42j8K54r3l86N22j24k94O3P8K26j15Nk62K02m08L42K40l89M35
6199A72k16K40k93J34j18j04M37l82l7J97L3p7O2J75j63j28L41m20J40J58j26
$$ y = [33, -122, -25, -28, -179, 101, 76, 43, 11, 169, -126, -111, -317, 147, 53, -27, -74, -36, -5, -80, -90, 3, 80, 111, -123, -225, -85, 90, 87, 52, 121, 215, 81, 192, -19, 74, -165, -24, -249, 59, 3, -207, 276, -182, 7, 57, 31, 3, 146, -123, 60, -23, -53, 23, 89, -120, -69, 145, -10, 194, 175, -118, -49, -2, -27, -126, -71, 79, 330, 91, 36, 49, -46, -124, 40, 274, 336, -90, -362, -194, -44, -237, 66, 41, 194, 381, -145, 194, 6, -151, 36, 109, -12, 146, 134, -194, 28, -287, 209, 116, 251, 101, -123, -468, -4, 128, -31, 121, 8, -94, 98, 140, 89, 156, 22, 76, -115, -36, 0, 8, -295, 46, 66, 252, 173, -132, -280, 253, 89, -251, 192, 26, 146, 145, 225, -96, 59, 172, 13, 48, -121, 40, 107, -198, -248, -106, -124, 130, 37, -349, 173, 49, -245, -182, -104, 122, 7, 12, -250, -48, -456, -114, 126, -263, 172, -44, 196, -97, 37, -81, -185, 252, -130, -167, 30, 63, -14, 48, 223, 60, -68, 273, -147, -7, 151, 25]
6220B5k6P8mN6j59N2J97l19K70j76o4J82Q7k28k16K27K79l06J32jK6k85K12l3
6244Fp7N8j0j43j20N60m96J32L3m9J38k43J79q3J67K16k38L1J45j52J75n20L09
6267A8K73l94P6J3L7o2p9K81k77J36l92L58K28l29J94q5J44K86p72K31M53n75
6289b37L55j87P8l03M60J54l95P1j16o4o2L14k91J37M9J14j55L32j32Nl22K85
6311I0j31O7n7j84K54l0J52M3J0m17J20J46R5l12K52n02pM79N2j21K6j63J03J58
6335A23J31k91Q2n4J9M9k16k04L55J2J81j85J05k04K01j99K18j65K18j14j77O9
6357d6j14J27j47J13j94K76P9P1j48L5m13M90p1N2j04j80J32J90O0k00k59N23
6379B72r6j74j37j52K26M9j56K41o5j16m0R8K36l62J86p9L91m45l0k1K94R2k1
$$ y = [25, -1, 77, 73, 129, -30, 22, 219, -100, 170, -6, -70, 112, 199, -29, -245, -18, 261, -45, 87, 86, 112, -173, 39, 6, -71, -13, -23, -166, -286, 274, -222, -90, -57, -106, 32, -211, -32, -115, 52, 268, 30, 61, 206, 54, 229, -291, 18, 291, -103, -27, -14, 23, -39, -118, 163, -114, 22, -370, -12, 216, -113, 81, -4, 140, 426, -346, -115, 338, -237, 118, -69, 9, -294, 166, 320, -75, -4, -120, -184, -246, 68, -223, -86, -37, 77, -78, 254, 122, 127, -195, 90, -41, 26, -31, -215, 39, 9, 161, 204, 214, -203, -83, 63, 158, -154, 98, -404, -411, 68, 120, -1, 25, -138, -35, 123, 254, -37, 45, -9, 10, 59, -157, -361, -6, 6, 187, 2, 107, -97, 104, -95, 123, -42, 176, 62, -115, -46, -160, -33, -180, -67, -261, 15, 94, 165, 17, 52, -361, 129, 58, 110, 6, -174, -42, 148, 208, 8, -251, 272, 176, 2, -135, -287, -61, -12, -168, 73, 8, -108, -148, -50, 186, -176, 10, -69, 322, -123, -153, -174, 120, 212, 191]
6402A91l82Q5L67m58N21o5m00J21P0J39k12Q2p5Q4l4j63J68J64n6k74K27k24K36
6425A12k28K44P4j07k58L44j89R0k25k07O61l36J46j06K60k30j13L02k45J7m21
6446d15K78J2J78Qj05n4pP8O6P8m9k19J44j89K94j21l9J37j99m3k0J25J3j15K9
6471a35K55j74r4K61J05M2k89J35o5RR5k67L45k80J65J09k92l8J91k38J49p8n
6494i4p7J20l07K34qq1M8K99j57j27J55Q2q8k22J85j43J43k04L97l81M55j05q1
6517D3J16l37M15j53R9l90P8K47Q0l98L3M13l75K83j70j31L35j04j21M1k73J04
6539a65K21j94R9j50N5L5k7L59m65K60N3L1j04j1k39K30Oj95J11J63j55M6K80
6562B44K15l09k22L9J16J26k09l8oJ07o1j40L7O0j24L1J28N3J7j35k82J50M25
$$ y = [191, -191, -106, 261, -197, 324, 259, -141, -20, 50, 189, -23, 59, -16, 68, 34, -129, 39, 203, 147, -127, 100, -124, 112, -116, 128, 202, 95, -163, 181, -8, 82, -143, -350, 311, -25, 121, 15, 275, 45, -68, 234, -11, 6, -415, -137, -125, 53, 61, -44, -98, -105, -27, 39, 117, 68, -151, -7, -196, 98, -23, -62, 75, -124, -167, -187, -62, -49, -164, -135, 120, -54, -148, 113, 218, 260, -29, 106, 41, 50, 145, -122, 223, -57, 108, 217, -75, -113, 78, -160, -11, -89, -94, -171, -51, -358, -124, -132, -213, -165, 134, -23, -150, 5, 87, -1, -223, -38, -181, -38, -242, 155, -226, 229, 124, 43, 159, -178, 237, 84, 183, -207, -129, 118, 198, -200, -167, 246, -129, 154, -16, -147, 188, 84, -37, 4, -269, -165, 56, -138, -39, -189, -134, -99, -126, 233, -232, 28, 81, 112, 8, -3, -242, -12, -6, -201, -90, 73, -82, -36, 244, 459, 150, -72, -33, 83, 209, 0, -38, -44, 63, 2, -138, -101, -41, -165, -134, -6, 47, 64, -71, -353, -203, 222]
6585B22l96K90j18j2p3j00P5K68r2k24L91m03M4M71o14K27N7J6l13N3L80k47q8
6608a86J15K02Rr3o2L5k62K11m7J30K7k64J96k03M23n6k19l3K2K43j2Lj04j69
6632i4J74K1O5j13P0k46L62k76j06K19j4o7J96l34j6R2Q8j77JK95k38j91K81L85
6656C77k89l9l69K70R6R3j82K01q0m3j0K3j40J26r1N3j28j71J9L11l19L60m9J52
6680A71l42J31J46k66NJ89j4Q4j6q0N1j0p6k22Qn9J36J35K43k64j37K14j52J16
6704iJ1p6P6K23k85mk39L89j69J70P1k19Q6l06K75K7k57M3R8J82Rj69Q8j51L23
6729A87L1r3J68k52L13l09m6k04L49j30N7J81n03J69R4N5j94k0J22J12J51j86
6751E2k16J31m00M15k15P6J68p3J22j41K93m29K30J38m39M4J53J35n7p4L8j1L0
$$ y = [222, -174, 116, -2, -14, -87, -187, -112, 156, 64, -160, 231, -172, -128, 343, -271, -44, 13, 29, -284, -231, 149, -98, -186, -71, 131, 140, 47, -15, 20, -242, -31, -78, 52, 79, -185, 11, -192, 231, 175, -44, -77, -55, 188, 176, 179, 75, -94, 80, 101, 166, 53, 123, -123, 239, -37, -143, 76, 62, -5, 191, -143, -159, -67, 21, -156, -155, 140, -98, -289, -8, 377, 88, 49, -320, -50, 46, 139, -43, 158, 78, 35, 25, 48, -92, 34, -57, -4, -132, -303, -284, 27, -292, 68, 19, 171, -171, -40, 106, -160, -155, 34, 20, 104, 88, 8, 59, 49, -27, -249, -241, -300, -164, -29, 214, -50, -187, 27, -125, -9, 2, -74, 2, 225, -60, -64, -303, 86, -83, 87, 158, -61, 25, -281, -6, 21, -236, -193, -95, 87, 96, -73, 15, -136, 187, 218, 125, 293, 41, 354, 45, -1, -205, 144, 14, 71, 252, -251, -82, 12, 67, -127, -147, -25, 87, 238, 52, -164, -33, -433, -18, -233, -157, 11, -62, 60, -81, 212, -217, 13, 151, -288, -244, -91, 44, -13, -87, -49, -60, -30]
6774c0j85M9L91j21J01j11j74R3k16j16J35L43j09j26j82R0Q9n8J22L76o90M61
6796A32m0j21n7J24k1p2M2K29l59L21p0j49J82j30rK87k43l5J11k95J33m0L57
6819B77k60o1j52l8K67r9o5M16l50J71n13M61k30L30k77J33K31j83L0L07j88j76
6841C1j78L76j73k92L15j09j5k26M35k6l24M04l20L16o3n7j67L28j66k8j9J38
6863A80j35l44L35k91L92l41M52j96r6n9nj35K03K96l61J17r5J47J38j11m07M98
6885A82j47m3J34p4m2J04l25J14J81L4l97M7K69K00l3k60J2lO9o7R6n0K53j52
6909A02k51j14P5L75l52J23J8P9N5n3K46l71k00J51K86j07l4p2p1K32l68q8L15
6932b4J61l14M62k35kL41l56j30N3l9k98L90K12j54L7k1k87K81J19p5j27j67K94
$$ y = [-30, -215, -166, 225, 104, 205, 94, -80, 13, -203, -319, -184, 159, 50, -76, -258, -168, -79, -137, -15, 361, -329, 132, 92, -29, -86, 38, 17, -55, -13, 216, -143, 178, 108, -41, 141, 11, 2, 289, 46, 11, 122, -173, -40, -80, 277, 17, -44, -196, -234, 33, -66, -131, 285, -65, 106, -407, 54, -176, 154, -123, 10, 241, 58, 88, 395, 207, 31, -147, 229, 56, -236, 79, -30, -45, -271, 164, 138, -186, 218, -102, 214, 151, 94, -73, 255, 89, 61, 42, 180, 45, -299, 36, -255, 137, -204, 248, 52, -44, -103, -108, -243, -40, 256, -105, 12, -83, 64, 202, 91, -316, 182, 35, -8, 126, 52, 10, 114, -211, -97, 84, 118, -279, -232, 37, 237, 204, -56, -44, -47, 22, -45, 51, 1, 254, 102, -149, -263, -188, 187, -165, -42, -24, 55, 110, 57, 303, -68, -268, -117, 169, 62, 28, -44, -115, 117, -251, -339, -24, 137, -177, 285, 50, 48, 389, 33, -97, -44, -83, -381, 9, 221, 67, 104, 83, -204, 77, 196, 121, -6, -173, 121]
6955A21k44J05P4k79M8j01J18o4K86kj59Q9j51J3P0m9J08K61l42j10K81L2N2j11
6979D6k06k54J77K13l0J39J02k50L01l35K1P9r8M5J90Nl53l3j5N1l80K92M75m31
7003b49KJ55L97o96L48j2K8o3K68j5j6J58q7j96k56K12M8k04K2M50l64op0K08
7027F2q2M9j33R3K17l40j28M53k09KoK2q5m7K21p3P1J26l22K68k37L4L41l24M74
7052D47o68n9L81j29R8J28l31J90l3j36K54j15j87L80l02J52K11k14o1L12k06
7073A12k11m8J8Q9j52O0J15o2NK51j48j60K30l83M13K11k50R8L1j8l07k0R9m4
7097g1L79m95L53k74J18j97K80L15m42o5M23k35k30J70K31m05NJ93J0j5j99J40
7119a1l41M3R0L66qk33o5J86k01J05J54j53J28l3j8j94L30k3k50J62K05l34J48
$$ y = [121, -123, -18, 56, -223, -175, -276, -158, -222, 64, 62, -97, -8, -159, -146, -76, -125, -17, 244, -98, -208, 73, 105, 157, 46, -160, -414, -237, -24, -54, 85, 187, -63, 238, -97, -76, 3, -95, -50, 140, 145, -208, -241, -256, -205, -585, -293, 182, -249, -247, -92, 305, -391, -43, -55, -27, -90, 178, 163, 147, 305, 218, 22, -234, -22, 26, -178, -156, 294, -70, -76, -146, 62, -20, 29, -104, -11, 206, -134, -262, 191, -18, -16, -22, 0, -85, -132, 89, 16, 87, 213, -109, 159, -78, -44, 297, -27, 447, -221, -280, 101, -28, 70, 198, -133, 57, 24, -112, 142, 27, -160, 220, -82, 70, 281, 67, 6, 318, 112, -99, -147, -129, -40, -192, -132, -17, -79, -74, 177, 29, -131, 99, -284, 129, 340, 90, 188, 219, 201, -106, -126, -27, -71, 308, -187, 166, -108, 10, -187, 93, 408, -34, -99, 324, 89, -141, 29, 260, -145, -140, 53, 63, 48, -151, -11, -352, -309, -219, 147, 139, -94, -159, 27, -174, -69, 85, -68, 60, 27, 9, -185, 145, 122, -128, 34, 239, -95, 53]
7142E3l06L23j93J59m5j07R6K62k48J21j13Q5Q9j63K00j76k6R9k76L31j59k52
7164b46l7N14l23K10l27J81k43J92L73k05j02n7J63j11q7J29Q7M4j04K40l45j62
7186b16M30k38o6J41j51J00k54M85n05L28L97l62j79J56k1K65P5m01N9l05J17
7207a45j09K35j97J22K06j69KK12k47L12k45q3K64m72L45L57k86j04K45l22kL61
7229B80l24p6oM33m04P1K54j14l0L50n55K09jl5j6K29l11Q8l8J63j63N9K8r9k13
7254b21Q3J17j98J24lK11j01j81j4O03m55O7k45j6K41j05n0K49r1O1R4j76L8j51
7278a19M25k55k84L28K63j94k14j5L04k51K09k40k4k37L85Jm17M29n8N0m1M8j3
7301H0l8k97M70m12K59n3J34k91P3K11jj26L0M3Q0k43J1K14j93L64m09j4j37M73
$$ y = [53, -253, 70, -123, 36, -9, -116, -20, 242, -6, 115, 2, 87, 176, 13, 213, 37, 11, 110, -166, 165, 6, -246, -283, 231, -92, 118, -209, -28, -271, -79, 294, 89, -13, -70, 93, -18, -105, 24, 111, 155, 51, 291, -54, -216, 214, -24, -90, 51, -100, 0, -254, 231, -274, 54, 451, 89, -90, 66, 45, 310, 385, -16, 43, -262, -145, -254, -19, -216, -94, 112, -57, -55, 157, -90, 222, -23, -106, 158, -314, 31, 388, 102, -2, 243, -79, -81, 280, -44, -120, -126, 307, -97, -26, 228, 114, 84, 434, -121, 88, 87, 52, 36, 265, -46, 42, 4, 167, 4, 63, 91, -8, -221, -138, -21, -219, -95, -98, 113, 12, -169, -183, 420, -35, 32, -213, -229, 12, -93, -143, 106, 15, 76, 170, -6, 32, -119, 306, 51, -233, 95, 358, 164, -50, -65, 239, -12, 197, -43, -67, -304, 81, 82, -335, 94, 36, 86, 45, 93, 80, 42, -255, 215, -197, 62, 9, 143, -148, -75, 136, 135, 9, 39, 82, 162, -81, -70, 144, -49, 315, -94, -108, -245, 228]
7325B28j05j27l02L37p2j94L88m49M86l01R3K62m7L3j99l44K06M12n21N0M77n09
7347a98J01K2J9J46M0l31p0N87k31k29L73j11k34J61j82J69m9m3J80k41j50L40
7369F9r8m2J05n3j15J35K84J2m30k7k0L07k38K9Q9R0n0j61j6j0j0J31N5k13O5
7394a12N1j13K02M8k26K45O4k52J36k04L24k41R9j47K74k3o4M8r4P8qk2J21j36
7418D8j69pL9r8k1L36j5p5k25M75j36k12J4J07m7j94K83q5p5J3K66k30j57K71
7442A06j4o3o6l63O15j25L5j19J2Q6J33j43k95J72k66L61l86k1K11j84L16J6J24
7465A42P0m30L23j87K03j89j3K3L02k69L73k19j41o5l6o9M26l28K45j94r7K54
7487A24k01J76j7O9l76L73j40K86j37N0j23J0P1k02L06j27q7m2o4J32j29j84K33
$$ y = [228, 123, -4, -306, 31, -41, -235, 153, -296, 190, -111, -18, 244, 197, 230, 31, -313, -107, 305, -216, -166, 311, -198, -97, -75, -56, 90, 130, -201, -271, 316, 85, -144, 229, 118, -116, 45, -137, 32, -17, -60, 120, -121, -271, 69, -29, -71, 34, -19, -134, 1, 285, 297, -133, -160, -180, 127, -111, -82, 7, 97, 47, -114, -130, -140, -150, -19, 36, -177, -112, -61, -174, 28, 76, -150, 95, 159, -93, 43, -161, 163, -78, 21, -126, 148, 125, 61, 109, 15, 93, 85, 63, 184, 48, -121, -128, -89, -187, -208, 128, 113, 38, -187, 288, 152, -60, -46, 61, 14, -180, 103, 18, -57, -44, 222, -8, -165, 106, 92, 29, -37, -400, 215, 90, 125, 6, 18, 104, 237, 94, -201, -29, -295, 66, -320, -341, -130, -314, 2, 18, 142, 212, -218, 105, -82, 121, -68, -81, -58, 244, -25, 348, 129, -12, -77, -113, -182, 244, -84, 161, -33, -130, 124, -77, 99, 82, 151, -225, 148, 8, 294, 157, 207, 84, 94, 165, -37, 269, 142, 55, 13, -51, 81, -48, -232, 1]
7510Aj92j13M47n2k51m1O3J33J12J3j61j57K06L6J46j11k45K57o1n4K7k6m1j55
7534b19M57l37Q3L06l08J4J16j9K28l16k0m6K19L6j05k7J14n3Q1N9l11j32K55
7557G5P1k44K77k56J66k04K07k6J2k39l30O64o0j4k23K12J50j02K46m61L37l22
7579f4K49k4K5j82n7L3k5J02n0O4j25j4K8j64K10j92L16Jl56P5K91J74k60j20
7603f5P3j24O06m70m9J79n02K54J16P9R1O3k09r0J0O9r6J17j4q0L97j93M9l24
7627a13K67r4k81M6k52K71k94M04k01L30k06JLQJ62k33J37J83j42PO0L9lj09O8
7652E8j99J07K64j06m52L90L3k00J24l7r5l0P5P7P3j51J66l07K60j8p6J3J19m7
7676D1k55J29l5J33o5P5j58J43j04Rk95N38l30J57j21N7K5J46k52K57o5J8J16
$$ y = [1, -191, -304, 143, 91, -160, -201, -138, -5, 107, 120, -41, -198, 8, 44, 190, 79, -166, 91, 30, -24, 3, -23, -64, -219, 238, -99, -16, 290, -18, -4, 112, 93, 321, 5, -15, -61, 158, 194, 89, 62, 176, 123, 204, 263, -48, -180, 75, 146, -98, 179, -77, 89, -115, 92, 66, 78, -161, -491, 173, 113, 99, -124, 88, 238, 136, 382, -79, 258, -64, 185, 161, 186, 4, -53, -20, -45, 57, 7, 71, -54, -68, -40, -204, 6, -186, 130, 131, -225, -150, 141, 315, 55, -65, 8, -116, 490, 20, -29, 150, -352, -98, 18, 97, 188, 251, 42, -48, -38, 31, -65, 52, 38, -42, 355, 162, 211, -113, 154, 60, -221, -175, -427, -156, -450, -46, -247, 83, -123, -122, -119, -111, 51, -182, -45, 138, -4, 3, 63, 102, 99, -10, 58, -141, -34, 230, 124, -328, 62, 95, -105, 19, -18, -113, -143, -68, 9, 82, -69, 97, -210, 50, 32, -44, -31, 88, 41, -214, -85, -120, 13, -52, 23, -135, 8, -96, -87, -382, 156, -174, -17, -138, -81, -56, 90, -162, 95, 30, 48, 164]
7699A64j06l33K36J75k7O8nj72j63J24k65J69P7L91k04m14L59j44l6o2K34j38
7721g2L17j94J7KJ49k75q5qN3j15J27j68J36Q2j32l5K3R3K10J78k52j21k61L5
7745b96N05p8N1K36o18J76j29J76K1j01M8K94n97K79J84M9L7j68j87k0L99m4m09
7768a92k02N21k24L76l10j55K16j1O2l42OjM70j38o9l1j19N66J49m11k35q2p8
7791b34J94O3j44K69K15n13j0P4L31m92L77J30l02K1J83J12j31n5N1j46J05k84
7813a86K61P0j13K78r0k68J13J92l16K3j29L23k93j43O76R2n49J32j57j1J17j21
7835i9J08N4lj78m1j05J29K24p2l0j68n8J18J5J34J86k54j35l6L02m5k06P5L34
7859B49j86j37J55l85M14l02M36K02m44j00L93n60M05L8j23j01L46l48m1M63m98
$$ y = [164, 58, -275, -39, 136, 109, 177, 172, 0, -163, -39, -304, -135, -58, 333, 129, -285, 74, -70, -106, -168, 66, -72, 245, 51, 68, 70, 219, -56, -141, -149, -96, -211, -84, -252, -116, -34, -166, -201, -178, -85, 125, 303, 51, -70, -331, -296, 209, 131, 182, 418, -200, -24, -153, 23, 44, -57, -9, 285, -312, -33, 151, 200, 237, 69, -118, -138, 261, 217, -192, -394, 127, -97, 279, -31, -186, 30, 19, 81, -261, -255, -256, 214, 76, 7, -24, -143, 423, 572, 161, -74, -156, -234, -40, 23, -121, 148, 363, -150, -160, -86, 245, -247, 130, 260, -42, -21, 162, 274, 143, 88, 139, -7, 98, -186, 75, 145, 32, 310, 220, -48, 65, 257, -59, -36, -165, 158, -135, -278, 398, 490, -59, 73, -84, -95, 22, -99, 9, 63, 60, -118, -159, -264, -135, 89, 17, -13, -181, -239, -121, -106, 28, 214, -40, -175, -211, 91, 46, -160, -85, 249, 63, -74, 81, -304, 110, -192, 244, 446, 2, -98, 295, -265, 140, 178, 55, -46, 300, -48, -89, 374, -124]
7880a24J32p9l8P2L26k51k18J05lk04L62m9J15j30L6j14j49j44L78L32l73K9J52
7903A63k96J48k69J02k2L37J56m72K68j7J29m47L34M1j73L3p0j3j23k43J77K00
7925e7rn4L81N9j81q2r9j72K04r6K7j54K44oj37J43j93N2K75j24K82l11j0l12
7949c30K12L23j48o9J12O5k96L11j18J3J4k63K10r0J91l0J38k46n2L7%J21O8j89
7973a6n9l7M0J15j40J85J89k22j61J35j49J73J82k99Q6j1l77L77N6l65J11K11
7995B4K11J6o06m5L09Q1J85l93K0L8L00j56l90O67m17K92O7J64l69r1J47k88L51
8018A17j45J65m9k17L16Q8k11k69K28k22oK12J26o4l5o9j56J71o5J65L95l85k42
8041a52K50j04j70j13K22J99J51k87M2Nq6j10K53M3r5J29k07j01R1J94j06l0k29
$$ y = [-124, 8, -71, -109, -37, 289, 38, -180, -75, -78, -282, 80, 31, 146, 16, 52, -62, -211, -355, 23, 355, -18, 11, 163, -133, 15, -254, -152, -174, 163, 319, -153, 115, 98, 227, -220, 114, 155, -18, 15, -55, -68, -191, -434, -257, -57, -66, -120, 261, 320, 139, 57, -42, -214, -10, -106, -79, -233, 11, 5, -132, 11, -182, -130, 145, 21, 303, -8, -18, -330, -118, 205, 57, -12, 100, 165, -131, 180, 62, 75, 89, -174, 36, -54, 137, 107, 245, -1, -53, -16, -16, 105, 173, -16, -75, -112, -72, 43, -97, 88, 277, 55, -106, 29, -120, 53, 235, -64, 22, 11, -366, 11, 67, -298, -187, 24, 235, 251, -355, -400, -91, -10, 175, -218, -198, -160, 140, -16, -406, 261, -156, 136, 203, 367, -2, -93, 54, -234, 117, -28, 137, 88, -129, 187, 275, 64, -205, 23, -199, -205, 7, 133, 69, 34, -35, -191, -20, -85, 80, 475, 90, -152, 98, -6, -176, -289, -67, 132, 283, -4, 38, 43, -43, -153, 100, 143, 48, 177, -30, -131, -40, 154, 48, 18, -211]
8064b11o7K89J3J5k06L57o2j77j36K39k2K5K0J8O2l92M81l21K55pm36M39k49K6
8088d7M53p61L77K34m00j0N0k00N00J17k91J92k49o6K15N2k03k43K72j13p1p4
8110b66L44l60M31q0k31N32o09L17r8o1Q2K28k98N0o3o3K5K13j74k10M39j53M
8133aj97K71k87J36k30N79j63j70R5j16J93R1l91L51N0j39Q8J69m91K32n7K18
8155B31J3n01L71r2j36J08j18K89n85K03M45j53q2q4O4k0L00j38j03j5q8J4L14
8178B37m73N88m40N5m0n7K83k04j09L35m05m7K79
$$ y = [-211, -278, 11, 24, 39, -167, 190, 128, -49, -185, 54, 32, 57, 77, 95, 157, -235, 246, -75, 180, 173, -263, 176, -73, -47, 406, -355, 22, 256, -144, -154, -104, -304, 196, 313, 22, 214, -35, -101, 114, 166, -37, -280, -8, -121, -192, -266, 78, -282, 149, 69, -162, 370, -239, 78, -20, -81, 1, 229, -69, -19, -82, -145, -120, 93, -81, -291, 148, -5, -1, -198, 73, -214, -78, -308, 271, 108, -62, 33, -83, 110, 201, -190, 161, 211, 72, 160, 329, -162, 70, 13, 231, 244, -257, 114, 22, -114, -6, -124, 165, -420, -217, 228, 75, -7, -91, -27, -47, 253, 115, 12, -3, -91, -77, 237, -236, 352, -88, -33, -73, -130, 153, -51, -160, 175, -230, -277, 2]
8191B
$$ Imaginary data points
##PAGE= N=2
##DATA TABLE= (X++(I..I)), XYDATA
0@%%%%%%%%%%%%J6l2L2l2L2m8O4o4Q0r6J12j44J73j91K16k62L04l42L90m48N12
33B72n78O57p42Q32r36J046j166J301j447J605j779J968k175K404k653K924l223
50a690L552l913M310m753N248n805O436p154P984q956J0116j1517J3257j5490
64h375J8466k2661K9044m0034O4086k15869J73559K83953m62808K0686L59275
75A99322j08864k52483K22946P1071j96432P249J25332o7219j8260J6962l8535
86c8911M4008N1341j22287O350J38049p6758j01064J63888L4434j80006M2162
97c8794J54539j04009j01833Q5032K0398n1150L7757K241l3397N7600K7497o0499
109d618J0337K8316m8466p45L5830m2275j4537M2374k3136o005N3921m7138m8690
$$ y = [0, 0, 0, 0, 0, 0, 0, 0, 0, 0, 0, 0, 0, 16, -16, 16, -16, 16, -32, 32, -32, 48, -48, 64, -80, 93, -98, 118, -144, 160, -182, 208, -240, 272, -306, 351, -391, 441, -495, 551, -615, 686, -761, 844, -935, 1033, -1142, 1262, -1391, 1533, -1690, 1862, -2051, 2259, -2494, 2754, -3051, 3385, -3769, 4215, -4741, 5375, -6142, 7115, -8375, 10091, -12570, 16474, -23560, 40526, -175343, -1784, 282169, -180639, -159953, 199322, 90458, -162025, 60921, 131992, -64440, -57191, 68141, 922, -17338, -376, -38911, 5097, 56438, -65849, -59499, 78550, 1792, -99272, 64616, 99050, -80956, -38794, 115745, 11736, -90097, -5065, 15333, -35817, 1940, 4181, -29216, 28384, 55881, -4618, 5719, 34035, -14431, -15176, 20654, -21621, -36158, 6216, -16920, -22925, 30996, -16142, -64832]
122f4832J04478K0012j16044M9565J05085j00763m4102J32256m2340j50061Q6461
133b0285J00368j30255n1699J27853Q663p9242M3430N2225m9095j7898M1903J037
145B7005l4027j0225J4914J8221r220k3306P077J3641j2763L090J5781k0977q405
158a9194M0917J0607l7800o724K4452l195k3097n160J0400j438j0601K0696L1721
171C1584k6188k7447N3507K2203p2308n882O6023m0150n8540P1761K3922r8750
183f0265J3236J00405m3356p5202O3976M6475n3664j898M6876j4613k7125J6236
195A1081J0817j7123k7139o271L2424N619m6559J1332N7398k7501l6718N9673
207B7033J0787p4628K2353O8268n2380m7252O1023J2239n1663J7074K6811l3359
$$ y = [-64832, 39646, 59658, -56386, -6821, 98264, -2499, -46601, 85655, 43315, -106746, -20285, 80083, -50172, -101871, 25982, 34645, -44597, -1167, 51058, 1963, -15935, 25968, 27005, -7022, -17247, -2333, 15888, 6668, -16638, -9561, 4080, -8683, -5593, 10188, -10789, -19194, 21723, 32330, -5470, -12194, 12258, 9063, -14034, -19194, -8794, -10232, -20833, -137, 31584, 5396, -22051, 31456, 53659, -18649, -24531, 41492, 1342, -57198, 14563, 38485, -60265, -47029, 53376, 10020, -65182, -1206, 45269, -8395, -10293, 36583, 21970, -5155, 11081, 21898, 4775, -22364, -28635, 3789, 9408, -37151, -25819, 31579, 4078, -32640, 27033, 37820, -36808, -14455, 53813, 1433, -45819, 15204, 27443, -24220, -7146, 19665, -13694]
219a3694j686L1496j0268j1243R773n692J0113J3794l7923j1138M6524j8443m6368
232d4755M6593K3893o1470J9583P1165m6445m6049O7823J2658o6851J7234L9436
244C2815m6810j3983M5472j5873l5792K6366J3838j9253Q991R308j1251J3525
256G353J1966j5056K240Q201j6669K781J3731k5640j1204L1080o905k5916K6102
269B064J1486l1907J3487L2461k9614j9406L5463J836l0440J0538J5463j7525
281f094k055J4204m294m179K748o05J0191K668k1760M608K4701k0474k3903K9382
295E138M768l7680J3515L5435k8105j9341M0578R274l4309Q721K6672j5571j6487
308g392J4119N396j7175q097J0031P039j4849j0302K0745J1362k3507R30L1022
$$ y = [-13694, -15380, 16116, 5848, -5395, 4378, -1314, 8799, 22593, -15330, -26468, 20056, 1613, -44755, 1838, 25731, -35739, -16156, 55009, 8564, -37485, 30338, 42996, -23855, -6621, 32815, -13995, -27978, 17494, 1621, -34171, -7805, 6033, -13220, -4229, 5079, -6172, 7353, 19319, 4263, 6503, 14704, -1965, 816, 14547, -11093, -22297, 8783, 1878, -24038, 2064, 13550, -18357, -4870, 27591, -2023, -21429, 14034, 15870, -14570, -4032, 11431, -6094, -8149, 6055, 1761, -2418, 330, -275, 9916, 12584, -9176, -4568, 20133, -341, -24244, 5138, 9906, -27774, -14259, 21176, -6929, -26270, 14308, 23582, -10727, -2006, 24666, 9095, -7392, 6727, 12123, -5052, -13149, -3118, 3921, -10928, -21230, -485, 10877, -12630, -11700, 19322]
321A9322q972k5450K3863J6788l2360n538K9552r305k5983J4905J3248j6485k411
334h826J1790j686k771J480j608N576J469j3911L670J6204j4873j3704K4262M276
348A1348k6533J0956K5123k0391j2746K8181j249k7419J2105J7280k4234r110
360a6689K2089m751j8987J2016J2557j3481l17J6509j568r450O399P194n116n218
374A187P24J028j554n760j668M618j558o745N298R438p670o475J4403P031j5765
389c468j885J6371m838j5423R518R594j5117m961J7876K0j6021N253J2443o991
403B371p056N047O93m481J89J718L06k193k499M832P464o778o171J2946N024j2826
419a414L281J0651j2541o550J5500o159j9846J1132J2306j6433j560J8370p349
$$ y = [19322, 10350, -15100, 8763, 25551, -6809, -12347, 17205, 7900, -18083, -3178, 10070, -6415, -8826, 2964, 1278, -1493, -13, -1621, 3955, 5424, -8487, -4817, 11387, -3486, -17190, 7072, 11348, -15185, -4229, 20894, 503, -12243, 15938, 14689, -12730, -625, 16655, -7579, -16689, 5400, 649, -18338, -6322, 6235, -7246, -7563, 8946, 7378, -2072, 4327, 11521, 6405, 1187, 1911, 2939, 1385, -4375, -6043, -1425, -2983, -9728, -4430, 5008, -2662, -9137, 5266, 12297, -3468, -5353, 11018, 6180, -9243, 275, 9869, -5248, -10209, 7667, 7687, -8334, -3081, 9362, 2371, -4685, 362, 1055, -3426, -3237, -1519, -1213, -3406, -5905, -1073, 6391, -387, -6558, 6388, 11412, -1414, 1867, 12518, -23, -6573, 8927, 2768, -17078, -5946, 6360, -10073, -11633, 6737, -612]
432f12r160J8566L302j9116N665J4115j0043n823Q557m129n428P896k659q264
446g133N374L61n721J0090J304j5533R578J7673j7667j0837K1751l449k1869J7087
460A009J4486k6387q02L0849q716k3012J5794R692j9286R48J2630j1497o978J1849
474E79J465n854K259l566R81J2179o239j2017J5761Q672j7438N056J6260k0264
488b166j2158K6031k966l1154J1739K3464j8677q260K4066l835j9106J5676J1400
501A4054j9284l644J4632k138l962N326m429k974Q679m143q020P336l159q208
515i934J6200M725k3528M726K5644j6878j9444K2770K965k5558J4267K3893k3857
528d009r733L0661q06k5517R302J0943j7674r76J4944q414r444J0290K465l058
$$ y = [-612, -9772, 8794, 12096, -7020, -1355, 12760, 2717, -3106, 5451, 1322, -4106, 3790, 1131, -7133, -1759, -1398, -7119, 2971, 4275, -11258, -1680, 15993, -1674, -12511, 9240, 5791, -16078, 1009, 15495, -10892, -11694, 19155, 10439, -12573, 3221, 12913, -6373, -5425, 7205, -4292, -11270, 579, 2044, -3810, -1551, -5117, -4136, 8043, 1804, -10213, 5548, 14220, -3218, 1838, 18098, -2166, -14324, 11707, 8741, -22413, -10674, 12790, -5887, -14147, 9919, 6084, -13022, 2654, 14054, -5230, -8874, 5758, 3620, -342, 4984, 555, -2419, 6260, 2117, -5903, 1433, -1726, -9934, 6266, 10991, -12537, -7811, 17833, 955, -18489, 4281, 7246, -18312, -4045, 19848, -4009, -13742, 16919, 16113, -9404, -102, 10841, -6833, -7809, 7135, -1279, -10723, -433, 2032, -1026]
542a026J383p621j298J6429l023j5815J4595J2471j9250K333K0086j9160j9444
555a9340K6168N239k9909O874K4367j5370r007K2583n001k1687J3874J3013j6791
568d987m261J2304j073l04N758p102l545R031l803p456Q484k879r261J4330O762
583A1998j9431M29J7020j3122j1752J8719r11k0958J5877K2015j9055j1142K1891
596A1578J566j8219M341P203j2012j187J3704l193j1665L084Q761j606q209k688
610h542P768M201o957J774J2393m799j2351J1032R743j9030r008J8164K105j5820
624i327N611J3149j0870n613J5545o14k0432K440J9154m965j6509Q151J4458o848
638C330q907R370L025j1896k60J3078j871j2461M940J1245m764j0494L192M837
$$ y = [-1026, 357, -7264, -8562, 7867, 4844, -10971, 3624, 16095, -3155, -822, 19264, 104, -19340, 6828, 12067, -17842, -10968, 13399, -1971, -10978, 11605, 6604, -15083, -1209, 11804, -4987, -9248, 3056, 1983, 1679, 7437, 335, -3210, 5821, 2018, -5438, 3046, 167, -9094, 5236, 11998, -7433, -7004, 10016, -3106, -14858, 3861, 2950, -18008, -2131, 19884, 829, -10313, 11578, 13144, -5075, -734, 6469, -5543, -6730, 6974, 3781, -7884, -4800, 3961, 2355, -5854, -8542, -774, 3427, -3530, -1756, 10637, 5838, -6513, 4519, 14262, -4768, -13776, 4388, 6493, -9327, -3716, 9433, -1437, -7050, 8495, 7881, -12551, -10111, 9043, 4078, -12431, -4280, 10178, 3330, -5577, 3793, 6818, -5078, -5338, 7740, 5869, -6592, -1652, 9593, 4829, -5665, -2473, 2364]
652B364r092l869J1056K674j2628L075J9451k679j8745P010J6273j2955j1615
665i680J4957K349j7394O425J5745j3408j3021J5028N673j4870L83J1780l334
678F33m699Q299L182o407l672L708M537n058q928M910J0445o393o269J1794K35
693F317j3730O944J1236j6487q149J9950J73j8369Q804J3488j4422l470J6516
706H801m308j4027J0076J0165q855l796P181j493l715J5j750k439j180j016M960
721a381L198p721J208J4275l348j3152J0377Q041j4750k009J6342p785j5186J3279
735A388R317j6711m741J4819j725j0567O624P503o164l408O547L946o809o647
749f628N956P039q648o703J1860M810j2926K710J4295r385j2023J3945O809j8628
$$ y = [2364, -6728, -10597, 459, 3133, -9495, -6420, 13031, 10352, -8393, -1383, 14890, 1935, -9680, 5277, 7626, -9768, -3343, 12402, -1006, -14027, 1001, 6674, -8196, -7813, 3967, 633, -4066, 4233, 7415, 1008, -2664, 1044, 5581, 523, -8405, -3495, 6950, 557, -5712, 6082, 6317, -7413, -469, 10767, -5720, -13869, 6081, 6254, -12115, -3311, 10177, -4245, -7715, 8801, 4493, -9534, 542, 10707, 1852, -1944, 5237, 3744, 29, 44, -1706, -4145, -5325, -6341, -1381, 1817, -5904, -4696, 9579, 6231, -6921, 3456, 11497, -3253, -5262, 11080, 3295, -11891, 1388, 10705, -6006, -10747, 4072, 2347, -8220, -1596, 5907, -257, -3665, 2882, 6828, 19, -6628, -672, 6367, -2281, -8984, 2876, 7686, -5240, -2530, 11765, 2380, -9643, 4302, 11111, -7517]
763g517k463J7000m915j3808R385R063j1844k842J3784R48j1352L017J1697k905
777G248j0483L732P760q163q268P810L556j2430l75J4099j372j2713P277J2127
791I805p987p036R622L841j0806n75R455l374r300L023Q652m518q311O163P648
806F302p089m860R770J657j1223K220J0401p544r463J0057N608j1229J39J1658
820F404l658o830Q301L726q911j051P724k865p775J641M486l713m017L026M296
835G84k914k210O859L951p458m48J0563j994j1919M585Q499j0180o986J1301O09
850C042j2386L641J2110o526p941R913N976q585k208P775q23o862Q44N229k732
865D67n381K897O342l657n535N945N656o865l741Q224o19r855L388P959q188o727
$$ y = [-7517, -9980, 7020, 2105, -11703, -2318, 6745, -5099, -7941, 5843, 6791, -4561, -1544, 10153, 7248, -3235, 497, 8257, 94, -8174, -364, 3192, -9238, -9613, 4486, 3114, -9599, -2322, 9805, 1818, -5218, 4404, 8245, -2561, -3136, 6319, 2945, -6355, -3332, 5320, 802, -7509, -1346, 6302, -787, -5647, 4123, 5780, -5443, -3223, 7178, -366, -9829, 228, 5836, -5393, -5254, 6404, 2746, -4084, 4217, 7943, -968, -2019, 5705, 2840, -4935, -3294, 1192, -2521, -6538, -3512, 784, -2130, -4340, 2519, 6470, -988, -1436, 9127, 7133, -4786, -201, 8298, -1882, -8868, 2433, 3042, -9344, -5703, 6407, -119, -8060, 1853, 7829, -756, -2964, 4811, 3988, -2874, -2030, 3199, 467, -4914, -2017, 4325, 668, -4867, 1078, 6734, -131, -3872, 4352, 3733, -6122, -2734, 5225, -2963, -9690]
881i690J0798L933j0614J270J0855l183o701P526M145r325j242P795k338r328
895f099K027N586m012m199M227L364l099o41N888K422n957p59P223K78r250L36
911b665Q088m723p902P146L919r489l81J1872k769j0183O739P737p581l929O999
926B878n88o358K663M193m084k378M249K057j019k099P38L142m64m104J292K445
942B563m997j714N143j832p063N751O729o550k126R031m23o733N760L993r270
957a738j283Q401l223p826L600L138m805K45M028k385j352M095J565j170j62l66
973G62J553J119l270k840L629o0n031L441M347p071n78R785j856r081M054O427
989E330p012k718O865j778o422N471M459o587j664O292J326l437j5K234K81p09
$$ y = [-9690, 1108, 5041, -5573, -4303, 6552, 3369, -3332, 4194, 8339, -986, -2228, 5567, 3229, -6099, -4072, 1514, -2498, -6697, -2470, 894, -2205, -2846, 3042, 5464, -493, -1252, 5971, 6249, -3001, -2665, 5423, 700, -7202, -56, 3863, -5626, -6007, 5865, 3096, -7087, -348, 7389, -192, -4121, 2878, 2290, -4068, -1405, 2788, -1296, -3674, 575, 2632, 1613, -486, 252, 3394, 2930, -1174, 118, 2563, -2434, -4148, 995, -837, -7900, -2149, 4580, -1970, -4096, 4935, 4512, -2221, 3539, 7532, -1738, -3021, 5380, 2157, -5669, -2069, 1069, -3736, -3491, 537, -1848, -3200, 895, 2460, 1290, 1128, 762, 2315, 3434, 164, -2676, 953, 893, -4138, -697, 3650, -3421, -3999, 5786, 3930, -5151, -1097, 5330, -1682, -4400, 2465, 687, -5735, -264, 4195, -2392, -4056, 2236, 3562, 125, 110, 2344, 2625, 1916]
1005A916j161O07m38m108p28M854j446o387L822O976l525l152O057Q70o145L635
1021A647N032o997l934P148J088o799P6L454k438j086K825j009j891K613K069
1036A798j10m44o77l14J903r61l502R71K020k301J227L823l167l756O494K348
1052E352p952j093O202k002m593M433J350n664J473O151m000m390N280K658l403
1067a98J200K658j740q66J290o03k659j638r56J579K078l047j171N273J864m706
1083a642J946L208l929j272O127j699o781M489M877n786l140M707j491l630L415
1098f01K105l801N26L962n55j299N75j773l10K338j595k368K386J495j014K245
1114B316M44m488J584M184m504l885N007P90m902L103L414n981j625P193r85o047
$$ y = [1916, 755, 1362, 924, -3184, -3912, 942, -504, -6891, -3069, 3907, 382, -2770, 3287, 4157, -1988, 1647, 6679, -318, -4252, 2896, 3984, -2815, -2739, 715, -1723, -2809, 16, -993, -2884, -271, 1798, 1688, 1244, 567, 253, 2156, 1195, -2307, -1336, 684, -1617, -390, 3433, 266, -3490, 3004, 5352, -2600, -3693, 2509, 507, -4086, 347, 1697, -3967, -2494, 3657, -343, -4733, 547, 3205, -198, 1002, 3660, 1920, 1054, 2344, 1741, -918, -2556, -3512, -1933, 145, -2902, -4073, 1200, 3064, -1642, 304, 3512, -417, -1689, 4438, 2739, -4042, 447, 5324, -462, -3602, 1105, -386, -4016, -601, 1504, -2297, -1771, 2191, 1636, 337, 912, -861, -1171, 1167, -428, -2796, -410, 1085, 71, 2316, 2760, -1728, -144, 4040, -464, -4349, 658, 1448, -3454, -351, 3063, -2918, -4543, 2650, 1665, -4382]
1130d382L334M544k872m02M317j794l827K208P73k722j893l95J206K694j934k033
1146c178L996K135m781R17M342l704l908P563J462q068J574O668m481m397M534
1161F74Q90n436K508M562l785j813M027O63k426l86o40l83J027p5p39K135M57
1178A260j307K714J143n082o07N490k381n460M431K500n834M48N833m190m734
1193e776N488L397n478L13N396j060k174K767K94l354j94P66m71j113j124R61
1209a362K400j213k172K177K087l344j46M423k944l870N748K588n985l72N558
1224C573k493m585L593K336m613M30M727j428l489J921J833k252j640J171J30
1239g86n29K68J487J199j274o24K812M76m181J70L882j997l722L470J459m661
$$ y = [-4382, -1048, 3496, 624, 222, 4539, 2745, -1082, 1126, 1899, -823, -2716, -3111, -1905, 789, -1145, -3178, 818, 2953, -1828, -911, 3431, -273, -4181, 3382, 4844, -3224, -1650, 5018, 537, -3860, 674, 1564, -3872, -1364, 3198, -587, -2400, 1627, 2290, -136, -522, -1162, -1545, -518, -593, -1332, 803, 1260, -47, 2667, 3810, -1272, -1879, 3611, 1230, -4230, 201, 2701, -3133, -2685, 3148, -1042, -5776, -288, 3109, -2369, -2056, 3340, 2280, 106, 2873, 3167, -187, -381, 385, -86, -1199, -2323, -1362, 1038, -175, -2347, -170, 1917, -1427, -1573, 2850, -94, -3964, 1784, 4372, -1613, -1985, 3573, 1080, -3505, 88, 2424, -2189, -1759, 2968, 1540, -1949, -28, 1805, -447, -2087, -916, -786, -1315, -1047, 440, 1639, 365, -259, 2553, 3029, -1152, -982, 2900, 903, -2819, 651, 2110, -2551]
1255b551q0M660k424m074L616L040k957p97M026K46k930J038K095k022k428J498
1271d4J807k409j711K594J453k511j390L496o34l285J659L317k760k343L822J782
1287B843m102q7M060j769l155K671K316l191j550L877K90m367L62L421j718l524
1303c623K548K533l131r59M069J140m205Q59M532k000l645K856K481l984j415
1318a944L078M17l881m6L316j180l040J822L329j771k614L208K453m009j215M883
1334B806m82m526J473M191l564k997M137J408m937J75M376j496l475K586J664
1349A339k428q42K639O56k300N4K339k4k090L77K623j154k427J773J703l160j338
1366b260L657o64m292J696M079l100k224M402N48l717J199M044k328l064L415
$$ y = [-2551, -2631, 2029, -395, -4469, -853, 2187, -770, -1567, 2459, 2705, -225, 813, 2908, 886, -1542, -44, 1763, -646, -2357, 237, 1690, -821, -2211, 1285, 651, -2634, -975, 2342, -418, -2761, 1061, 2843, -1259, -1346, 2714, 945, -2210, 461, 2777, -414, -1964, 1913, 2203, -2164, -1802, 1619, -99, -3623, -1075, 1458, -1673, -2632, 1437, 2577, -1628, -769, 3763, 1763, -1882, 974, 3455, -529, -1944, 1134, 1551, -2330, -2376, 940, -240, -3280, -1458, 1871, 100, -2514, 694, 3147, -862, -2077, 2806, 2324, -2202, -729, 3462, -102, -3099, 1038, 2446, -2491, -2316, 2060, 564, -2911, -325, 1339, -1089, -1931, 708, 1364, -936, -882, 1457, 1433, -657, -280, 2343, 1189, -1238, 535, 2238, -922, -2260, 1397, 733, -3559, -1863, 2216, -884, -3108, 1294, 1842, -1875, -676, 3368, 1040, -2024, 1391]
1381A391J744l720q13K554k19k902P78K164j525k116K005K360k411j885L217J802
1397B424l489j39L144m20l342K137K695l553k078M297Q44m244k51L493o75l404
1413b561K159J937l062r71L910O3l554P41L846j076k611J708J695k422q38K624
1429A588J1l363L40K848r61k893Q60K893j970j833K916J630l658M00M413j434
1445A787m231K468L919l631k847L930j34l657J699K984l247k568L967J191l030
1460a400j30K037K98j127r4J008m58j006N67K634j103l543K548L138l402k712
1476b745M036K74m552K025L937m766k420N842L19m668J292M076k709r28L048k19
1492A842l001J553K083j816j757M20P16J54r53r22J549N48j781J317J816k696
$$ y = [1391, 3135, -585, -1398, 1156, 937, -1965, -1187, 977, -548, -2664, -659, 1701, -710, -2595, 622, 2424, -1065, -1204, 1940, 1520, -1822, 315, 3010, -543, -2621, 1676, 2520, -1724, -1975, 1518, 843, -2561, -402, 1535, -1527, -2498, 1412, 1475, -2079, -1338, 2508, 1432, -1179, 529, 2224, -198, -1036, 1588, 1599, -1764, -1424, 1424, 463, -2430, -1570, 1323, -647, -2480, 436, 2066, -1592, -1192, 3221, 1787, -2444, 24, 3943, 312, -2535, 1395, 1261, -2396, -697, 2287, -960, -3528, 439, 1630, -1400, -1530, 507, 805, -322, -416, 592, 134, -872, -305, 2329, 1226, -2317, 231, 3369, -33, -2745, 1291, 1565, -2987, -962, 2975, -1791, -4211, 1631, 1950, -2718, -1426, 2650, -59, -987, 2061, 1842, -1159, 394, 2477, 661, -1096, -676, 40, 194, -759, -1681, -132, 416, -1365, -48, 1768, -928]
1508i28j283M771K31n185J633M521l658k286M391m76n222K922L768m147k041L712
1524G23P49k609L17J487j174k40J222k65n79k17M79J954J88k921O40K734j961
1541E27k218L279n29m111K576L534m471k887N759M16m922K155L232l000n17M343
1557C166j143l656J834K154k343j260J136l91k63K63r5Q19p78l96O76K263k691
1574g05k002M201J213m076K76L786k453k325M128M6n259K019M411k700l131K994
1590D23J492l257N48J338j557j020J643P34o11j18M25J238P43j600q28J715n37
1607G71j497J573J32l050O49L698k490l348L274J673l096P67K918k196q44L420
1623B354j08l420P54K006j836n90J104n92m41P86Q89q00m65k80M26J361j683j906
$$ y = [-928, -2211, 2560, 2791, -2394, -761, 3760, 102, -2184, 2207, 1731, -3491, -569, 3199, -948, -2989, 723, 1472, -1137, -820, 667, -507, -747, 475, 210, -369, -586, -107, 1847, 2035, -886, -246, 2488, 527, -1691, 1588, 1059, -3052, -476, 3058, -1413, -4300, 1459, 1875, -3047, -892, 2340, -660, -1177, 3166, 2023, -1633, 201, 2355, 12, -1248, -112, -503, -766, -503, -598, 221, -557, -953, -277, 1986, -705, -2707, 1494, 2707, -1369, -1093, 2693, 240, -2085, 2043, 2089, -3170, -1151, 3260, 560, -2571, 423, 1915, -1342, -794, 544, -1013, -2033, -390, 344, -267, -385, 40, 1278, 2021, 421, -407, 1308, 771, -726, 847, 979, -2071, -1422, 2276, -214, -3562, -288, 1385, -1711, -944, 1974, -222, -1066, 2354, 2246, -1174, -420, 1586, -250, -840, 264, -328, -769, 17, 906, 106, -359, -639, -213, 1148, -535, -2441]
1641b441K415J896k545r3K577j506k130L111Q56m056R60L783j374k627J839K71
1657I36k118M01J011j579j149K059R74p45K51K84M33M72l29r05M87j76n74J188
1675I21L1k190K44J966j157k303J896J426j881L14K481j330j768K470J115k797
1691e62m03J883o00j285J361L20r23R5R18P4j432j70M95M84p18p61Q48J186j314
1710e04N9J344n31j686J710J655k415l16K309Q9k220K24J073j401q94J480k59
1727b83j552Q31J489n6m00J33K06M35o74k41P08n79o52P96J000j705n95J312J02
1746B75j429K78J176p02l91K031n25j848R03J514j347q43J075P4k07L65M94q26
1764F7k6N76l93l28l58k7M62p04l46M19N62j52l20Q38k66r91R69J388p77n79R79
$$ y = [-2441, -26, 1870, -675, -768, 1809, 303, -1827, 1284, 2140, -1916, -956, 2827, 1453, -1174, 665, 936, -1182, -781, 230, -1349, -2498, -439, 535, -210, 41, 325, 758, 1230, 901, -4, 483, 307, -267, 921, 952, -1238, -994, 972, -185, -2488, -592, 834, -1047, -733, 1748, 418, -1350, 1120, 2235, -562, -965, 918, 318, -967, 394, 714, -209, -114, 804, 878, -554, -724, -229, 255, -463, -1224, -376, 810, -504, -445, 899, 368, -1318, 392, 2047, -368, -684, 1625, 1714, -506, -282, 791, -610, -1504, -24, -283, -1835, -1004, 485, 429, 29, 162, 368, 803, 129, -112, 596, 17, -635, 161, 1161, -544, -1139, 173, 275, -1154, -876, 300, -402, -793, 1238, 713, -1135, -232, 1282, -65, -908, 167, 241, 34, 399, 893, 67, 41, 617, 224, -104, -462, -489, -27, -731, -1077, -658, -96, -248, -568, 270, 4, -987, -18, 1370, 593, 14, 993]
1785I93K61j179N1K81p92o90N74M72j051O50M33N82p03N6P73j46n99J98P75q43
1805I6l74O96N09j289k09R47l67p09J99J053j160JQ88m1n98j19M21K38o20j17
1825e55P55o3l51R07L52j058J11Q97n03j353N65N97q26q64J606o6j402M50J241
1844D40l97l15N12R18q45k87Q98j78q33j84K83M75j475k11J378j27j237O99J450
1863I64j258o57J403M96j484K10J139n31n77N30R69j271m04J070K0p91k94J007
1881E41m89m06J00M14m27n69O65N59n01l80R28N14j046Q7J097l42j197J165M82
1900A195j853k52J236m86j179P61N62o96l24J613r6j184J103P32r32m41J178j29
1918H08q51J26L57j94o04m50M88L31o94j01J177l5j034P29J008j286q52J748k15
$$ y = [993, 1254, 75, 126, 407, -385, -1075, -501, -29, -1080, -430, 3, 585, -118, -62, 711, 565, -34, 164, 939, 96, -278, 418, 927, -362, -571, 376, 9, -700, -501, 552, -608, -607, 281, 240, -358, -477, -56, 182, -438, -555, 200, 137, -214, 693, 1045, -13, 98, 995, 492, -861, -296, 301, -525, -1389, 217, 151, -1251, -801, 440, 43, -272, 240, 1158, 313, 26, 924, 746, -87, -271, 12, 487, -988, -1199, 179, 52, -1185, -486, 964, -294, -951, 452, 948, -536, -326, 813, 282, -295, 235, 1204, -67, -471, 599, 619, -172, -466, 541, 52, -354, -254, 160, -267, -836, -171, 388, -113, -493, 435, 949, -97, -10, 1087, 745, -452, 713, 1195, -658, -910, 326, -160, -1339, -578, -16, -712, -1036, 577, 481, -703, 400, 1132, 200, -241, 937, 808, -43, 83, 440, 246, -358, -808, -320, 11, -683, -784, 393, 358, -676, 53, 1061, -225, -1077, 671, 456]
1937D56j807J586J302k123j89J841l27j798J104J150j705k67J231l79p51K92L40
1954d4k8j73k15K46R32m46o19J386J98j623R06Q67k219o04K466m68k938K001J639
1973A264k435k20K604r34j897J981J234k024K6J651n73r55O30j89l26M29q24J90
1991c68Q17j147j72J681L6k583J315K020j870j336K438l24k068J752K004k578
2007c83o38K389k71j883P91N26r88l62J130m99n80M96K5L0K44q13Q69R47q11p78
2027e59J840j89j580Q77J275k242p12K434l94k446J233J343j929k86K355p97j596
2044a373J437J244j400m40J110j01r3l88J49k8p8q3N00l81n41l38J318j81j555
2063a222J013J323j386q64J755r7j736J272J902k495k06J728J23j514K32J217
$$ y = [456, -1351, 235, 1537, -586, -775, 1066, 739, -1059, 45, 1195, -510, -777, 454, 75, -676, -384, -44, -72, -245, -460, -214, 718, 272, -347, 1039, 1237, -386, 520, 1387, -832, -1436, 1030, 562, -2376, -375, 1264, -1171, -1391, 1213, 279, -1618, 363, 1597, -427, -401, 1250, 677, -278, 352, 163, -163, 266, -558, -368, 449, -698, -870, 811, 847, -1736, -421, 1599, -271, -1607, 831, 507, -1561, 191, 2195, -383, -1021, 1368, 1097, -786, 5, 531, -457, -819, 311, -188, -768, -272, -247, -217, 27, -786, 83, 1030, 219, -559, 1281, 1092, -488, 389, 1664, -578, -1290, 1144, 750, -1696, -463, 880, -1049, -1335, 1020, 223, -1373, 64, 1308, -92, -532, 578, 477, 384, -4, 145, 117, 39, -44, 456, 75, -466, -804, 514, 333, -1222, -209, 1114, -272, -1136, 619, 522, -1214, 58, 1960, -535, -741, 987, 1110, -404, -172, 1045]
2079A045r87r19J172l39q29J64P79j93K08l95M82j66M16l35L01k0o66R54P30j671
2099b69n84J361J25j538M49J016j082o01J758K5j826N03J793r35j233J495K45
2116G02q64K40P55n55o41O20M78o30o11J4Q77m78p79O31Q26o71o13J467j75j667
2136a074M98J863j150q83J206O18j233K50R12r81r34R97J11j248M0J363l16l35
2154b96J96j39O2l72Q31R0k93k76P95L14o11p91P25K11q85N25L70j066l53J538
2174E75Q0j725P01J211q17j169J455J01o39M00N63n90o09N58M92q09k30K45K91
2193H4j26k84M17j0m71m73J127j82j290P54J437q58m18Q98J86q41J08R08q86r70
2213h90J073L65q96m64R18N8r78Q24O6m26l60O24M65o21N26K70J55o76k95P52
$$ y = [1045, 58, -861, 311, -28, -857, -693, 86, -107, 101, -294, 188, 22, 438, 103, 404, 384, -282, 672, 1402, -269, -853, 508, 633, -905, -456, 560, -522, -1123, 635, 660, -1166, -663, 1130, 195, -1038, 457, 702, -162, 78, 833, 278, -363, 257, 735, 105, -506, -492, 385, -93, -872, -241, 585, -86, -699, 768, 593, -1074, -576, 1287, 137, -746, 460, 1078, -155, 95, 1007, 26, -908, 89, 200, -1048, -1008, 355, 39, -296, -100, -239, -177, -549, 282, 372, 79, -197, 598, 912, 301, -490, 235, 446, -439, 86, 456, -610, -963, 575, 655, -1070, -369, 842, 25, -1144, 311, 412, -227, 173, 736, 146, -463, 95, 587, -222, -452, -207, 84, -42, -326, 91, 81, -390, -863, 264, 82, -1208, -454, 983, 125, -293, 605, 791, -50, 58, 966, 80, -890, 183, 548, -348, -812, 106, 164, -814, 10, 76, -350, -710, -86, 379, -242, 284, 554, 709, 33, -262, 490]
2233D90n99n99M53O20n66n56J022R2r37J84Q72p38o00J054L16q78q0J115j66p55
2253b56L81N75m96m39L63J56o58K15L92j19n52m28R24m14j87K60Q84l85m36P08
2273D88j5l87J62L21l94o06M38M26n01m36P08J10n01n3N76k33n01P1J245r68p2
2294a22L90K33m64N4Q38m76o57O60n4n05k91J048n97p30L49K81j74m10N40P3j57
2315a71L16K07o2m37j06O22q1l51K31K98n84j76J39L55j046L51R27p62j51K31
2335b50N18m42J00O25l61n68N32J12k05j3O9J26p3n04K89L69n19j89L61P0m69
2356d22L23K73j97n09Q23k06j28Q2O81o75k64O52o8m19l50Q25k96q12O05P8m34
2377d38j25M70L63p93P39P1k8j55m61R19k23m08K62K11l08n74P62k69o70N17M33
$$ y = [490, -109, -708, -255, 365, -201, -757, 265, 357, -580, -396, 476, -262, -862, 192, 508, -370, -450, 665, 499, -256, 125, 700, 204, -235, 128, 284, -374, -159, 233, 114, -438, -866, 58, -356, -543, -283, 601, 216, -220, 488, 473, 86, 248, 569, 175, -431, 7, 433, -68, -504, 204, 314, -187, -240, 336, 103, -398, -327, 918, -50, -122, 268, 501, 37, 91, 929, 453, -204, 456, 402, -103, -394, 654, 57, -673, -324, -43, -217, -627, -87, -14, -171, 145, 352, 290, -147, -253, 369, 288, -63, 168, 466, -118, -294, -155, 200, -846, -495, 432, -330, -481, -250, 268, -174, -74, 551, 190, -378, 154, 266, 61, 48, 117, 243, 170, -334, -45, 324, -195, -384, -23, 47, -422, -99, 174, -23, -532, 291, 85, -43, 39, 720, 45, -219, 433, 365, -54, -404, 421, 125, -687, -82, -4, -438, -563, -93, 270, -523, 216, 287, 259, 104, -357, 562, 339, -69, 193, 404, 96, -478, 284, 15, -655, -138, 295]
2398B95l51k18N98p4n42J98N59n07j28K84M53l42l58M73K2k78l39J74O11m83o02
2419e55O10ml96n3M97N9q42N95Q64j026p8R71l15p40P75Lo46L65P0j46m52L57
2441h7l1r5o3L73M2k11L3p4J06N27n18j25P68p14k85O49l11k07J75N40j171L90
2463b89Q42n40o85O25J92p1k63K30K22n06L68R3l84K25nK13j31o5k08J29J00l81
2485b89k09M05p1m66N05J36k82QQ22k92k61L04j85n57P13K60n14l08O53k05p62
2506e95L48L5M3K27L8k68k31N88n12Q02j81m70K15P39o58j16K32L76p21J39N08
2527E38n84l14P66m66m07L52M49n76l58N07n5Q8L13j07q0j44M46m6j07j35J56
2548B36j30p6Rj55o4Ok5J95N96j080j2R35l77o15Q54l74j2n0O69o17n0K89M29
$$ y = [295, -56, -274, 324, 250, -292, -94, 465, -42, -170, 114, 567, 225, -133, 340, 362, 84, -255, -81, 530, 47, -555, 55, 51, -345, -398, 99, 158, -684, -89, 775, -251, -329, 642, 327, -413, 362, 365, -281, 84, 154, 8, -444, -87, -118, -213, -276, 97, 139, -72, -39, -113, -7, 520, 2, -123, 645, -69, -354, 295, -16, -223, -48, 492, -679, -289, 553, 13, -672, -47, 145, 74, -189, 41, 263, -243, 125, 218, -166, 59, 54, 267, 136, 71, -137, -8, 92, -289, -498, -93, -164, -630, -125, 11, -271, -263, 559, 267, 6, 310, 125, -432, 281, 541, 27, -281, 372, 167, -595, -247, -212, -169, 58, 96, -172, -403, 185, -327, 475, 294, -176, 39, 778, 120, 4, 236, 612, -109, 30, 538, -46, -360, 406, -60, -467, -115, 334, -242, -600, -93, -148, -60, 253, 146, 66, -78, 368, 322, 215, 80, 236, 106, 30, 39, -116, -180, -174, -199, -4, 592, -488, -500, 435, 58, -557, 297, -77, -89, -139, 530, -87, -137, 152, 581]
2571E81p66k06M92j8RN7j50j15j16L84K42l62J88m63O81k41k58P9M62n34P4L05
2593C25r4o37Q11Q9p09j19M19n9j55J07J37l36m5O65l11k2J0L60j17j99O7R1m14
2616a36J83K7j37k72L55j54M11l14m72M92J31m10K72J59k81m7O60l77q05O31N82
2637D98o01J18M58m80l76L05K69j48n39M92o5j81n0J45J65K82l85N7K30l26J39
2658GJ40L21p34J36M02l39l86O49k52l59K89R9m93j01J047k71L8m12K90l9O7P0
2680A69j74J27m06N30m34J2k06J54M57o47l30Q38J4j57j24N52n90n8O77k97l33
2701b26J5L36m7o7N19j52n37K4N61m18l85J76M32j78q0P5K03m08J18L00Q8p63
2723d14O61J76n72l9L70L84m80k54j10K73n79K77K86J90n96M53J20j82j70L50
$$ y = [581, -185, -391, 101, 83, 92, 149, -1, -116, -232, 152, 394, 32, 220, -243, 438, 197, -61, 18, 480, -54, 20, 325, 231, -406, 405, 494, -215, -334, 85, 26, -129, -22, 115, -221, -266, 399, 88, 66, 76, 436, 319, 120, 187, 278, -136, 47, 74, -63, -335, 20, -134, 277, -37, -509, -17, 114, -296, -24, 135, -146, -193, 467, 90, -715, -84, 498, -103, 15, 473, -7, -383, -78, 191, 43, -496, -4, -69, -250, -300, -155, 10, 292, -93, -36, 194, -132, 7, 147, 468, -266, -130, 272, -67, -453, 196, -56, -415, -126, -27, -520, -621, 426, 155, 193, -219, 71, 32, 99, 169, -5, 122, -284, 246, -188, -176, -382, -228, 229, -418, -748, 90, 104, -53, -177, 375, -215, -273, 404, 107, -226, -211, 125, 78, 11, 530, 378, -159, -135, 426, 8, -377, -201, 231, 53, -27, 48, 251, -157, -39, 261, 349, -414, 247, 423, -149, -188, 182, 566, 86, -168, -278, -5, -584, -307, -21, 169, -427, 26, 146, -36, -206, 144]
2743A44K1K89o95O48k95o40N60N3l10NK47l65K06J02J55j86j42M30k54k11Q1L00
$$ y = [144, 165, 454, -241, 407, 112, -528, 32, 85, -225, -220, 27, -338, -132, -30, 125, -61, -203, 227, -27, -238, -157, 143]
$$ [...]
8191a20
##END NTUPLES=NMR FID
##END=
